##TITLE=1H_PR 1452_W
 D2O, 8 sc, 
 8.04.2021
##JCAMPDX= 6.0         $$ Bruker NMR JCAMP-DX V2.0
##DATA TYPE= NMR FID
##DATA CLASS= NTUPLES
##ORIGIN= UXNMR, Bruker Analytische Messtechnik GmbH
##OWNER= root
$$ XWIN-NMR		Version 3.5
$$ Thu Apr  8 14:41:41 2021 Russian Standard Time (UT+4h)  she@DPX200
##.OBSERVE FREQUENCY= 200.131506
##.OBSERVE NUCLEUS= ^1H
##.DELAY= (6, 6)
##.ACQUISITION MODE= SIMULTANEOUS
##.ACQUISITION SCHEME= undefined
##.AVERAGES= 8
##.DIGITISER RES= 18
##SPECTROMETER/DATA SYSTEM= spect
##.PULSE SEQUENCE= zg30
##.SOLVENT NAME= DMSO
##.SHIFT REFERENCE= (INTERNAL, DMSO, 0, 15.7039)
##AUDIT TRAIL= $$ (NUMBER, WHEN, WHO, WHERE, WHAT)
$$ ##TITLE= Audit trail, XWIN-NMR		Version 3.5
$$ ##JCAMPDX= 5.01
$$ ##ORIGIN= Bruker BioSpin GmbH
$$ ##OWNER= she
$$ F:/spectra/data/she/nmr/H-F/1/audita.txt
$$ ##AUDIT TRAIL=  $$ (NUMBER, WHEN, WHO, WHERE, WHAT)
(   1,<2021-04-08 14:39:28.37 +0400>,<she>,<DPX200>,
      <created by zg, POWCHK disabled, PULCHK disabled
       configuration hash MD5:
       00 E9 B6 7A A2 85 ED C7 34 08 36 98 17 FE 4E 26
       data hash MD5: 16K
       DA 11 E6 CD 3E 85 93 15 9A 58 83 43 AB BF 16 EF>)
$$ ##END=
$$ 
$$ hash MD5
$$ DF 9A 0C C9 B2 10 05 70 86 53 A8 C1 11 02 1B 26
##$RELAX= 
##$RELAX= 
##$RELAX= 
##$RELAX= 
##$RELAX= 
##$RELAX= 
$$ Bruker specific parameters
$$ --------------------------
##$DU= <F:/spectra>
##$EXPNO= 1
##$NAME= <H-F>
##$PROCNO= 1
##$TYPE= <nmr>
##$USER= <she>
##$AMP= (0..31)
100 100 100 100 100 100 100 100 100 100 100 100 100 100 100 100 100 100 
100 100 100 100 100 100 100 100 100 100 100 100 100 100 
##$AQSEQ= 0
##$AQ_mod= 1
##$AUNM= <au_zg>
##$AUTOPOS= <>
##$BF1= 200.13
##$BF2= 200.13
##$BF3= 200.13
##$BF4= 200.13
##$BF5= 200.13
##$BF6= 200.13
##$BF7= 200.13
##$BF8= 200.13
##$BYTORDA= 1
##$CFDGTYP= 0
##$CFRGTYP= 5
##$CHEMSTR= <none>
##$CNST= (0..31)
1 1 145 1 1 1 1 1 1 1 1 1 1 1 1 1 1 1 1 1 1 1 1 1 1 1 1 1 1 1 1 1 
##$CPDPRG= <>
##$CPDPRG1= <>
##$CPDPRG2= <>
##$CPDPRG3= <>
##$CPDPRG4= <mlev>
##$CPDPRG5= <mlev>
##$CPDPRG6= <mlev>
##$CPDPRG7= <mlev>
##$CPDPRG8= <mlev>
##$CPDPRGB= <>
##$CPDPRGT= <>
##$D= (0..31)
0 1.2 0 0 0 0 0 0 0 0.06 0 0.03 0 0 0 0 0.0002 0 0 0 0 0 0 0 0 0 0 0 0 
0 0 0 
##$DATE= 1617878367
##$DBL= (0..7)
120 120 120 120 120 120 120 120 
##$DBP= (0..7)
150 150 150 150 150 150 150 150 
##$DBP07= 0
##$DBPNAM0= <>
##$DBPNAM1= <>
##$DBPNAM2= <>
##$DBPNAM3= <>
##$DBPNAM4= <>
##$DBPNAM5= <>
##$DBPNAM6= <>
##$DBPNAM7= <>
##$DBPOAL= (0..7)
0.5 0.5 0.5 0.5 0.5 0.5 0.5 0.5 
##$DBPOFFS= (0..7)
0 0 0 0 0 0 0 0 
##$DE= 6
##$DECBNUC= <off>
##$DECIM= 32
##$DECNUC= <off>
##$DECSTAT= 4
##$DIGMOD= 1
##$DIGTYP= 9
##$DL= (0..7)
0 120 120 120 120 120 120 120 
##$DP= (0..7)
150 150 150 150 150 150 150 150 
##$DP07= 0
##$DPNAME0= <>
##$DPNAME1= <>
##$DPNAME2= <>
##$DPNAME3= <>
##$DPNAME4= <>
##$DPNAME5= <>
##$DPNAME6= <>
##$DPNAME7= <>
##$DPOAL= (0..7)
0.5 0.5 0.5 0.5 0.5 0.5 0.5 0.5 
##$DPOFFS= (0..7)
0 0 0 0 0 0 0 0 
##$DQDMODE= 0
##$DR= 18
##$DS= 0
##$DSLIST= <SSSSSSSSSSSSSSS>
$$ [...]
##$SUBNAM2= <"">
##$SUBNAM3= <"">
##$SUBNAM4= <"">
##$SUBNAM5= <"">
##$SUBNAM6= <"">
##$SUBNAM7= <"">
##$SUBNAM8= <"">
##$SUBNAM9= <"">
##$SW= 16.9725357007746
##$SWIBOX= (0..15)
0 0 2 0 0 0 0 0 0 0 0 0 0 0 0 0 
##$SW_h= 3396.73913043478
##$TD= 16384
##$TD0= 1
##$TE= 0
##$TE2= 300
##$TE3= 300
##$TEG= 300
##$TL= (0..7)
0 120 120 120 120 120 120 120 
##$TP= (0..7)
150 150 150 150 150 150 150 150 
##$TP07= 0
##$TPNAME0= <>
##$TPNAME1= <>
##$TPNAME2= <>
##$TPNAME3= <>
##$TPNAME4= <>
##$TPNAME5= <>
##$TPNAME6= <>
##$TPNAME7= <>
##$TPOAL= (0..7)
0.5 0.5 0.5 0.5 0.5 0.5 0.5 0.5 
##$TPOFFS= (0..7)
0 0 0 0 0 0 0 0 
##$TUNHIN= 0
##$TUNHOUT= 0
##$TUNXOUT= 0
##$USERA1= <user>
##$USERA2= <user>
##$USERA3= <user>
##$USERA4= <user>
##$USERA5= <user>
##$V9= 5
##$VALIST= <valist>
##$VCLIST= <CCCCCCCCCCCCCCC>
##$VD= 0
##$VDLIST= <DDDDDDDDDDDDDDD>
##$VPLIST= <PPPPPPPPPPPPPPP>
##$VTLIST= <TTTTTTTTTTTTTTT>
##$WBST= 1024
##$WBSW= 4
##$XGAIN= (0..3)
0 0 0 0 
##$XL= 0
##$YL= 0
##$YMAX_a= 191315
##$YMIN_a= -162349
##$ZGOPTNS= <>
##$ZL1= 120
##$ZL2= 120
##$ZL3= 120
##$ZL4= 120
##$ABSF1= 10
##$ABSF2= 0
##$ABSG= 5
##$ABSL= 3
##$ALPHA= 0
##$AQORDER= 0
##$ASSFAC= 0
##$ASSFACI= 0
##$ASSFACX= 0
##$ASSWID= 0
##$AUNMP= <proc_1d>
##$AZFE= 0.1
##$AZFW= 0.1
##$BCFW= 1
##$BC_mod= 2
##$BYTORDP= 1
##$COROFFS= 0
##$CY= 11.3945322036743
##$DATMOD= 1
##$DC= 2
##$DFILT= <>
##$DTYPP= 0
##$F1P= 15.9154993809931
##$F2P= -4.1035820241983
##$FCOR= 0.5
##$FTSIZE= 0
##$FT_mod= 4
##$GAMMA= 1
##$GB= 0.15
##$INTBC= 1
##$INTSCL= 1
##$ISEN= 128
##$LB= 0.24
##$LEV0= 0
##$LPBIN= 0
##$MAXI= 10000
##$MC2= 0
##$MEAN= 0
##$ME_mod= 0
##$MI= 1.114404
##$NCOEF= 0
##$NC_proc= 0
##$NLEV= 6
##$NOISF1= 3.799351
##$NOISF2= 2.8
##$NSP= 1
##$NTH_PI= 0
##$NZP= 0
##$OFFSET= 15.70392
##$PC= 1
##$PHC0= -11117.81
##$PHC1= -1.19908
##$PH_mod= 1
##$PKNL= yes
##$PPARMOD= 0
##$PSCAL= 0
##$PSIGN= 0
##$REVERSE= no
##$SF= 200.130013532006
##$SI= 16384
##$SIGF1= 3
##$SIGF2= 2
##$SINO= 400
##$SIOLD= 16384
##$SREGLST= <1H.CDCl3>
##$SSB= 0
##$STSI= 0
##$STSR= 0
##$SW_p= 3612.71676300578
##$SYMM= 0
##$S_DEV= 0
##$TDeff= 0
##$TDoff= 0
##$TI= <>
##$TILT= no
##$TM1= 0
##$TM2= 0
##$TOPLEV= 0
##$USERP1= <user>
##$USERP2= <user>
##$USERP3= <user>
##$USERP4= <user>
##$USERP5= <user>
##$WDW= 1
##$XDIM= 8192
##$YMAX_p= 0
##$YMIN_p= 0
$$ End of Bruker specific parameters
$$ ---------------------------------
##NTUPLES= NMR FID
##VAR_NAME=  TIME,          FID/REAL,        FID/IMAG
##SYMBOL=    X,             R,               I
##VAR_TYPE=  INDEPENDENT,   DEPENDENT,       DEPENDENT
##VAR_FORM=  AFFN,          ASDF,            ASDF
##VAR_DIM=   8192,          8192,            8192
##UNITS=     SECONDS,       ARBITRARY UNITS, ARBITRARY UNITS
##FACTOR=    0.0002944,     1,               1
##FIRST=     0,             0,               0
##LAST=      2.4114304,     0,               0
##MIN=       0,             -162349,         0
##MAX=       2.4114304,     191315,          0
$$ Real data points
##PAGE= N=1
##DATA TABLE= (X++(R..R)), XYDATA
$$ [...]
1782h8K11j89j37J84j1jK7j65L84k69J19j56J27R6rL6k57L30k68J76k16p1J97
1805E0K1J38l27j37Q1K40j67j88J98lJ17j21J65J0j90K09k1k2l46N53l04k5J60
1828I1j36P4K11l17O2q8L9J34j89O1J03P3k69M14m57J10K27q0R6Q8%l70L51k72
1852d4J85l9k36K36p2Qj26J08P8j60r7N6L2K01j21q4K0L4jpj4j2J61K0j01J53
1878A78L3j7k9k23Q7L0j66qP2m4rJ24j48L1K66k14L26l25L2j38j22K62J37k38
1902a03Q6j37K55K83p10L58L6j97L88k32N4k9r1LJ9J27m2Lj20l9R7j14K86l87
1926b06M3K96j34n8j40K42L4L60o20K38j13n9j0kK04k3j6l6P7J02l42K85j43N8
1950C7k45M42j60j00L83m25J79%k03J70l89L09J3j39K47l53K70m64J92L35k25
$$ plain form
1782 -88 123 -66 -203 -19 -30 -31 -4 -169 215 -54 65 -91 36 132 123 159 -98 232 -36 140 -76 -147 50
1805 50 71 209 -118 -255 -174 66 -101 -289 -91 -94 23 -98 67 77 -113 96 75 53 -293 260 -44 -69 91
1828 91 -45 29 240 -77 -15 -103 -64 70 -119 -58 45 118 -151 263 -194 -84 143 63 159 247 247 -123 228 -44
1852 -44 141 102 -134 102 30 38 -88 20 98 -62 -159 -103 -71 130 9 -75 -55 -21 -22 -29 -43 -55 106 126 25 178
1878 178 211 194 165 -58 29 59 -107 -115 -43 -87 -96 28 -120 -89 177 -37 289 -36 -4 -142 -264 -2 135 -103
1902 -103 -17 -154 101 384 -326 32 68 -129 259 27 81 52 -39 -36 -17 110 68 71 -49 -88 9 -105 181 -206
1926 -206 -163 133 -1 -59 -199 43 77 437 -183 55 -58 -117 -127 -129 75 52 36 0 77 179 -163 122 -21 37
1950 37 -208 234 74 -26 357 -68 111 111 -92 78 -311 -2 11 -128 119 -234 36 -428 -236 99 -126
1971a26J19Q2j03K72k34K2Jr4N4o7O0mP8J34k97J17Q0l85M13k32Q8j44K17r3J18
1996G6k65K81l7l0j24J69k2l04K50k4l1N4L6j28K26k65M16j48M0k62NQlJ53J72
2021B43k42j31J34j58N4J31Q1k02p3L30k44J87n0J37l4j24R0q2J0J15j35j28J63
2044G2o0Q4Qr2K27k91l4j29M11j54j18K2K13k38K20j43n9l08L19O3J60m05K85
2067E3J09k3r7j97K82j96J96K2j73o8K05n9j47L17jj72J08k29p1m8L97k19j74
2090a85m1K73k36J37J28j61K14N6l53J09j60L55j57j59K03r7K44j55j78K30P8
2111A45j05K26k05rJ24k85K39m26P24n62M5q5J62L90m57K49k39J7LJ22j2L2j87
2134i4R9J03r3k6P1j04J52r8Q9J00k11P5J48o5rk27L01l53O7j30N7P1L05j76j37
$$ plain form
1971 -126 -7 75 -28 244 10 32 33 -61 -7 -74 -14 -18 60 194 -103 14 94 -291 122 -110 -22 -166 51 -42 76
1996 76 -189 92 55 25 -99 70 48 -256 -6 -30 -61 -7 29 -99 127 -138 278 130 170 -92 -87 -79 -82 71 243
2021 243 1 -130 4 -154 -100 31 112 -90 -163 167 -77 110 60 197 163 39 129 47 57 172 37 -91 72
2044 72 12 96 104 12 239 -52 -86 -215 196 42 -76 -54 159 -79 141 -2 -61 -369 -50 13 173 -232 53
2067 53 162 139 42 -155 127 -69 127 149 -24 -92 113 54 -93 224 223 51 159 -70 -141 -189 208 -11 -185
2090 -185 -226 47 -189 -52 76 -85 129 185 -168 -59 -219 136 -21 -180 23 -74 170 15 -163 67 145
2111 145 40 266 61 52 176 -109 130 -296 428 -134 -89 -174 -12 378 -79 170 -69 -52 -49 73 61 93 -94
2134 -94 5 108 15 -11 60 -44 108 10 99 199 -12 63 211 146 137 -90 211 -142 -75 -205 -148 -77 228 52 -85
2159h5K67r8j75M00k02r6o8K58k26N6j39N3m7J37r3j71O6K59J55o5k08j46J28
2182d0K60m11j80J71J04n7J87o9J39k32j04J47L59l10L2q6P0j96O1J03J27k39
2204a64k9J35j55O7j92K01j8Q1Jn4K02l4k23k33K78J55l46J73K03q1J34k79J87
2227IJ18j07j89J73K15l85j94K16L73l34N7J07j69q4K93P8p0o1L9j18J63J24j39
2250A15r5j41J32J85j59K09k57M7r9N9Q6l94M48N9j84k13K85j32l7M44o03L07
2272F2k37K55j67J6K6nJ39K7K24k61j05Op4O5K2R9K3m5%k08J15oK04j93K21j62
2298D1j31l7J74N7k39J09M0R6J0k64P5j40L47m04L54nM9Jk45pL6J42k99K75k0
2323A5P6j63N16n12R9k97K21M6J15j59M3k69L53l9k21K38q2K23j86N7j45L50r1
$$ plain form
2159 -85 182 84 -91 309 107 11 -57 201 -25 31 -108 -55 -102 35 -58 -229 -163 96 251 186 -22 -168 -40
2182 -40 220 -191 -371 -200 -96 -153 34 -35 104 -128 -232 -85 274 -36 -4 -90 -20 -216 -155 -52 75 -164
2204 -164 -193 -58 -213 -146 -338 -137 -155 -74 -73 -127 75 41 -182 -415 -137 18 -328 -155 48 -33 101 -178 9
2227 9 127 20 -169 4 219 -166 -360 -144 229 -105 -48 59 -110 -194 99 177 107 46 85 -33 130 254 115
2250 115 20 -121 11 196 37 246 -11 36 -63 -4 82 -312 136 195 11 -202 83 -49 -86 358 -245 62
2272 62 -175 80 -87 -71 -45 -50 89 116 340 79 -26 -20 -94 -29 -7 92 115 70 70 -138 -23 -29 175 -18 203 41
2298 41 -90 -127 47 104 -135 -26 14 110 120 -144 -69 -209 138 -266 88 83 132 133 -112 -119 -83 59 -240 35 15
2323 15 91 -72 444 -68 31 -266 -45 1 116 -43 0 -269 84 45 -176 62 -20 203 17 74 -71 279 188
2346A88j44l45M81k16J8j76K13k7K68l06OJ10Q9p7j05j44P2J4K25l15K86n9k81
2369b25J82J71k03K74k00k39K39k08L67j15k31R4j03K42j85K48j23RN1R2j46K2
2391A3j36m8J65Q0j69J15r5L5J10j4j08J68L0m33M06J02k60M01k40j57N2L6j79
2414a26J82r3OJ38j04P0k55K4J38k5L6m6j61J51k20J60m5L82j01o2k9J82r6k7
2438G9k5Nl39L99k17O6K49j06k13K67j7Qk33R1n4j22J99j88J22l0O9n5K1r0J02
2463a2Q5j70j35J36j43J12k3Q9N5J8n3J64K1k84K01J3j46J17K6L8k62l4Q8P8j09
2488a30J23K70n60P11o36L61j85JJ20j08J08j31J44j54L7J45r6J01k95L49j6l33
2510a74M22l79m9J34j80J92J1K51j38j7n2j5n4M6J91l91J97n2J19n5K78n49l3
$$ plain form
2346 188 44 -301 180 -36 -18 -194 19 -8 260 -46 -40 70 159 82 -23 -167 -95 -81 144 -171 115 56 -225
2369 -225 -43 128 -75 199 -1 -240 -1 -209 158 43 -188 -94 -197 45 -140 108 -15 -6 45 137 -9 13
2391 13 -123 -171 -6 74 -95 20 -75 -40 70 56 -52 116 146 -287 119 221 -39 362 122 -35 17 53 -126
2414 -126 56 -37 -31 107 3 73 -182 -158 -20 -45 -9 -55 -216 -65 -285 -125 -170 212 111 49 20 202 106 79
2438 79 54 59 -280 119 -98 -32 217 111 -102 165 148 156 -77 14 -40 -162 37 -151 -29 -59 10 -45 -24 -114 -12
2463 -12 73 -97 -232 -96 -239 -127 -150 -61 -6 12 -41 123 144 -140 61 74 -72 45 71 109 -153 -187 -99 -21 -130
2488 -130 -7 263 -297 414 -222 139 -46 -45 75 -33 75 -56 88 -66 -29 116 20 121 -174 175 159 -174
2510 -174 248 -131 -180 -46 -226 -34 -23 228 90 73 21 6 -48 -2 189 -202 -5 -57 62 7 285 -264 -297
2533b97K10m6J11N3l35K02M8N6J81k8J19m03m1J13N1k28K57r7J77j38l7R7J90
2556B15M8l42M0R9P6nj91K5j08nR3J00j75j45K26K0K01l59J22no4N0L7J16q1k60
2582b72Q4K67K4j60M2K12j78O7k02J80LRl7l04L56j37O5K5J10j63m7j03K8K46
2606A15Q1k47Q6J5j86J0K31l81L09jj77L04l47L82j34J91n21L37l9O4j84J27j3
2629B2R5J71k22l68k02M65K25l98K47O3M3k64o88J294m01q63J213m40j10kL6K79
2651A95m84L72R3l21o5J20J94j71k3r2K51j74K01rJ20k53j37J10L71k52l33M27
2673A40j73K22l18J93Q2k19J27k58J39k4J1O5J85k49K31k31J21j54J41J99r5L3
2695A68j52J34j56q6J10n8J14j0j00k7N1K7J55m1k37P3L7P2m8k14j7K23l39L80
$$ plain form
2533 -297 -87 -133 -22 31 -304 -102 -54 2 183 155 274 -129 -170 -57 -6 -234 23 -74 103 -35 -72 25 215
2556 215 263 -79 -39 60 136 131 -60 -35 -143 -148 -55 45 -130 -275 -49 -29 172 -187 -65 -70 -134 -84 -47 69 -12 -272
2582 -272 -188 79 103 -57 -15 197 19 86 -116 64 67 76 39 -265 91 -46 19 44 154 -9 -56 -159 -131 115
2606 115 196 -51 35 50 -136 -126 105 -276 33 32 -145 159 -188 194 60 251 -270 67 28 92 -92 35 22
2629 22 117 288 66 -302 -504 -39 186 -212 35 98 141 -123 -811 483 82 -781 432 -8 -118 -120 -84 195
2651 195 -289 83 176 -145 -210 -90 104 -67 -90 -182 69 -105 96 87 207 -46 -183 -73 298 46 -287 140
2673 140 -33 189 -129 64 146 -73 54 -204 -65 -89 -78 -13 172 -77 154 -77 44 -110 31 230 135 168
2695 168 16 150 -6 -92 18 -40 74 64 -36 -63 -12 15 170 129 -108 -35 2 74 26 -188 -205 18 -321 59
2719E9j30J4j65K41n7k04L81k00j77J47K37j61j54J61p7J75k58P7j13L24p0p5
2741b5O8P6r7p3M6K97l71o4N2kJ2m3L55k03j53K87j89O6j34lJ73k78M5K21j90
2766a27q6J72L5k23J80J18n0K20k73k84O13j48j91K46j31j51K23j01k44K33m7
2787a6k46J56K26R9l76K71j05K6k51K64n6o9p0O7K42L9k52L9k2N1k33K18o2Q7
2811B7Lj4j52J29J63J2j79k17NL83k71M9J15j43r0pK27m2Q4k40J78j44K77k36
2835h3k6k02L65r6j67M18k46O6o1Q0k44K82J62O0l95M0K85l27K36l62J71m0J2
2858g2o1L8J66j80K88K21n68K12p8M2K17l2j23q8K21p6k52L0l2O4J47N6q8Lj97
2883a42J45o0J73N0k33K72l51J08m5K98L6r9k62K92k82L12k81K2QJ0p8K46k59
$$ plain form
2719 59 -71 -57 -222 19 -38 -242 139 -61 -238 -91 146 -15 -169 -8 -85 90 -168 -91 -204 120 50 -25
2741 -25 43 119 22 -51 -5 292 -79 -143 -91 -93 -81 -124 231 28 -125 162 -27 39 -95 -98 75 -203 -158 63 -127
2766 -127 -213 -41 -6 -229 -49 69 19 239 -34 -318 295 147 -44 202 71 -80 143 42 -202 31 -16
2787 -16 -262 -106 120 219 -157 114 9 35 -216 48 -8 -77 -147 -80 162 201 -51 -12 -34 17 -216 2 -60 27
2811 27 30 16 -136 -7 156 168 -11 -228 -223 160 -111 -62 53 -90 -180 -187 40 -2 82 -158 20 -124 153 -83
2835 -83 -109 -311 54 -42 -209 209 -37 29 -32 48 -196 86 248 308 -87 -47 238 -89 147 -215 -44 -84 -72
2858 -72 -133 -95 71 -109 179 400 -168 44 -34 8 225 193 70 -18 203 127 -125 -95 -127 -63 84 140 52 55 -142
2883 -142 3 -57 116 166 -67 205 -146 -38 -83 215 251 152 -110 182 -100 212 -69 -47 -39 -29 -107 139 -120
2906a20K13k8M3j25j3q5J37j74J89k53K67k1J36m4j57J91m84K37J26J36O8j14
2928A25Mk94J50J47P9k61k17O64l41l2j46O2q2J04qJ2j19J93n4J51k49P5J19j94
2952a12k8J63N2p7j51j3K05K2P6k46KJ84J81l29K45j19k78K41J12l08L88k43K26
2975A93p3j02J83l83L68j74J12l54K63l37J96O2J41j68m9L08k02p2m8J22J00J8
2997A04j4J51l51J13N2k59N5P4l9q9K10k5J11J29l02j18k8l0M50P5m06r1M61k62
3021b9J96J99m16j44K45J20l08K56j03L3q3J42N0n04L83k9O8j86J96k25K15K26
3043C02m54J74n8p1k0J58r9J61o2J7n1R1l53L25l5On3J79k07J15m5K6k11K1L7
3068a07J33k1m2n4k7J31n0K12m77J87K04o6k18K34j38K06k4j94J67J80k27J1J04
$$ plain form
2906 -120 93 65 108 -17 -30 -115 22 -152 37 -216 51 30 166 122 -35 156 -328 -91 35 171 239 125
2928 125 129 -165 -15 132 211 -50 -267 397 56 24 -122 -60 -142 -38 -46 -34 -153 40 -14 137 -112 -37 82 -112
2952 -112 -140 23 75 -2 -153 -166 39 61 137 -109 -107 77 258 -71 174 55 -223 18 130 -178 210 -33 193
2975 193 120 18 201 -182 186 12 124 -230 33 -304 -108 -46 95 -73 -122 186 -16 -88 -136 -14 86 104
2997 104 90 241 -110 3 55 -204 -149 -75 -114 -203 7 -18 93 222 -80 -198 -226 -256 194 269 -137 -228 233 -29
3021 -29 167 366 -50 -194 51 171 -137 119 16 49 -34 108 158 -346 37 8 76 -110 86 -139 76 302
3043 302 -152 22 -36 -107 -127 31 -68 93 31 48 -3 88 -265 60 25 31 -22 157 -50 65 20 46 -165 -144 -107
3068 -107 26 5 -37 -91 -118 13 -37 175 -302 -115 89 23 -195 39 -99 107 83 -111 56 236 9 20 124
3091A24r2K16q4j80jj56J28P3M0K8j16J12J75k23J07l37K4k4J91K70k20p0j50
3114a65J09j68M50l66J20j82R7K1k3J58q5J94j49j50J11Kr6J07K17l37K35J7j30
3137a3j69K71j53o8M63l34J67k05J74k63L8K99l28j4j10L81j06n2J17O8k60p2
3159a69Q8J80m3K47l11K59N8m45J96k60K49j52j29J82K6M5j88K21j6J41j68J09
3181A20j72j23L46j11k63J82K19j89O0k73K01J53j99K13k83r0L32Q8k25r2J59
3202E3j6j69J46J63j28j67J5k89L74J85j52k20J81P7n1K28k15O4k5j4m5RJ4o3
3226d5J29l09Q4J73q1KK7j20J49j33J67k05K97q3L89l98%m4l6j7K08j22R5k23
3250i6J61R1k84L2Q9Q8j44J06j50J45l9J1mm2j14K06R6j32r0J44l37J20J43R2
$$ plain form
3091 124 32 248 164 -16 -17 -173 -45 28 68 96 -20 92 267 44 151 -186 -162 -186 5 275 55 -15 -165
3114 -165 -56 -224 226 -140 -20 -202 -105 -84 -107 51 -34 160 11 -139 -28 -26 -122 -15 202 -135 100 117 -13
3137 -13 -182 89 -64 -132 331 -3 164 -41 133 -130 -92 207 -121 -135 -245 136 30 -22 95 163 -97 -169
3159 -169 -81 99 56 303 -8 251 309 -136 60 -200 49 -103 -232 -50 -24 21 -167 54 38 179 11 120
3181 120 -52 -175 171 60 -203 -21 198 9 69 -204 -3 150 -49 164 -119 -209 123 211 -14 -106 53
3202 53 37 -132 14 177 49 -118 -103 -392 -18 167 15 -205 -24 53 2 230 15 79 54 40 -5 4 18 -45
3226 -45 84 -225 -141 32 -49 -47 -20 -140 9 -124 43 -162 135 52 441 43 43 -1 -37 -54 154 32 127 -96
3250 -96 65 156 -128 -96 -7 81 -63 43 -107 38 -1 10 6 -36 -150 56 152 20 -70 74 -263 -143 0 92
3274I2J98m01L31n4l07K28r2J1qn3K1L1Nj21j03M16k8o5J69r1k21N2R6J06l19
3299a07J09N9M9J24l36j25J33j05K58r2K20n3j73j63J29n1j5R0k65M11j40O3j09
3322h9J64j35j45K23P8j44K93j58j63k64K86q6j48L22j47mJ47j40K91k3j92J28
3344I4l94Q2J51j6J14k13K27j59J90k54o0J77O8j25j40M82k48m6k23K78J63j13
3366C5m3n6N6l74K91M6N6m9p1J26j24K6J05j57K70k29J0P1q9o5J12O7N8o8K3p
3392B0QN1OL7Jj84k4l7N5K14k10j23j6K21J31m01J05K38j7j77J14o0K8J93m27
3417b54K49K43p8j43Q0k70K73r5q2N7Q2k00L57j10k80l5J51l9K34j81n1K25j06
3440B7J52j84N2N4L0j74q5J47k0j04n3J51J7l57K84ok8j70J0K32M5NK9n0q4KR4
$$ plain form
3274 92 290 -111 220 166 -141 87 -5 6 -2 -55 -34 -3 2 -119 -222 194 166 101 270 179 -42 10 106 212 -107
3299 -107 2 61 110 234 -102 -227 -94 -199 59 -33 187 134 -39 -202 -73 -124 -139 -49 -314 97 -43 20 -89
3322 -89 75 -60 -205 18 96 -48 245 87 -76 -340 -54 -140 -288 34 -113 -117 30 -110 181 158 -34 94
3344 94 -300 -218 -67 -83 31 -182 45 -114 76 -178 -238 -61 7 -118 -258 224 -24 -70 -293 -15 148 35
3366 35 -8 -64 -8 -382 -91 -45 11 -38 -109 17 -107 -81 24 -133 137 -92 -82 -11 -100 -165 -53 14 72 4 27 20
3392 20 28 79 85 122 123 -61 -85 -122 -67 147 -63 -186 -202 19 150 -251 -146 92 75 -102 12 -48 -20 173 -254
3417 -254 -5 238 160 17 97 -173 100 5 -77 -20 62 -138 219 109 -171 -206 -55 -94 140 -41 -92 133 27
3440 27 179 -5 47 101 131 -43 -128 19 -1 -105 -158 -7 10 -347 -63 -69 -97 -267 -257 -25 20 25 54 4 -80 -78 16
3467A6L5J3j52K21j81k7K00k9o1k26K02j8N3l7j32J55J32k21L4K43l67K05k8K66
3491B96k01l0k1j47L13l12%R6N9P1j73lM7n2J59j83L64k74Q8K15k90J73j74N2
3515G3m9k0j05N5j73K56q9J20l7K2k6p8j02J6J23J2JK88j53q2L07l15j71Lo2N6
3541a30J78Q3k27J7n1K14j77l56K65K50j06Q7j44n0J74j11j56K70j35K52k66q0
3563a99K3J20J95L6k55m1J93J41l55K42J11n25L84p1p7J76j58K11k96K02K2m58
3585c79L33K3ok31K58P9j58J25j93K15k3K7q9j17O1o9p6L05k62K09J2J18j57l4
3609b9j8k68K81K6Q7j1J2k26K24l01L27n3L8o6o8j44j0j26L51j99K80K7k52J25
3633GJ26o4j80Q1J90k16K21k70L32l97K41j31j8k4J21j15p2K18J5J09l09J79j08
$$ plain form
3467 16 51 64 -88 133 -48 -75 125 96 35 -191 11 -7 46 9 -123 32 164 -57 -23 220 -147 58 30 296
3491 296 95 65 44 -103 210 -102 -102 -6 53 124 -49 -52 -5 -57 102 -81 283 9 97 312 22 195 21 73
3515 73 24 4 -101 -46 -219 37 -52 68 31 53 27 -51 -153 -137 -14 -2 -1 287 134 52 359 44 -127 -124 -186 -130
3541 -130 48 131 -96 -79 -130 84 -93 -449 -184 66 -40 47 -97 -147 27 -84 -240 30 -105 147 -119 -199
3563 -199 -176 -56 139 175 -80 -121 72 213 -142 100 211 -314 70 -1 -78 98 -60 151 -145 57 79 -379
3585 -379 -46 -23 -29 -260 -2 77 -81 44 -149 66 43 70 -19 -136 -75 -144 -220 85 -177 32 44 162 5 -29
3609 -29 -47 -315 -34 -8 79 68 80 -146 78 -223 104 51 89 23 -45 -189 -199 -325 26 -173 107 134 -118 7
3633 7 133 69 -111 -30 160 -56 165 -105 227 -170 71 -60 -78 -102 19 -96 -168 50 65 174 -135 44 -64
3656f4n6K00k43pJ81j66J09K56k35n31N21J11m26K66R8J50j44P5j87o6K93L7j16
3679E6k04J91k77O0j7K1L24k65J73K9j85n3J95k59M15l51PL5k8J49J43j73K07
3702A93N3l55K26r8L7Q6l6k76J66j72L18j87L6P6K5j86m5K49o6k3J31j85J2o9
3726i0l8P1j21L09n0J1R1j03n3k71K05k84L46lj5k49M64k38nJ30Q7l58M60l70
3750g4P4N6J20q2J75j95n7N2j59J16j46K30J34p3j42R8K09m17O1j07Q7pJ32k6
3774E9r5K39K7j76k4q0j71j08L72j52J83j95N0j8j69P6R1R7j62J77k6Mk80L12
3798C1o6m8j41J49L16j48k00Q3L7k3j16LnJJ0J84l3r0j14J81K02n11L54n6O7%
3824F7o6k41J39oO2mqJ25j77J8N0J31j34j5K32j30m3m5J87j58J3l5j21K10O1l9
$$ plain form
3656 -64 -120 80 -163 -170 11 -155 -46 210 -25 -556 -35 76 -350 -84 14 164 20 95 -92 -158 135 172 56
3679 56 -148 43 -234 -174 -191 -170 154 -111 62 91 -94 -147 48 -211 204 -147 -140 -105 -133 16 159 -14 193
3702 193 246 -109 117 19 56 142 106 -170 -4 -176 142 -45 -9 67 92 -94 -139 110 44 21 152 -33 -21 -90
3726 -90 -128 -57 -178 131 81 92 183 80 27 -244 -39 -323 23 20 5 -244 220 -18 -23 107 194 -164 296 -74
3750 -74 0 56 176 94 269 74 17 69 -90 26 -120 110 244 171 29 127 336 -81 -20 -127 -40 -47 85 59
3774 59 -36 203 230 54 30 -50 -221 -329 43 -109 74 -121 -71 -89 -258 -182 -91 6 -156 21 -5 -1 -281 31
3798 31 -35 -83 -224 -75 241 93 -107 -24 13 -10 -126 -123 -128 -127 -117 67 34 -56 -170 11 213 -298 56 0 67 67
3824 67 1 -240 -101 -107 -45 -49 -57 68 -109 -91 -41 90 -44 -59 173 43 0 -45 142 -16 -3 -38 -159 51 112 73
3850G3j25J67k53N5J45j0j46R3Q6j14%J22j2j79L3J51k45K93n1j95K58qK4j76
3874a4L3L1r9K60k52rK51m9q9k01M09k77j3o4j74O8J71M4O5o8o2J4q1J75l5j17
3900h3j47K77K16k30J04j33j02k51K6J73L07l05J03R6j88Jj75M13q0J5O0J86j26
3923A57j63R7m9j15J67l05P1L04j0n9j43n9J93j97J58m3j03J68L01l72j59J03
3945e8J97j62R9j12J44k03j75K49J14j94J36J71j22k9j6j68J59o6k26L02l1j28
3967a19R1j20K06j58J70j21nN8N5o3K0j14J49k07j5J94P4j04%L04m34j23l1L50
3991E7k04J54P5j14P0O0o9l7j01J90Q5k95K4N0pJ76m8l2P2j67J17j29M8J90j77
4016a2M5J3j83L9J39j93J86Mk2J39nj05j05L9n7J4jqj9K99l19P2k9j64M1M15r5
$$ plain form
3850 73 -52 115 -138 -83 62 52 -94 -1 85 -29 -29 93 81 -98 -65 86 -159 134 83 -112 146 138 162 -14
3874 -14 19 50 -49 211 -41 -50 201 152 63 -138 271 -6 -19 -83 -257 -189 -18 26 91 23 -39 -25 -106 69 34 -83
3900 -83 -230 47 263 33 137 4 -98 -349 -323 -150 157 -148 -45 51 -137 -136 -311 102 22 37 97 283 157
3923 157 -6 91 42 -73 94 -211 -140 164 154 95 -48 -107 86 -111 47 4 -99 69 370 -2 -161 -58
3945 -58 139 -23 76 -36 108 -95 -270 -21 93 -101 35 206 84 55 39 -129 30 -36 -262 40 9 -119
3967 -119 -28 -148 58 -100 70 -51 -56 2 57 -6 14 -100 49 -158 -173 21 95 -9 -9 295 -139 -262 -293 57
3991 57 -147 7 82 -32 38 98 29 -8 -109 81 166 -129 -105 -55 -62 114 66 34 106 -61 56 -73 -25 165 -12
4016 -12 33 46 -137 -98 41 -152 34 38 16 155 150 45 -60 -21 -78 -64 -65 -73 -92 207 -112 -40 -69 -233 -192 223 128
4043A28j89L76m03K57j07J6l4j19J26kk69L78p8k75L65m8J9k51L9Q3k07j3L15
4066A07j71oj18K1J10N1J41l72J34M2j6l8MJ13O8n6J00k11N8L4j68P1o0K35o1
4091A2m2K0M8J22l49J23R0j93K26j05J62j99K1K4Q5p0P2r6j05pK50j14N8k5j93
4116a85J3j2l8J01J63K49k85r2n2M48m51MK12o7j7N5j82N4P0k64K49m4j5N7J42
4141A13k39L82l51M5J36o5j8j97K17j3j22j12J33m5K58j3j15P4j32K16j04p2j1
4164c5J11j08m9J36J7j43M9j74q2M95k49L3Nj61L54j27j42J98k91K74P9M9j17
4187A22p3j25NqJ71K08j42l11K41l50L36r3J30P2j89K12j79rm1p4J93p7j14l03
4211c98M96r4lMk5p1k24K93J7p8k3R8J29j53J61k86M6J17j09R9j07J34O6O2k17
$$ plain form
4043 128 -61 315 -88 169 62 78 44 -75 51 49 -220 158 80 -195 170 122 141 -110 -71 12 -195 -208 107
4066 107 -64 -70 -188 -167 -57 -6 135 -237 -103 -61 -77 -115 -111 2 70 14 114 -97 -39 -5 -173 -102 -162 73 12
4091 12 -30 -10 38 160 -189 -66 24 -169 57 -48 114 -85 -64 -40 45 -25 47 -49 -154 -161 89 -25 33 8 -185
4116 -185 -172 -184 -222 -121 42 291 6 -86 -138 310 -141 -137 75 8 -9 46 -136 -82 -12 -276 -27 -71 -86 -29 113
4141 113 -126 256 -95 -50 86 21 3 -194 23 10 -112 -224 -91 -136 122 109 -6 68 -64 152 48 -24 -35
4164 -35 76 -32 -81 55 72 -71 -22 -196 -278 217 -32 1 6 -155 199 72 -70 128 -163 111 190 239 122
4187 122 49 -76 -71 -79 92 300 158 -153 88 -262 74 -19 111 183 -6 206 27 18 -23 -97 96 19 -95 -398
4211 -398 98 4 1 5 -20 -91 -315 -22 -5 -83 -106 -8 121 -32 129 -157 -111 6 -103 -4 -111 23 89 151 -66
4236f6K41M5k79J7J18j40N3K29oj79k7j31M4K22J37l37O1j74K05o3k34L26p5j74
4260a87J91k4l2J17r8J77o4r8j09J18q4L43n7r8n9M9j34K29q8J9j57pN8l77L07
4285f5L48k42k91N05k53q3R8j86J54k64J51K32n7l4J4j52Q8K7M3J68k23M0P0k86
4309a98K53Nj07J8J67J5m43L13k54L62j08j42K53j95O6m8K70k54L06l76J64J23
4331A90r4j89k1Rj9O0N8R4k6r6Q5k50M33j25n4j75J39r9J97l02M1J28J13j75j84
4356b62K28J93L7l03J67l01J67K19jk86Q8r9J46K79j91j06L1M3j17J46k34m8L36
4379A32j48N9p3J57j82K13l41j62O10k32j2J8j76J90j58p0J54j7M3P3pO8l03J54
4403a0R5j91L35j61k58K0J47N7K8L9j94J44k73K14j14n9K19j23P7q6J39j74L18
$$ plain form
4236 -66 175 220 -59 -42 76 -64 -11 218 212 33 6 -125 -81 141 278 -59 2 -172 33 -30 -264 62 -13 -187
4260 -187 4 -20 -52 65 -33 144 80 -18 -127 -9 -93 250 193 95 36 85 -49 180 92 111 -46 -53 5 -372 -65
4285 -65 283 41 -250 255 2 -81 17 -169 -15 -279 -128 104 47 13 27 -125 -37 -10 33 201 -22 18 88 -198
4309 -198 55 60 -47 -29 138 153 -290 23 -231 131 23 -119 134 -61 5 -43 227 -27 279 -97 67 190
4331 190 96 -93 -114 -105 -124 -64 -6 88 62 -34 51 -199 234 109 55 -120 19 -80 117 -185 -144 -16 97 -78 -262
4356 -262 -34 159 196 -107 60 -241 -74 145 144 -142 -54 -153 -7 272 81 -25 6 49 -68 78 -156 -204 132
4379 132 -16 43 -30 127 -55 158 -183 -345 265 33 21 39 -137 53 -105 -175 -21 -38 5 78 71 139 -164 -10
4403 -10 85 -106 229 68 -190 -170 -23 34 62 101 -93 51 -222 -8 -122 -181 38 -85 -8 -94 45 -129 189
4426A89j96j13J34Kp4j00n9J09J75l9p5J43qj93J80R5m37M52j65k91L83k6J03
4449A89k64K34ll9p8pL5L1j41K88k38l2K50q1l25k9J1K31J75k59j56L05JL5o1
4474G2j78N1O3j51O4J88J0p4j59O4j98K66J4j00J10j22K35l28K15r4L5O2j12J02
4498C5J36K3j14k96K55J08j96k89M24k57L36j53m1j00o1J22P2O0Q8Pk32P1K0J67
4522A85r2j44l8r1K12n8j07L22l28Q0J10J4o2j17J01q7K26j98M7j05K10j59j24
4545b03J52J64l5k5J26j97m1J63l74n0L26j95J77kl5J20J78l34J81J1j41k3P2
4568A5l15J72J89n4n1K55j96K23m01J86K50j28K6j29j1j32K69l78M27k59p8K16
4590I6L0j75J84%j99j94J38o3L54j43OP9j48O2k31O5r8K06k4P8k1L2k06J10m1
$$ plain form
4426 189 -7 -120 14 16 -58 -158 -217 -108 67 28 -47 96 88 -105 75 170 -267 185 20 -271 112 86 189
4449 189 -75 159 156 117 39 32 67 98 -43 245 7 -25 225 144 -181 -210 -199 32 207 -52 -208 97 98 133 72
4474 72 -106 -55 8 -143 -79 109 119 45 -114 -50 -248 18 32 -68 42 -80 155 -173 42 -52 -17 45 -67 35
4498 35 171 194 80 -216 39 147 -49 -338 86 -171 165 12 -29 -129 -190 -68 4 64 152 159 -73 -2 18 185
4522 185 93 -51 -89 -180 32 -26 -133 189 -139 -59 51 65 3 -114 -13 -100 126 -72 -25 -130 80 -79 -203
4545 -203 -51 113 78 53 179 -18 -59 104 -270 -320 6 -189 -12 -14 -49 71 249 -85 96 107 -34 -57 15
4568 15 -300 -128 61 7 -44 211 15 238 -163 23 273 145 171 42 31 -101 168 -210 217 -42 -120 96
4590 96 126 -49 135 135 -64 -258 -120 -183 171 28 34 113 -35 27 -204 -139 -237 -31 -55 23 2 34 -172 -62 -103
4615a03J23j64J75q6N6N8r7J06j77j91K28K83l71%J90j49K94J3k10J71l02K49
4637I6j30o0J20R1j18%J02K8o7k9q6n9m2K07j11K0K72m44L5M60p8j32l4o2q4P2
4663c3l9j64J43J90l8k57K97q9j13l5L05n5k94K76j32k4J10J02j60J76k04J3J29
4686A04j43J6O9j66L6L07k99L4o2p0J52K13k14j98J88K50j26j2K50j06k97K74
4708B00P1k07J29n3j87K3r0J61k9j21M03l36K96j66q7p8RM7j36k50L81k0J3j30
4732a57J22M6l70L65j82KK79r4j51K24L1j15J15L6j34n3K1K0J71l08L43l93L73
4755A91j97K3J44k92lN2K24n6l76J19o5J42J51j16L0Ml4L1p3M5K3K85n7l85K77
4780H7n4J51J71k82J1K9l0K4J0mj81j54J30J67lN9l5q9p8K09k1l0K14l40n6J72
$$ plain form
4615 -103 20 -144 31 -55 1 59 -38 68 -109 -300 -72 211 -160 -160 30 -119 175 188 -22 149 -153 96
4637 96 -34 -94 26 117 -1 -1 101 129 62 33 -53 -112 -154 53 -58 -38 234 -210 -175 285 207 75 41 -21 -105 -33
4663 -33 -72 -236 -93 97 59 -198 99 10 -103 -138 167 112 -182 94 -38 -62 48 150 -10 166 -38 -25 104
4686 104 -39 -23 46 -120 -84 223 -76 -42 -104 -174 -22 191 -23 -221 -33 217 91 79 329 223 -74 200
4708 200 271 64 193 140 -47 -24 -114 47 18 -103 300 -36 260 94 7 -71 -62 -15 -151 -401 -20 -40 -27 -157
4732 -157 -35 11 -359 6 -176 -174 105 11 -140 84 115 0 115 151 17 -36 -15 5 176 -132 211 -182 191
4755 191 -6 17 161 -131 -134 -82 142 86 -290 -171 -236 -94 57 -59 -29 -25 -59 -28 -101 -56 -33 252 195 -190 87
4780 87 33 184 355 73 84 113 83 107 117 113 -68 -222 -92 75 72 131 96 7 -71 138 117 87 301 -39 -95 77
4806G7j26O2j13k18L01pR7Lj93P8K20J59m36J96j95J28m7k26J32q0L08j68k51
4829b99O37k85P8m47J77J88q5l49N81J9m72J93K1O3K40k07k97K40k9o8l7J87L1
4852H0J10k91J92j46j07l6J13O1K4K82r8k60K3N9R4L0j48R9l10L17J18k70J13
4875D9k36J32m8J21r0K22m9k63J20j40L60m17J33P9o3N3N2K19O7m18K66Ok01K4
4899b2L0j50j94M11q1k53K24K21j00Q6j54J08p4j24Q8K82l06q6o0%J66j4L15j55
4923A58j63M5j28J09J8q2K7J89o1j54J60K1j18P2j76J40J28k14N2j66O1J75K0
4946A13l3j13J48j04K20j50J5p0J16m0O0j83j64K83j53J2rJ64k48K86j92j7m9
4969a08K23p8j26J64l7K6k26L61N4l58O5N8j44J50j40J49J83k09n4j21%J11J01
$$ plain form
4806 77 -49 13 -100 -318 -17 -24 73 76 -117 -39 181 340 -96 100 -95 33 -14 -240 -108 -188 120 -48 -299
4829 -299 338 53 131 -316 -139 49 -36 -385 196 215 -257 -64 -43 20 260 53 -244 -4 -33 -101 -138 49 80
4852 80 190 -101 91 -55 -162 -198 -85 -24 0 282 184 -76 -53 6 100 130 -18 81 -229 88 206 -64 49
4875 49 -187 -55 -103 18 -72 150 101 -162 -42 -182 178 -239 -106 -27 -90 -37 15 234 301 -117 149 155 -46 -22
4899 -22 8 -142 -336 75 -6 -259 -35 186 86 172 18 126 52 -72 16 298 -8 -94 -154 -154 12 -2 313 158
4923 158 -5 40 -88 21 39 -43 -16 173 112 -42 118 139 21 93 -83 57 185 -29 23 -143 -82 93 113
4946 113 80 -33 115 11 231 81 96 26 142 102 162 -21 -185 98 -55 -43 -52 112 -136 150 -42 -59 -108
4969 -108 115 37 -89 75 38 64 -162 199 253 -105 -40 18 -126 24 -116 33 216 7 -47 -168 -168 -57 44
4992D4M9l4J2o6J36l19j21L17k21K64j98k4R0L33k09J51p9k86N8J37j53O2N5j8
5016b0J22m7J58k17j6J4j73L14J1k1p1r8m9k7L05j42k34K26P6k14K16q3q6J81
5040A25rj17OJ01J2k16K17j12L5kj75L10p5m7J12q9Rk73K41j16K51o8J44l14l0
5065h0N8r0J27p5j58K90j36J7J32Km9j1QJ36k59Q8j2m3J44k37N4J08j25L16j39
5090F6R2j91J49k35p2L14p8k0k30K21J0P1o1m8o5l0P0k3KN11n20J13oj74L8o5
5116a61K17on2L23j55j11j77J61J0K7n3L6j1J86j67k4l1J36j52j00L02l61L02
5139A39M1k37K90kj72J40p1k39o9J82k4J19j77K55j1m78L9N24j21k02L33l04j8
5162f3J91j94J17n4l4m3K8Q7m05N10Jj98k18J13M7L6n7M00j25o5j31k08L87j58
$$ plain form
4992 44 93 59 71 5 141 -178 -299 18 -203 61 -137 -161 -71 262 53 204 125 -161 -103 34 -119 -57 -2 -20
5016 -20 102 55 213 -4 -20 -6 -179 135 146 125 54 -44 -93 -120 185 43 -191 35 111 -103 113 30 -56 125
5040 125 116 -1 5 106 118 -98 119 7 42 40 -135 175 100 53 165 76 85 -188 53 -63 188 120 264 -50 -80
5065 -80 -22 -112 15 -60 -218 72 -64 -47 85 87 38 27 35 171 -88 0 -12 -55 89 -148 -94 14 -111 205 66
5090 66 158 -33 116 -119 -191 123 45 25 -205 16 26 97 36 -12 -77 -107 -37 -60 -58 453 -67 46 40 -134 -96 -161
5116 -161 56 50 -2 321 166 55 -122 39 49 76 23 59 48 234 67 43 12 148 -4 -104 198 -163 139
5139 139 180 -57 233 231 59 199 128 -111 -180 2 -22 97 -80 175 164 -314 -275 249 128 -74 259 -45 -63
5162 -63 128 -66 51 -3 -37 -80 -52 35 -370 140 141 -57 -275 -162 -115 -79 -136 264 139 74 -57 -265 122 -36
5186c6M0k89M22k20J69j20L6M1r5J3j04M58k29j76L04q4k61M35m99J20j28M20
5208B17m71J25n7P3J88l1M4k5j96L45k19oK06k29J61j16j46rJ36k44K85Pl2J12
5232A18k66q4L33J7j41r5O8j34K02j49J03Ok00R0K23j87Q3lK0qqJ54m7j58k30
5257b93J73K26j77J5o2K34j8k33K58N9q9j70L33k42k13LJ52O7P0k78K46K21j43
5280A39j38Q3R6k41j26K30L1k51J02L11l66J44j83o6K32l13Q3L67N6j19l00J30
5302i9j34J08J31r3L7pl84N55K3J62l00l3k3J01N1k36J59K42p1l6J23l85n9K42
5326G4kP8l26J51K70l20R4r4k9K7O9p5K40r9Q3j81j23j30R1K46j16P4j03j60K61
5351@j02J59L6j53q0L08K8j47R8l95L11j34j37L66j66K85j50k53J51J35l0j76
$$ plain form
5186 -36 4 -285 137 -83 86 -34 2 43 -52 -39 -143 315 86 -90 214 130 -131 304 -195 -75 -203 217
5208 217 -254 -129 -186 -113 75 44 88 63 -133 212 -7 -13 193 -36 125 9 -137 -146 -10 -254 31 38 6 118
5232 118 -148 -232 101 118 -23 -118 -50 -184 18 -131 -28 -22 -222 -132 91 -96 -13 -16 4 -4 -12 142 95 -63 -293
5257 -293 -120 106 -71 -56 -118 116 98 -135 123 182 93 -77 256 14 -199 -196 -44 23 93 -185 61 282 139
5280 139 1 84 180 -61 -187 43 74 -177 -75 236 -130 14 -169 -235 -3 -316 -233 134 190 71 -229 -99
5302 -99 -233 -125 6 -87 -50 -57 -441 114 137 299 -1 -34 -57 44 95 -141 18 260 189 153 276 -109 -168 74
5326 74 72 150 -176 -25 245 -75 19 -75 -104 -77 -8 -83 157 58 141 -40 -163 -293 -202 44 -72 2 -101 -261 0
5351 0 -102 57 93 -60 -140 168 196 49 147 -248 63 -71 -208 158 -8 277 127 -126 25 160 130 -46
5373d6K63j3q5l9k8K11m8j26o2j48K70k84o2J30J39Ol2J50l76r7J94j56L85k60
5397a14R7K38j68N4r5N5p8n9K70R3l53j0J34m6R6j30k3J81Rj83k66K63l6L53j38
5422A44p2K6L9j13Q8k24L94m22N4no5J49l5L2j95J43Q4p5j66K71P5J72l47J6r0
5447a22L24k76J10j32M0lr1J61L0k4n8j18J76J64j72J12l05J33m4R2M2l0p3j28
5471a92K65k08J33Q6q9j38L59l34k1j45L14j78J69J5P8l49L70O9j02j55r4Q3J6
5494d8k49J76K17j88j09n7L01j4j33j16L07j67J32p3O1n1K51l44K13j62j50Q4
5516a19NK23M8mj6l3oK3j63K60j66j78K41j46Pk2Q7P2K1n3L9m3k04J15q4K24O1
5543A89j70K53k77J25j24o4P8q8j06L69n15J36R4K29l4p1l9K36j48l2r7k1J52
$$ plain form
5373 -46 217 204 119 80 52 263 215 89 27 -121 149 -135 -197 -67 72 78 46 196 -180 -277 -83 -239 146 -114
5397 -114 -17 221 53 107 12 67 -11 -70 200 293 -60 -70 64 18 114 -16 -39 142 151 -32 -298 -35 -71 282 144
5422 144 72 98 137 24 112 -112 282 -140 -86 -91 -156 -7 -42 -10 -205 -62 22 -53 -219 52 127 299 -48 -32 -122
5447 -122 202 -74 36 -96 -56 -59 -150 11 41 17 -41 -159 17 181 9 121 -184 -51 -95 -3 39 9 -64 -192
5471 -192 73 -135 -2 84 -5 -143 216 -118 -139 -284 30 -148 21 36 114 -235 135 204 102 -53 -147 -64 -48
5494 -48 -297 -121 96 -92 -201 -258 43 29 -104 -220 87 -80 52 -21 40 -11 240 -104 109 -53 -203 -119
5516 -119 -114 109 157 153 137 104 98 121 -42 218 52 -126 115 -31 -24 -46 41 113 134 81 120 77 -127 -12 -96 128 189
5543 189 19 272 -5 120 -4 -68 10 -78 -184 185 -330 -194 -100 129 95 24 -15 221 73 41 -56 -77 75
5566G5P2k75L66m05K52j19N0J77k16K25k14O8l3r9j8kJ05J24j89%L30j86J72k54
5590FN7M8Ok8k80J48K42l03J66k5L7j22J80k17m5K52k11J49o5R5j60R4lj99J06
5615g2j85K48r4R6P0m7LQ1l10K57k77J91j06J63rJ41j89k5K53k07j24K25l15P1
5639a61K15k09J03N3Q3j68K93l37L18k47j22L56l08j6K05m0P2j9j33j6j07J54
5661c1M7O0k02K51K5j86J38R7j40p9M6k05J25K1j72K42j32J04J29m8Q2j98l7P9
5685A6n9L0K49k46j11J19J53j62k05K9K44J28m16J20R1Q0j64r7J63K21n4j98L5
5708c4o7L2MJ44j38J72Q3j37N0o0R5o6m0K4j23O1l9J10k00M05l37L4k71J10L78
5733A90l01M1J34q7l9J89j15J52j45l05L7K19K24j82L5K2J8N8Oo3j61J31q3q8
$$ plain form
5566 75 147 -128 238 -167 85 -34 16 193 -23 202 -12 56 23 -76 -94 -96 9 133 -56 -56 274 88 260 6
5590 6 63 111 117 89 -191 -43 199 -104 62 37 74 -48 132 -85 -130 122 -89 60 -5 90 -70 24 21 -178 -72
5615 -72 -257 -9 -103 -7 63 16 19 100 -210 47 -230 -39 -145 18 9 150 -39 -64 189 -18 -142 83 -232 -161
5639 -161 54 -155 -52 1 84 -84 209 -128 190 -57 -179 177 -131 -147 58 18 90 71 -62 -78 -185 -31
5661 -31 16 76 -126 125 150 -36 102 199 59 -20 26 -179 -54 -33 -205 37 -95 9 138 90 172 -26 -63 16
5685 16 -43 -13 236 -10 -121 -2 151 -11 -216 -187 57 185 -231 -111 -20 60 -104 -201 -38 183 129 -69 -34
5708 -34 -101 -69 -65 79 -59 113 196 59 109 49 144 78 38 62 -61 0 -39 71 -129 276 -61 -27 -298 -188 190
5733 190 -111 -70 64 -23 -62 127 12 164 19 -286 -249 -30 194 12 47 69 87 145 151 88 -73 58 -25 -113
5757a13r3M08j61N5o0K47j92j91J52J08J92m25J7L39m29J86m3j31K22j8N0l%J15
5781B32j80r3p7Q0J21J46k68j20K65j84j31L11N0j49j30P4q6J55J86j49J77k20
5803A0K09j99j96J6J83k41K24J22O3k89K6K33l15J53j04J61lj14J24j61M30l22
5825A0J42j39L2J86j91J11j88j17L90n50L31j03J85O6m3j17RJ67k29J0P8k62J10
5848a12j47J16L08l12K5N08k05J9r2r3j93O0j40L88J64m10J10J44k03p5K03j67
5870a04J56j33K66l58J42K09l80o6J4N11r4p0k5J2j00r4p9L20K7j55M9p5k1rJ10
5895E3k38K58k70k8J15Q5Q3j4M2q8M2j11k9k3J89J79k00j81j43J23L9K19r5J71
5919A78j22k49L76Lj73j90j27L55L7J3n2k37J01p2q6J29M20l95K70l21m2K28k96
$$ plain form
5757 -113 -206 202 41 96 36 283 91 -100 52 160 352 -73 -56 283 -146 40 -3 -134 88 70 120 117 117 232
5781 232 52 -41 -118 -38 83 229 -39 -159 106 -78 -209 102 152 3 -127 -53 -139 16 202 53 230 10
5803 10 219 20 -176 -160 23 -218 6 128 191 -98 -72 161 -154 -1 -105 56 53 -61 63 -98 332 10
5825 10 152 13 45 231 40 151 -37 -154 236 -314 17 -86 99 165 122 5 14 181 -48 -38 40 -222 -112
5848 -112 -259 -143 165 -147 -122 386 181 200 108 15 -178 -118 -258 130 294 -116 -6 138 -65 -140 63 -104
5870 -104 52 -81 185 -173 -31 178 -202 -268 -254 257 163 93 68 80 -20 -114 -193 127 154 -1 48 -27 -48 -57 53
5895 53 -185 73 -197 -225 -110 -25 58 44 86 -2 40 -71 -100 -123 66 245 45 -136 -279 -156 -117 102 7 178
5919 178 56 -193 183 186 13 -177 -304 51 88 101 49 -188 -87 -159 -245 -116 304 -91 179 -142 -184 44 -252
5942b52L35q3j7o3K00k72K15Mj62J61k19J31P2r5K59l30J72P3l0J57k21j77M28
5965B86m13L99l37J48J66k7k3m63J55Q7j79K25m9N9Q6q7pk64L20M1m0J26l22p6
5989a89L09n2j34O4K31j96J8J8j64O8q6L83J4k12j3j55q8K77j13N8O9k42J96p8
6013a7RN9L7J21l55K49j20J99n4j99J20J26j20j03J73n3j83p2L03j65l9J41M2
6036I9j7j50J13K09L9l95p6Q0K6K64j61J1KK46k63k63J50M7j20O1N1%K3j12Q4
6061e2KO3j74J52L2j13j02K08M0n0OL05l90J81L5j82J60Pj41j00j35J35J44Kj69
6086a36J38q1J77l12L61k04n9j28Q3R5l2QP8mj28N17m39K02r9o2J07j1N2M4l9
6111A28k12J64k08K56j89J43M0j11j51oL36k73K37j61q7j0J23Pm9K52k24K81k75
$$ plain form
5942 -252 83 0 -17 -80 120 -152 63 67 -95 66 -153 -22 50 -45 214 -116 56 129 99 256 35 -142 286
5965 286 -127 272 -65 83 249 222 199 -264 -109 -22 -201 24 -25 34 120 33 26 -238 82 123 83 209 -113 -189
5989 -189 120 68 -66 -2 229 33 51 69 -95 -27 -113 270 284 72 59 -96 -184 93 -20 38 107 -135 61 -17
6013 -17 -8 51 88 209 -146 103 -17 182 128 -71 49 175 55 -48 125 72 -111 -183 120 -45 -84 57 99
6036 99 82 -68 45 254 293 -102 -178 -98 -72 192 31 42 44 290 27 -236 -86 -39 -159 -98 -47 -47 -24 -136 -52
6061 -52 -50 13 -161 -9 23 -90 -192 16 56 6 12 317 -73 108 143 -39 121 128 -13 -113 -248 -113 31 33 -136
6086 -136 2 -79 98 -214 147 -57 -116 -244 -161 -66 -98 -90 -12 -16 -144 373 -66 136 37 -25 82 71 123 167 128
6111 128 -84 80 -128 128 -61 82 122 11 -140 -146 190 -83 154 -7 -94 -104 19 26 -23 229 5 286 11
6134A1j76O1n7L15j27J65k17o4L16j68k88N8L4M4p1J64j91K50J60m13K10j03J45
6157E8k0q3J05l08K65p7J80j37lj74K51j72K82lj4j23J2J22j74mM1J38k80J84
6181F6o1j51L6J64J14k70K96k23R4J2l9j08J63j20j69R5R0k28N0L03l46K81J46
6204A95j89O8K5k04K03j82KN5Pk2J04N4q1M3K2r3j16L01l49J11K7O4Q8k71K10
6229G2Jr7j4J28Qj71J02O5j44j44J75k8j99K17K45k92K9N1N2M0M7k60k8L73k61
6254c3j52K15J52l08O0j42L71k83J52p2K11o8j43K04j71j39q2K02L8Q3o5p8K19
6277A71p6l66K83O1m4J72Pj35J45o2n2j02J13j51j78J79j6M4k1j99K52n9qK20
6301A78k34P3P4J06j5J70o02L18j43L1p9k3Q7M9j08K35k28k61M99j31M3k0N7J17
$$ plain form
6134 11 -165 -104 -161 154 27 192 -25 -89 227 59 -229 -171 -137 -93 -164 0 -191 59 219 -194 16 -87 58
6157 58 38 -45 60 -248 17 -60 120 -17 -20 -194 57 -115 167 164 150 27 39 161 -13 -17 24 162 -118 66
6181 66 5 -146 -110 54 168 -102 194 -29 65 77 38 -70 93 -27 -196 -101 -11 -239 -189 114 -232 49 195
6204 195 6 74 99 -105 98 -84 -82 -27 -20 -42 62 116 35 78 100 7 -109 192 -157 -46 -19 45 133 -138 72
6229 72 73 -24 -38 90 98 -73 29 94 -50 -194 -19 -47 -246 -29 216 -76 -47 4 56 96 143 -117 -145 228 -33
6254 -33 -185 30 182 -126 -66 -208 163 -120 32 -40 171 103 -40 164 -7 -146 -228 -26 12 95 30 -48 171
6277 171 95 -271 12 73 29 201 208 73 218 156 104 2 115 -36 -214 -35 -51 -7 -28 -227 25 -34 -42 178
6301 178 -56 17 91 197 182 352 -250 68 -75 -44 -123 -146 -59 -10 -118 117 -111 -372 127 -4 39 19 76 193
6325A93j79r1J58M0r7J25j42n5p9K47k0J9N1j73j02R4J40l97J97J93rk49P5L14
6349B53n8j20L6K26l56m0n2N0L2Q9p3m6mJ75j44L62l08j70J57j13L18j37r3J22
6373A06L2l38J76K31l41K54n1k84L53q4k34N3n8o0J90J18j57L30j70n3j92K61
6395H2n0l1J10n1n6j55K71j63J91l3j22j39O7q7M2J32k40R6k4K07l1J54k50K66
6419A86k6j24j59J23O4j91K25J74l78L1j15J28K71j39j32J30K7k47J19J24O9j45
6441A5q9L8J99k37L9R8k31L9n1K46K1m4m9J08R6k30J60o2j62R9R5k05J05J26j75
6466e1p6Q5M26m52J43O0r0K1l48K61RK75l97K46p1j22oP6J74k46M8M0J73j46L3
6491F5p5Q6j05n0L7Q8O6p1K79l83m1J62L8p4p0J53j34O4k6j46K15m43L83n4n7
$$ plain form
6325 193 14 -77 81 121 24 149 7 -48 -127 120 100 119 170 -3 -105 -11 129 -268 -71 122 113 -136 -61 253
6349 253 195 75 111 337 -19 -59 -111 -61 -29 60 -13 -59 -63 112 -32 330 22 -148 9 -104 214 77 -16 106
6373 106 138 -200 -24 207 -134 120 69 -215 138 54 -180 -127 -185 -245 -55 63 -94 236 66 13 -179 82
6395 82 32 1 111 60 4 -151 120 -43 148 115 -7 -146 -79 -166 -124 8 -232 -136 -160 47 16 170 -80 186
6419 186 160 36 -123 0 64 -127 98 272 -106 -75 -190 -62 209 70 -62 68 95 -152 -33 91 160 15
6441 15 -74 -36 163 -74 -35 63 -168 -129 -180 66 87 43 -6 102 198 -32 128 66 -96 3 98 -107 -2 124 -51
6466 -51 -127 -42 384 -68 75 135 45 66 -282 -21 -12 263 -134 112 41 -81 -87 -11 163 -83 -35 5 178 32 65
6491 65 -10 76 -29 -79 -42 46 112 41 320 -63 -104 58 96 22 -48 105 -29 35 9 -137 78 -365 18 -36 -93
6516i3L39j00n9j51J83j95KJ76r4K4P9Q9j31n8j19M8P7M7R6k47J32j4j33K88n0
6541A36j00k2l4r4J59O4j60K3m40M70n6J73j58J9M0o4N6O9k16M3J9K36k00J16
6565G9p6M5L7j7j37J71j82K2q0O7j26J46M3k9j09j19M26l90M60j2j67n2k48K77
6589B9j61J29r2l3L8l2L94j47n2q9q9J25j6J75k57j6j89M84k46p0R2k29K45j55
6613a62J72L0o3J33k35P1l11oM65k11J53k51L63k52J93j74K61J64l15l1m7j70
6635b23K68O4k22L1MJ4j10J68J71k04j56L85j94Q6K7j38J59j93K00J75m13P3k09
6658b37J49K47k10J44j25p6J15j00j61K70J95j18R5m45J12M01k87J37Q6j91r8
6679i7K09j74o7L3K01j06n7m2n0K10J37k36R8O2j51J67l4j43L2k83K11P7j35L43
$$ plain form
6516 -93 246 146 87 -64 119 -76 -74 102 8 32 111 200 69 11 -108 -60 17 64 160 -87 45 31 -102 186 136
6541 136 36 14 -20 -114 45 109 -51 -28 -468 2 -54 119 -39 -20 20 -44 12 81 -135 -92 -73 163 -37 79
6565 79 3 48 85 68 -69 102 -80 -58 -138 -71 -197 -51 -8 -37 -146 -265 161 -229 231 219 52 0 -248 29
6589 29 -132 -3 -95 -128 -90 -122 272 125 73 -16 -105 20 4 179 -78 -94 -283 201 -45 -115 -23 -252 -7 -162
6613 -162 10 40 -23 110 -125 -54 -365 -371 94 -117 36 -215 148 -104 89 -85 176 340 25 -6 -53 -223
6635 -223 45 109 -113 -82 -78 -64 -174 -6 165 -39 -195 190 -4 82 109 -29 130 -63 137 312 -101 -28 -237
6658 -237 -88 159 -51 93 -32 -108 7 -93 -254 16 211 93 188 -257 -145 256 -31 106 192 1 -97
6679 -97 112 -62 -129 -96 105 -1 -58 -100 -150 60 197 -39 59 121 -30 137 103 -40 -8 -291 -80 -3 -138 205
6703B05l35J43j19J06k2J7J09j54j36L61j30jQ4j09Q1j17j28K14l64K23J63j75
6725h4j10K57%K9N3j82K26k49L9k2L07n8k67kQ7J2j7k5Pk6QKJ32N1k50m6J36p9
6753g1K2k03J91n3L10k80J4J0j43J21J82q3K81k80J19l98J57nmK66j17r7j19L44
6777A64k47L28j29j06J82j26M3M3j93K84l22j65J02P6rk6J19o1L5M1j09J67j19
6800b8J6J95k18J42k30K78j74j12J85R2k89P9n7L7L35m29K87J78j98L9o4k95L11
6823H0k99K88nO5r5j36J72j5k23K38K6j63j16J76J11k26Q4R7j2j5lJ46k37L78
6847C16m48J15j67J14q7O3L43k96M1M8j31m3J34j0l3joo1J24j2L47l82K73l91
6871a50K22k57L17rl77L23o1pP8J35k29J2R9j66K37J45n08L71k2j96J88J52l63
$$ plain form
6703 205 -130 13 -106 0 -22 -5 104 -50 -186 175 45 44 128 19 100 -17 -145 69 -295 -72 91 -84
6725 -84 -194 63 63 92 145 -37 189 -60 -21 -43 264 206 -61 -63 24 36 19 -6 1 -25 -17 -15 117 168 -82 -128 8 -71
6753 -71 -49 -252 -61 -114 196 -84 -70 -60 -203 -82 100 17 298 18 137 -261 -104 -109 -113 153 36 -61 -180 164
6777 164 -83 245 116 10 192 66 109 152 -41 243 -79 -244 -142 -66 -75 -101 18 -43 -8 33 -76 91 -28
6800 -28 -12 183 -35 107 -123 155 -19 -131 54 146 -143 -64 -121 -84 251 -178 109 287 89 128 64 -231 80
6823 80 -219 69 64 129 34 -102 70 55 -168 70 96 -67 -183 -7 104 -122 -38 59 47 32 29 175 -62 316
6847 316 -132 -17 -184 -70 -157 -94 249 -47 -6 42 -89 -132 2 -8 -41 -42 -48 -109 15 3 350 -32 241 -150
6871 -150 72 -185 132 123 -254 69 8 1 79 214 -15 -3 96 -70 167 312 -196 175 153 -43 145 297 -66
6894f6o3O08o65J79J84j66j06K30j82rR8P5j20n9K65rn5mj17j65M8P6mo7p3J49
6920a8N4j43m2q9J80r1L64l10M8J0l0J16K5P9j41j43L78m12Q5J77j25L9l6J07
6944H2q1J45oj06K5qJ32k42k48J07N0J9J33j25K64n8R6k10Q5l97L48K87k46J70
6968B16j97j02O7N0kk41L07k8J30o3j88L65l84J58j55K04k60K18n6N1j90K9J68
6991I7J1p8k9j14L8k7M5K23k62KJ37K1r7Q1K5j34j05J11P5Q1J19M8k71r3J03K61
7017B68k67p9N9p6k2p9N5J04J58j9j73M4P6N5k1O1N9j86j6j13K75J34n05L16j24
7042a6J47j69q1L70k17j32Q9K0%k82K50j88L01J92j39l91K63J67l7Ok89J81k30
7065a85J99P4L8k09j60K57J9L0K45l76J32j00J88j06q8J06m2j9j82K47lj08r4
$$ plain form
6894 -66 -129 479 -186 -7 177 11 -95 135 -47 -56 42 117 -3 -62 203 194 139 135 18 -147 -99 -23 -27 -94 -167 -18
6920 -18 36 -107 -149 -238 -58 -149 215 -95 -47 -37 -67 49 74 153 12 -131 247 -165 -80 97 -28 11 -25 82
6944 82 1 146 140 34 59 51 183 -59 -307 -200 -150 -131 2 -123 141 83 179 -31 54 -343 5 292 46 216
6968 216 19 -83 -16 34 32 -209 98 70 200 137 -51 314 -70 88 -67 137 -123 95 39 90 -100 -71 97
6991 97 108 30 1 -113 -75 -102 -57 166 -96 -94 43 64 -33 48 73 -61 -166 -55 20 101 220 268 -3 -96 7 268
7017 268 1 -78 -19 -95 -117 -196 -141 -37 121 102 -71 -27 49 104 83 144 203 17 1 -112 163 297 -208 108 -16
7042 -16 131 -38 -119 251 34 -98 -9 11 11 -271 -21 -209 92 284 145 -246 17 184 147 153 -136 45 -185
7065 -185 14 88 126 -83 -243 14 33 63 308 -68 64 -36 152 46 -42 64 22 3 -179 68 65 -43 -137
7088a37J83Q0j30n5N1j11rK5K13l32J37J95j64Q8R9j46q4j60K93K6l6J23j91k53
7112b95K91K9k00O9K04J5J9j07q3J37J0J5j12J5n9J70j25M9k3j44M38j19l22J00
7136b8M9L7k16J91q8J09r7K89l21L57m1p7j98k38L85R2l57r3J01J38j36M8j57
7159b51J96K58j28n1r7J26LM0k18L22m21L30l05J73O9J37l71J78j11O9Q1P5J4
7182A18j66J06L9j83r5M04l49K82k31K09k55J35r1nJ75j5j05M7nN4k8lj89m4K56
7207F1j00j30J93k8L2J83k14J59L0k10O0j32q2J37P7J57j34O0j73J78j19PO8P8
7231A58l8M4l19J64p6q8J95j42k1j1J06q8K50R9k84K49k77k44M92l59k4P7O6J99
7255A28m58L04N1j23r0N1J37R3j4J57l05P5j90p4M31l38jP7N1L4j5j07J16j24
$$ plain form
7088 -137 46 126 -4 -59 -8 -119 -128 -103 110 -222 -85 110 -54 34 133 -13 -97 -257 36 62 26 149 -42 -295
7112 -295 -4 25 -175 -106 98 113 132 25 -58 79 89 104 -8 7 -52 118 -7 42 19 -125 313 194 -128 -28
7136 -28 21 58 -158 33 -55 54 -43 246 -75 282 241 164 -34 -272 113 205 -152 -245 -144 -6 -142 -94 -251
7159 -251 -55 203 75 24 -73 53 56 96 -122 200 -221 109 -196 -23 46 183 -188 -10 -121 -52 29 104 118
7182 118 -48 58 97 -86 -181 223 -126 156 -75 134 -121 14 -77 -82 93 78 -27 20 15 69 41 38 -151 -195 61
7207 61 -39 -169 24 -4 28 211 -3 156 186 -24 36 -96 -178 -41 36 193 59 119 -54 124 5 12 80 158
7231 158 120 164 -155 9 -67 -155 40 -102 -123 -134 -28 -116 134 233 -51 198 -79 -323 169 -190 -214 -137 -71 128
7255 128 -330 -26 25 -98 -188 -137 0 93 79 236 -69 6 -184 -258 173 -165 -166 -89 -38 -4 -19 -126 -10 -134
7279a34P8k48N54k95n7K06l6K09m80lM28j56j98J9J74k10j43L24M5P0l32K53k36
7302a68ML71j17p4q6N5J62j40K6q9n0K26k91K15R8q4o4k54L63l18J16r6K70q4
7326iL6k17Q2J23j8MN3M3m7j7N2k24K18J47l58J69J25N3j12j23RM1j73J58l38
7351c23K74J3O5P4p9l7m0O6J58Ll76K05j23J21rr1K23k56Q6j1J5J92j36R5o6j3
7377C0k07K71j76mJ26j34K54j30p8J13j33J00l7R0Mj2k35K46j34J1n5m2L52k68
7401d8J08L8k93J66o8j68K33N2N7l3K8q6lL6J56k93J75K03m08K15k18J33J88j41
7425B9K03l83J79M9q1J35o9k43K36l01J48P7J61j21J6M3l9P3j00o8J09j70J63
7448D6k60J38j5J69j58pj74K70K85k31j78J67j99K79l2O6L0m13K32r0N0J80M5
$$ plain form
7279 -134 -56 -304 250 -45 -102 104 68 277 -203 -206 222 66 -132 -113 61 -149 -292 32 77 147 -185 68 -168
7302 -168 -164 207 90 16 -70 -15 147 7 33 -56 -106 120 -171 44 142 58 -6 -260 103 -215 -99 -195 75 -9
7326 -9 27 -190 -108 15 -3 1 54 97 50 33 85 -139 79 226 -132 37 162 215 103 -20 -11 30 -143 15 -323
7351 -323 -49 -36 29 103 24 -13 -53 13 171 174 -202 3 -120 1 -8 -99 124 -132 -46 -57 -42 150 14 109 43 30
7377 30 -177 94 -82 -86 40 -94 160 30 -48 65 -68 32 -5 85 89 77 -158 88 -46 -35 -90 -132 220 -48
7401 -48 60 98 -195 -29 -97 -265 -32 20 77 44 72 -14 -17 19 175 -118 57 260 -148 67 -151 -18 170 29
7425 29 232 -151 28 77 -4 131 62 -181 55 -246 -98 -21 140 19 35 78 39 112 12 -56 53 -117 46
7448 46 -214 -76 -91 78 -80 -87 -261 9 294 63 -115 52 -147 132 100 166 196 -217 15 -75 -25 155 200
7471B00k46ol3R6o2L6R6j3j39J0j0J96r5j29l9K47j41J61P9j52j49k43K78%p0
7496a28J69j69J5J47r0K00q7o5p8L23j40j65O7J9K08l50O0q8J59l1l7Q2l99L95
7520A7J75j84Lr7N5k5J02o9n5J48j8J53k73N6J0P9J01J13l48M7RK8l7j17K02p5
7546@j70J65j36J95J26j69q8K31J22k40P5Q3k92J23om2M6RJ37k82p8K40p3n5J80
7571A01K7l3k02K06J14m48L51k21L40j98k9j38m8J74j38J45j96O4j12M18k05L98
7593C70n03j48K85Q8k58M0q8J28k0K8k5O6N0k2j01J02k06L52p6J35k74l0K05l02
7617b04J99M5N4k66L69j43J21l48J27K4j00J08m0J04l16L23k13Q9j9L25k68k99
7639c28M81p7l3r3K6RO0J7l6K29m95J95j70K10J28k87K53k7J14k65j6j31J26P9
$$ plain form
7471 200 -46 -52 -85 11 -51 -15 81 68 -71 -61 -71 125 30 -99 -138 109 -32 129 208 56 -93 -336 -58 -58 -128
7496 -128 41 -128 -113 34 -56 144 57 -8 -86 237 97 -68 -1 18 226 -124 -64 -152 7 -24 -61 21 -378 17
7520 17 192 8 11 -86 -31 -56 46 -23 -78 70 52 205 -68 -12 -2 77 178 291 -57 -10 -1 27 -10 -127 75 0
7546 0 -170 -5 -141 54 180 11 -77 154 276 36 111 194 -98 25 19 -23 23 32 169 -113 -191 49 -24 -79 101
7571 101 128 95 -107 99 213 -235 116 -105 235 37 8 -130 -178 -4 -142 3 -193 -129 -241 177 -28 370
7593 370 -133 -281 4 92 -166 -126 -214 -86 -106 -78 -103 -37 13 -9 -110 -8 -214 138 62 197 -77 -107 98 -204
7617 -204 -5 40 94 -172 197 54 175 -173 -46 -22 -122 -14 -54 50 -266 57 -156 -67 -86 239 -29 -328
7639 -328 153 76 43 -50 -24 -15 45 62 26 255 -240 -45 -215 -5 123 -164 89 62 176 -89 -105 -236 -110 -31
7663c1P4j3j7l67L07k16K97K14l96K03J45R6n14J51M7K50j63O2k48J28k72O7j4
7686b10R6L18p2j78l29M18p3J86N7j79K1r5N2O4N0J00k99N4r3J90k22J72N0K6
7710A04k12J37p6k17K56k14J66J61k14p1L53k84J80n1k44K84j71J92j78K25l03
7731a77J41Ln6K40q1q9m5rl6L31l08K04Q9j92K63j91R6l5J1j68JK44j17j48n0
7756g9k09K60J71j63j8R5q3p2o3QK15j6j32j30K80n5p2kP5k37K89J46m32M22J3
7781B11k82j81L50j5j04L96m49O1l32K49K87k46k18M47m32L28n6R1l87L23K04
7802B45k78J08q2r0J98j54l9L50m4j73P0j80k6J4N2K17k27l0LN7q4J02k47N16
7826B78m94N1O9p4k9P3K05P3J09j47j31M2nj01J9J74k1n3o9M8J0j90J74k23P4
$$ plain form
7663 -31 43 30 13 -354 -47 -263 34 248 -148 55 200 296 -218 -67 -20 230 67 129 -119 9 -263 -196 -210
7686 -210 -114 204 132 -46 -375 43 -30 156 213 34 55 -40 12 76 126 226 -73 -19 -112 78 -144 28 78 104
7710 104 -108 29 -47 -264 -8 -222 -56 105 -109 -180 173 -111 69 18 -226 58 -113 79 -99 126 -177
7731 -177 -36 -33 -89 151 70 -19 -64 -73 -109 222 -86 118 207 15 278 87 183 148 159 -9 -8 236 119 -29 -79
7756 -79 -288 -28 143 -20 -38 57 -26 -98 -161 -153 62 46 -86 -216 64 9 -63 -65 10 -227 62 208 -224 198 211
7781 211 -71 -252 98 83 -21 375 -74 -13 -345 -96 191 -55 -273 174 -258 70 14 105 -282 41 245
7802 245 -33 75 -7 -97 101 -53 -92 258 214 41 111 -69 -95 -81 -29 188 -39 -69 -66 -9 -93 9 -238 278
7826 278 -216 -165 -96 -170 -199 -126 79 152 261 114 -17 25 20 -81 -62 112 91 38 -31 17 27 -163 11 -212 -138
7851a38J39J84j91jj36O2R0J30o%j34l6R3m3j06K08k42jJ27K6L52n74M5j98L1
7876c19J14J24K5J91j58l4J6K90m10J44k69P6k0N35j95j51O0j9n3O3O0J4m0K81
7900C25j17k60pk00J90K46j32q2oj01J98n6r1J74k7j07J45j61j04K90j41L2R0
7923I8k19J80j9k15J37p0qJ46M1m3J32l99K67P5k44J20R9J9k21J82n8L12j75j7
7947A20l41R8K9J92K7k71K57j27q9m3L21m52K71J50r0j57O7k7J10j22o68O80K54
7970A89k32m52P99k53J28m69J64j94O94j28k32l49K58N16n15O94p09q2K15j23
7990h1L67p1k32l1K80p4n36M63P0o2J88j0K92j15q84M86K14n2n80O15k06L04n48
8013b03M70M38r76L72K16n1J8k80l50Q31n21MM6J95K3n24N90k48j26R1n09M89
$$ plain form
7851 -138 1 185 -6 -7 -143 -81 9 139 133 133 -1 -37 56 13 -93 115 -127 -128 -1 25 377 -197 -152 -350 -319
7876 -319 -205 -81 -56 135 -23 -57 -41 249 -161 -17 -286 -210 -230 305 110 -41 19 0 -53 10 70 84 44 325
7900 325 208 -52 -59 -259 -69 177 45 -37 -43 -144 54 -2 -93 81 54 -53 92 -69 -173 117 -24 8 98
7923 98 -121 59 40 -175 -38 -108 -116 30 71 28 160 -239 28 103 -141 -21 78 97 -124 58 0 312 137 120
7947 120 -221 -123 -94 98 125 -146 111 -16 -105 -148 173 -279 -8 142 52 -105 -38 -65 45 -77 -745 -65 189
7970 189 -43 -495 304 51 179 -290 -126 -320 374 246 14 -335 -77 439 -76 618 -91 -173 42 -81
7990 -81 286 215 -17 -48 232 158 -378 85 155 93 281 271 563 448 -436 50 264 212 -368 247 41 345 -203
8013 -203 267 705 -271 101 317 266 284 4 -346 485 -36 -32 14 209 232 -292 298 50 -76 15 -494 -5
8035eQ5O34j84m37m93M54j76J17k0j95P71n15O37p82P6k12K47R4k59K27p8j6j15
8058a45L51k91j32K42p6K27k96J93K1m7n6L24m01j28K73N7j59J03k8L4k18Q5K63
8081A96k10j03J31J85n5nk39q6K22K2j47M8o7J89o6r7J22J6J87k31J10k56L7K6
8105g1J18N5j64P7L32l32RK6j63K01j58J36m25L65J6N7m7j18J09o4J87j43j73
8128a70Q2J83R6r0j08j21M87k31k09K27j31p8PK27k61j8J67j94J4J15k47M91k75
8151c7Rj90K56k19P4K87m23L06j0j43N2Q6j0k28L77p4l65J62N2o4n1L12j06J40
8175A93k28J24r2p7J98l65L89j42j13J99j25K6l7Q5j85J80
$$ plain form
8035 -5 80 714 530 93 -400 54 -122 -5 -25 -220 551 36 673 -109 -33 -245 2 96 -163 64 -14 -30 -145
8058 -145 206 -85 -217 25 -51 176 -120 73 94 47 -9 315 -86 -214 59 116 -43 60 32 66 -152 -67 196
8081 196 -14 -117 14 199 144 139 -100 -186 36 58 -89 -41 -108 81 15 -82 40 56 243 12 122 -134 -97 -71
8105 -71 47 102 -62 15 347 15 24 50 -113 88 -70 66 -359 6 22 79 32 -86 23 -41 146 3 -170
8128 -170 -88 95 191 101 -7 -128 359 128 -81 146 15 -63 -56 171 -90 -108 59 -135 -121 -6 -253 238 -37
8151 -37 -28 -218 38 -181 -107 180 -243 63 53 -90 -38 48 38 -190 187 113 -252 -90 -38 -102 -153 159 53 193
8175 193 -35 89 -3 -80 118 -247 142 0 -113 86 -39 -13 -50 35 -150 30
8191C0
$$ Imaginary data points
##PAGE= N=2
##DATA TABLE= (X++(I..I)), XYDATA
0@%%%%%%%%%%%%%Qj6J6j6K2l0L3m1M9n7P2q6J00j16J34j53J77k05K31k63L00l41
35a82L85m33M87n45O10o83P62q44R34j035J146j266J396j539J696j869K060k269
53a189K500k757L047l373L743m168M659n239N934o785P857r251J1153j3928J8410
68A0613k7290P8700j73400q859Q6040l9383K54040n6402k14159K1972k6095O4865
80b9358K01904j08492j04751j2315p2070J31032J39461j07507m3774n4515n7426
91a17811J43382P8499o3066k7531r0841j6114J24639L6701j5358l3397j04302
102h5199J5148R5327K2333J3414m7508r3590K8285O4202K7600K4356n9803p3053
114f8488K8133M0791L8689K2771o4515n1701J8871K7591M8483J3634n9999l4612
$$ plain form
0 0 0 0 0 0 0 0 0 0 0 0 0 0 0 8 -8 8 -8 14 -16 17 -24 25 -32 40 -46 54 -62 72 -81 96 -109 122 -141 159 -182
35 -182 203 -230 257 -288 322 -361 401 -443 491 -544 602 -664 732 -807 889 -980 1080 -1189
53 -1189 1311 -1446 1601 -1772 1971 -2197 2462 -2777 3157 -3628 4229 -5022 6131 -7797 10613
68 10613 -16677 62023 -111377 -120236 -34196 -73579 180461 124059 -90100 -68128 -94223 -29358
80 -29358 172546 64054 -40697 -53012 -125082 5950 145411 37904 -5870 -60385 -117811
91 -117811 25571 104070 41004 13473 -77368 -93482 31157 67858 52500 19103 -85199
102 -85199 -70051 25276 47609 61023 13515 -80075 -51790 12412 40012 64368 4565 -68488
114 -68488 -40355 436 39125 61896 -2619 -54320 -35449 -7858 40625 54259 -5740 -40352
126d0352M613K3826N4218K424m9746k4760p836K7022N0913n152l5219k4819j3989
139c8857L2599M1128o689k2591k8803j4270L5176L0054k431j5651l3619r236L2304
152h86K1692L928j4324l4024l623K5429J7532R924j6708l0950M01J7270J7727
165A3388J2081j9116k5053K03J1441J9665J1345j9509j9309k074Q561K0963Q394
178B0980j7275j4729n299P639K1433M894j3709j2263p936Q738J9245K805r646
191D877j1830q883R766J6000K390o201j2665q264R894J2746L218m345j3256o552
205a3105Q929J0252M286l596j3382m671P511Q239N600l997j1864l605N277P509
219C383O383m588j0237l147L564P444O618n212q490k720K394P443N438m571o507
$$ plain form
126 -40352 -35739 -11913 42305 44729 -5017 -29777 -37613 -10591 40322 35170 -49 -24868 -38857
139 -38857 -6258 34870 28181 5590 -23213 -37483 -2307 27747 25316 9665 -23954 -33190 -886
152 -886 20806 24734 10410 -23614 -27237 -1808 15724 25648 8940 -22010 -21609 -4339 13388
165 13388 25469 6353 -18700 -18497 -7056 12609 23954 4445 -14864 -16938 -8377 12586 20980
178 20980 3705 -11024 -16323 -8684 12749 17643 3934 -8329 -16265 -7527 11718 14523 4877
191 4877 -6953 -15836 -6070 9930 12320 6119 -6546 -14810 -4916 7830 11048 6703 -6553 -13105
205 -13105 -4176 6076 10362 6766 -6616 -11287 -3776 4463 10063 6066 -5798 -9403 -4126 3383
219 3383 9766 5178 -5059 -8206 -4642 2802 9420 4208 -4282 -7002 -4608 2835 8273 3702 -2805
234b805l540J434P895M125l813n562l984J729P357L021k511m965m202J755O537
249B471L011j674n074m449K016N424K917j133m618m046K329M111L018r36m656
264a289k959J486L611L276r73m426k457J060L460K935q38l891k233N46L259L026
280C593j117l183k237N19K938K434m81l007k203L41K763K250m40k427k115K81
296b091K323K109o47j816k062N8K535J561j14k174j969M54J967J643j13j857j647
313a840K09J492J871j00j878j232J69J271J690k52j498j515K83J173J429K2j440
330a46j100k83J397J399J17j484r67l15J156J169J81j216r13j31J152J188l4j002
348A68j119j16J156Q76J57q53j131j17Q44R80K17p01j248Q9M52J217q6p47n92
$$ plain form
234 -2805 -6345 -4911 2984 7109 3296 -2266 -6250 -4521 2836 5857 3346 -1619 -5821 -4066 2471
249 2471 5482 3808 -1266 -5715 -3699 1725 4642 3509 -1109 -5155 -2826 1285 4303 3367 -1289
264 -1289 -4248 -2762 849 4125 3152 -1274 -3731 -2671 789 3724 2886 -1005 -3238 -2692 567 3593
280 3593 2476 -707 -2944 -2425 513 2947 2466 -541 -2744 -2403 360 2610 2170 -257 -2372 -2091
296 -2091 232 2341 1694 -122 -2184 -2126 409 1970 1856 -318 -2287 -1833 134 1777 1664 -193 -1840
313 -1840 -1631 -139 1732 1632 -246 -1478 -1309 -38 1652 1400 -98 -1613 -1330 -157 1272 1294 -146
330 -146 -1246 -1529 -132 1267 1384 -100 -1067 -1382 -226 943 1124 -92 -1005 -1136 16 1204 1170 168
348 168 -951 -1067 89 965 1122 269 -862 -979 -135 845 1062 361 -887 -798 -346 871 785 38 -554
367e54l64N52Q76L93m86j053k88P84P13J17n27o43j15J31P82M56m89p15j42J61
387d11P90J60k88p13k62M78P53K0j92o23j15J67L88M37m59m00k71K89O21K87p38
408h2l43J12J71L15M81m55m68J2qM99L3R2o72o1J33M83P7k82k30k62L46M59k4
431C26J6o63o4K30M53j80J36m41R1q3M91jp7l97p8J88JM59j26j80k41K1K73J15
455B69K6l09O1k79K68J60O8k54k94j19M67J0J45n14K36J41L0L6Kr5j24k8J72o7
479HJ72k53l24M09L2J30k82o4J66p9m1L15K8j98j75l62M91mPK29l92K73mN5j60
504b3o9K0M4J6N6l12L18j18J70j18K7J34k17J06k0N2k3q7N5q2L9k95M25L8k25
529h9L7m3J42k6m9R4Rm33L07K7J78q8k34K76J64k13J3R9k05N7K3M3Q2j08R9n18
$$ plain form
367 -554 -918 -366 510 903 417 -636 -924 -140 573 690 163 -480 -595 -464 318 774 285 -430 -572 -411
387 -411 379 539 251 -462 -724 -246 507 527 335 -288 -403 -236 152 589 130 -270 -541 -252 369 656 -82
408 -82 -425 -313 -142 173 654 199 -269 -257 -265 234 267 359 -313 -374 -241 242 319 37 -193 -455 -109 350 326
431 326 342 -321 -385 -155 298 118 254 -187 -96 -179 312 311 234 -163 -241 -53 -52 407 281 101 -140 -119 154 269
455 269 295 -14 47 -232 36 196 264 10 -284 -403 64 74 219 -295 -59 82 112 148 150 55 -69 -97 75 8
479 8 180 -73 -397 12 44 174 -108 -172 -6 -85 -126 189 217 19 -156 -518 -27 -31 -24 205 -187 86 82 137 -23
504 -23 -92 -72 -28 -12 44 -268 50 -68 102 -16 11 145 -72 34 14 66 43 -44 11 -71 -32 -327 98 136 -89
529 -89 -52 -95 47 21 -28 66 75 -358 -51 -24 154 66 -168 108 272 59 72 171 -34 23 46 89 171 63 162 -356
555c56M57r2J05n5j00j80K83k35L33J72k8l55J17L3J7L5l10J10p7P8kq1J67n2
579a6P6k28K69R7k75L8P2k95K84Q2j54l8ml3L37k48J56k38J72q9R9n7J20j73L8
604hJ57l91J83J05j00mp5MK78k8l66J42J72O4K5k96K73n9p4J80j03j56J48J08
628A79j01k12J44l14N08j32j97J03joJ61j04P6l96O97k57k53J02n0k86M01Q6k09
651f1J15J62k10K00l08K9o7L31m41L85rk53R1n0P6l2J2K04p9q6n6K05j76J29j19
676hN1O5j24l3K54l73J9K60l83L92k1N2k41J02j61J85J5O6k1j6NJ2p0K04n2l31
702a52J64r3L3j44L91j13j13j60N26l53m2p0J95q8P0j68J69N5j70R7k01K59n8
725C4j84K85j19r3J09qkl6j5m7L1L77n06J25N1Q4r5L07k78J04J5j13j14L80j84
$$ plain form
555 -356 101 9 114 59 -41 -221 62 -173 160 332 304 -51 66 99 116 151 -159 -49 -126 -48 -50 -131 36 -16
579 -16 60 -168 101 198 -77 -39 33 -262 22 104 -50 -88 -92 -125 212 -36 120 -118 54 -35 64 7 127 -46 -8
604 -8 149 -242 -59 46 -54 -58 -133 -129 149 121 -245 -103 69 133 158 -138 135 76 2 182 79 -77 71 179
628 179 78 -134 10 -304 204 72 -125 -22 -23 -29 132 28 104 -292 405 148 -105 -3 -53 -339 62 148 -61
651 -61 54 216 6 206 -102 -73 -140 191 -250 135 126 -127 -36 -86 -10 -42 -30 174 95 9 -47 158 -18 111 -8
676 -8 43 108 -16 -49 205 -168 -149 111 -272 120 99 151 -90 12 -149 36 51 117 96 80 85 97 27 231 179 -152
702 -152 12 -81 -48 -192 199 86 -27 -187 339 -14 -56 -126 69 -19 51 -117 52 107 -63 34 -167 92 34
725 34 -150 135 16 -77 32 24 22 -14 -29 -76 -45 332 -174 -49 2 86 -9 298 20 124 139 26 -88 292 108
750A08J18k77n3L4J94m3J30j96l35L54J24kj57K16l01K07j5j22j70K31jk32L04
773A16j31m0Q6J04J6l22L35O1k99J38p1j2j25K97j82K57k32J40j03J05k93R6o8
796a27n2K56m5K4j11L2oL9J56k15Lk12M8K58j19K17k12L31q2k29K64k63n2N7J11
821G1k20J73j82L78j26k47J66j77M9Q8n2j1l8N3l6K01Q4l25L23l66N7J25K80m06
845a38J41r6O7L03l34l4J94o2m3J73k17j66K48qj28OkJ74l58L21j48R7Lq0N1n4
871i0NJ6O2J63R5j89k69L20j64jJ43j57k3q5K09P4J5q6k36J47J21j19K96j27j71
896e1K40k53J73Rk40K60j77J9l7M5j7J28k98J39J84j21j47O8K43Mrq1k41L68j14
921I4J90k46N3j94L16j03l45K14m3J45n3J63k93L43k46J80K5k24r1J75Rl41J36
$$ plain form
750 108 226 -51 -104 -70 124 81 211 15 -320 34 158 156 -1 215 -86 121 106 -16 -186 45 44 -188 116
773 116 -15 -55 31 135 151 -171 164 225 -74 64 -7 -19 -144 153 -29 228 -4 136 33 138 -155 -59 -127
796 -127 -179 77 32 56 -55 -23 -29 10 166 -49 -46 -258 -210 48 -71 146 -66 265 183 -46 218 -45 -97 -40 71
821 71 -149 24 -158 220 94 -153 13 -164 -115 -27 -79 -90 -128 -75 -111 90 174 -151 172 -194 -137 -12 268 -138
845 -138 3 -93 -26 277 -57 -91 103 41 -2 171 -46 -212 36 28 -100 -94 -96 78 -280 41 -107 -10 -7 -87 -36 -90
871 -90 -85 -69 -7 156 251 62 -207 113 -51 -52 91 -66 -89 -174 35 109 124 38 -198 -51 70 -49 247 120 -51
896 -51 189 -64 109 118 -122 138 -39 -20 -57 -12 -29 99 -199 -60 124 3 -144 -76 167 171 162 81 -160 208 94
921 94 284 38 91 -103 213 110 -235 -21 -64 81 28 191 -102 241 -5 175 200 -24 -115 60 69 -272 -136
944a36J01P9p7O1j28J31j20J64p9J28J1R0k73J61J8k89K04P1j19j48Q3j53M51
967B31k03p3j64L51k99L15p4J27k73L1j08J39j13p9P0K15O8k04o5J00J77j40J5
990D4k05J95K3N6r3l5J09j08J42k2j30L26k91k17R9J75r1K35l60K36r0k2K4p6
1014g6L18k67J47j38j54J02N8p5J76k07K65j52q3N5k7q5K00j21J92n01L86N4j3
1037E4k31L40Jk57P0O3k0K31l70R9M3K12k99J47j17J24o1K67j36l00K9K04j56
1060f3n0Q2O1o8j24J85J45j64L31j62j57M5K9M5k1j22J33L5p2j00J19m3j35J53
1084H2L00l24j89K5O1r4P9O1J31Kj77j23J70j7p0L1N2p1M1K3J27j15j83L47j7
1109A52J83j58r9N4q0R2k21m6L39j85j06J39l2j78M33k24j22J75j63o6K33l54
$$ plain form
944 -136 -35 44 -33 28 -100 31 -89 75 -4 124 135 225 -48 113 131 -158 46 117 -2 -150 -67 -220 231
967 231 28 -45 -209 142 -157 158 84 211 -62 -31 -139 0 -113 -192 -122 93 161 -43 -108 -8 169 29 44
990 44 -161 34 57 113 20 -15 94 -14 128 106 -24 302 11 -206 -107 68 -23 212 -148 88 -2 -24 0 -76
1014 -76 242 -25 122 -16 -170 -68 -10 -85 91 -116 149 -3 -86 -31 -58 -143 57 -64 128 -373 13 67 54
1037 54 -177 163 164 -93 -23 40 20 251 -119 -20 23 235 -64 83 -34 90 29 296 160 -140 -111 93 -63
1060 -63 -113 -31 30 -38 -162 23 168 4 335 173 16 61 90 135 114 -8 125 160 88 -12 107 64 -71 82
1084 82 382 58 -131 -106 -45 -139 -60 1 132 134 -43 -166 4 -13 -83 -52 0 -71 -30 -7 120 5 -178 169 152
1109 152 335 177 78 132 52 144 -77 -123 216 31 -75 64 32 -146 287 63 -59 116 -47 -113 120 -234
1131b34K61j29J97J54k40R6r7k11K13j90O1n6K64k21J10k60L88k81J79m4K76r3
1153A43Ol29L47o0l12L8L93o0l97K44J0r3J33O9m8K3k10R8k35J96K09j9p5N8j63
1178c4K82k42k9J54l98N43n30O8K49q2Q6J88k48j06J50j32o1K61j85J46J47j31
1200I6j60J69l85L26j64O6j03R4K53M5k86m1J02N1K4j89J38J89k38J2j36J08j40
1223a69J74O9J68k68j0oJ11k36J33O5j61K44N4r7l7M3J5o8j04P7j77K58n0l8j43
1248a53L84j33k68l9J60l2K62l8k72PJ90p1j05N5M4J78k16K1L9K42l84j23L81
1271A29j51K68k04k12J39K9j52M0O4P3OJ24j12j10J82J0j83Q8r2j0j61J18L7m6
1295a26l9J71r3KKJ17p4J07j38J81j59QK31l13K32k05O7r4O9J66J32k44n8n6J06
$$ plain form
1131 -234 27 -102 95 249 9 105 8 -203 10 -180 -119 -175 89 -132 -22 -282 106 -175 4 -40 236 143
1153 143 149 -180 167 107 -205 -167 226 166 -231 13 23 -70 63 132 84 107 -103 -5 -240 -44 165 146 71 129 -34
1178 -34 248 6 -23 131 -267 276 -254 -186 63 -19 67 255 7 -99 51 -81 -142 119 -66 80 227 96
1200 96 -64 105 -280 46 -118 -52 -155 -61 192 237 -49 -90 12 63 87 -102 36 225 -13 -1 -137 -29 -169
1223 -169 5 74 242 -26 -36 -42 69 -167 -34 31 -130 114 168 71 34 77 92 24 -80 -3 -180 78 28 -10 -153
1248 -153 231 98 -170 -209 -49 -81 181 143 -129 -122 68 -3 -108 -53 -9 169 -47 -26 13 255 -129 -252 129
1271 129 -22 246 42 -170 -31 -2 -154 -114 -50 23 29 153 41 -69 113 123 -60 28 -64 -74 -235 -117 -80 -126
1295 -126 -165 6 -87 -85 -83 34 -40 67 -71 110 -49 -41 190 -123 109 -96 -29 -123 -54 112 244 0 -58 -114 -8
1320hj4J15m8J77j56MJ0J20j51O3j33o8L41m69L84l16J42J45k65j21K86m0j27
1343a29j5J66j8r2J66p4K05j12j73P6K3j66L85k41J07j6M4j49p8K41m7o9L9M4
1367A17k62J31L4K55l05k1J46Q6j81L4J9j05K03k03O4j83K44j07j37K71o4N8j07
1390a3j51m8L26k34K10j71J30j23Q6j72O7K52n0k20J73j35j34J30j5L15n8M8k11
1413Bj80J24L8J31j15M4j98K46K1j25n9J07p7J80J3k34J28m5p0J79R1l34J76K5
1437F8K19j82j64J30M3L0j67q3J26l1m4j08K6M0J39n9j13l6K41l2l2K85m54K98
1461A40l93K44n5LK30m17M44k84j81L52k87K68J18m03K71j9j93K98K06l51j08
1482a17P5K29p7L6j88MK21j27k04L68l10M1J39PJ54j89m0j9J1m5j56L79o5p4J13
$$ plain form
1320 -8 -22 93 45 222 66 70 80 200 49 112 -21 -89 252 -217 167 -149 -7 138 -127 -248 38 -2 -129
1343 -129 -144 22 4 -88 78 4 209 97 -76 0 23 -143 242 1 108 92 136 -13 -91 150 103 34 73 117
1367 117 -145 -14 20 275 -30 -51 95 181 0 34 53 -52 151 -52 12 -171 73 -34 -171 100 36 94 -13
1390 -13 -164 -212 114 -120 90 -81 49 -74 12 -160 -93 159 109 -111 62 -73 -207 -77 -92 223 165 213 2
1413 2 -178 -54 -16 115 0 44 -154 92 113 -12 -71 36 -41 139 152 -82 46 1 -69 110 201 -133 43 68
1437 68 287 105 -59 71 114 144 -23 -106 20 -11 -55 -163 -137 -97 42 -17 -130 -166 75 43 11 296 -158 140
1461 140 -253 -9 -64 -61 169 -248 196 -88 -269 83 -204 64 182 -221 50 31 -162 136 342 -9 -117
1482 -117 -42 187 110 146 -42 -38 183 56 -148 220 -90 -49 90 97 251 62 22 3 14 -31 -187 192 127 53 166
1507A66l07L07k06M6K33j36M1l21K89j73J6J51m9k12J67r2J36k7n4p0m7J23l7
1530e6K5k22R5r1L57q4j86J0J80Nm5k03L54j06J32k69J82m4j22j41J97J52k0q8
1554A2l8K17m6k78J02P4L0n1o9L1l42L29lQ0j50J91o6j09J71k78J91J15j31O4
1578D6OJ6k08R4M9j87J6J5l8L69k3k18P7l0j99K09k06K41nJ07j23j54Q6J00Q0
1603A20k07kJ51l8p4J49oQ1k20m1J60k62R6J52J54j95n5J58k29J94n8j13R6J88
1627A99j10O9k92J33l3J05nk5J69k24K01j92o3j6K31l92M18j83J82n6k05J31r3
1650e1ML0L5j13K2l6J05m1N1J17r5QK5j39K44o4l49K50q6j07J31J38j0O5Qk65
1676a23qJ12q1J52K33k68j61K14J28j70M2j26l4K05k64K20k02J33q4K17j33Q6
$$ plain form
1507 166 -141 166 -40 6 239 103 144 -177 112 -61 -45 106 57 -155 12 -80 56 29 -25 -95 -142 -19 -56
1530 -56 -31 -253 -158 -249 108 24 -162 -152 28 33 -12 -215 139 33 165 -104 78 34 -88 -229 -32 120 100 12
1554 12 -26 191 145 -133 -31 43 73 22 -47 -16 -358 -29 -32 48 -102 89 23 -86 85 -193 -2 113 -18 46
1578 46 52 68 -140 -46 3 -184 -168 -153 -191 178 155 -63 14 -16 -215 -6 -212 29 24 131 8 -146 -60 40 120
1603 120 -87 -89 62 24 -50 99 93 174 -46 -87 73 -189 -93 59 213 18 -37 121 -108 86 28 -85 11 199
1627 199 89 158 -134 -1 -34 71 66 41 210 -14 187 -5 -68 -84 147 -245 173 -10 172 116 -89 42 -51
1650 -51 -47 -17 18 -95 -73 -109 -4 -45 6 123 28 36 61 -78 166 102 -247 3 -83 -190 -59 79 69 134 142 -123
1676 -123 -131 -19 -100 52 285 17 -144 70 198 28 70 -56 -90 115 -149 71 -131 2 -82 135 2 88
1698H8O8Q0l69%L36l00J54j62K45o5Pj74J99o0j94J52l7K62m04J70j4K41j09l41
1722b27N27j27l00K10k25J48L9j41L5n4K20k61J80j11jJ63j14j13j2J0j43J54
1744a43L12m20K61Jj37K94l5k41J44k9J52j25K3j66Q1K08q4M2P2l59j07L59L2
1767A35p3n3K18o6r3j11l9k9K5j40J98k36K98J2k40J32K7j11P0K10l95K74J2q9
1791f4J02Pj12M71l97j73n5J16n1J17J56j31j17N9J08o0K10k03J33j18L4J6j40
1814i2J37k18kJ6J15o2qM8M7K6j48J54m4L3J5p7J35M6j09J10J20j68m8L1m3j45
1840a31L24k87K10m5l44L52k86L4Q9L00Qn16K25P1O3n5r6k36N33j23k68J96k5
1863gp2o2K94j38k5N9j00R8m0%K7k4J03l9j60R9J96l74J48n5K13j52J52k63K10
$$ plain form
1698 88 156 236 -133 -133 203 -97 57 -105 140 75 82 -92 107 47 -147 5 -32 230 -174 -4 -18 223 114 -227
1722 -227 300 173 -127 83 -142 6 45 -96 -61 -115 105 -156 24 -87 -88 75 -39 -152 -164 -154 -297 -143
1744 -143 169 -251 10 11 -126 168 133 -108 36 7 159 34 57 -109 -28 180 96 138 210 -149 -256 103 135
1767 135 62 9 227 161 68 -43 -82 -111 -86 -226 -28 -264 34 46 -194 -62 -35 -146 -76 134 -261 13 25 -64
1791 -64 38 45 -67 404 7 -166 -221 -105 -156 -39 117 -14 -131 -72 36 -24 186 -17 116 -2 32 48 -92
1814 -92 45 -173 -175 -159 -44 -106 -114 -66 -19 7 -141 13 -31 2 17 -60 75 121 12 122 242 74 26 57 14 -131
1840 -131 193 -94 116 71 -273 79 -207 -173 -84 216 224 -292 -67 4 67 12 -84 -320 213 90 -178 18 -7
1863 -7 -79 -141 153 15 -10 49 -51 47 7 7 34 10 113 74 -86 13 209 -165 -17 -72 141 -11 141 -122 88
1888H8Q4l9j06O0r9q8n3J47k41L20j28m9J07j25K24j0o9j93J37K85k96K7j08K70
1912A45j28q5j40L94j11k29P3Q6k0j21K39j60j36K45j70J55Mj35K9m3K2K97j24
1935H7o8L4j24O5m7K07k11J53j44J64k41J14J01k53J99P4M7j07k40NN1O2J17j81
1959a36O2O1J57j36k49K31K58j67O7l81M61l71J58L6p3n0O0R8j51NK3K50l40J31
1983DJ34p5M4L4l35J53K58j38k44Q1Q3k8Q3J58j85J22j4M0j85L10l37k29L84j64
2007d6J15L0j36j21J94o5P8j53l9r2M39j34p1j27L13j96K1l3r5j32L68O2j43M3
2031H0qJ1K0j39J27J15j15k46J18l53O04j74j52N19n90P1J60k13K77l01L38j10
2053C9J5j34J96k19J67m01M37n4J03j50Q9j74J28K5j94K62j35J07k82n4J89O9
$$ plain form
1888 88 172 133 27 87 -12 -100 -153 -6 -247 73 -55 -104 3 -122 102 92 23 -170 -33 252 -44 -17 -125 145
1912 145 17 -68 -208 186 75 -154 -81 5 -15 -136 103 -57 -193 52 -118 37 41 -94 -65 -108 -86 211 87
1935 87 19 53 -71 -6 -53 154 -57 96 -48 116 -125 -11 90 -163 36 110 157 50 -190 -185 -134 -72 45 -136
1959 -136 -74 -13 144 8 -241 -10 248 81 148 -233 228 -143 15 51 -22 -72 -12 86 -65 -60 -37 213 -127 4
1983 4 138 63 107 141 -194 -41 217 79 -165 -84 -1 -29 54 212 27 149 135 175 -10 300 -37 -266 118 -46
2007 -46 69 99 -37 -158 36 -29 49 -104 -143 -235 204 70 -1 -128 185 -11 10 -23 -118 -250 118 180 37 80
2031 80 72 83 103 -36 91 206 91 -155 -37 -390 214 40 -112 407 -183 -112 48 -165 112 -189 149 39
2053 39 54 -80 116 -103 64 -337 100 46 149 -1 88 -86 42 67 -127 135 0 107 -175 -229 -40 29
2075B9QK13l82OL44l32J92M6r2l5j9p0k4l1J33q4p2K63p5QJ70j57K4r7K0J24j71
2102f1J52j09J01J3j37J49j39J47k63J53J0P2k56J26j63O5J50l4J34p2J7r8oO5
2126A6J07K0Pl2k74K82j92K32J8j86j46J43L4m3k02K61J25j50m5j06K13k96Q5
2149a29J68oK16k17q3J94j77N6N5p3j0K00K5q4k03p9K35n8K07m24J69J03m2O6
2173A09k6j14k02L35k14L55j33j6m1j52K45J0m41L10k6q7K99n47L86q9M6k70L63
2196A00o6J33p0k14R4J01j46K83j93J30K0K9q7l96J53R3J81r1J03K2j74L3j10
2219g2J16k82K64J56l13J02J74j67Q5j42J36k61K82p9K4P1n7j8M1j16J94k53J4
2242a01M25l03P2j93J27lR3j99JJ29k8J44n3M7j99j3J30j31J71n9q8J54j34Mj5
$$ plain form
2075 29 37 250 -132 -126 218 -114 78 124 32 -3 -22 -92 -116 -147 -14 -98 -170 93 18 26 196 39 63 -34 -14 110 -61
2102 -61 91 -18 83 96 -41 108 -31 116 -147 6 16 88 -168 -42 -205 -140 10 -24 110 38 55 -43 -49 16
2126 16 123 143 150 118 -156 126 -66 166 184 -2 -148 -5 29 -14 -216 45 170 20 -25 -131 82 -214 -129
2149 -129 39 33 249 32 -51 143 -34 22 77 4 -6 194 219 135 -68 -147 88 30 237 -187 -18 85 43 109
2173 109 83 -31 -233 102 -112 243 110 94 53 -99 146 156 -285 25 -1 -88 211 -336 50 -39 7 -263 100
2196 100 34 167 97 -117 -23 78 -68 215 22 152 172 201 114 -282 -129 -36 145 54 157 179 5 38 -72
2219 -72 44 -238 26 182 -131 -29 145 -22 63 -79 57 -204 78 -1 23 94 37 19 60 -56 138 -115 -101
2242 -101 324 21 93 -100 27 24 117 -82 -81 48 20 164 111 158 -41 -54 76 -55 116 57 -31 123 -11 -7 -22
2267b2N2k36J78p1O1L39j04j13j33M6R8k63J44j04k5K88q8k6j54K53j03j97J85
2290Ej53J01j22K05l8jL6j05P0M3J2n0k23K30K7k08L92l60K34j19J23Pm1j6k10
2315a61J61M3j00o3K36j25P3L9k20O0Q4j8J9J85k95J81j74K64Q7j93J56k13j16
2338i0r4L72O5j13m6j7l35K14K4j9k7M7j32L14k33J55m14K59j25O2K16O3j54j96
2362b04J80j24K01J58j32j30J79k1K5R4k79J1j78P5L67m52J48M0J2j40K44o5k58
2385b49M56p6j15K4q0P2P1p4Q7l59K00O4mL9j83N1R5jO6k74K69k45Q5k8R6M0r2
2412f5j97K60m9p4lK27l07O3L32k51K03j32o7K1qJ39j30N9j90K00J32J1j73J24
2436A25J66n04J02Q2K3L7Kj48r6R1J10N7J02j92p7L11l20J27P2O6r7j20J63k59
$$ plain form
2267 -22 30 -206 -28 -99 -38 301 197 84 -49 -3 95 -168 -24 -128 -153 135 47 21 -133 120 17 -180 5
2290 5 -148 -47 -169 36 -2 -3 33 -72 -2 41 53 3 -220 10 37 -171 221 -139 95 -24 99 106 65 49 -161
2315 -161 0 43 -57 -120 116 -9 64 103 -117 -57 27 9 28 213 -82 99 -75 189 276 83 239 26 -90
2338 -90 -184 188 253 140 94 77 -258 -44 -20 -39 -66 -19 -151 163 -70 85 -329 -70 -195 -133 83 146 -8 -204
2362 -204 -24 -148 53 211 79 -51 128 107 132 226 -53 -42 -220 -145 222 -230 -82 -42 -30 -170 74 9 -249
2385 -249 207 131 16 40 -40 32 103 29 116 -243 -43 21 17 56 -127 -76 19 18 84 -190 79 -166 -81 -109 -13 27 -65
2412 -65 -262 -2 -51 -125 -128 99 -208 -145 187 -64 139 7 -60 -39 -47 92 -38 21 -169 31 163 174 1 125
2436 125 291 -213 -111 -29 -6 31 33 -115 -211 -120 -10 47 149 -43 -120 191 -129 -2 70 136 39 -81 82 -177
2460a77o4J17K61m58L95r3j02J27J09k42j69K88j10L6k9K29L6k78K31j81K05k92
2482a61k4N3L14k55L46m32QJ30J29j45P2q4J19J76k59J5r9m2Q2J60l06L56k82
2505a29L29j36j05k20K79j41J05j17J18j50J52o8O6m3k25M06j78R5j25j55L01
2526E9j72J76M7j04k05N17m53J03j32O%n6L31J39q7k93j5k0m3J15K31l64P7r8
2550b41J10K0J50j57K83k64j5j00rL79j91J41L2l01K62j42K83j72P0k16R1K20
2572B33l66L26k21K5j04K43j68PR9k14L16j33P2J25l35K96k49r3J53l0J31k1L52
2595D44l76J18l47J28M44l78J37j52L4j38q1L39k34J18K5Ml16J72j50J31O8L15
2617C05m47J51q5L02l62L19l42j98L64l08K59J12k58K45k82K50j61L3l18L13l15
$$ plain form
2460 -177 -241 -124 137 -321 74 -19 -121 6 115 -127 -296 -8 -118 -82 -111 118 154 -124 107 -74 131 -161
2482 -161 -185 -132 182 -73 273 -159 -151 -21 108 -37 35 -49 70 246 -13 2 -97 -139 -57 103 -203 153 -129
2505 -129 200 64 -41 -261 18 -123 -18 -135 -17 -167 -15 -83 -17 -60 -285 121 -57 38 -87 -242 59
2526 59 -113 63 110 6 -199 318 -135 -32 -164 -158 -158 -214 117 256 169 -124 -139 -159 -202 -87 144 -220 -143 -241
2550 -241 -131 -111 39 -118 165 -99 -114 -214 -223 156 -35 106 138 -163 99 -43 240 68 138 -78 13 233
2572 233 -133 193 -28 -3 -107 136 -32 -25 74 -140 176 43 115 240 -95 201 -48 -141 12 -18 113 92 444
2595 444 68 186 -161 -33 411 33 170 18 52 -86 -167 172 -62 56 81 85 -231 -59 -209 -78 -10 305
2617 305 -142 9 -76 226 -136 183 -159 -357 7 -301 -42 70 -188 57 -225 25 -136 -103 -421 -108 -423
2638d23P01k09R21j067k5K99n52N05O0m5k44n2J50K58k90J02K44k20k41J2L3M1
2660d2J6J88M6j96L0j70K57j45k21M16k79K5K92k36k20M6J49j12n6J00K28k73
2682a57K58j23l2J01P7K7J34l31J76j97kN2J02n4k5j3j60J22j06L59l00K47k16
2705f1K40k97lJ19p4K32l06M9J85j20KL37l94m9J6N9K24j32k14K57k10M24k99
2728a5L2p9J28r9Q2j60L57k67j80K96m1r1K2K4n0k4l0K8J9k07J57n6K02N1k34
2753a35K36j02J67k51p3K85p5r5r0J77j68J74n3J16j27J09Q0l67O8j08M42k77
2775f7L31j14j24j6l0O4k8O2j08K11K13m77N3n4K70k16n2L7J18k59K8j18M00N8
2799A82j07j11j64J91J87o8M9n3k26N0J57o8nJ81p5k09M08m41R0J57j41k21L23
$$ plain form
2638 -423 278 69 990 -77 -102 197 -355 150 210 165 -79 -131 19 277 -13 89 333 113 -128 -116 -83 -42
2660 -42 -26 162 208 12 42 -128 129 -16 -237 179 -100 -75 217 -19 -239 -193 -44 -156 -212 -112 116 -157
2682 -157 101 -22 -54 47 124 151 285 -46 130 -67 -69 -17 85 31 6 -7 -167 -45 -151 208 -92 155 -61
2705 -61 179 -118 -121 -2 -76 156 -150 -101 84 -36 -34 303 -91 -140 -124 -65 159 27 -187 70 -140 284 -15
2728 -15 17 -62 66 -33 49 -111 246 -21 -201 95 54 -37 -15 9 -41 -65 -95 -67 -48 -255 -98 -154 48 99 -135
2753 -135 101 -1 166 -85 -158 127 52 -43 -133 44 -124 50 -3 113 -14 95 175 -192 -124 -232 210 -67
2775 -67 264 150 26 10 -20 44 16 78 -30 181 394 -83 -30 -84 186 -30 -82 -45 73 -186 -158 -276 124 182
2799 182 75 -36 -200 -9 178 110 159 106 -120 -70 87 19 14 195 120 -89 319 -122 -32 125 -16 -237 86
2822H6n4r2j09J55J76l39J96J06j60j14o2qn4J81J94k80K84q7j20L16l28J17l2
2845b8J50n4l09O05o06RK45o9o3P2O6N2r1j15J03n6L8MO3k43J0M7J83L8p7l6k07
2872b69J79M02m65O0R3M7q3J69j27L9j04Q0m2P5M2m2K4k7j84J89k4m7OM5k05R1
2898g8J12j40M1M4p2J84q1j05K8J11J11l6l63J63J23r5p3J41L7J32q7l01J26L79
2922C01k90P2r7nl03M77r0j3r2J30K5k8l6qJ30k46R2j94P7J55k43P7K71k16K8
2947b6p2n1J27J73k22N8J01q3k8m6j48M44j79R6k8J83j17k47j1N6N9n2LJ89l23
2972a44K3N9M7J02k52K95k65Q3P3n3O6j19J49j67P9J21k19Q6J38p4k07K92j16
2995cR5j66N8PL5P8l5M10m55O7k84M2K19J5k53K19n1N0J39l02L81j71k9K39j84
$$ plain form
2822 86 32 -60 -169 -14 162 -177 19 125 -35 -149 -211 -219 -273 -92 102 -178 106 19 -101 215 -113 4 -28
2845 -28 122 68 -241 364 -242 -233 12 -57 -120 -48 18 70 -21 -136 -33 -89 -51 -47 16 -227 -217 -170 13 51 -26 -62 -269
2872 -269 -90 312 -153 -93 0 47 -36 133 6 45 -59 21 -21 54 96 54 78 51 -133 56 32 -15 -9 36 -169 -78
2898 -78 34 -106 -65 -21 -93 91 10 -95 -67 44 155 119 -244 -81 42 -53 -126 15 52 184 97 -204 -78 301
2922 301 11 83 -14 -19 -322 155 65 52 -40 90 115 87 51 43 173 -73 19 -175 -98 57 -186 -109 162 -54 -26
2947 -26 -98 -149 -22 151 -71 -13 88 5 -23 -69 -217 227 48 144 116 299 182 -65 -76 -20 39 -13 -10 179 -144
2972 -144 -121 -62 -15 87 -165 130 -135 -52 21 -32 34 -85 64 -103 -24 97 -122 -36 102 28 -179 113 -3
2995 -3 92 -74 -16 -9 26 104 69 479 24 91 -193 -151 68 83 -170 49 -2 48 187 -115 266 95 66 305 121
3020A21k37Q4K09Q2j53k45L47j80J77j63J50J0k90l05J05K82K28l50J25J55q6
3041F6N2k33J3N4j92K93k3m34L61K03j29n2m5j62K68j37j8J10l64M26M00o14J87
3064C0p5N2J9N5r4l2J46k14K91j98j34rj07J04j29R1K24j41K57p4j43m7L1K17
3088A20j16j06J35j40J01L0L0o0m8M7q7L7J47j75J39j54L18k05J38l19m6Q5o7
3111a96K68L8N2j14k04N5O9L9K41k18j9P9o5N7P6k5J75j41K9l63J11j93K33k08
3135b24L95J8r8k37M19l76N6l46L22N7J69j17j29R4k4J98m31M2M03j48k6j34j26
3158b43J96o0J41p3nk26K58N1O4L8k52M2J08m2j34L47l88J16K9J57j38J7l5J14
3182H2J9j2n8j28M6K04j79J01J22Ql00O4j3q9J44r2MJ42K0P2l62N3n5K38n5r1
$$ plain form
3020 121 -116 -32 177 259 106 -139 208 28 205 42 192 202 -88 -393 -288 -6 222 -128 -3 152 66
3041 66 118 -115 -102 -48 -240 53 30 -404 -43 160 31 -21 -66 -228 40 -97 -115 -5 -369 57 457 -157 30
3064 30 -45 7 26 81 -13 -45 101 -113 178 -20 -154 -163 -270 -166 -295 -204 20 -121 136 62 -81 -128 -97 120
3088 120 4 -102 33 -107 -6 24 54 -6 -54 -7 -94 -57 90 -85 54 -100 218 13 151 -168 -214 -129 -196
3111 -196 72 110 162 48 -156 -101 -32 7 248 30 11 90 25 82 158 133 308 167 196 -167 -56 -249 -16 -224
3135 -224 171 189 91 -146 273 -103 -47 -393 -71 -14 155 38 -91 3 -21 177 -254 -212 191 43 17 -117 -243
3158 -243 -47 -107 34 -39 -44 -270 -12 39 103 141 -111 -69 39 -3 -137 210 -178 -62 -33 124 -14 3 -32 82
3182 82 101 89 31 -97 -51 153 -26 75 197 205 -95 -31 -44 -133 11 -81 -77 65 85 157 -205 -152 -207 31 -24 -115
3208a15Q8j34K63j03k39M8O9K27Q2l67J21J76p2N9k01J5L06j60M9l26J89%O2k54
3232b17L89m5J32k65n0M4J9j24L35k18j46K09k83K21M9nJ26j19j4L8j04O2J25
3255A59l37J81o8N6J29j46j41K29j29J47J5j73P1P0p2j11O5J27k83P5K31j99J55
3278E1J4J35l94K32n6L55r8l60Q9r2K05K9J3N4j97k07K69k16Q2P7p7K00r9L5J95
3303B39n11K44j02R2J75j82J10j90J40k64J53N3Q5m9K7r3J34j35O8j80J32j34
3325a88K68K7r2L4K9m45M79J6k48J85K3k10J30k0R5P8M8r3j46O5M3j98J25m4J40
3350A01K2o4j01p5J56m6j35J34J4N5j6p4K38j35n8J14M3n9l00M20k63Q4n1m8J47
3375A03N0Q2j49Mj70r6J16J5N1k6m5K2N9j02Q4K4n6J66k38K47n4M7k59j6nK35
$$ plain form
3208 -115 -27 -161 102 -1 -240 -192 -123 104 186 -181 -60 116 44 103 -98 -83 223 63 112 -214 -25 -25 37 -217
3232 -217 172 127 259 -6 -56 -12 7 -117 218 0 -146 63 -220 1 50 45 171 52 38 76 -28 34 159
3255 159 -178 3 -65 -9 120 -26 -167 62 -67 80 95 -78 -7 63 -9 -120 -55 72 -211 -136 95 -104 51
3278 51 65 200 -194 38 -18 337 239 -121 -32 -124 81 110 123 177 -20 -227 42 -174 -92 -15 -92 108 9 44 239
3303 239 -272 -28 -130 -38 137 -45 65 -125 15 -249 -96 -43 42 -7 20 -73 61 -74 -6 -186 -54 -188
3325 -188 80 107 15 49 78 -367 112 128 -120 65 88 -122 8 -12 83 161 209 116 -30 35 78 -120 5 -39 101
3350 101 123 59 -42 -117 39 -7 -142 -8 6 61 45 -29 209 74 16 130 173 114 -186 234 -29 55 4 -44 103
3375 103 153 235 86 90 -80 -176 -60 -45 6 -20 -65 -43 16 -86 -2 22 -34 132 -106 141 87 134 -125 -141 -146 89
3401H9L8m1j45J94J39j97j10R6k23K96n2m3j57OJ34j97L19m3j90rJ72m6L7j54
3425h7K14j69j49N9j98K45J63j27P6j70J60n2r6K38j2r1P0k1k36L48n5k1J14o8
3449A35l05K42J17k85L6K52k23J27K56n36Q5k5R3J1K07J6m27K56J17k9j21k20
3471b21J87J74k7j66n9L79m90L15r0J62k98R0j02R1K20l4j41jj55O5R6n0j00J93
3495C8j86M61m52K7L91l86j02K66o9J92j47j55J98n9m9l6j1o8K5j2o8O4J33j26
3519a31K75k08K61j11r2P6j70L12j79j36L0K51k53N6j00j10K10M8kk06K55j00
3541b4j97J75k85M10o6K3Q6k14K64k26o9P5k95L53N3j64K04j07j80K73j09P4m9
3564EO0J82k09k4P7J33K1k29l0jL9K29k96j06K1L64k59j45J55J32j17k76O5L65
$$ plain form
3401 89 127 86 -59 135 274 77 -33 63 -160 136 84 41 -116 -110 24 -173 146 103 -87 -96 76 30 67 -87
3425 -87 127 -42 -191 -132 -330 -85 78 -49 27 -143 17 -35 -131 107 95 4 74 53 -183 165 110 89 203 135
3449 135 -170 72 189 -96 -60 192 -31 96 352 -184 -99 -124 -31 -20 187 203 -224 32 149 120 -1 -221
3471 -221 -34 140 113 -53 -112 267 -223 92 2 164 -134 -44 -146 -55 165 131 -10 -11 -166 -101 -5 -55 -155 38
3495 38 -148 313 -139 -112 279 -107 -209 57 -12 180 33 -122 76 17 -32 -68 -79 -147 -122 -134 -202 -138 -5 -131
3519 -131 144 -64 197 86 -6 70 -100 212 33 -103 -73 178 -75 -19 -119 -229 -19 29 27 -179 76 -24
3541 -24 -221 -46 -331 79 13 36 122 -92 172 -54 -123 -48 -343 10 63 -101 103 -4 -184 89 -20 54 5
3564 5 65 247 38 14 91 224 245 16 -14 -15 24 253 -43 -149 -128 236 -23 -168 -13 119 2 -274 -209 156
3588A56k08%m4O4j01K58k2k91K84j20J3l07L44j24J98l7l6q8J43k17j05K89j56
3611a07o8J74J8k87M00n7o4O8j1k90O8K24j3j66K15J6n2l97K37K62j57J79l55
3634a63M8R7P7lk75J70%j05K27P3k00J41r3j69r4L15n0J74j17k73K20J11L5k29
3658h3L51l56lJ51o2J5m7J53k20J18K14j38j21l1J83j22J34L6j5m7j72M0m6K2
3682d6q7q4J43j25J21J49r0lp8k15K96LK17m26K6k1J60j21L0K6J16n2J23k59L73
3707A76j78k29J84M42m05M0p6r3K25j47K60k09K48L1j57q7j3L0n10M63k0R9m5
3730B9l0J03j73J51l69J96R9K8q0K17j35J39j49K05l45K99L4k15%j61J62J72j59
3753A8l7j10M2J12J31j7n4j59J16j22N6m4J49j37J59j21J14K6j79J45N0n1L3k51
$$ plain form
3588 156 -52 -52 -96 -32 -133 125 103 -188 96 -24 -11 -318 26 -98 100 63 27 -61 82 -135 -240 49 -107
3611 -107 -175 -1 17 -270 130 73 9 77 66 -224 -156 68 55 -111 104 120 68 -329 -92 170 13 192 -163
3634 -163 -115 -18 59 56 -219 -49 -49 -154 73 146 -54 87 -6 -175 -269 46 -4 170 53 -220 0 111 146 -83
3658 -83 268 -88 -91 60 -2 13 -34 119 -101 17 231 93 -28 -59 124 2 136 172 157 110 -62 -22 -68 -46
3682 -46 -133 -217 -74 -199 -78 71 -19 -22 -100 -315 -19 -16 201 -225 -199 -220 -60 -181 -151 -125 -9 -61 62 -197 176
3707 176 -2 -231 -47 395 -10 30 -46 -139 86 -61 199 -10 238 269 112 25 12 42 -468 -5 -25 74 29
3730 29 -1 102 -71 80 -289 -93 6 34 -46 171 36 175 26 231 -114 185 219 4 4 -157 5 177 18
3753 18 -19 -129 -87 25 156 139 85 -74 42 -80 -24 -68 81 -56 103 -18 96 122 -57 88 138 87 120 -131
3777a31n1K59k58K53J66k74j18L26k93J73J45r4j06J47O1k32K24l66J96R2J19
3798B38j36J18l11MQ1J37j48k8J59j12K67n8j18l0J69m07J92J00r9j34J95k3j10
3821e4J77j02q5J98j27J16j6l26J62l3Q5J67n78M24Jl7J86k58J29j6J26m19J32
3844a48L3n3K21J23j68L9o5O6k82K44j66L77j14p1J42l7K80m07k02K04K4R6j46
3867a0R3K5L7j65R7Jk84J34L9K1K63k44j76J33L00l55R0JJ29j85j45M52j84j42
3891g5N6Q4j6q8j43K5M2K07n2o0K44k23k15N46m73K37J54k08j17K2K38k95J43
3914C3q0J2J58j27J97j86J87m51J6K21o5J96k80JL03j89K7j73K48k95L49r2n3
3937d3N9O7n2J9R2j70M9q4J06j6M2J49k6k12J9J51j32J18j5k67p2Q4J42p1J37
$$ plain form
3777 -131 -182 77 -181 72 238 -36 -154 172 -121 52 197 103 -3 144 205 -27 197 -169 27 119 238
3798 238 102 220 -91 -87 -6 131 -17 -45 114 2 269 211 93 63 232 -175 17 117 18 -116 79 56 -54
3821 -54 123 21 -64 134 7 123 107 -219 -57 -90 -5 162 -416 8 9 -28 158 -100 29 13 139 -280 -148
3844 -148 -115 -168 53 176 8 47 -18 48 -234 10 -156 221 107 36 178 141 421 14 -188 16 40 136 -10
3867 -10 83 108 145 -20 77 78 -206 -72 -33 -12 251 7 -169 -36 264 -91 -1 0 129 -56 -201 251 67 -75
3891 -75 -19 65 49 -39 -182 -157 -115 92 40 -20 224 1 -214 332 -141 96 250 42 -75 -53 185 -110 33
3914 33 -47 -35 123 -4 193 7 194 -257 -241 -20 -85 111 -169 -168 135 -54 -27 -200 48 -247 102 10 -43
3937 -43 16 83 31 50 142 -28 21 -63 43 27 69 218 192 -20 -1 150 18 136 121 -146 -218 -134 8 -63 74
3962G4l69M98j63j19K1J02j62j54O0K00J40nj40q9K15j57N8r4r9K06J70k00k28
3985b35J75J75k24p5K55j24K42k74j40J75J94rj57NL2J2J69j28j67K87k50J33
4007G1j9j3j00p6qN9K57o4k17R6l4J10j04p5Q1J00o5k0J22K0J35l23m6J54P2n9
4033E4j61O0L9j06J35q0J52l7j0k1L7n7P8M8j20j17J0O7J47j17n7J70k14K0q5
4058a65J53J4o1L11j68l5l3n2%j98J10j14K69k15L66l51K90l8k33N4K67j01m0
4081C0J54k90j8J64Q6r4o9l0J01J1n2O8l20K66k39K27J87m12K25J43j80p7K00
4104H1mr3O4kj03J9N4m2q3R8Jj59K65l2k24J32J03L1j21J98j57l9J28k92P9K01
4130A03k88k0K28j73J50j31L68n06J21L10j39N2J86r9l1j32j45%P9L08j62k05
$$ plain form
3962 74 -295 203 40 -79 -58 44 -118 -272 -212 -12 128 123 -17 -106 109 -48 10 -84 -183 23 193 -7 -235
3985 -235 -60 115 -109 -184 71 -53 189 -85 -225 -50 144 135 -22 -17 15 27 196 68 -99 188 -62 71
4007 71 52 39 -61 -137 -145 -86 171 107 -110 -14 -48 62 -42 -117 -36 64 -1 -21 101 121 256 -67 -113 41 113 54
4033 54 -107 -47 -8 -114 21 -59 93 56 46 25 62 5 83 131 11 -106 -96 -29 118 1 -56 114 -100 -80 -165
4058 -165 -12 2 -59 252 84 49 16 -36 -36 -234 -124 -238 31 -184 182 -169 121 83 -150 -96 171 70 30
4081 30 184 -106 -124 40 126 32 -37 -67 34 45 -7 61 -259 7 -232 -5 182 -230 -5 138 -42 -119 81
4104 81 77 -16 48 46 -57 -38 16 -26 -109 -11 -10 -169 96 64 -160 -28 75 106 -15 183 26 -13 115 -177 -98 103
4130 103 -185 -205 23 -150 0 -131 237 -269 -148 162 23 75 261 162 131 -1 -146 -146 -67 241 79 -126
4152a26J67l1J19k42p4K96r4J38p9j94M01o9m08O6k72N33Jj79K02j51P7K8j56
4175d7P0o7n7l3R2J82j6J26k31j97K05J06l21K90J94j83j43M40j76l99N6P9M31
4198D01j75j16k0j56n2o3M22k22K28m16L27k52R4R9J84l72Q1K8o8K35j10j61N8
4221b6j16m3K25j22J00L1k42J82p5J7R3K99m49K45J38k60j47Q1K91l97K11J9l49
4244b94K99j44Q4r5J28k2j6K3J06j59J51m6J38o7k67j0J40m5K44j70J0l2l1O6
4268iL8m8r1j27K06k4j2J69k67J8K44k73p7L38j06M1lj00J95l21L48n5n3K39j58
4293A12j31J87p9k22M46k61ql3L9j85J26J08pj54k10J24M96r0k89j7l01K31J35
4316A7n8Q0J81j99J12l28K42J35m6j90J02J21j52j15L1J97j25J3RR6j88J80j06
$$ plain form
4152 -126 41 10 129 -113 -187 109 15 153 74 -120 281 212 -196 -130 -402 131 132 -47 155 4 81 109 -47
4175 -47 23 -44 -101 -134 -42 140 124 250 19 -178 27 133 -188 102 296 113 -30 410 234 -165 -109 -30 401
4198 401 226 110 90 -66 -118 -181 241 19 247 -169 158 -94 0 99 283 -89 -8 20 -48 187 77 -84 -26
4221 -26 -142 -185 40 -82 18 49 -193 -11 -86 -69 24 323 -126 119 257 -3 -150 -69 222 -175 36 55 -294
4244 -294 5 -139 -55 -150 -22 -44 -60 -37 69 -90 61 15 153 86 -181 -191 -51 -96 148 -22 -12 -44 -75 -9
4268 -9 29 -19 -110 -237 -31 -55 -67 102 -165 -147 97 -176 -253 85 -21 20 17 -83 112 -209 139 84 31 270 112
4293 112 -19 168 89 -133 313 52 44 11 50 -135 -9 99 92 -62 -272 -148 348 258 -31 -48 -349 -118 17
4316 17 -41 39 220 21 133 -195 47 182 136 -54 48 169 17 -98 -67 130 5 18 27 123 -65 115 9
4339IJ57l61K43QJ06K8k33p8R6K0j74J51j04K49j3j32k03K64j62R7J16K8p5q9
4363e2M4o7k4J79j4j33O5pL22k79j7N1K24j16k30L9j31PK00J12j5l0j77qM21l74
4389a0J67J25k10k39K62K0j24j47J34N1l3J52l13j12L12k27k1K33O2j98J36r4
4411g4J40j23l6N8j3m6K71l0p7j76J29j80J48Q6j98L53m7l3j17j41Q6j08K59l32
4435b01R6J14j48P0o8K56j66R9J92j45J11l20J58o7p2P2k13L99j93L1K0K7j10
4458e8P3L8K0kjl7J23k93Q8L62k91J31k08n8J81R9l35M07k63K79o7j45k11o8L99
4483A63j22oo4n4K0L09q7k83K19M6l8k72k3QJ19K43jJ2k57K87n0k61L21k08J30
4508A51j53r8OJ18r6n4r8K02n9N5K65j76J11j35k4J04n8k44K84K57n29R7O6n1
$$ plain form
4339 9 166 -195 48 56 162 190 -43 -121 -25 -5 -179 -28 -132 117 104 -28 -231 33 -129 -32 84 112 37 -52
4363 -52 -8 -75 -99 80 66 -67 -2 -9 313 34 17 68 292 176 -54 -15 -146 -139 61 173 158 128 -49 -57 364 -10
4389 -10 157 282 72 -167 95 115 -9 -156 -22 29 -4 148 -165 -277 35 -192 -213 20 82 -116 20 -74
4411 -74 66 -57 -93 -35 -48 -94 177 147 70 -106 23 -157 -9 77 -121 232 185 152 35 -106 -20 -128 131 -201
4435 -201 -105 9 -139 -69 -137 119 -47 52 244 99 210 -110 48 -19 -91 -19 -232 167 -26 5 25 52 -58
4458 -58 15 53 73 71 70 33 156 -137 -49 313 22 153 -55 -113 68 167 -168 239 -24 255 188 43 -168 -236 163
4483 163 41 35 -29 -83 -63 246 159 -124 95 141 103 -169 -192 -184 -65 178 177 189 -68 219 169 -92 229 21 151
4508 151 -2 -100 -94 24 -72 -126 -224 -22 -81 -26 239 63 174 39 15 119 61 -183 101 358 -171 -74 -8 -59
4532e9J74j03Q9j88K5J96O3l03k04M47q6N8j01j28M22k69r2N5Rm3R5j4O2l17L46
4557A34j63j89j38M14k10K01J46r1p4K75k05m8j7j94J59P5l26L94j22O5r3J0j52
4580a49J0K4K15j98q3L43J2k16j36K27J23k36Q0K41k41pj06J30J4q2J90j44J30
4603A41m71N90k79K02k62K65j44N6k87J97p5OK36JO5l20J9p8n1K79L3l94K50L6
4627A5q3J88j72J61k34J57K6J15l9j84r0K35j0k78L48l76M06l27L22j54P4j75
4649g5K8L57o00L79j41J24j36n8K4J25K04Oq1p7r2J2o7J99l55J66K22n1kj15j66
4674a70J13J92j03L8J65k37K58l38O7Rk72K28K37m1k81K31J77k14P0j07l2j71
4696a81K02K37k09J37k00l5N2j10K34k67K48j15j9N8K5j22Q3k39L82M6k69R8J13
$$ plain form
4532 -59 115 12 101 -87 -62 134 197 -106 -310 137 51 109 8 -120 302 33 -59 -4 5 -38 57 43 105 -212 134
4557 134 -29 -218 -356 58 -152 49 195 104 30 305 100 52 35 -159 0 75 -251 143 21 86 -7 3 -149
4580 -149 -139 -115 100 -98 -181 162 174 -42 -178 49 172 -64 16 257 16 9 -97 33 47 -35 155 11 141
4603 141 -330 260 -19 183 -79 186 42 98 -189 8 -67 -61 175 176 241 -79 -60 -138 -189 90 123 -271 -21 15
4627 15 -68 120 -52 109 -125 32 58 173 134 -50 -140 95 85 -193 155 -221 185 -142 180 26 100 -75
4649 -75 -47 310 -290 89 -52 72 -64 -122 -98 27 231 237 156 79 -13 -1 -68 131 -224 -58 164 113 111 -4 -170
4674 -170 -57 135 32 70 235 -2 256 -82 -15 -6 -278 -50 187 146 -135 96 273 59 129 22 -10 -181
4696 -181 21 258 49 186 -14 -49 3 -107 127 -140 108 -7 -26 32 57 -65 18 -221 161 207 -62 36 149
4719A49k52k2L68k0l61N3LJ8pn1K02p3j42K39o9k0o6J90j7j51K8%j0q0J79l75
4745b87K02L3J17M7l9j49Q2K0k4j60J16J7j9o0J74P5k59m1L4rJ51K61k00k19R6
4770d1p8rJ39J00J30k68J7N1r8m6J16K7j6j56l1J71J07p5J79l29J18L6O0r3k49
4795b38J69m2RJ48J03m04K58k30K84o1j45K46m06J72p0j9O5L28l30K49j07j33
4817a54jK00O6k03K8lJ12q6K77j22M2l05K41r1n9L69l18rj63J83J50k42J94l77
4841b71K51J82k77J74q7q4J74Kk37L09j51J93M8k37Q4M8O3l18L16j43j0j05m7
4864a23N6J0k7j55K75k8Pj10J87J4O3k01K44k98J54N9j50K11J75k65j79K60k18
4887c9J35j4j39O5q7j22K67J41l00J96k44J31j11L87k42k22J61j25J83kO4n8J4
$$ plain form
4719 149 -103 -125 243 223 -138 -85 -82 -64 -71 -122 80 7 -135 104 35 15 -51 139 122 -29 -1 -1 -11 -91 88 -287
4745 -287 -85 -52 65 112 73 -76 6 26 2 -158 -42 -25 -44 -104 70 145 -114 -155 -121 -130 21 282 82 -137 -41
4770 -41 -119 -128 11 111 241 -27 -10 41 -57 -103 13 40 24 -132 -163 8 115 40 219 -110 8 44 104 11 -238
4795 -238 -69 -111 -102 46 149 -255 3 -227 57 -4 -149 97 -309 -137 -207 -226 -161 167 -163 86 -21 -154
4817 -154 -155 45 111 -92 -64 -67 45 -41 236 114 156 -149 92 1 -58 311 -7 -16 -179 4 154 -88 106 -271
4841 -271 -20 162 -115 59 -28 -112 62 64 -173 136 -15 178 226 -11 73 121 184 -134 182 39 29 -76 -123
4864 -123 -67 -57 -84 -239 36 8 15 -95 92 106 169 -32 212 -86 68 127 -23 188 363 98 -81 179 -39
4887 -39 96 82 -57 8 -79 -201 66 207 -93 103 -141 -10 -121 266 24 -198 -37 -162 21 19 83 25 39
4910C9j90L23k44J66o4q6LJ38Lj75K20P0k78K31j88j45J46L66j17k72K56k29J13
4933H6J1n4k38N3M07l37N7m0j1m5rJ84j0o1l9Q0m0O4k02J82j60N8jq0J68j1q3
4960g1Q9k00K32k3q0R4m4J40j86K39j97l0l6Q4p9m7K9J68J48j69l5R8j4n4k14
4985a58K4jqJ20l2k2J35k22K81j74J52l3j5J89j61j34R7J14Pj42k19J67ML19l35
5010d7r3K17j3K5N2q1j03O7Q4j86J41j10R7j32Q2j79J60k96L03j5K52Ok70K03
5034A64K9k12j11K03j02K29j23n8J07m1o1l1K40l43L73j15k22J25J64j61j73K49
5056A30Rj60m4N9P7p5j36P5n3J28J1M7Pj80R5O9r9M2r7K23j91K53j01j63j33K65
5082E8M0j21k8j63N7j30L38K11k49J32j79N9J7j29M89m91L02m1o3J51j58j67l4
$$ plain form
4910 39 -151 172 -72 94 30 -56 -53 85 88 -87 133 203 -75 156 -32 -177 -31 335 218 -54 202 -27 86
4933 86 97 43 -195 -142 265 -72 -15 -55 -66 -111 -120 64 54 -7 -46 34 -6 58 -144 38 -122 -64 -65 -145 23 12 -71
4960 -71 18 -182 50 27 -53 41 -3 137 -49 190 -7 -37 -73 11 -68 -115 -86 82 230 61 26 124 110 56 -158
4985 -158 -134 -135 -143 -23 -55 -77 58 -164 117 -57 95 62 47 236 75 -59 38 152 159 17 -202 -35 -31 288 -47
5010 -47 -140 77 64 89 141 60 -43 24 108 -78 63 -47 50 -82 0 -179 -19 -315 -12 -27 225 231 -39 164
5034 164 193 -19 -130 73 -29 200 77 19 126 85 24 -7 233 -110 263 148 -74 51 215 54 -119 130
5056 130 139 -21 -65 -6 71 -4 -140 -65 -118 10 21 68 75 -105 -10 59 -40 2 -95 128 -63 190 89 -74 -207 58
5082 58 98 -23 -51 -214 -157 -287 51 262 13 145 -34 25 42 -87 402 -89 213 172 109 260 102 -65 -99
5105i9L14k96J34p7J00l12K48r3J00J72n2m5k57K52J01l05N7J23k3P0J59k46j98
5128a73K35k18J84O9j80L3K85n24M68o0j71M0k11J7M21k65R9j36L2J27j38L3k6
5151e9L38l76K20j03l45L52M5R3j05n7K3J74m8p4J33l76j22O24k51j83J11J50
5173A64r4l2J12k30K00M7k17K26k33m9j4j3J89l20K33M6l51L65Pj28J67j99N0
5196g4o1K03j70L2n4K35m11K32J01k69K03r5K51j02k65L09p7Q2J32j03k49K11
5218F1K7p4J90k90N05l90k20J61k02K01J08l39L57J59j46k48j20L39K7j61J23
5239F8l0J04j16r4l8J82j41K07j84J76j2j29j07R6k18N66n21N7K13j17K0J91k37
5262f4J84O8r6k19Pm5O4J80j92M61j13k79n8R1m4l9J01np3K4l5rJ80k57L09l0
$$ plain form
5105 -99 215 -81 53 -24 76 -236 12 -81 19 191 139 94 -163 89 190 -115 -58 65 42 112 271 25 -173
5128 -173 62 -156 28 97 -83 -50 235 -289 179 119 -52 -12 -223 -206 215 -50 49 -87 -55 72 -66 -33 -59
5151 -59 279 -97 123 20 -325 27 72 165 60 3 26 200 152 78 211 -165 -287 337 86 -97 14 164
5173 164 70 38 150 -80 120 167 -50 176 -57 -106 -120 -133 56 -264 -31 15 -336 29 36 -92 75 -124 -74
5196 -74 -135 68 -102 -70 -124 111 -300 -68 33 -236 -33 -128 123 21 -244 65 -12 70 202 99 -150 61
5218 61 88 14 204 -86 419 29 -191 -30 -232 -31 77 -262 95 254 108 -140 -260 79 106 -55 68
5239 68 38 142 26 -68 -106 76 -65 142 -42 134 122 -7 -114 -18 -236 330 -191 -134 79 -38 -18 173 -64
5262 -64 120 188 92 -127 -120 -165 -101 79 -113 348 235 -44 -102 -11 -55 -94 7 2 -71 -47 -82 -91 89 -168 141 111
5288A11j32J27k82P9M7P2K4j00j39K42O5m3K5m2n4Q0k19O8J03j90J68j65k3K43
5312F5j81M29l11J49p0j2j75J52M9j91M2K64j74R2l20K10j20O9J62k53K19k43
5334a48J60J30j45J35R0k12J98k37K65k91k80J62J17m6L02k14J79k34J06J09k46
5355a00O8K23J15l47L62k52Q5k60K20k15J37o4K34l40J34R3q1J94j89j19J9j43
5377b26K73j78J97P2k03J80o6j14P6J15l38J08k04L31k2o3L73l23k60L32J10j65
5399Ek33J86ON3J42k19J17n2l4J15m4q4j1j3J81l85J68J92k0j73J03J29k70J34
5423gK2J7j4r6J17j84J53J22l9K06q5o3l28q7O01m84P4p5L02J5k32RL2j21l8J68
5449a5k3O7q6P7K30l01N6J37r3o9n8O6r8Q2K74P3l59j7K04m6j06j47K11rj4J64
$$ plain form
5288 111 -21 106 -176 -97 -50 22 46 -54 -193 49 114 71 96 54 0 80 -139 -71 32 -158 10 -155 -178 65
5312 65 -116 313 2 151 81 69 -106 46 95 -96 -54 210 36 128 -192 18 -102 -33 129 -124 95 -148
5334 -148 12 142 -3 132 222 10 208 -29 236 -55 -335 -173 -56 -102 200 -14 165 -69 37 146 -100
5355 -100 -32 191 306 -41 321 69 154 -106 114 -101 36 -28 206 -134 0 93 12 206 17 -102 -83 -226
5377 -226 47 -131 66 138 -65 115 49 -65 11 126 -212 -104 -308 23 1 -62 311 -12 -272 60 170 5
5399 5 -228 -42 -36 17 159 -60 57 5 -29 86 42 -42 -53 -66 115 -270 -102 90 70 -103 0 129 -141 -7
5423 -7 15 32 18 -78 39 -145 8 130 91 297 212 149 -179 -266 335 -149 -75 -150 152 167 -65 -56 -24 -145 -183 -15
5449 -15 -38 29 -57 20 250 -51 5 142 49 -20 -78 -12 -110 -28 246 319 -40 -57 147 101 -5 -152 59 50 36 200
5475B00l55J49j33rJ20R3j28J21K2Ol7k9j12M3J61l5j43q7R5J45k36Q8j5lj9K29
5501A31o5n6J29j42k2k12Q9m2L43J70k82O5J45k05Q5j04l9j64L59j18k80L97q
5524A74J4k42K1q3J00n7K85k67j7J15q6J70k31K01p3j53J99k73K8K4J56j36mp1
5548b06L59J8k14k32L48j07J00p6J93k61K61O3l96L19k66K16J03j83j85K54k02
5569i4J68o8J61k19j33j4K49p6j70L89j38k07RP0J37j17P6k04J34J7j51J71j14
5592a24q0L21l54K61Q1k20R8j13K34q2o5M9J75j00l7P2k2j08N3j08P6J14k99L23
5616A45o0q4j35J40N6k1J5k10J58J82r1j59Q6j44P5Q6K03k48n8J6l0K1j89K37
5640io5J66j61o6j14K54p7m1J17p4J10l0K6K7j58J96k46O9J12L0k7o3N0o9Q6k44
$$ plain form
5475 200 -155 -6 -139 -148 -28 65 -63 58 80 86 49 20 -92 -49 112 77 -66 -153 -58 87 -149 -61 -76 -79 -98 131
5501 131 66 10 139 -3 -25 -237 -148 -190 153 323 41 106 251 46 131 27 -12 -176 183 65 -215 182 174
5524 174 188 -54 -33 -116 -16 -73 212 -55 -72 43 -43 127 -104 97 24 -129 70 -203 -175 -151 5 -131 -135 -206
5548 -206 153 171 -43 -275 73 -34 66 -10 183 -78 183 246 -150 169 -97 119 222 39 -146 108 -94
5569 -94 74 6 167 -52 -185 -199 50 -26 -196 193 55 -152 -143 -73 64 -53 23 -181 -47 -30 -181 -10 -124
5592 -124 -204 117 -237 24 105 -115 -17 -130 104 22 -43 6 181 81 44 116 94 -14 39 -69 7 121 -178 145
5616 145 85 1 -134 6 62 41 56 -154 4 186 95 -64 22 -122 -47 39 242 -6 -64 -48 -78 -57 -246 -9
5640 -9 -74 92 -69 -135 -249 5 -72 -113 4 -70 40 10 36 63 -95 101 -145 -76 36 66 39 -24 26 -43 43 -201
5666b01K45o0j1j96J58K21k87k1M81l68l3L94m99o1M01j72J9J91j51j47J54K4
5688H1o0j40j4J27p3J7K13j37k1J22j60J46J82l90M8J56j28MM0J36j15J00j98
5711f4J24J22l41K42m0P9j74J61k72J2O3L8K97k11mj83J31j04L1N30j74J2k32
5734D3K1j61K43p2j3j84K28j66J6J9j33L3O0l1K29j10R6l2qQ7N8k58j1M3no6k4
5761i8Q5l6J9N0j0J84l16K41k25J09q4R3K96k75j78J88JjP3j94K88j24j84L15
5785B17j83j7Lq9K8K3j31J26k3J00m2J68k34J50L9l06L19j53j04n3K07j02O0O3
5809F6l38J6L34k89J75J75k79L5Q7j28L02k31J66%l9q3pM8J65q0J23k70n6k2J99
5834F9j89j01K70j8kj42L5L4J89J44l06p7K45k07j9j1j24J55J70k69L23J2k02
$$ plain form
5666 -201 44 -16 -27 -223 -65 156 -131 -152 329 -39 -72 322 -177 -238 163 -9 10 201 50 -97 57 81
5688 81 21 -119 -133 -6 -79 -62 151 14 -7 115 -45 101 283 -107 -59 97 -31 -27 13 149 34 134 -64
5711 -64 60 182 -159 83 43 122 -52 109 -163 -151 -88 -50 247 36 32 -151 -20 -124 -93 437 263 275 43
5734 43 64 -97 146 74 61 -123 105 -61 -45 -26 -159 -126 -66 -97 132 22 118 86 78 165 223 -35 -46 -3 -8 -74 -98
5761 -98 -13 -49 -30 20 10 194 -122 119 -106 3 -81 12 308 33 -145 43 44 43 116 -78 210 86 -98 217
5785 217 34 17 20 -69 -41 -18 -149 -23 -46 54 12 180 -54 96 135 -171 148 -5 -109 -162 45 -57 3 66
5809 66 -272 -256 78 -211 -36 139 -140 -105 -18 -146 156 -75 91 91 52 -31 -38 10 175 95 218 -52 -108 -130 69
5834 69 -120 -221 49 31 29 -113 -78 -44 145 289 -17 -94 151 -56 -75 -86 -210 -55 115 -154 169 181 -21
5857b1m6K2O2k9m1L2j6R3nj22J61qj70J43j4n1J31m2R3k23r2R2J09m5j54L79j94
5884D4l7J4o4p8J93r9J87j13k76J88J09n3o1j53J05J26K8J9J50o1l54J41k51L69
5908G3p2j30J59J97j17j56K6j51O2q5M0K52k61nJ3L9j2L81m36J80P0k54K66k7
5932E2p4J28p4L1J83l41K3J62rql3K20n47L85j8j16j44K56J71k31J2OL2K6k47
5957a55K98k01l4J51l11J61j8J27m0K71k17k5k62K08M1L1j19J12J4j57K14j04
5979a5j1n7J88r5j10K1N7j60P1j28J25J30R9j52K20l25O8L1m3M8K95l52N3j21
6003a63Q4k8K00j29J26r5M6J41l18K73k61R1L8k22J24L3R6j86K64Q0m33K85J9
6026F5J67j7k71Q6J69k71J36J85j56q0JN8n7j39M8N4j30K53j21j7K0j21J84O3
$$ plain form
5857 -21 -67 -45 17 -12 -53 -21 -37 56 51 -71 90 82 -88 55 41 -10 121 79 172 -51 -143 -51 58 13 -141 238 44
5884 44 7 21 -43 -121 72 -27 160 47 -229 -41 68 15 -46 -199 -94 32 60 79 229 168 -186 -45 -296 73
5908 73 1 -129 30 227 110 -46 -20 -171 -109 -194 -154 98 -163 -168 -155 -116 -128 253 -183 -3 67 -187 79 52
5932 52 -22 106 32 63 246 -95 -72 90 81 73 40 260 -287 98 80 -36 -180 76 247 16 28 34 66 92 -155
5957 -155 143 -58 -92 59 -252 -91 -109 18 -22 249 32 7 -255 -47 -6 25 -94 18 32 -125 89 -15
5979 -15 -26 -83 105 10 -100 -79 -22 -182 -111 -239 -114 16 115 -37 183 -142 -74 -43 -86 -38 257 -95 -42 -163
6003 -163 -79 -107 93 -36 90 -5 41 182 -136 137 -124 -33 5 -217 -93 -60 36 -150 114 194 -239 46 65
6026 65 232 215 -56 30 199 -72 64 249 93 13 14 72 15 -124 -76 -22 -152 101 -20 -37 -17 -138 46 109
6050A09M7k92K28Ok73M3K99j60n5k3K47j81o2J26j16J27n2%O4n0q4J25J54p9k46
6075i8K4j7Q0k4j43j4J39R9P7j00J02j66K3j29L00j55j18j17J23K08k04R1K68
6098B49l28MJ48J15J0l5J68l92j8K23m6k60L05k5j90K49j96o6J56N1pn8k28J76
6122Ek4J23k18J15M5j17MK16r1M3j0j76l4M78l12j25r4J99r2l1R8q9k0J25J7R7
6148A32j09m%j60j64K18K03J00j9o1k1k51K2P9K06j47J4J23k57J53L6j56K21r5
6172F3J96k85K55k63QJ02lOJ89k76K9LR2k0Oj76j7j70J47J87k01J36k0m4K6N5
6198B5j77K42l6j50q5L9L50l05L37l71K16J42j00jj39K0l5k55J77M0O4M7j0k70
6222b35J32K80l88K46l5k6K78k50Km0K73l00j9L3k16K56n6L23k46R6j23J43j01
$$ plain form
6050 109 156 -136 92 98 -175 -132 167 7 -48 -71 176 -5 -67 59 -57 70 18 18 82 32 -52 73 227 148 -98
6075 -98 -74 -91 -11 -35 -178 -192 -53 46 123 23 125 -41 -18 -147 153 -2 -120 -237 -114 94 -110 -19 249
6098 249 -79 -75 73 188 198 163 331 -61 -79 144 98 -162 143 118 -72 177 -19 -85 71 122 115 57 -171 5
6122 5 -19 104 -114 1 46 -71 -67 149 58 101 91 -85 -119 359 47 -78 -172 27 -65 -96 2 -87 -107 18 35 132
6148 132 23 19 19 -141 -305 -87 116 216 197 136 115 -136 -114 -35 171 24 38 161 -96 57 93 -63 158 63
6172 63 259 -26 229 -34 -26 76 73 79 268 -8 21 24 116 96 102 -74 -91 -261 -114 73 -128 8 -12 -56 -30 25
6198 25 -152 90 54 -96 -181 -142 208 -97 240 -131 85 227 127 126 -13 7 -28 -283 -106 -66 -2 45 35 -235
6222 -235 -103 177 -211 35 0 -26 252 2 4 -36 237 -63 -82 -49 -265 -9 -65 258 12 108 -15 128 27
6245B7L4M1k1j12pJJ99Pj60J5k94L38k97O1K31L0O4n5j09Q6P6o6j59J15l79K52
6271h2J47J35j79q8O7j73K97q9q3k26M21j80R0r2K79k45K93k67N7K48m18o1L29
6294A80k51J0k11L00Jk7o2r3K66j96J62M7Q7m89L42j56Q7k64J68l9j94L30j46
6317a48K52P0o7l35R9o3M61o7l4l11Pm4J19k2K20j23K0j79K05R1j60p0R7M2j35
6342g5Q7k30J70m9J39O5K27m28L00j96J11Lr9k27K08q2k8L36l02J49k39J07q6
6365a39L43k40M6kN7J5L8j49o9J48k49K36k01K43l35K13n2R2k7J24K5o8j30K1
6389f0M4j12J34J39j47j4o2M4J79j55l5K86k70l0J77J00j46k54K53m5j60J90r1
6412c5j41J30l6m0k37M26P2j43Nl3n0K4J04J35l61P8L7m3J10P8P1m2k99L29j08
$$ plain form
6245 27 61 102 81 -31 -38 -37 162 169 9 24 -270 68 -229 -168 63 93 157 102 -7 79 155 89 -70 45 -334 -82
6271 -82 65 200 21 -67 0 -173 124 35 -48 -274 147 -33 57 -35 244 -1 292 25 82 330 -88 -149 180
6294 180 -71 -61 -272 28 29 2 -60 -153 113 -83 79 126 213 -276 66 -90 -3 -267 -99 -138 -332 -2 -148
6317 -148 104 174 107 -228 -129 -192 269 202 168 -143 -136 -180 -61 -83 137 14 34 -145 60 151 -9 -79 18 60 -75
6342 -75 12 -218 -48 -97 42 107 334 -94 206 10 121 124 25 -202 6 -76 -104 232 -70 79 -160 -53 -139
6365 -139 204 -36 10 8 65 80 118 -31 -100 48 -201 35 -166 77 -258 -45 -97 -5 -32 92 117 49 -81 -60
6389 -60 -16 -128 6 145 -2 -16 -78 -34 145 -10 -45 241 -29 -59 118 218 72 -182 71 26 -134 56 -35
6412 -35 -176 -46 -82 -122 -359 67 139 -4 1 -32 -82 -58 46 181 -180 -102 -65 -108 2 80 151 109 -190 139 31
6437C1R0m2j43l3J74m2M0L5k92K32p4J24O7o7k10J75k60K20J59j60q5K29k2l69
6461b23K26Q0J3j59K29l56J61Q0j10J84k11O8R8k99J60J00j22L7L4J78k53P4q0
6484i1K02l4j14P5j2N1k0J68k93P0O0j89J28RP6pJ40m5j59K89l68L38n38J87R8
6509B1L3rl02K34J80k98P2%J14jm0l3N2Jj5j65J97r8j41J08Q2J68J73j87j30P5
6535I1m8j14nK01r7k3K04j58J85k78K5m3JK11k65L6K39l09K87m04K44k82J97m
6559a09o8Q2L80l45n6K45m19K82Q6p8nL11o16L53J18j10j54K52p0L3j20Rk83K35
6583d7M3j84K47j09N2R7k31K05P9k78J20Q0k8j88J73J17l11k3J85J11l16K17j34
$$ plain form
6437 31 121 79 -64 -97 77 35 75 110 -182 50 -24 100 167 100 -110 65 -195 25 184 24 -61 168 146 -223
6461 -223 3 83 96 -63 166 -190 -29 51 -59 125 -86 -18 80 -219 -59 41 -81 -44 -10 168 -85 -11 -91
6484 -91 111 77 -37 38 26 77 57 225 -68 2 62 -127 1 10 86 79 219 174 15 304 -64 274 -264 -77 21
6509 21 54 45 -257 -23 157 -141 -69 -69 45 44 4 -29 23 24 9 -156 41 -57 -198 -90 -8 160 333 146 16 91
6535 91 43 -71 -76 125 28 5 209 51 236 -42 -17 -60 -59 152 -113 -77 162 -147 140 -264 -20 -302 -105 -109
6559 -109 -177 -95 285 -60 -116 129 -290 -8 78 0 -5 306 -310 43 161 51 -103 149 79 112 -8 1 -282 -47
6583 -47 -4 -188 59 -50 2 99 -132 73 152 -126 -6 74 46 -142 31 148 -163 -186 -1 110 -206 11 -123
$$ [...]
8191A04
##END NTUPLES=NMR FID
##END=
