##TITLE=1H_PM1003
 CDCl3, 8 sc, 
 12.3.2019
##JCAMPDX= 6.0         $$ Bruker NMR JCAMP-DX V2.0
##DATA TYPE= NMR FID
##DATA CLASS= NTUPLES
##ORIGIN= UXNMR, Bruker Analytische Messtechnik GmbH
##OWNER= root
$$ XWIN-NMR		Version 3.5
$$ Tue Mar 12 15:27:07 2019 Russian Standard Time (UT+4h)  she@DPX200
##.OBSERVE FREQUENCY= 200.1316
##.OBSERVE NUCLEUS= ^1H
##.DELAY= (6, 6)
##.ACQUISITION MODE= SIMULTANEOUS
##.ACQUISITION SCHEME= undefined
##.AVERAGES= 8
##.DIGITISER RES= 18
##SPECTROMETER/DATA SYSTEM= spect
##.PULSE SEQUENCE= zg30
##.SOLVENT NAME= CDCl3
##.SHIFT REFERENCE= (INTERNAL, CDCl3, 0, 15.7039)
##AUDIT TRAIL= $$ (NUMBER, WHEN, WHO, WHERE, WHAT)
$$ ##TITLE= Audit trail, XWIN-NMR		Version 3.5
$$ ##JCAMPDX= 5.01
$$ ##ORIGIN= Bruker BioSpin GmbH
$$ ##OWNER= she
$$ F:/spectra/data/she/nmr/H-F/1/audita.txt
$$ ##AUDIT TRAIL=  $$ (NUMBER, WHEN, WHO, WHERE, WHAT)
(   1,<2019-03-12 15:25:50.20 +0400>,<she>,<DPX200>,
      <created by zg, POWCHK disabled, PULCHK disabled
       configuration hash MD5:
       00 E9 B6 7A A2 85 ED C7 34 08 36 98 17 FE 4E 26
       data hash MD5: 16K
       1A 35 89 37 02 60 0F F1 BE FF F7 5C B3 22 3A AB>)
$$ ##END=
$$ 
$$ hash MD5
$$ 02 9D 75 2E 43 5B 05 02 57 47 3C 71 27 02 33 79
##$RELAX= 
##$RELAX= 
##$RELAX= 
##$RELAX= 
##$RELAX= 
##$RELAX= 
$$ Bruker specific parameters
$$ --------------------------
##$DU= <F:/spectra>
##$EXPNO= 1
##$NAME= <H-F>
##$PROCNO= 1
##$TYPE= <nmr>
##$USER= <she>
##$AMP= (0..31)
100 100 100 100 100 100 100 100 100 100 100 100 100 100 100 100 100 100 
100 100 100 100 100 100 100 100 100 100 100 100 100 100 
##$AQSEQ= 0
##$AQ_mod= 1
##$AUNM= <au_zg>
##$AUTOPOS= <>
##$BF1= 200.13
##$BF2= 200.13
##$BF3= 200.13
##$BF4= 200.13
##$BF5= 200.13
##$BF6= 200.13
##$BF7= 200.13
##$BF8= 200.13
##$BYTORDA= 1
##$CFDGTYP= 0
##$CFRGTYP= 5
##$CHEMSTR= <none>
##$CNST= (0..31)
1 1 145 1 1 1 1 1 1 1 1 1 1 1 1 1 1 1 1 1 1 1 1 1 1 1 1 1 1 1 1 1 
##$CPDPRG= <>
##$CPDPRG1= <>
##$CPDPRG2= <>
##$CPDPRG3= <>
##$CPDPRG4= <mlev>
##$CPDPRG5= <mlev>
##$CPDPRG6= <mlev>
##$CPDPRG7= <mlev>
##$CPDPRG8= <mlev>
##$CPDPRGB= <>
##$CPDPRGT= <>
##$D= (0..31)
0 1.2 0 0 0 0 0 0 0 0 0 0.03 0 0 0 0 0 0 0 0 0 0 0 0 0 0 0 0 0 0 0 0 
##$DATE= 1552389949
##$DBL= (0..7)
120 120 120 120 120 120 120 120 
##$DBP= (0..7)
150 150 150 150 150 150 150 150 
##$DBP07= 0
##$DBPNAM0= <>
##$DBPNAM1= <>
##$DBPNAM2= <>
##$DBPNAM3= <>
##$DBPNAM4= <>
##$DBPNAM5= <>
##$DBPNAM6= <>
##$DBPNAM7= <>
##$DBPOAL= (0..7)
0.5 0.5 0.5 0.5 0.5 0.5 0.5 0.5 
##$DBPOFFS= (0..7)
0 0 0 0 0 0 0 0 
##$DE= 6
##$DECBNUC= <off>
##$DECIM= 24
##$DECNUC= <off>
##$DECSTAT= 4
##$DIGMOD= 1
##$DIGTYP= 9
##$DL= (0..7)
0 120 120 120 120 120 120 120 
##$DP= (0..7)
150 150 150 150 150 150 150 150 
##$DP07= 0
##$DPNAME0= <>
##$DPNAME1= <>
##$DPNAME2= <>
##$DPNAME3= <>
##$DPNAME4= <>
##$DPNAME5= <>
##$DPNAME6= <>
##$DPNAME7= <>
##$DPOAL= (0..7)
0.5 0.5 0.5 0.5 0.5 0.5 0.5 0.5 
##$DPOFFS= (0..7)
0 0 0 0 0 0 0 0 
##$DQDMODE= 0
##$DR= 18
##$DS= 0
##$DSLIST= <SSSSSSSSSSSSSSS>
##$DSPFIRM= 0
$$ [...]
##$SUBNAM2= <"">
##$SUBNAM3= <"">
##$SUBNAM4= <"">
##$SUBNAM5= <"">
##$SUBNAM6= <"">
##$SUBNAM7= <"">
##$SUBNAM8= <"">
##$SUBNAM9= <"">
##$SW= 24.9336934301222
##$SWIBOX= (0..15)
0 0 2 0 0 0 0 0 0 0 0 0 0 0 0 0 
##$SW_h= 4990.01996007984
##$TD= 16384
##$TD0= 1
##$TE= 0
##$TE2= 300
##$TE3= 300
##$TEG= 300
##$TL= (0..7)
0 120 120 120 120 120 120 120 
##$TP= (0..7)
150 150 150 150 150 150 150 150 
##$TP07= 0
##$TPNAME0= <>
##$TPNAME1= <>
##$TPNAME2= <>
##$TPNAME3= <>
##$TPNAME4= <>
##$TPNAME5= <>
##$TPNAME6= <>
##$TPNAME7= <>
##$TPOAL= (0..7)
0.5 0.5 0.5 0.5 0.5 0.5 0.5 0.5 
##$TPOFFS= (0..7)
0 0 0 0 0 0 0 0 
##$TUNHIN= 0
##$TUNHOUT= 0
##$TUNXOUT= 0
##$USERA1= <user>
##$USERA2= <user>
##$USERA3= <user>
##$USERA4= <user>
##$USERA5= <user>
##$V9= 5
##$VALIST= <valist>
##$VCLIST= <CCCCCCCCCCCCCCC>
##$VD= 0
##$VDLIST= <DDDDDDDDDDDDDDD>
##$VPLIST= <PPPPPPPPPPPPPPP>
##$VTLIST= <TTTTTTTTTTTTTTT>
##$WBST= 1024
##$WBSW= 4
##$XGAIN= (0..3)
0 0 0 0 
##$XL= 0
##$YL= 0
##$YMAX_a= 28298
##$YMIN_a= -32978
##$ZGOPTNS= <>
##$ZL1= 120
##$ZL2= 120
##$ZL3= 120
##$ZL4= 120
##$ABSF1= 10
##$ABSF2= 0
##$ABSG= 5
##$ABSL= 3
##$ALPHA= 0
##$AQORDER= 0
##$ASSFAC= 0
##$ASSFACI= 0
##$ASSFACX= 0
##$ASSWID= 0
##$AUNMP= <proc_1d>
##$AZFE= 0.1
##$AZFW= 0.1
##$BCFW= 1
##$BC_mod= 2
##$BYTORDP= 1
##$COROFFS= 0
##$CY= 11.3945322036743
##$DATMOD= 1
##$DC= 2
##$DFILT= <>
##$DTYPP= 0
##$F1P= 18.9103706918063
##$F2P= -1.10871071338519
##$FCOR= 0.5
##$FTSIZE= 0
##$FT_mod= 4
##$GAMMA= 1
##$GB= 0.15
##$INTBC= 1
##$INTSCL= 1
##$ISEN= 128
##$LB= 0.24
##$LEV0= 0
##$LPBIN= 0
##$MAXI= 10000
##$MC2= 0
##$MEAN= 0
##$ME_mod= 0
##$MI= 1.114404
##$NCOEF= 0
##$NC_proc= 0
##$NLEV= 6
##$NOISF1= 3.799351
##$NOISF2= 2.8
##$NSP= 1
##$NTH_PI= 0
##$NZP= 0
##$OFFSET= 15.70392
##$PC= 1
##$PHC0= -8925.829
##$PHC1= 1.000254
##$PH_mod= 1
##$PKNL= yes
##$PPARMOD= 0
##$PSCAL= 0
##$PSIGN= 0
##$REVERSE= no
##$SF= 200.130013532006
##$SI= 16384
##$SIGF1= 3
##$SIGF2= 2
##$SINO= 400
##$SIOLD= 16384
##$SREGLST= <1H.CDCl3>
##$SSB= 0
##$STSI= 0
##$STSR= 0
##$SW_p= 3612.71676300578
##$SYMM= 0
##$S_DEV= 0
##$TDeff= 0
##$TDoff= 0
##$TI= <>
##$TILT= no
##$TM1= 0
##$TM2= 0
##$TOPLEV= 0
##$USERP1= <user>
##$USERP2= <user>
##$USERP3= <user>
##$USERP4= <user>
##$USERP5= <user>
##$WDW= 1
##$XDIM= 8192
##$YMAX_p= 0
##$YMIN_p= 0
$$ End of Bruker specific parameters
$$ ---------------------------------
##NTUPLES= NMR FID
##VAR_NAME=  TIME,          FID/REAL,        FID/IMAG
##SYMBOL=    X,             R,               I
##VAR_TYPE=  INDEPENDENT,   DEPENDENT,       DEPENDENT
##VAR_FORM=  AFFN,          ASDF,            ASDF
##VAR_DIM=   8192,          8192,            8192
##UNITS=     SECONDS,       ARBITRARY UNITS, ARBITRARY UNITS
##FACTOR=    0.0002004,     1,               1
##FIRST=     0,             0,               0
##LAST=      1.6414764,     0,               0
##MIN=       0,             -32978,          0
##MAX=       1.6414764,     28298,           0
$$ Real data points
##PAGE= N=1
##DATA TABLE= (X++(R..R)), XYDATA
$$ [...]
517b013k056L221L895J61k558k857j340K317M421P86l975l383O44K687K422O52
533C024k652l808M1M093K910j130l299k578M26L684L244j162m105k360J362L500
549A190K500j260m002k091K013L388J642j157l676k777K138M857J209l072k929
564b027q86J035L395K643k629m761j22L499J777O8n88l016k554L123M980q22m319
581a204j293J067R65K263J590l203l946J666L965M66j361j028k154p54M037L376
597D452k991m366L13K254J182J515p5l980k559L360M007o46k482j499j204R14
613a805M166J921l789m070P37L037J946N05j568l293j154K915L357K0k771k612
629b458r3K542K488r0k217k299n38K319L141l13l416j527J516J227N88R01j166
$$ plain form
517 -2013 -4069 -848 3047 3208 650 -2207 -3547 -1230 3191 3977 2 -3381 -2737 -50 2372 3024
533 3024 372 -3436 -3395 698 3608 2478 -821 -3399 -2973 711 3955 2793 -1312 -3672 -2310 1190
549 1190 3690 2430 -1572 -3663 -1650 1738 3380 2223 -1453 -4230 -2092 2765 3974 902 -2027
564 -2027 -2913 -1878 1517 4160 1531 -3230 -3352 147 1924 1992 1404 -1612 -4166 -1043 3937 3115 -1204
581 -1204 -2497 -1430 -465 1798 3388 185 -3761 -2095 1870 2336 975 -53 -2207 -2961 1076 4452
597 4452 1461 -2905 -2592 -338 844 2359 2284 -1696 -4255 -895 3112 2466 -16 -1515 -2719 -1805
613 -1805 2361 4282 493 -3577 -2840 197 2143 2648 1080 -2213 -3367 -452 2905 2925 154 -2458
629 -2458 -2551 -9 2479 2389 172 -2127 -2665 -346 2795 2482 -934 -2461 -945 282 870 1771 605
646F05l141J98L880J072k684j194O10k85Q77K490q48l771m9L296N36j440K86n47
664a09k147J338L815o47l896m55J910K80P85J541k193l617J554L921k75j947J92
681E0q35j890K345M038j719m472K23K562R6K58J542j662l583J062L975L05k369
698g4m75J65r54Q03K581j04k983j110J823J369l04m40l19p73l16J160J204o20
716F33j470j2J020R0l87M33Jj081J19J627j14j821J99J661l81j153P89N08j380
735g19L0J946k73j986K92J271o80j36J540p35k450Q51K611p68j738J109M60k044
753a419L70K865m88k757N17J711j069m69K127j54k821K73K599n04j682J267Q95
770A261k126o72K393N59j922m4J284r01j115J516J254j385j144Q55L81p34M31
$$ plain form
646 605 -2536 -2338 1542 2614 -70 -1264 -654 -939 -62 2428 1580 -2191 -2240 1056 1592 152 438 -109
664 -109 -2256 -918 2897 2250 -1646 -2101 -191 89 874 2415 222 -3395 -1841 2080 1805 -142 50
681 50 -785 -2675 -330 3708 1989 -2483 -2260 302 398 656 2198 536 -3047 -1985 1990 2295 -74
698 -74 -549 -384 -1338 -535 2046 1942 -1041 -2151 -328 1041 737 297 -22 -795 -1111 49 1253 633
716 633 -837 -849 171 261 -126 307 308 -773 -654 973 859 -962 -763 898 517 -636 153 661 -719
735 -719 -689 1257 984 -1002 -710 561 -119 -255 1285 550 -1900 -1049 1562 794 -944 165 625 -1419
753 -1419 -1049 1816 1328 -1429 -912 799 -270 -739 1388 1234 -1587 -1314 1285 781 -901 366 1261
770 1261 -865 -1537 856 1415 -507 -551 733 -168 -1283 233 1487 102 -1042 -187 194 -540 -109
787a09J280o02j828m3J699O83q24m20J85n84m48J373J392j132j861L19J169N0
805B99K05O28j127j767J011K210m31j487L02J71j054O51K023o68k329L00J621
822E58l24l89Q90n76j621J007J964j080j621J122P86j344K96J789j117k277J464
839d73K429j271j833J003N17j252Q76K064j482k817J019K520k90j102M03n98j625
856a912J161K911k73k881q83J256Q57O10O85j099k365NK570J426j045j458p07
873a142j27J012J929L74k248j978Q71K167P84p54j140r83r5J522J603n66k043
890h14q25R69J179O57j94j488j354R68K207K53j688r48K68M22R63J039r62k276
908a624p4K249J133q65r39p82o27J243K426k34k916j187J648J374K42J49j077
$$ plain form
787 -109 1171 569 -1259 -1302 397 1080 256 -164 21 -563 -1011 362 1754 622 -1239 -920 249 299
805 299 504 1132 5 -1762 -751 1459 1028 -459 -157 14 -1040 -389 1634 966 -1363 -1063 558
822 558 234 -155 735 159 -1462 -455 1509 429 -1192 -70 716 -628 -332 1457 340 -1937 -473
839 -473 1956 685 -1148 -145 372 -880 -4 2060 578 -2239 -1220 1300 1010 -92 311 -287 -1912
856 -1912 -751 2160 1887 -994 -1877 -621 236 846 1531 432 -1933 -1928 642 2068 1023 -435 -1142
873 -1142 -1269 -257 1672 2046 -202 -2180 -1309 858 1642 888 -252 -1235 -1330 192 1795 1229 -814
890 -814 -1639 -670 509 1166 972 -516 -1870 -902 1305 1558 -130 -1078 -810 -388 575 1614 652 -1624
908 -1624 -1698 551 1684 819 -120 -902 -1529 -286 2140 1906 -1010 -2197 -549 825 1067 1216 139
925A39k269J30L116J492j958j964j28M42J200J937l18l148j458K248K232j96r75
942E22j042j292M19K694J333k060k315R5J395J392P74j108k429n43K223J808n02
959A364j468j144m23J241K169K23k306j798O78J903J290k65j836j688N53K268
975G61J251q50j815j215N49K059J446r31k244j033J030K025J152j107k346q40
991b108J524J904M72j067j829r96J350K395L54j931j605k5J108J706Q01j704k471
1008b122K25K423J297o80j288j240l11J791K092n59k411j073Q36J487J307j17
1024A657k238j856J226K561O20j289j478r48M83K143J383j354k298n46J198J668
1040I32J039r37k479q90J973K030j17j339j247o05R77K121O37j890j887K04J536
$$ plain form
925 139 -2130 -2000 1116 2608 650 -1314 -1442 -1000 200 2137 1819 -1329 -2787 -539 1693 1497 522
942 522 -520 -1812 -1393 1301 2634 574 -1741 -1646 -251 1141 1915 807 -1622 -2165 58 1866 1364
959 1364 -104 -1248 -1671 -430 1739 1962 -344 -2142 -1464 439 1729 1464 -372 -2060 -1507 761
975 761 2012 1162 -653 -1868 -1319 740 2186 1255 -989 -2022 -992 1033 2185 1078 -1268 -2108
991 -2108 -584 1320 1792 725 -1104 -2100 -750 1645 1999 68 -1537 -1562 -454 1252 2053 349 -2122
1008 -2122 -1897 526 1823 1143 -145 -1385 -1696 95 2187 1628 -783 -1856 -1020 467 1774 1657
1024 1657 -581 -2437 -1211 1350 1970 681 -797 -1745 -1262 881 2264 910 -1388 -1934 -736 932
1040 932 1971 1034 -1445 -2335 -362 1668 1551 212 -1035 -1640 -663 1458 2095 205 -1682 -1478 58
1057E8J423J72j522j816J55J921J311n12j479j257J74J774J400p50j822p95O28
1074i37J350J203m13k086j183J344J930K56r83j232q03O84J989P93j526j707n
1091a326J079J198O33r02j958m84J681J597j85j324j218j47J286J455j56j454
1107b25r84Q8R88J349K34j691j531P11J751N88o21r19q97Q0J534J166q39j570
1125g88l36O77R00P47k79j547r05J068J519J37r73r57l15O61J205L13r85j046
1143i04j04P56J013L12r74j215J10J156P11j69o90q27j43J091J050m63j169l16
1161g75M38M79N44J48r24r48M16J215L79o36p65l13L68Q20L52n80o98j95L60O44
1181C29M20m07r36k31P16O50j9l96n36k68N36Q32q5p87k65K69J44K21M01k76q71
$$ plain form
1057 58 1481 1653 131 -1685 -1530 391 1702 1190 -289 -1546 -1372 402 1802 1052 -770 -1565 -937
1074 -937 413 1616 1203 -883 -2066 -722 1208 1464 481 -751 -1554 -870 1119 1912 386 -1321 -1326
1091 -1326 -247 951 1584 682 -1276 -1760 -79 1518 1333 9 -1209 -1356 -70 1385 1229 -225
1107 -225 -1209 -1121 -133 1216 1450 -241 -1772 -1061 690 1278 657 -262 -1159 -1079 455 1621 782 -788
1125 -788 -1124 -447 453 1200 921 -626 -1531 -463 1056 1193 220 -737 -1052 -391 814 1127 142 -904
1143 -904 -1008 -252 761 1073 99 -1116 -1006 150 861 692 2 -825 -968 123 1173 710 -459 -775
1161 -775 -337 142 686 834 -90 -1038 -622 593 972 336 -429 -742 -374 446 798 218 -480 -675 -315 329
1181 329 749 342 -594 -825 -109 541 522 126 -410 -678 -142 690 605 -182 -447 -178 -34 187 588 312 -559
1202e59n7Q88L88n26l56Q2m1P1M33N5n75k89M02L24j75o2K6k52p1M09K34l53k85
1225b89J72J96PL8m6k50M2L35Pk78M4J73j80r9L17Q1l96j01L54Q5k82jJ22r4l5
1250g8J75p4k45J43K87j68l03J49K37j04j22J78K4k73r4L71L23k26n38j3M93J91
1272C33j79j06m4l37K6P00K57p19m47L27J97OM53lj032l64J074O50o43l91J64
1293g8l41j13J070M45j190p02P70M06k05M29O6j211l56J427O64j022m63L75k59
1312b88m8J070J71j446m39J130L31m63K73o5j129N2J666K93j498n04P47J97k3
1331B7O03j58j255k30J256P08m76o09m21j58O96J021j18j184p23M40R95N80l97
1350E97r59m86K44P39Q55Kj394j077Q71J481L8o93m29o52k01J462J250j182j618
$$ plain form
1202 -559 -616 272 660 134 -222 -140 -181 -110 323 378 -197 -486 -84 240 65 3 29 -223 -294 115 349 -4 -289
1225 -289 -117 79 86 124 78 -172 -130 205 212 -66 -22 151 -29 -128 189 270 -126 -227 127 212 -70 -71 51 -43 -78
1250 -78 97 23 -222 -79 208 40 -263 -114 123 19 -103 75 99 -174 -268 103 426 200 -338 -351 142 333
1272 333 154 48 4 -333 -307 393 650 -69 -516 -189 8 14 467 464 -568 -932 142 792 149 -242 -78
1293 -78 -419 -532 538 983 -207 -909 -139 267 62 491 557 -654 -1010 417 1081 59 -404 -29 -288
1312 -288 -336 734 905 -541 -980 150 481 18 291 226 -903 -851 815 1108 -390 -894 -147 50 27
1331 27 630 472 -783 -1013 243 951 475 -134 -555 -713 -17 1004 886 -298 -1021 -581 414 994 597
1350 597 -362 -848 -604 135 990 992 -402 -1479 -608 873 911 218 -211 -863 -1064 398 1648 466 -1152
1369a152L15Q57R8O23L90j586j319J490J695o74r52N5m78k68J638J007j837j418
1387a516J151Q62m54M58L58j724q83K113J361j529j087N86q2p9J439L42k059r26
1405a669J680R65n71j00k07j263J10K097O79j709j162M14O21P23O53p61j624j70
1423a294J290R99J29p88j404m01J436J307k91r80q83m83R63J841j7j899q35P16
1441e94N20O39Q58r87k103L38K148L86r46j71n12r52J190K069r07k212L14J210
1459B88l20K70J019j239j920J304K127p91j314M25j88p32J525J466j939j903J463
1476d59J407p36L2O10j563j195K154J839j528j526M28J10L8J551N02k246j309
1493a891J518J276k15l6m79j540j8K081R36j237j101k45R2J061J249o69j692k58
$$ plain form
1369 -1152 -837 20 118 741 1131 -455 -1774 -284 1411 737 -215 -160 -638 -906 732 1739 -98 -1516
1387 -1516 -365 497 43 501 859 -865 -1748 365 1726 197 -890 -304 -386 -465 974 1316 -743 -1669
1405 -1669 11 976 405 305 98 -1165 -1055 1042 1721 12 -1150 -736 -115 608 1261 500 -1124 -1294
1423 -1294 -4 995 1124 336 -1068 -1469 -33 1274 983 3 -880 -1363 -400 1441 1424 -475 -1310 -594
1441 -594 -74 565 1423 436 -1667 -1329 819 1205 259 88 -424 -1376 -186 1883 976 -1236 -922 288
1459 288 -32 238 1257 18 -1902 -598 1529 738 -576 -151 -339 -1071 454 1920 -19 -1922 -459
1476 -459 948 212 244 854 -709 -1904 250 2089 561 -965 -537 -427 -389 1162 1664 -582 -1891
1493 -1891 -373 903 688 652 173 -1367 -1385 696 1632 395 -706 -951 -859 202 1451 782 -910 -1168
1511a168Q48O35O25k5j471r56J221J254k93m46l17r01J55J847M68j781p55R03
1529a57J77qR72k93j942J9K024K25j206J21K7j076O69K077o42k298K89J506l25
1548A59j26J007r13j878J096K160o60j355M62j56r44J383J782j621k117J074J392
1565G45o33R1P91j301j475J552J763r54j132L09k28l16J398Q23j598j177R56P56
1583C70j23L26j38j255j82J398N14o68k69k64m95P15J232n69j296J94N78j22M22
1602C68M97j057r61J026R76o51l70L71o19m42J331P01j412p04R34J90l66P16J01
1621F29j461j19J594J11j057L03L12j071J73J766k40j857J90J236m21l47J021
1638G62l19j603M88J644m60j023N88J01j022N38J454p05j414N43Q31m68J2O76
$$ plain form
1511 -1168 -320 315 940 915 -556 -1512 -291 963 670 224 -93 -994 -839 1008 1476 -305 -1060 -157
1529 -157 20 12 984 691 -1251 -1232 792 1017 -189 -68 -41 -1117 -448 1629 987 -1311 -1022 484 159
1548 159 33 1040 127 -1751 -655 1505 845 -510 -48 -204 -1148 235 2017 396 -1721 -647 745
1565 745 112 203 994 -307 -1782 -230 1533 579 -553 -244 -472 -788 610 1433 -165 -1342 -386 370
1583 370 247 573 435 -820 -1002 396 910 242 -27 -291 -786 -71 1161 592 -704 -510 68 -54 368
1602 368 865 -192 -1153 -127 849 198 -172 199 -420 -862 469 1170 -242 -946 -12 178 -188 528 629
1621 629 -832 -951 643 754 -303 0 312 -759 -586 1180 940 -917 -727 509 88 -259 762
1638 762 443 -1160 -672 972 512 -511 77 178 -844 -306 1148 443 -971 -428 403 -65 -53 623
1656F23o21q82P76P80n66k68L62l90l35Q85L80r41k39O37j49k75O42nr67J30R69
1677E46l01o42N13J77q00J86R74m40q31N08M59n79P8O65n50o66Q35M72q64r7Q20
1698D63l69p26Q06N53r92k62R49j54p61O18M78r71j61J086j86j039N50Q14q84
1717a88m66J063Q3j093L02R35o07o31P76K45q10K22P10n81n49Q07L22q06M1O29
1737D04m33l89P74J55q59J9O87k88l71O39K3r23J59R44k71o58L90J74o00K46Q12
1758F34m80q05N11M79m76L0N98m89p52O92P37n54m08L26j28k39O46L03q04l10
1778d89N98L6k58M81N1r68r8J091J49p71j8K43m24J34Q85j92j009O9O69r8n3M45
1800D73m16q60M85J000k33o58P6lk05N52N52o66p28L62M38l4K19K1q20l07R02
$$ plain form
1656 623 2 -880 -104 676 110 -158 204 -186 -521 364 744 -197 -436 201 52 -223 419 414 -553 -423 546
1677 546 245 -397 116 293 -507 -321 653 213 -618 -110 349 -230 -152 513 -37 -703 132 604 -260 -357 463
1698 463 94 -632 174 727 -265 -527 422 268 -493 125 603 -368 -529 557 371 -668 -118 696 -188
1717 -188 -654 409 492 -601 -299 636 29 -602 174 419 -391 -169 541 -40 -589 218 540 -266 -225 404
1737 404 -29 -418 356 511 -348 -329 358 70 -301 338 361 -562 -403 541 270 -388 2 176 -424 -178 634
1758 634 154 -651 -140 339 -137 -107 491 2 -750 -58 679 125 -283 43 -85 -324 322 625 -179 -489
1778 -489 109 145 -113 368 419 -549 -647 444 593 -178 -196 47 -377 -243 642 450 -559 -490 179 81 28 473
1800 473 57 -803 -318 682 449 -209 -133 -136 -341 211 763 97 -631 -269 169 135 354 375 -445 -752 150
1821A50N29n22l30J0k88J84Q92Rj042k86O41K26k6K87k83q65J46J024K18n90k80
1842a96j24q1N92O27m98q68J00N10J44K01N6p30n44O65Q23k01n20k35k44K14Q52
1863E43K05r09n58M23L88J25K82k67q99r1J012N15n01m69j84q1M83P62k18r63
1883d02k56N17L95K06J5n94o80M03R26J41n38m25k58J46P34M86o22q31M5N56L86
1904C50J55k40p10k83O33P03n8n27m57j26M76P45J4p81n26K39N35L83j8n43n74
1925f10J43O83L87j97n55n08J33Q05N02n05p47j13L39M44L69j78p75m04N65P14
1945D92Q4l83n22l08L56Q38K14p26o16J33M22M05K22l68p85j26P48N59k21m68
1965e0l61j07M47O77j1p78n09L46N64K23j03m31m72R0P19M28l79o21j69K64M53
$$ plain form
1821 150 679 157 -173 -163 -451 -267 625 634 -408 -694 -53 173 147 434 151 -714 -568 456 674 84 -196
1842 -196 -320 -401 191 818 320 -548 -448 62 206 407 463 -267 -811 -146 677 476 -44 -279 -523 -309 543
1863 543 748 -161 -719 -296 92 217 499 232 -667 -758 254 769 268 -201 -385 -466 17 779 561 -402
1883 -402 -658 -141 254 460 475 -119 -799 -396 530 671 133 -292 -550 -404 330 816 194 -637 -592 -36 350
1904 350 505 265 -445 -728 -95 608 550 23 -434 -560 -84 661 675 -106 -632 -393 142 525 507 -36 -610
1925 -610 -467 216 603 406 -149 -657 -524 281 783 278 -469 -582 -243 201 570 392 -383 -787 -222 492
1945 492 576 193 -329 -637 -281 557 771 45 -571 -438 -16 389 611 243 -542 -668 80 639 418 -50
1965 -50 -411 -518 -71 606 595 -183 -692 -346 218 441 338 -93 -565 -475 244 672 293 -328 -497 -233 220
1986B20L90j92p51l95N59P46j2n31l49r2J74N29L84m38q19m3O24M48k1l45n04
2007d18k22N38P04j27o63k63J71K08L67K59m47p23J20P59K94l33l24j99j3M05
2027I3M65j89o39j79L58L44R8j11l89l25K24N90J73m50m54K2L19L17J10k69m68
2048c60j56M61N39r4m97k30Q3J91L36K76m17o96P8P51K68l71k28q2k22K40O73
2069E43m8p69j91M28J21j0L02j97p71R9R08R8o88o1L00k43l0O27J3p96j00O65
2091B00R2l18J29L2m71R7O93k6o75m8M09m0r4K75o5n48J7N65J05l24j31Pq7J73
2115c3L32p7m31j41K52K51L7j26j66p9M1J81K38m2l87j62L05K60j38n9J0k38m6
2138b18M38J69m82j55L78o1k85L37K78n67l29O59K44n97l2M79k39l74M63L06o10
$$ plain form
1986 220 610 418 -333 -728 -169 577 565 34 -315 -407 -233 296 680 242 -577 -620 4 452 431 86 -418
2007 -418 -640 -102 602 475 -188 -451 -280 -72 295 554 107 -616 -496 263 557 224 -100 -299 -312 93
2027 93 558 369 -270 -449 -91 253 351 240 -149 -474 -250 340 513 63 -391 -369 -50 267 377 108 -360
2048 -360 -516 -55 484 390 -107 -337 -254 -63 273 549 132 -564 -486 265 533 162 -66 -148 -370 -130 543
2069 543 495 -274 -465 -37 84 74 376 179 -592 -493 415 513 -175 -236 64 -179 -209 418 431 -365 -465 200
2091 200 292 -26 103 135 -336 -239 454 428 -247 -295 114 74 -20 255 190 -358 -341 224 329 5 -126 -119 -206 -33
2115 -33 299 222 -209 -350 -98 153 190 64 -102 -181 -140 41 279 237 -150 -312 -7 253 115 56 66 -172 -218
2138 -218 220 389 -93 -248 130 69 -216 121 399 -168 -497 162 406 -191 -223 256 17 -357 106 412 -198
2159a98j77O31j5n33K54M45n01l11O55J77o66n3O11j47m40L12K68m71j19N10m
2180B28m57J18K99k40j72L73L4m12M6L33o8j97J16M4j45O3J83r1j51P5Q7l4LJ1
2204D6l3KJ3j5O9K5j66o4K59O8l02n2K92o9k21J92J38l43o8M08Jl64J18K52l22
2229a36j15N45M2o59MN94p8l77K60J89n23n3O30L2n19K7K53k29j1M78q8o33Q6
2252b81M97p0k30J96m3m14J47N31j07l99L8J23j21J62K93k42m15J77L33l5p4J2
2274G8j78r7K76K02j97j64J6k0J06K29q1l43n0K42R8J9j7k75j81L31K91k06k06
2297a27Q2j00j04M25K76n12m18L74K97j19N6O7m43j64N77L07m06k18J25j29k5
2318a79N23J46o89l11N11K38j47O1l8m47m0O26J59m43j55J02j00J42M46j33o07
$$ plain form
2159 -198 -375 256 241 -292 -38 407 -94 -405 250 427 -239 -292 319 172 -268 44 312 -159 -278 232 228
2180 228 -229 -111 188 -52 -224 149 183 -229 -183 150 82 -115 1 45 -100 -37 146 55 -96 -21 66 32 35 46
2204 46 13 15 28 13 82 107 -59 -123 136 204 -98 -150 142 73 -148 44 182 -161 -229 179 180 -184 -66 186 -136
2229 -136 -251 294 336 -323 -319 275 197 -180 80 269 -254 -307 323 355 -164 -137 116 -113 -124 354 266 -367 -281
2252 -281 216 146 -84 112 69 -345 -198 333 226 -173 -135 -12 -133 29 322 80 -335 -158 175 140 66 78
2274 78 -100 -197 79 281 84 -80 -64 -84 22 251 170 -173 -223 19 117 136 119 -156 -337 -6 285 79 -127
2297 -127 -45 -145 -249 176 452 -60 -478 -104 193 74 130 197 -246 -410 167 474 68 -150 -25 -154 -179
2318 -179 344 490 -199 -510 1 239 92 153 115 -332 -372 254 413 -30 -185 -83 -183 -41 405 272 -335
2339c35k8M77R9j18N6j82l24K37N23j07m25o6J37OJ93K25k90m52J19M19J15j37
2361A42j71k50jL83K29k30k61q3M7K17L10r1m55j44K65K52J08o7l45k68L20M39
2383C46l5l08j07p5KL64K79l36m78P6L59J09K4j11l39j39L95L38j71k94r4k8J40
2406h3L69N5m57k70K44K60Q7%k12l38P0M87J74l11k41oM7J98K66j16m35j16K89
2429c9K56J4j09k70k06K53L92ll35j90K5J49K38Q5k29k88MK53K21O1k82l04N6
2452b48L83J97j75k08j25J9J99K69m5l64j88J67K50J38p8k86k25J61L65O0k31
2473C5j99n7Q5K43J74j95l01n3K14K18N1j38k72o6K49K65l3k28j72oJ89K38Kk67
2497b4j94Q6J99J35j0j91k32K3K91J76j33k42r0J03J97J00q3k22r8J07J98J04
$$ plain form
2339 -335 -363 114 213 95 151 -31 -355 -118 405 298 -127 -193 -56 -50 143 368 78 -374 -255 164 279 142
2361 142 -29 -279 -280 103 332 102 -159 -242 -195 22 332 241 -214 -358 -93 159 267 200 -145 -413 -93 346
2383 346 311 3 -104 -179 -177 187 466 130 -348 -272 87 196 220 109 -230 -369 26 364 193 -101 -195 -223 -83
2406 -83 286 341 -116 -386 -142 118 205 205 -7 -345 -275 212 386 75 -166 -172 -125 73 339 223 -212 -328 -39
2429 -39 217 231 122 -148 -354 -101 291 288 -47 -237 -212 -63 175 260 31 -257 -253 0 221 282 0 -304 -248
2452 -248 135 332 157 -51 -176 -157 42 311 266 -98 -286 -119 131 269 191 -95 -320 -159 206 266 35
2473 35 -164 -221 -136 107 281 86 -215 -268 -54 164 215 77 -195 -261 -12 253 220 -8 -180 -186 3 241 243 -24
2497 -24 -218 -132 67 202 192 1 -231 -208 83 259 126 -116 -206 -103 94 194 111 -111 -209 -102 96 200
2519B00q4k26j13J55K63M7j95k06NJ78J47J1j36j66k4J18J85M8j87k08QK01J63
2542A84o7j87j15N5J58J14n1j58r8L9J68J26o2j59j31Q1K08P0j07j32o1R0J42
2565A07P5j06j52l3R3J41J6r2j15n5P9J55L7j60j27L8J17Q4j9j07q9J5J25P0l4
2590F3p9n1k1Q9J41j6j90o6J24R9po1l4n1J3J01N0p1r5LL9N3N0m4j46k0J51O5
2618H9p9o6J9j1jR3M3j01o4M5Q2lnk5n8K7O8M5o5m6%M0J1qj0k3k8L4M8j2o0j1
2650c2QK1K2Ql8n5K4Q8K0j14j5O7J7m6L5M3p3o6Q6R1n4p3RL5OM8j7q0j5Q6Rp2
2682b7K1M4p1n2J17N6j17p2Q6N6m1j1K5n8j3J15K7j11l3P7%k1Q2J1j35n7J63O9
2710A30r3n9K4j5k4J09N0j41j16J00J14m4m1J4m8o5Q0J27l4j50m5R1O9K7k3q4
$$ plain form
2519 200 116 -110 -223 -68 195 242 47 -159 -154 24 171 182 46 -120 -144 -26 159 207 20 -188 -180 21 184
2542 184 117 -70 -185 -130 28 142 91 -67 -165 -126 42 168 106 -53 -184 -103 105 175 68 -64 -125 -35 107
2565 107 182 76 -76 -109 -16 125 141 49 -66 -121 -42 113 150 -10 -137 -99 18 102 83 -24 -113 -98 27 97 63
2590 63 -16 -67 -88 1 142 126 -64 -130 -6 93 86 25 -9 -60 -47 54 104 33 -62 -59 -20 33 83 39 -107 -127 24 89
2618 89 10 -56 -37 -48 -49 44 87 -14 -78 -33 49 46 41 16 -42 -15 53 98 33 -13 -13 27 38 30 20 -3 -31 3 51 39 -21 -32
2650 -32 -24 -3 19 27 -11 -66 -42 46 66 -48 -63 4 21 -25 10 53 -20 -86 0 91 37 -36 -27 8 14 62 45 -35 -50 36 45 -27
2682 -27 -6 38 -33 -85 32 88 -29 -101 -15 41 0 -11 14 -44 -57 58 85 -26 -59 18 18 -3 79 90 -45 -102 61 130
2710 130 37 -22 2 -13 -37 72 122 -19 -135 -35 79 35 -6 8 -40 -105 -25 102 68 -82 -127 -36 33 60 37 -47
2736d7n7O8J04No9k6rj1P3J00p3j44JJ32Q8q6p9k2K5K7Q0j4q3q4N6O7L7J2r4j18
2766a41L2K07L4j40q0M1L0kJ25J9j84j02J66J44p4p3Mo1m3J88J03j88j72R8J36
2791F7l6nM0j35j15J59J78j09j48K9L0lR5R3j60j90J36K05k9j17nj1m8J07J47
2816A75o9j94l5J15Q9L9l8j25j03J10J69j6j43n4L4j7Q0J10l7k15m6J69J28q8
2840C8p1j6k9K1J40O4j75j21J25J05l2j0K6j19j14K20J68j85j96J10J06n4L1J03
2864A35j75j96J77K47j08j67O2lj03J32K24j63k89Q5K44j2p9O1p9j42J09K31m9
2887A42k04J4M6l6P4J51j22k26N1K16kj09j3qm2K5J36k1j36m5P5O3K2k6o8p9O5
2914e7J26L7j11r3L4J03qJ8Mp5j03R9J98m7j77k6P6lK1J24p9k38L2K41K0j63K2
$$ plain form
2736 -47 -104 -36 68 73 4 -22 -31 -42 31 131 58 -86 -85 47 135 49 -30 -52 -27 0 80 66 -17 -101 -45 22 59 71 -23 -141
2766 -141 -109 98 132 -8 -88 -47 -17 -19 106 125 -59 -161 5 149 75 2 6 -55 -98 90 193 5 -167 -69 67
2791 67 31 26 66 -69 -184 -25 153 44 -104 -75 -45 -48 47 140 -20 -210 -74 131 102 -15 -20 -31 -79 28 175
2816 175 106 -88 -123 -8 81 120 82 -43 -146 -36 133 117 -26 -80 -46 -63 17 127 90 -125 -171 -2 126 38
2840 38 -33 -49 -78 -57 83 147 -28 -149 -24 81 49 39 65 -54 -168 52 220 35 -161 -51 55 1 32 135
2864 135 -40 -236 -59 188 80 -87 -25 -28 -131 1 225 62 -227 -142 102 90 11 72 -7 -149 -40 191 142
2887 142 -62 -48 -2 -38 36 187 65 -161 -110 106 104 -5 -18 -26 -68 -43 93 72 -64 -109 -34 29 51 25 -43 -122 -57
2914 -57 69 106 -5 -98 -64 39 31 49 53 -22 -125 -26 172 125 -52 -78 -2 -5 16 140 61 -177 -145 96 116 -47 -25
2941b5M4j33%K65Ok69l8K01op3J14Lk14JK74qk27L1J40j13o3K09L1k48n2K10N0
2968A10j32QJ6q3K2J51pj81%J12m6jJ03k2j84K2J81K8r9l4Pj6M5P2j2p5l6M4N8
2997E1J2ro9l4M2M7J7k3o5l3Q2M9o0k9L7m5l2J15M8j27p9J08N6r7N5N3j17o8J70
3026E5J01j72p7J14J5r2Q7Q1j15j13J28O7p3jL3j04k5J51M2j56m3J28k5n9Q1L7
3052F5j07n0J14M3p0OJ9o3J5J17l3j03M3P0n1j0O0j8q8J5R6j0q0J6Lk9M9L6o7
3081a2o0M9K8k1K2po1RQ1Nn9K4Lo5L6J02l5q8J9P5m1j3N6j6r6O3Q5p0o5Q2Oj07
3113g1O7J00r5q7P3Q6o2m5L8j8l9O5M1q0%M3k9rQ9J2j21k9J26J5q5J9K1n8nR7
3143E9nr3J5O1m1k4R6l9j11L6J01k5n6J4om4O8M4n5n3M0K2j3L9J2p7k6Q6L3n2
$$ plain form
2941 -25 19 -114 -114 151 157 -112 -150 51 45 -28 86 89 -125 -124 150 142 -85 -54 86 -27 -90 119 150 -98 -150 60 110
2968 110 -22 -14 2 -81 -59 92 85 -96 -96 16 -30 -31 72 50 -134 -112 69 97 -2 -36 -29 -45 0 72 60 -15 -51 -7 51
2997 51 63 54 -15 -49 -7 40 57 34 -31 -64 18 67 7 -22 15 -30 -62 53 101 -26 -105 3 59 -38 17 70 -47 -115 55
3026 55 156 -16 -93 21 36 -56 31 112 -3 -116 12 79 6 5 38 -66 -91 60 102 -54 -97 31 6 -53 28 65
3052 65 -42 -92 22 65 -5 1 20 -43 -28 89 56 -47 -4 66 15 5 65 47 -41 -26 70 60 -20 -4 -1 -30 19 55 -12
3081 -12 -72 -23 5 -16 6 -1 -62 -53 28 33 -26 -2 1 -64 -28 74 39 -49 -30 45 4 -9 47 31 -65 -2 83 13 -52 30 36 -71
3113 -71 -4 96 1 -86 -13 73 11 -34 4 -14 -53 12 53 -27 -27 16 -13 -22 67 79 -42 -71 55 70 -15 4 25 -33 -38 59
3143 59 54 -39 -24 37 -4 -28 68 29 -82 -46 55 30 -26 -12 -18 -62 6 50 -5 -58 -18 4 -9 30 42 -35 -61 25 58 6
3173FK1ro9L4J09j1j29J9Q3l9m1Q7kj23nJ18Kp1K9k0n2O6R1q5r2P2M5o2K1O9o4
3204br1Q1Q5m9m7K1j8j8R9J9j09k8P4ll8O9J2j23k1J33K3r8j1L4k4nJ02k4j13
3233g0NQ8j6j3N7m7p2M3R4l3m5K5k0m5Q2P9r8q3P2N1m9K8J6p3k9P5M8o4k0J0n6
3264f0J3J12mj26j4Q7J7m5L4Rq8LR2J2n0Jkm3O9P4p5q9N4Q3o4oN5n3p3O8P3m4
3296B0m6M0l5l7P0N8r9p1J03M2n1ML9p4l1J00L1o5k0L4j6jN8K1r7j4O4Rj7Kl3
3327a2k5L1K6j3j8J2l0j7M4L4n0m4K9J8NK2On8RM0%k4L3No3QJ11k9q9J7O1j4m2
3360a7N8lq2L0P2l9m9M8J8q1RJ09m6r9M0R1q3j7O5qp5L4P7m1n3M6L2o0PP8k4p5
3392c8J1N3j5j2J6j4k9K3K6k3j5QJ1l3JM6nm8pL7L9n1j1J9L2l9pN6J6n8j3N1K
$$ plain form
3173 6 27 18 -51 -17 92 81 -48 -29 54 15 -26 61 59 -64 -69 49 51 -20 9 -11 -63 3 94 9 -83 -11 34 -28 -7 62 -2
3204 -2 -93 -12 73 24 -23 -2 -20 -38 61 80 -29 -57 17 14 -24 45 57 -66 -87 46 69 -29 -40 -6 -30 -35 67 43 -70
3233 -70 -65 23 7 -6 51 4 -68 -25 69 36 -9 16 -4 -49 33 112 14 -69 3 54 5 33 49 -24 -53 22 70 6 -14 -4 -60
3264 -60 -47 65 61 -65 -79 8 25 -20 14 23 -65 -62 30 42 -8 -7 -9 -52 17 91 16 -73 -19 64 0 -6 49 -4 -77 -9 64 20
3296 20 -26 14 -21 -58 12 70 -29 -100 3 45 -6 -2 37 -37 -68 32 63 -2 -22 12 -4 -5 53 74 -23 -37 27 36 19 21 -12
3327 -12 -37 -6 20 7 -11 1 -29 -46 -2 32 -18 -62 -33 -15 -10 12 18 -40 -31 9 9 -15 18 23 -40 -32 79 50 -39 -22 39 25 -17
3360 -17 41 38 -44 -14 58 19 -30 18 36 -45 -36 73 27 -72 -32 59 -24 -41 24 16 -59 -25 52 11 -42 4 36 -24 -17 61 37 -38
3392 -38 -27 26 11 -1 15 1 -28 -5 21 -2 -17 -9 2 -31 -30 16 11 -37 -44 -7 32 -19 -30 -11 21 -18 -25 31 47 -11 -24 27 29
3425B9k7J7K1m6JM5rm1J9N2n6n0O8L8q9k2P6J8r2J5R1n6o6P4L1o9k6Q5j2o1K8
3456a4O4n4n1O5M2n3j7L6On3L3M7o3mK3J9n7J3N7k4p7M4N4k8m2K8J5l6J2L7j6
3487Fj6LK5k2ML8oo2PQ2k3o6J6N0k6l6L0M7n7l9N5K5m8j5K8qk5L9J8o2j2M9%l2
3521c3J4M4k7n4K6O4pm6J6OrKM7jn6nN3j5j8K7Kl3k2M5J6l7j8K2mj0J9Ql7qM3
3556A4Pl4K0J9m6j9O6K7p1k1P5mm3J0K8k3m2N2K6n4j4M0k4j5N4J1p4m0P7L9n0
3587ik1M2k3o2O2P2n5n0J7L5qK1K6m6n2L1P9l0l3K3nl6K9M6j6n4J1K1JlK3l5l4
3620c3J2O2Jp5nM7j6qJ7K7o1k0O3N1n3l4J1nJ0M0J0o7k8O3K8m1J2K2n2n2R2P4
3652I2q6p6N5L2k6K4K6n9o2N6P7l7j6Om2j2P5M8n7o1K0M2MjJ9l1n0L5P4k0m8r
$$ plain form
3425 29 2 19 40 -6 -5 40 31 -10 9 61 5 -45 23 61 -28 -50 26 44 -48 -33 58 2 -64 10 41 -28 -54 31 19 -42 -14
3456 -14 50 -4 -55 10 52 -1 -18 18 24 -29 4 51 -12 -16 7 26 -31 -18 39 15 -62 -18 36 8 -34 -6 9 -27 -15 22 6
3487 6 -10 -7 18 -4 0 38 32 -30 -23 59 36 -30 -14 36 10 -26 4 51 -6 -45 10 35 -13 -28 0 -8 -33 6 24 -38 -50 -1 -1 -33
3521 -33 -19 25 -2 -56 -30 34 27 -19 -3 3 -6 -4 43 42 -14 -19 34 19 1 28 30 -3 -25 20 36 -1 -19 3 -1 -11 8 16 -21 -29 14
3556 14 21 -13 7 26 -20 -39 27 54 -17 -38 37 33 -10 0 28 5 -37 15 41 -13 -27 13 -11 -26 28 39 -35 -75 2 41 -9
3587 -9 -30 12 -11 -73 -11 61 6 -44 -27 8 0 21 47 1 -51 -20 59 29 -4 19 14 -22 7 53 37 -17 -6 15 16 13 36 1 -33
3620 -33 -21 41 42 -33 -38 9 -7 -15 2 29 -32 -52 11 62 9 -25 -14 -19 -9 31 41 -26 -54 9 37 -4 8 30 -22 -74 18 92
3652 92 6 -70 -15 17 -9 15 41 -18 -80 -24 53 16 0 6 -36 -48 27 75 18 -43 -23 19 23 22 41 10 -40 -5 69 49 1 -8
3684hJ0lJ6L1l3o0MN6K9m1l2KrL7J5On3m0N6K4Onon3RP5M4p8n4L8K9QrL5k4r2
3720g0M6R2jp4rQrL5M7n9p4K9O5j4j5K4k1p2L1J14j1j00KN3j1pL2mp7K1O3J4k3
3753B5j7j1k8L0M9k9m4j9J8K8K4j7m7j9M0L9Ol2k2j3K1J6J5Kl5k4L4N0pl8j8L
3785b0L1PJ6Jn0j1K6K6Lj0j0l8K2N4qo7pM1nqL9j4o0j2N5M3l5k4J0k5J3M6K3p3
3819b1k4N0MLRj0l4j0M7L0l3j3j4mJ9L1j2m1k4M0kJ6Lj8l4K6K7%Jok0j5M8K1l8
3854Bl2J5L1NQmj3k7J3K8J1j5k4k9L0L8j1k1k7KNJ7L0l2m5rM6J4qJ7m9rN0K9k5
3889A1k1j2J6k0M5J1l0l9K9K0J7j2j3l6J0K9L1k5l4mJ5J5K4j2k9nNJ8OJ8k7k9
3921b8J9M2J6k4m1jK3L1Nj6l0j8NK1L5j2n9j0L2L7nl3j4j1K6K5Kl2j7NLM4J7l6
$$ plain form
3684 -8 2 -1 15 46 13 -47 -43 13 42 1 -31 -29 -38 -1 14 20 -33 -73 -17 7 13 8 2 -51 -42 33 77 -1 -55 -17 12 20 11 46 22 -70
3720 -70 -24 68 67 -7 -16 -8 -17 18 65 6 -68 -39 26 12 -3 21 0 -72 -41 73 62 -38 -36 17 6 -1 31 27 -50 -29 34 48 25
3753 25 8 -3 -31 -1 48 19 -25 -44 -26 2 26 9 -38 -57 -17 22 28 -4 -26 -39 -18 -2 13 15 -20 -44 -10 40 33 -5 -23 -20
3785 -20 11 18 34 35 -15 -26 0 26 29 19 9 -29 -7 47 39 -28 -35 6 1 -7 32 18 -42 -54 1 44 9 -15 -5 -30 -17 29 52 -21
3819 -21 -45 5 9 12 21 11 -23 -33 14 44 11 -2 -16 -20 -1 30 18 -23 -47 -7 -9 7 10 -8 -42 -16 11 11 12 6 -14 -29 19 40 2
3854 2 -30 -15 16 21 29 25 12 -15 -2 26 37 22 -2 -31 -1 37 26 5 -22 -20 -15 2 32 0 -45 -54 -8 6 -2 15 -34 -43 7 36 11
3889 11 -10 -22 -6 -26 19 30 0 -39 -10 10 27 15 2 -34 -24 5 36 11 -23 -27 -12 3 27 15 -14 -19 -14 4 10 28 1 -28
3921 -28 -9 33 49 25 -16 -17 6 37 42 26 -4 -22 -17 4 39 27 -32 -42 -10 27 22 -11 -25 -36 -10 15 17 -15 -32 -27 -24 20 37 1
3955An2J6N9J5l2j2k%J9K1j6k0j1JJ5L0J1m8l6L6M3j1k5j5roK7K9l7j0%K3MJ7
3989B5j3k5k1K6K7J5k5j3j7K7J9ol5jLRRK0rm3k0L9L3j5k3l3K0K1J1j0qj5RPK9
4024A7kj8k1jM1nJ2k7oJ1J5Pj7%Kk6K0L7rl1j4J6J6qK4k5m0J1L8j2j7R%k5J3K7
4060A2ml4MJ3JJ9nKl0RL3mk7lRj6J0L4Kl7rJ6L2j2j0k1rJ7K1jj3l2LK2rM8Jm6
4098a4j4J9M7ok6Jj7RjM5%o6J1K7K1qJk8l2J6N9km6llKJK9j4n1rN8J3j7j1J2l7
4135c4OO0Qo7j4L0L7j1KJ1m3k6O0N5n2l6oK1J5K6ln2l9L8N3j3k0j4k0j9M3P8l7
4168C7q2j0O0K1Pj6k8l9J6Q0J0n0k7%KL3M1j0q9j2Q5J4l5oJm8PP0J9p0n1M4L9
4201A3pNmm6mM6P3m1o7J3J2K6K7J2p3l7L9P8nl8nk3k6P3M5m4j02NP6J6Lk1j5o0
$$ plain form
3955 1 -51 -35 24 39 7 -5 -7 -7 12 33 17 -3 -14 -13 2 32 43 -5 -41 -5 38 27 2 -13 -22 -28 -1 28 -9 -19 -19 4 8 25
3989 25 12 -13 -34 -8 19 34 9 -4 -21 6 25 19 -16 -17 -14 -5 4 24 15 -28 -48 -9 24 9 -14 -47 -27 -6 5 -5 -13 -28 -19 -12 17
4024 17 15 -3 -24 -25 16 11 23 -4 -10 1 16 23 6 6 8 -18 2 39 30 -1 -15 1 17 9 33 8 -32 -21 17 5 -12 -3 -3 -28 -15 12
4060 12 8 -26 -22 -9 -8 11 6 8 -22 -13 20 16 -11 -14 -5 -21 -11 23 25 -12 -21 -5 27 15 5 -16 -25 -8 13 12 -1 -33 -30 -8 -17 31 32 -14
4098 -14 -28 -9 38 32 6 7 -10 -1 -2 43 43 -23 -12 15 36 28 29 1 -31 -15 44 42 -4 -7 -10 -8 -7 22 8 -43 -52 6 19 2 -9 3 -34
4135 -34 -28 32 40 -27 -41 -11 26 15 17 28 -15 -41 19 74 22 -14 -20 1 16 42 39 -13 -52 -14 39 26 6 -8 -28 -47 -4 74 37
4168 37 -45 -55 5 26 33 17 -11 -50 -34 46 56 6 -21 -21 -19 14 55 45 -44 -56 29 43 8 2 3 -45 -38 32 51 -19 -70 -26 13
4201 13 6 11 7 -39 -43 3 76 35 -32 -19 -7 19 46 58 -15 -52 -13 65 60 22 17 -6 -32 41 86 42 -60 -55 21 37 40 19 4 -56
4235e6K2O7L4o7l9kK7K9M1k6q9oP3N5n0j0nm6K5P4L1r4n3M0N1Lnk6l0k6P9L9m9
4268A1m1KKJ6O0%p0n2P5N2ko1mk6NP2M2o0o3K3N1PRj8l7m8M5P2mo4l9ML0M0K4
4303E3n7n9ON4M4om4j1k9L6N7no6m7N0N1Joj5l3rN6L8k9m4k0K7K9L0j2o1k7K8
4336b0N5Jk5j7j6nM2L5k2o2%L8K1J3j8l5k2L6N7j5m0j2jJ5L5J8m4m0JL8L1qj9
4369A5n2j0N4L4po0j8K8OK7J3m0n0J3N0M7k4m3kkM8J9k6l9rK6K6K7j8m0k7K7M1
4402C4L1m4m6lL3J7Oml9k3L3L0J9l6l4LJ9L0J6l8m1QM4J1lrm7OL4L6on2oJ1RK1
4438B0Rl0n6K9M5K2k8k5j6J6K1K5j3m3nJ9K3J6ll7l3L6M2J2l5j6JJ5ONJ6m1q%
4472a1L8J0k3k6rK9QJ9m0roJ3J0N%j9j4K0L2j0k5k0K4nK0Krl9J6M5qj9J1j1j1
$$ plain form
4235 -56 -34 33 67 0 -39 -41 -14 15 56 30 -59 -65 8 63 13 3 -2 -48 -23 51 82 -12 -65 -25 26 29 24 -2 -32 -58 21 60 11
4268 11 -30 -28 -26 -10 50 50 -20 -72 3 55 53 -8 -12 -38 -33 39 81 21 -42 -19 32 39 48 30 -7 -55 -10 62 58 -6 -45 -41 -11 29 53
4303 53 -4 -63 -57 -3 41 35 -9 -20 -49 -13 44 39 -27 -74 -24 27 28 22 7 -26 -35 21 59 30 -14 -34 -7 22 52 40 -21 -48 -20
4336 -20 35 36 11 -6 -22 -27 15 50 28 -34 -34 4 25 38 20 -15 -37 -1 56 41 1 -11 -12 3 38 56 12 -28 -27 11 42 34 15
4369 15 -37 -47 7 41 34 -26 -44 -16 -10 17 30 -10 -60 -47 3 50 26 -17 -19 -21 27 46 20 -19 -28 -2 24 51 33 -7 -34 -7 34
4402 34 65 21 -25 -28 5 22 28 24 -15 -38 -5 25 44 8 -26 -23 -4 26 42 4 -37 -29 15 26 23 14 -33 -27 7 43 37 -15 -21 -10 -1 20
4438 20 29 -1 -57 -28 17 39 11 -14 -30 -14 7 32 19 -24 -29 -10 13 29 26 -11 -44 -8 34 46 11 -5 -4 11 17 22 38 -3 -11 -11
4472 -11 27 37 14 -12 -21 8 16 35 -5 -14 -20 -7 3 8 8 -11 -25 -5 27 17 -8 -28 -4 -9 11 13 4 -35 -19 26 18 -1 10 -1 -12
4507a2J6L1qk2j0PJ4J3Kl0k0K2K2rJj5kpK3LQj6j9KK9%j9lklMQK2j4pojK7j8r
4547Bj1J2J6kj7Mjj0kJ6J4k3j5KK2moNl3J4J9J1j4KlmJ1L0jk6k8J7J0RPj2k1J0
4585@K0Ljj8j3pJ6K3jl2qmL3J5k2j7rJ3J8Qok9LJL1K5l2k4j5K2K5K3k7l7mJ9K8
4622B0Lj3k3l2K2L6J2l0j9j5K9M5rj6l0MK4J6Rk1l7oM1L6Qm7k1PK5L5qm3k1MK8
4657A3K4ll6l0J7L7J7k4l9j4OM7K1k1m9k3L9M3J2l9k1j6J3N2J5k3n8j1L7O3lm3
4689Cl1mL9J9jj6m4oL5M1jm2l8QN5L7k4o0j1J8M1K9%o1k3K0M8K2j5n1k7K3O4J7
4723F4m6m7j3M9L5J0j4p2k2N4L7Pm2m9j4M1N4Ll5n0qO6L1Qm6l4j2M3N7nm1m4J8
4756a7M2K1%n4l8J4O8J0k2m3rJ3L4L4j7n4k9K3O5K1l6m7j8M0L6J9k8n5k0N0L3
$$ plain form
4507 -12 4 35 27 5 -5 2 16 29 31 1 -19 3 25 16 17 2 0 -7 16 19 27 11 -8 -6 23 23 4 1 -1 -4 0 8 30 16 9 3 2 29 11 2
4547 2 -9 3 19 17 0 4 3 -7 -9 7 21 -2 -17 -15 7 3 -3 2 -31 -17 2 13 -1 1 -2 -6 5 35 34 8 -20 -3 7 16 23 11 -10 0
4585 0 20 23 22 4 -9 -16 0 23 22 -10 -18 -22 11 26 4 -13 -22 -9 9 17 11 -18 -15 -14 17 42 10 -14 -29 -7 18 41 14 -23 -27 -8 20
4622 20 23 10 -13 -45 -23 13 25 -5 -24 -39 -10 35 26 10 -20 -16 8 24 33 12 -25 -31 10 46 54 7 -14 -7 18 53 45 2 -19 -15 13
4657 13 37 34 -2 -32 -15 22 39 15 -24 -38 -32 15 36 15 -34 -57 -18 25 37 -2 -23 -39 -26 26 41 18 -40 -51 -14 49 46 3
4689 3 -28 -32 7 26 25 9 -35 -41 -6 35 34 -8 -46 -38 17 54 30 -30 -41 -23 18 47 47 -14 -37 -17 31 53 38 -13 -40 -17 47 64
4723 64 18 -29 -42 7 42 52 38 -34 -56 -2 35 42 0 -49 -63 -22 32 35 0 -50 -58 8 39 47 1 -33 -45 -2 55 50 9 -35 -17
4756 -17 25 46 46 -8 -46 -32 36 46 24 -19 -28 -15 19 53 36 -18 -47 -24 41 62 26 -21 -39 1 37 56 28 -27 -47 3 36
4787C6J6k9o2LM0N7j2m3m2LM0L9jm7m1NM7M0k0l7l5MN1M5k8n2k4OO3K4j5n7k3
4820d9L2N0K2l1k5l0K3L5L2j5o4j4L9M3Mm0l5lJ8M3Km8k1rM4K2J0l2n4J6M0M1
4852D6k3l4k4RL2K8om4l2L1L1J4pk6k8jM7M1k2p0nL2J4K1kl1k4J6M9nj5l2j1K0
4886a1K8K4j7n7RL1J6Jkj0l8K8L3lk4k2J3NK8%k0l8QK5J4j5j3j3%J0K4Pl6k7J8
4921b4M8k1oj5nPK8J4%m8PJ5QQJ2k0l8K4L0J0m1J2kj6J5L4j3l8qL9j1J3rmj8Q
4957eL6j0j6k6K1%QK7k1k7MJ6K1j5mlj4%K2J1j8k2QRlQjk3mJ4K9j5j6QoJ1Pmo
4996Ak2K2J7j5qJ0MloK4%k6LLK1k1%J3j8kK5Kj9LMj5lJ3krjRPOk0J6pqmL1l5l
5038a3J1PnKK2j2l7J3K8rk1QQj0lJ5LnooKRJ6j2j8j4L5mMj6J1JrJ9J8l9mOJ6n
$$ plain form
4787 36 52 23 -39 -36 4 61 49 6 -36 -33 7 46 45 -2 -43 -38 9 49 29 -8 -43 -39 12 57 29 -23 -47 -41 22 46 31 -26 -49
4820 -49 -17 33 55 24 -1 -31 -8 27 59 44 -20 -34 5 48 52 12 -23 -26 -8 35 37 -11 -32 -41 3 25 35 3 -51 -35 5 46
4852 46 23 -11 -35 -26 6 34 28 -16 -48 -17 14 28 21 -5 -33 -34 13 54 32 -38 -43 -11 3 24 22 -9 -33 -17 32 27 12 -20 -31 -11
4886 -11 17 41 24 -33 -24 7 23 24 22 12 -26 2 35 32 8 -14 -1 4 32 32 12 -26 -18 7 21 6 -7 -20 -20 -10 14 21 -15 -42 -24
4921 -24 24 3 -3 -18 -23 -16 12 26 26 -22 -15 0 8 16 28 8 -30 -6 24 34 -7 5 3 -13 2 36 23 -15 -23 16 5 18 9 5 -13 -5
4957 -5 31 21 5 -21 0 0 8 35 14 -13 -9 7 28 13 9 6 -8 -8 14 25 7 -15 -7 2 -1 7 6 -17 -21 -7 22 7 -9 -1 -7 4 11 7 1
4996 1 -21 1 18 3 -5 5 9 6 0 24 24 -2 1 4 25 4 4 17 -1 -3 22 24 5 8 12 -3 -6 7 5 -4 -5 4 11 17 -3 13 6 -2 -6 25 -10 -13
5038 -13 -2 5 0 2 24 12 -25 -12 16 7 -14 -6 2 -8 -11 4 7 2 -4 -10 -8 1 17 5 -13 -27 8 4 8 -8 3 4 -5 14 32 -7 -11 -5 11 6
5078FjPj0MJ4J0j5j4j2J8lkJ3j5k1KK9kKj8j0J0J5J7j4k3nJ7J3NRk7k4K0RL1j3
5115B2k9nJ2J9K1l0l1PJ9K6%lk8k4J3M1Kl2j4mK4J8Ll0j7PJ3K7J0l4k9NM5K5j3
5150C6l5k4OL3J0j3j9k1KL6J3pk5l3L0K7Orl3k4K4K6K3k2l7lK6K2J0j0m6oL2L2
5184B7J8k5m1KK5L8Mm5k3NJ8L1Om4l4KL0M3On0k8J5L9K0k3k8k5K2M9kkm0l7L0
5218a7M1J2j8n4%K6L4J6l2l2j5J4M8J2k6l5mJ3L7J4k8m6NL0M4ok6l0j6N8K4j1
5250C2j9m0J2M1J2Ml4l6J6L7K2j8m0k3K6L2L5l7l4k3J9L6J7k8m0j0K5M8nk2l6
5281c1mK7M0Lk1m5JJ8M0%k6l9oM9K9%l6l1QM3RLj8m5LL8L4on5k1K0L4K0j8l3r
5317b5L0J9Qol2j9K1M2%j4m2nK9L1Ql8j6j8K8J6J0k1l4J0L1J4J3l7m2J1K9J7%
$$ plain form
5078 6 5 12 2 6 20 30 15 1 -11 7 4 2 15 0 -21 -19 10 8 10 -8 -18 -8 7 24 10 -13 -18 -1 12 17 26 -1 -25 -5 4 35 22
5115 22 -7 -12 0 19 40 10 -21 -14 5 31 31 28 0 -24 -11 30 32 0 -14 -18 6 24 27 -3 -20 -13 0 27 37 3 -26 -21 24 49 36
5150 36 1 -23 -17 16 26 13 -6 -27 -25 11 24 17 -8 -41 -11 16 22 13 -20 -44 -20 6 29 7 -30 -33 -7 15 25 15 -31 -37 -5 27
5184 27 45 20 -21 -19 6 44 48 3 -20 -15 3 34 40 -4 -38 -36 -6 37 43 -7 -35 -20 19 39 16 -12 -37 -15 34 32 30 -10 -47 -17
5218 -17 24 36 18 -36 -36 -10 24 40 8 -24 -39 -25 23 35 9 -26 -30 -17 20 34 6 -40 -35 -5 39 33 7 -23 -39 19 43 32
5250 32 13 -27 -15 26 38 42 8 -28 -12 25 47 29 -11 -34 -8 24 59 22 -12 -35 -16 20 37 9 -31 -41 -16 32 27 5 -31
5281 -31 -35 -8 32 35 14 -31 -30 -12 28 28 2 -37 -43 6 35 35 -1 -32 -24 19 28 31 13 -32 -29 9 43 37 -18 -39 -19 15 35 17 -16 -25
5317 -25 5 24 32 26 -6 -25 -4 38 38 24 -18 -23 6 37 45 7 -9 -27 1 17 27 6 -28 -18 13 27 40 3 -39 -28 1 18 18
5350A8k5k6ML2K3qk7j9K0RL8j7k8ojL6Rrl8pK2K5Mj7k3j6K1K7j%m2%K6J0Lk1l
5387gj2J3K3Nj9k4mK3J4%qj5nK5J8j6pk1KJ5K2nl6%PLRJ5k5pqK1K1kl1mPK1J1
5426A9j7mj2K9oKpj9Q%J9J5l1OLKJ4Krj1nKJ7onklj0J9J5k5j0J2nJ4k6RrJ5rQ
5467aJj1JJJ1J1%j4pJ0j8J8Mj2lmQJ0J7k4lnJJ3%nr%J9j0Mk0K0%j2K1NnqpNRm
5510GlJpJ6j8N%lJ0k3J0J6j7rkJ7KlLqj6J2%RrNkKjJ1Jk8PJ9PJjj5k%K7Rj1j8
5554ApQOJ0j3qlOJ6Oj2qkkKJ3rplJ1J0kj3j5JJ6J5jj8lnJ0K2j0j7qMK0Rj5rk0
5596b4OJ0J9Mk2j1QPJ4Mj9j5%K9J2mk6JML1Kj8k3kK5K8ok4j7KMK8Mk2l1KJ3K9
5634B2Nl7j4MK5J4j9pj6QK1J1Rm1kNK6J7rl9PmJ7K0kl6j1J1J4K6rm3kL3J8Pl3
$$ plain form
5350 18 -7 -33 -29 3 26 18 -9 -28 -8 1 39 22 -6 -12 -13 23 32 23 -15 -22 0 25 29 12 -11 -27 -6 21 20 20 -22 -22 4 14 17 -4 -7
5387 -7 -19 -6 17 22 3 -21 -25 -2 12 12 4 -11 -16 9 27 11 4 -17 -15 0 22 17 -19 -19 -12 -9 0 15 -10 -17 -25 -4 17 15 -16 -20 -13 8 19
5426 19 2 -2 -14 15 9 11 4 -15 -7 -7 12 27 -4 2 5 7 21 23 14 3 -2 0 17 11 6 4 1 -9 10 25 0 -10 2 -3 11 -15 -6 -15 0 -9 -1
5467 -1 0 -11 -10 -9 2 13 13 -1 -8 2 -16 2 6 -6 -9 -13 -5 5 22 -2 -5 -10 -9 4 4 -1 -10 -10 9 -1 3 -17 3 3 -9 12 17 12 4 -3 2 11 7
5510 7 4 5 -2 14 -4 1 1 -2 8 -15 -5 11 -6 -15 -17 0 2 -1 2 -6 -22 -10 -10 -1 -10 -5 -7 -5 -6 5 6 -22 -15 4 11 12 11 -4 -6 -6 21 30 19 1
5554 1 -6 2 8 18 5 -3 -6 0 16 22 10 2 0 -2 0 13 4 -3 -6 5 15 13 0 -15 -14 2 17 16 -2 -5 -10 0 22 12 -5 -13 -9 11 20 5 -4 -24
5596 -24 -18 -8 11 15 -7 -18 -10 -3 11 15 -4 -19 -19 10 22 18 -8 -7 -3 28 30 12 -11 -13 12 40 34 10 -7 -5 -1 27 31 9 -22 -20 -7 22
5634 22 27 -10 -24 -20 5 19 0 -7 -23 -15 6 17 26 -15 -17 -12 14 31 22 -17 -10 -14 3 23 21 -15 -26 -15 -1 25 16 -27 -29 4 22 29 -4
5671dj1j3K2L6mk8k7OJ9K8Qk2l3QJ8L9ol3j9nK6L2%l1k7oL1J8j1k9rNL2K3k3k7
5707a7k0K4K4J7j7k5k0J5M4J9k0m9nL1J4Mj3l1rL3L4%l2j2k1L3L8ml1k6OK7J8
5740B9Jl1k8QK8K8nm1mMJ8K0Om1l2K9M2Oj1l5j8K5K1K1j8m3%K1K4Nk4k2j2K9K6
5775B6Mk6m4J9J4L2kj4m0MK9K1ok6j1OK0K9Kk7k9J0K9K4j7l8kNJ5K5qm3jJ1K8
5810A9J4j5k8j9K4M0j2j6k2qJ2K1J7j5k3j3J8K9J0l1k2RKK5Kk5k3K0J1J7Lm1J0
5843a0j3K2J4Jk3rNJ3K4j7j4qOK3Pj0oj5J1J6J8j7j3j1%L0Kk6llK1jJMk9lOJ7
5881A0J1j3k8ORK9qk5jLJPRqj5J0MJ0k3Nj7J0K3Rj2rkmMK0j4pj0J1K7lj9j0MQ
5921BPplokJ1K0k1lnJK1j6PlrNQ%Kj6MKJ1mMj1j2J0lLPj0poRNjrJKRj0J9j2Lj
$$ plain form
5671 -4 -15 -28 -6 30 26 -2 -29 -23 -4 24 32 10 -23 -15 3 42 36 3 -16 -21 5 37 37 6 -21 -27 4 22 11 -18 -27 -22 10 33 10 -17
5707 -17 -37 -13 11 28 11 -14 -34 -19 25 44 24 -25 -30 1 15 19 6 -25 -34 -1 33 33 1 -11 -32 1 39 35 4 -22 -16 11 29
5740 29 30 -1 -29 -21 7 35 30 -11 -15 -11 7 27 33 -8 -40 -11 31 37 26 -9 -27 -2 19 40 22 -21 -21 0 24 29 5 -17 -29 0 26
5775 26 30 4 -40 -21 -7 25 23 9 -31 -27 2 23 17 -9 -20 -14 6 35 37 10 -19 -9 20 44 27 -11 -13 -8 7 32 24 -19 -20 -9 19
5810 19 33 18 -10 -29 -5 35 23 7 -15 -23 -11 10 27 12 -11 -24 -6 23 33 2 -20 -11 -9 16 18 -7 -30 -10 1 18 21 -20 -10
5843 -10 -23 -1 13 14 -9 -18 -13 0 24 7 -7 -15 -9 14 21 11 5 -10 1 17 35 18 5 -6 -6 24 26 0 -3 -6 15 14 15 19 -10 -13 -7 10
5881 10 21 8 -20 -14 -5 24 16 -9 -10 -7 -6 1 10 2 -13 -3 1 11 -12 -7 -24 -14 9 18 6 -3 -5 -9 -5 15 1 -6 -16 -5 22 19 0 -10 -6 2
5921 2 9 2 -1 -7 -9 2 22 1 -2 -7 -6 15 -1 6 3 -6 -1 7 7 9 -7 -3 -1 10 6 10 -1 -13 -3 -6 -3 4 -6 -13 -19 -10 -5 -6 -15 -14 -12 -3 -13 6 -6 -3 -4
5968dlJ1Pj1Nj3K2k0J7lJ3j4mJ4plj5OlJ2%lmMMj2J8mj5MOqNJ0k0J2nqJ4Nj2p
6010iNnQJ2j3pJMNRj5Lj0K4Knj2nMMQ%qj2LJ2J4kj1j9K0K2poqqJ0J2olrlJ1nK2
6055B7j3k8MJ2J2jqrkPJ3%k2kj5J4K0Rj1k2J1RPMj9plJ7K0j6j5%nK1K1j3k1j7
6093b1K1QNoj9mOL0Pk3%j1KK0Jlk3nJ4K3J0j1k5MJ4J0Nj9pj5PK6Nk9qkK5QNl7
6133a2j2LK5QOk0j1j9M5Njk0j6J9K1Oj3k4j2J7J7L2l7k1qK1PK2k8j5MPL7j0ol9
6169b2J2J2K7%k4j9KK6O%k5j6J5K9NOm9j2J5K5J3k1j2k0PL3K0j2m9nJ1L0J7j7
6203Hk0j9J5L4kk4plJ0K3J4l2j3PJ3K6pj5k0qL0J2Kj8j6J0J6J5pj9k1LK5J5Jk8
6239@j0%K4J4rk4k5K4J0J5jk3k5K0K7Krk3j0K0J0J1j8j0oJ2K9lk0k1KJ7J9Mj4
$$ plain form
5968 -4 -7 4 11 0 5 -8 14 -6 11 8 21 7 3 17 10 7 -8 -2 -5 7 7 4 0 4 8 -4 14 10 -5 -1 5 -3 2 12 -8 4 -1 -9 5 10 -2 -9
6010 -9 -4 -9 -1 11 -2 -9 -8 -4 1 10 -5 -2 -12 12 14 9 -3 -8 -4 0 8 8 0 -12 -9 3 17 15 4 -15 5 27 20 14 6 -2 8 20 14 11 2 -1 10 5 27
6055 27 14 -14 -10 2 14 13 5 -4 -6 1 14 14 -8 -10 -25 -11 9 18 7 -15 -4 5 12 16 -3 -10 -13 4 24 8 -7 -7 -12 9 30 17 -4 -21
6093 -21 0 8 13 7 -12 -16 -10 20 27 4 4 -7 -5 15 16 13 -10 -15 -1 22 32 21 -4 0 14 24 29 10 3 -12 -5 21 26 -3 -11 -13 12 20 25 -12
6133 -12 -24 -21 4 12 18 -2 -13 -32 13 18 17 -3 -19 0 21 27 14 -10 -22 -5 12 44 7 -14 -22 -1 6 28 0 -15 -11 -4 33 23 17 -22
6169 -22 -10 2 29 29 5 -14 -12 14 20 20 -5 -21 -6 23 28 34 -15 -27 -12 13 26 5 -7 -27 -20 13 33 21 -28 -33 -22 8 25 8
6203 8 -12 -31 -16 18 16 -8 -15 -18 -8 15 29 -3 -16 -9 4 30 23 8 -12 -20 10 22 24 6 -10 0 16 31 24 5 -16 -13 12 27 28 0
6239 0 -10 -10 14 28 19 -5 -30 -6 4 19 18 -5 -30 -10 17 19 10 -13 -23 -3 7 18 0 -10 -16 -4 25 22 2 -19 -17 0 19 23 9
6274Ik1oK8Kr%j1lK6J4ml1j7J8LK2Mk1j4kL8J3j7l7%J5K4Pj1k9qJ2K4J4k2j4k8
6311c2J9K8lj8mjMPJ0Om6K0J2Rrj0p%K2J2Kk9jkL0JLk1rJ1J0KOk9PLJ2J3j4kk0
6352hJ0J5rOj7nRJ3J1j6rj2J8NkmqJJ5NKk8nJ7j5J8pj4jKJ2J9j4j1rLK3plqkO
6394dLQOk3MnKK8j0j3kJ4MmjppkJ5Rj0jnM%J8j9K0l4J6Qj3KnKnJ3mRj7jNjj0J4
6439AmJ5j0rlO%lJ7plO%Pj5jjJ0k1NMkJ1JJ3k3NoLK3j0oj3J2J3oNMjj4oK1llj4
6484bj0J5J0Kj0mRrJkOk2%J6KMk0J0qJ8Rj2j1LRJ2rNpj0jK4j0j2MoQJ5%j7jPP
6527A3J3j3onrPMMj6j3K3QJ5qk0oJ5J4qKj5KKJ5mqk2JJ1K1lj3j9J0jK4rj7Jj4
6567b4J6J8Qk3j3ROJ8rj1j0OJ3J5kj4j2LJ6mnorNK5Jnj3nmK2J0j1j2k1K0K7j4
$$ plain form
6274 9 -12 -18 10 12 3 3 -8 -11 15 29 25 -6 -23 -5 -2 20 24 3 -11 -13 25 38 21 -16 -16 -1 23 30 19 -10 -18 -6 18 32 10 -4 -32
6311 -32 -13 15 12 -6 -10 -11 -7 0 10 16 -30 -10 2 11 2 -8 -15 -15 7 19 21 -8 -9 -11 19 20 23 2 -7 4 14 16 22 -7 0 3 15 28 14 12 -8
6352 -8 2 17 8 14 -3 -8 1 14 25 9 0 -12 6 11 9 5 -3 -2 13 18 20 -8 -13 4 -11 7 0 -14 -15 -13 -1 18 4 -7 -16 -13 10 3 0 -8 -10 -4
6394 -4 -1 7 13 -10 -6 -11 -9 19 9 -4 -6 8 12 8 7 0 -7 -9 6 15 5 4 -1 3 3 21 2 22 -12 4 12 -1 1 -4 -2 -7 6 2 11 -6 -7 -2 -3 -13 1
6439 1 -3 12 2 -7 -10 -4 -4 -7 10 3 0 6 6 13 -2 -3 -4 6 -15 -10 -6 -8 3 4 17 -6 -1 -7 -4 19 9 3 -10 2 15 9 14 18 17 3 -3 18 15 12 -2
6484 -2 -12 3 13 15 5 1 10 1 2 0 6 -16 -16 0 2 6 -14 -4 -12 6 15 3 -8 -5 4 16 7 12 5 -5 -6 18 8 -4 0 -6 2 17 17 0 -1 6 13
6527 13 26 13 7 2 -7 0 4 8 -8 -21 2 10 25 17 -3 -9 6 20 12 14 -1 1 3 18 14 6 -16 -15 -4 17 14 1 -18 -8 -9 15 6 -11 -10 -24
6567 -24 -8 10 18 -5 -18 -9 -3 15 6 -5 -15 -9 4 19 17 3 -9 -6 10 6 1 -5 -14 -9 16 17 12 -1 -6 -10 12 22 11 -1 -22 -2 25 11
6605A1j3ooPK0J5k2k4JK8%Lj9j0JK2kJ9k2j1jJ1K4j9j4oJ4LJ5j5j2jMK7j6llj1
6643a1J7J1oj1j6PJ9LJ0pok1K0QJ9j8k0%K0Pj0j5k1J0K3Njj9llK0Okk1j9J7OJ0
6681Hkj1j6J4J1J2mk4LjK9Jj3j2qKL3Lj0k7qK8J8nj9j6kK1K0nj1k3LK0J8nj3m
6719ErJ3K2k0roLK8onk5KLJ1RJl1lJ1J6Nj3k0rK7J0%rj3lKK5mqj9jL3jkj5k5K4
6761fQJ9j2jj1jLJ6Ql0qLK1KRk8kJ7J0prrj1K5J1Lk1j8LJ4QOqj2nJ8lKorpJ7J5
6804A4nqj8QNQnKj9J2Qk%lJ1rQkNj9jkK0J1j7j2J2OklJ3j2KOkKJ1k1kOJ7oj5o
6848dJJ3Qj2%j7OPMpjj1LJ4mN%nmJ1pnOqKJ7j6Pj6J7j1J2J1j8Jj0PPpR%KoJjJ
6894B%jNRj2PnoJ2PrJ1j9MmK7j1pq%MmlJ8polqLK%JLoJ6j0rPmjkrJ4KOnRJOj5
$$ plain form
6605 11 -2 -8 -14 -7 13 28 6 -18 -17 11 11 14 -5 -15 -14 8 6 25 3 -8 -9 2 26 7 -7 -13 1 4 19 4 -8 -9 -5 22 6 3 0 -11
6643 -11 6 17 11 0 -16 -9 10 13 23 16 10 -11 9 17 36 18 -2 -2 18 25 15 0 -21 -11 12 17 16 -3 -6 -9 11 17 15 -6 -25 -8 -2 8
6681 8 6 -5 -21 -7 4 16 12 -12 -9 -10 19 20 7 -5 -13 -11 22 25 15 -12 -20 8 26 21 2 -14 -16 5 25 20 9 -14 -11 9 27 22 9 5
6719 5 -4 9 31 11 2 -4 -1 27 21 16 -9 -7 -4 7 16 17 -14 -17 -6 10 15 2 -18 -27 0 10 10 1 -12 -15 -13 12 8 0 -19 -20 13 12 10 -5 -30 -6
6761 -6 2 21 9 8 -3 -4 -1 15 23 -7 -15 -12 9 11 20 -8 -10 7 17 10 1 -8 -19 6 17 20 -1 -19 -16 -2 6 12 4 -8 -13 5 2 4 -2 -11 -18 -1 14
6804 14 9 1 -17 -9 -4 4 -1 1 -18 -6 2 0 0 -3 8 -1 7 5 10 -9 -10 -12 8 19 2 -10 2 8 6 3 16 4 6 12 10 12 23 2 0 6 23 17 2 -4
6848 -4 -3 10 18 6 6 -11 -5 2 6 -1 -2 -13 -10 4 0 5 5 0 -4 7 0 -5 1 -7 -5 12 -4 3 -13 4 -7 5 16 -2 -1 -11 -4 3 -4 5 5 7 1 2 1 2
6894 2 2 1 6 15 3 10 5 -1 11 18 9 20 1 5 1 28 17 10 2 2 6 2 -1 17 10 4 1 -7 -4 -2 -2 -1 2 -4 12 2 -7 0 -4 -5 -7 -16 -2 0 6 1 10 11 17 2
6944BKKj3K0mjlLmPlNj7JJ0jnNmKj3J9j2onJ3JJ3j4j%jJ0nJ0j0jlRJ6k1j9RJ4
6988GJNj7j0%kJ4%jj7OJ0J5llmj0OQJ0j1lJJ2Rplj4KOJ0oj1KLKLNj4koJ4J2j8
7032Aj8NnL7j3nj6QLK1j3j3LpK6%koj5qK3LQl2J2j1J1J1j1nmMJ4JPj3k3J9PJp
7073bPomJ7J1j8j2kJ1K1pmj4qJ1J1Rk8j1J7OKKj6lqJ9Orkj0rK3Qj0jj9nL3Mj4
7114dj0j7L9%pOk1nJ0K8krj1KNJ1oj3q%K2Onpj5JJ9KNj7mjJ5J8ol1nJ6MJ2Mj5
7156Fk1lK9NLk4mJK0oj0noJ4mJ5k0mnJ0J3%%k2j1K4K2nqk2j8K4K4Rk0k3J1K6q
7195GOj6KjQOlj6LLMJ0%j2j5NK6nj6Jj2JK5rlj0jJ4PNj8mkJ3JPmrjJ0O%j3j3J7
7240DkNq%jj3J6J2nmj5OM%Oj4%LJ2%LkqKK7nj3j1%jJ5Jmj0KNK4k0nnmKJ5%j6p
$$ plain form
6944 2 4 6 -7 13 9 8 5 8 4 11 8 13 -4 -3 7 6 1 6 2 4 -9 10 -2 -8 -13 0 1 14 0 -1 -1 -2 8 3 13 3 2 -1 8 24 3 -16 -7 7
6988 7 8 13 -4 -14 -14 -16 -2 -2 -3 -20 -14 -4 11 8 5 1 -9 -3 5 15 4 1 2 14 23 16 13 -1 1 7 17 11 0 2 5 7 10 15 1 -1 -7 7 19 1
7032 1 -17 -12 -17 20 7 2 -14 -6 -3 18 5 -8 -5 -12 14 14 12 6 -9 -17 6 9 17 -15 -3 -14 -3 8 -3 -8 -12 -8 6 7 14 1 -22 -3 4 5 -2
7073 -2 5 -1 -5 12 23 5 -7 -9 2 23 16 12 -2 -10 1 12 21 -7 -18 -1 5 7 9 -7 -10 -18 1 7 -2 -4 -14 -23 0 8 -2 -3 -22 -27 6 10 -4
7114 -4 -14 -31 8 8 1 7 -14 -19 -9 19 17 8 -3 -1 4 15 9 -4 -12 -12 10 16 11 4 -11 -10 9 11 16 -1 -5 -6 9 27 21 -10 -15 1 5 17 21 6
7156 6 -15 -18 11 16 19 -5 -9 -8 12 6 -4 -9 -15 -1 -5 10 -10 -14 -19 -9 4 4 4 -18 -29 -5 17 12 4 -18 -36 -12 12 21 1 -22 -11 15 7
7195 7 13 -3 -1 -2 6 12 9 -7 -4 -1 3 13 13 1 -14 -9 17 12 -4 -3 -15 -14 11 2 -1 -11 -12 2 9 14 -4 -8 -10 3 4 11 7 -2 -3 7 13 13 0 -13 4
7240 4 2 7 -1 -1 -2 -15 1 13 8 4 -11 -5 -1 -1 5 -9 -9 -6 6 6 9 7 -1 1 28 23 10 -1 -1 -2 13 14 10 0 2 7 31 11 6 1 -3 -1 14 14 -2 -9
7286iKMRNj9Pj2J8%j1LOnlJ5kRk5J3kQkj1KPjLJmj3J8J3j9%j1J0LJ5j4Nj3Rlj
7330E%j0lJ1jMnkj0PMKqJ3rNPorp%QQj2Ojj0pJ4nJ2qj4J0J0PlpMkPLrOO%j6J8
7378A3j0J5mrPoQpkRj6J4j8J1pQPj3nOJ0Pj4KlMj1kOj0KJ4l%nKLnjJ0plLJrJ2
7424Dj6LRoLmJ0j1MOqJ0oO%nNmJ0pMjRj1J3mj1Pj0lNK7k1Mj3L%jNJj0j6K7omj2
7470a5J2nJ3j0LOj1oJ3nJ5j0j2KRLJ0qj4J2mJ6Kj7lJRKl%%JOjMj3kJ0ojK%llJ2
7515A1lKj5mQJ9Pj8Jj0PkRj1j7OMJ3jrqJkRPj0pJ1MNPj4qOJ5%k2Oj1J8jMoqjR
7561ANnNokLKmqo%J4R%jk4J8mRnloNKKLj0KlJ5Ok3njQOJ4l0jJ3%PLj2oJjRJ3j1
7611bj4J7lQkrPj8QJ8jj2kOOJ0pj2j0RJ1kj1Qk2J5NOpQpj1J2Pj5m%J4%Lkj3oJ3
$$ plain form
7286 -9 -7 -3 6 11 -8 -1 -13 5 5 -6 -3 3 -2 -5 10 8 17 -8 5 3 11 9 -2 0 7 6 9 10 6 -7 11 24 5 5 -6 4 7 22 8 13 0 9 6 5
7330 5 5 -5 -8 3 2 6 1 -1 -11 -4 0 2 -6 7 -2 3 10 4 -5 -12 -12 -4 4 -8 -2 -3 -13 -20 -6 -11 1 -7 -21 -11 -1 6 3 -4 0 -2 5 8 -1 5 11 11 -5 13
7378 13 3 18 14 5 12 6 14 7 5 14 -2 12 -6 5 -2 6 13 0 -5 1 11 18 4 6 3 7 -4 -6 0 -10 -8 6 3 3 -2 0 3 -2 -3 7 0 -3 0 1 -8 4
7424 4 -12 -9 0 -6 -3 -7 3 -8 -4 2 -6 4 -2 4 4 -1 4 0 10 3 7 6 15 4 17 13 2 9 -1 -4 1 28 7 11 -2 1 1 0 5 6 -4 -20 7 1 -3 -15
7470 -15 -3 -8 5 -5 -2 4 -7 -13 0 -5 10 0 -12 -10 -1 2 12 4 -10 2 -2 14 16 -1 -4 -3 6 8 5 5 5 6 12 11 15 2 0 10 4 3 5 5 2 -1 11
7515 11 8 10 -5 -9 -1 18 25 7 8 -2 5 3 12 1 -16 -10 -6 7 6 -3 -11 -10 -12 -3 4 -6 -13 -2 2 7 14 0 -8 -2 13 13 -9 -3 -14 4 3 7 1 -7 -8 1
7561 1 6 1 6 0 -2 1 3 -1 -9 -15 -15 -1 8 8 7 -17 1 -3 6 1 -2 -8 -3 -1 1 4 -6 -4 -7 8 14 -9 -14 -15 -7 -1 13 -17 -18 -5 -5 2 5 -7 -13 -12 -13 -4 9 -2
7611 -2 -16 1 -2 6 4 -5 2 -16 -8 10 9 -3 -5 1 7 17 10 -2 -12 -3 8 6 -5 3 -19 -4 1 7 0 8 1 -10 2 9 -6 -10 -10 4 4 7 5 -8 -14 -1
7655aRj0Qj1KOJ0j5%j6jJ3K0Jj4pjJ2J3j3j7JMKJ5kj4j0K5LLj0k1J1rJ3J4%k5
7694a2oK0ROj1rMNJ2j0%qj8K0Pj3J4j9kPRQj4pONQkj2j0OJ7lj4PlLRoJ1j5P%J3
7738A9pLrnJ2pJkj8J2QJ3j2J2k4nK3np%QoJNrJ2k7J6Oj0Mj8nK1MqpmLmJJ5%lk
7783eoKJ1j0LkPLj1%mQnRMlj4J0Qk%Nk1K6MqJopNJ5rlkjrJ0rJ4oj4J6qjJ0n%m
7831dJ9j1j1J0%%%lMLqOj2J7Oj3oPkj0J1k4K1j3J4qkJ4pj6J4J4j2RkoqNjQJ1j0
7873D%j0J7LLj2jJ1j7jMqN%LLj9LNJ1j4J4k2nK6ojMNj0%jJ2nJ2k1LPQJj4qK0r
7917@J1Ok4LQjMJ1j6knJJ2mrjJ3oRj1OnmOJ3Nj1qOJq%KnNOrlNMj3JMNrlJ7nkj1
7967a1NRp%okKMJ0jkJr%K8j8MpoLK5qj5QmkjQKj1lNJ0kmj0PmPqPj0kJ8lJMooQ
$$ plain form
7655 -1 8 -2 6 -5 -3 3 13 -2 -2 -18 -19 -6 14 15 1 -6 -7 5 18 5 -12 -11 -7 -5 10 8 -6 -16 9 12 15 5 -16 -5 -14 -1 13 13 -12
7694 -12 -18 2 11 17 6 -3 1 6 18 8 8 0 -18 2 9 -4 10 -9 -11 -4 5 13 -1 -8 -2 3 11 9 -3 -13 -7 10 7 -7 0 -3 0 9 3 14 -1 6 6 19
7738 19 12 15 6 1 13 6 7 5 -13 -1 7 20 8 20 -4 -9 14 9 2 2 10 4 5 10 1 13 -14 2 8 -2 2 -16 -21 0 4 -4 -11 -15 -12 -16 -15 0 0 -3 -5
7783 -5 -11 -9 2 -8 -5 -7 0 3 -8 -8 -12 -4 -9 0 4 1 -13 -3 5 3 3 8 -13 13 17 9 10 4 -3 2 17 8 5 3 2 -7 3 -6 8 2 -12 4 -4 -5 5 0 0 -4
7831 -4 15 4 -7 3 3 3 3 0 4 7 -1 5 -7 10 16 3 -3 4 2 -8 3 -21 0 -13 1 -7 -9 5 -2 -18 -4 10 -2 7 5 -1 -9 -4 -5 3 14 4
7873 4 4 -6 11 14 17 5 4 15 -2 -3 1 -7 -2 -2 1 4 -15 -12 -7 4 -10 4 -18 -23 3 -3 -4 0 5 -5 -5 -6 6 1 13 -8 -5 2 10 11 -3 -11 9 0
7917 0 11 17 -7 -4 4 3 7 18 2 0 -5 -4 8 4 -5 -6 7 1 10 -1 5 0 -4 2 15 20 9 1 7 8 0 0 2 -3 2 8 -1 -4 1 5 -8 -7 -3 2 -7 -10 7 2 0 -11
7967 -11 -6 3 -4 -4 -10 -12 -10 -6 4 3 1 2 -7 -7 21 3 7 0 -6 -3 22 14 -1 7 3 1 0 8 10 -1 -4 1 11 9 5 -5 2 -2 5 -3 4 -6 -8 10 7 8 12 6 0 8
8017HQKk5J0pJ0mlnQkjoJMj3J5JJ5j3o%LJOrjNQj6J7Nj3jkJ8j5%nJ1kOn%qLKM
8065IlMj0J1j1NMpj1J4lJ1nj9NMjJ2k0nJ5j5J8Nnjj0J0J4j1nqLOPjpomJ6Klj0
8108fKJ3%mjMrJ5p%kmjKkJ2Kj5j1QJ3Kj9mJ5mOKoj7%K2kkJm%pOQj1pJ2jJ%%mL
8157ajJ0k0RJJ0JJ2k0J0moJ5qnpJj0K1Jj2MqOK1omj3kJ3Oj5%k1
$$ plain form
8017 8 16 18 -7 3 -4 6 2 -1 -6 2 0 -1 -7 -6 -2 -15 0 1 16 3 -3 -3 0 1 7 -2 -3 2 10 -6 11 16 3 2 0 18 3 3 -2 9 7 13 8 8 0 3 5 9
8065 9 6 10 0 11 0 5 9 2 -9 5 2 13 8 -11 -6 -2 -3 9 -11 -16 -1 -16 2 7 2 1 -9 1 15 4 -1 -9 -6 0 7 6 -1 -7 -11 5 7 4 -6
8108 -6 -4 9 9 5 4 8 -1 14 7 7 5 1 0 2 0 12 14 -1 -12 -4 9 11 -8 -12 3 -1 5 7 1 -16 -16 6 4 2 3 -1 -1 -8 -2 6 -5 -12 0 -1 0 0 0 -4 -1
8157 -1 -2 8 -12 -3 -2 8 9 21 1 11 7 1 16 8 3 -4 -3 -13 8 9 -3 1 -7 -1 20 14 10 -3 -5 8 14 -1 -1 -22
8191b2
$$ Imaginary data points
##PAGE= N=2
##DATA TABLE= (X++(I..I)), XYDATA
0@%%%%%%%%%%%%%%qJ6j6J6j6J6j6K4l2L2m0M8m9N7o6P4q8R7j05J20j36J52j68
37h8J85k06K29k54K82l12L45l82M24m70N23n84O52p33Q31r48J093j280J527j876
57a042K410l332N361j7174J0629L1446k7093q355J4064q686j9744K3878K1851
70B4213k1559k0884J5459P700p443P464Q201j9072j1310J7019J0980q514q08J517
84B963j0181j036J5131N04j2494K163P510o329j201R619m733j3080P614J3771
98A0221n981q843M001j03m527P559O693j0230p579P330M827r31L271l259j2883
113a0434J158J5322K966o830k68m973j0436R806J9438p114j8356M371Q026p496
127d820L993J5736j0497k2768R208K0740n762q550Q205m967j6253J1004K1305
$$ plain form
0 0 0 0 0 0 0 0 0 0 0 0 0 0 0 0 -8 8 -8 8 -8 8 -8 16 -16 16 -24 24 -25 32 -34 40 -48 49 -56 64 -72 80 -88
37 -88 97 -109 120 -134 148 -164 181 -201 223 -247 276 -308 344 -389 442 -506 587 -693 834 -1042
57 -1042 1368 -1964 3397 -13777 -3148 28298 1205 -7150 6914 -1772 -21516 2362 24213
70 24213 2654 -18230 -2771 4929 -2514 4950 13151 -5921 -17231 -212 10768 2254 1446 2963
84 2963 -7218 -8254 6877 7381 -5113 -2950 4560 -1769 -2970 6649 1916 -11164 -3550 10221
98 10221 4240 -4603 -602 -705 -5232 2327 9020 -1210 -8789 -1459 3368 2437 5708 2449 -10434
113 -10434 -9276 6046 9012 2182 1914 -3059 -13495 -3689 15749 8635 -9721 -5350 2676 -4820
127 -4820 -827 14909 4412 -18356 -9148 11592 5830 -2720 5485 518 -15735 -4731 16574
140A6574r817j7246Q309O702j0354L766J4609r530j6870J0044J3994p954n927
153c700P117l444q667Q866R898r166p638O686K180m375L821K759q208k283R232
168C078K154n901j24K54m651L292R290l000r505J486N021j716J242M196n546p122
184g552N787P386k622k685O9m950j399R664M281q251l731L535j596k37Q060k68
200E491j1577m60J0114m92m882M907j47j1003J953J4189j655j1815K916O186o886
215c161j214J1231j286j2691K462J0411l782n634O032M70q688K808R896l835q006
230d987M097L542n157Q82O243l667o112M725M396m572j325L790k442l241N344
245A516L028n815k066M347l82k385L405J171n243m86N166k71l278J615O71l551
$$ plain form
140 16574 6757 -10489 -2180 4522 -5832 -2066 12543 3013 -13857 -3813 10181 2227 -3700
153 -3700 3417 -27 -8694 172 10070 904 -6734 -48 2132 -2243 1578 4337 -3871 -6154 3078
168 3078 5232 -669 -793 -539 -5190 -1898 7392 4392 -5113 -3627 1394 -322 920 5116 -430 -7552
184 -7552 -1765 5621 2999 314 383 -4567 -5966 3698 7979 -272 -4003 -468 -2064 -2301 5759 5491
200 5491 -6086 -6546 3568 3076 -1806 3101 2954 -8049 -6096 8093 6438 -5377 -2461 3725 -3161
215 -3161 -4375 6856 5570 -7121 -4659 5752 1970 -3664 2368 2838 -5850 -3042 6854 3019 -4987
230 -4987 -890 2652 -2505 -1623 4620 953 -5159 -434 3962 -610 -1935 1855 -587 -3828 1516
245 1516 4544 -1271 -3337 1010 628 -1757 1648 2819 -2424 -2910 2256 1985 -1293 322 993 -2558
261b558J197M911j630m277J511J646k163J195L140k875l263L222J783l085P73
276d73L019l296k900M734K197m828m38M225j892l384L891K411m768q40M660j273
292A045l956L294K927m534j461M874n05m573K404L774l709k530M043P43l724J294
308e94L026l044k226L835J135l519L99K609k222j659L633J044l815l57K870q02
324C13j310K327J60l438L58L423n70k207J046L28j968J095K851j449k812R31J245
341C23o96R69J297k558k144K678K202j740r73P85j165o48K930J440k963j858J390
358g31P57L49J628o82l508k21L524J004j784m40l03j429J173L285l72l504j027
375b281J438R98J262Q55k444k965J445L312K49j516q29j122l27K676K368j931
$$ plain form
261 -2558 -1361 3550 1920 -2357 -846 800 -1363 -168 2972 97 -3166 56 1839 -1246 -473
276 -473 2546 -750 -3650 1084 3281 -1547 -1985 2240 348 -3036 855 3266 -1502 -2342 2318 1045
292 1045 -2911 383 3310 -1224 -2685 2189 1684 -2889 -485 3289 -420 -2950 1093 1836 -1888 -594
308 -594 2432 -612 -2838 997 2132 -1387 -988 1621 -601 -2260 1373 2417 -1398 -1755 1115 313
324 313 -997 1330 1490 -1948 -1590 1833 1263 -944 102 430 -1538 -443 2408 959 -1853 -922 323
341 323 -373 596 1893 -665 -2809 -131 2071 331 -642 143 -1022 -1670 1260 2700 -263 -2121 -731
358 -731 26 375 2003 1321 -2187 -2408 1116 2120 336 -104 -407 -1836 -663 2622 2250 -1254 -2281
375 -2281 -843 155 1417 2272 -172 -3137 -1692 1620 1869 353 -476 -1598 -1925 751 3119 1188
391A188l262k47J707J688J330p04l209j610K496K886r7j829j727q01J477K922
407B208N52k793k483K93K093K302O04k484l291J12L323K290q21k421j926K58K638
424D54K415p74l120j943R86K910K274q16l523k372J572L587J612j683k993j467
440b881J509L039J407j794l153j316J936L433J299k448l691r11K806L364M97k658
456D38l013m07K583K974L09k854l070J20L273K968m43l301k937M15L598L078q93
473B838l759k436J175L191K241r28l555k418J713L825J587j795l292k121J399
488b335M313K305k834m257o34K556K702J222j496l814j701L221M000m6k986k635
504b419q73K200M300J065m234l889J181L355J794N0k017l479m88M132L290j668
$$ plain form
391 1188 -2074 -2321 -614 1074 2404 1700 -1509 -3119 -623 2263 2166 337 -1390 -2191 -714 2208
407 2208 2760 -33 -2516 -2223 -130 2172 2776 292 -2999 -2887 436 2726 1905 -516 -2442 -2184 454
424 454 2869 2095 -1025 -2968 -1982 928 3202 2386 -1137 -3509 -1937 1650 3262 1579 -1414 -2881
440 -2881 -1372 1667 3074 1280 -1873 -3189 -1253 2180 3479 1031 -2660 -3571 -765 2599 3096 438
456 438 -2575 -2982 -399 2575 2884 30 -3040 -2920 353 3321 2878 -423 -3360 -2945 653 3731 2838
473 2838 -921 -3357 -2182 1009 3250 2322 -1233 -3651 -1938 1887 3474 1679 -1613 -3734 -2335
488 -2335 1978 4283 1449 -2808 -3442 -886 1816 3038 1542 -2272 -3973 -752 3248 3202 216 -2419
504 -2419 -3292 -1092 3208 4273 39 -3850 -2669 686 2480 2530 513 -2966 -3454 678 3968 2300
520B300l676j813P43L057L195r25m683k394K518L480J144j181k969k463J578M419
536B330J610k912l519q50K173L609J583k786m195o99L096L363O78k730l701m84
552c434L392L131j99k667l078q22L333M232m74m414k495J154K394K517P95l411
568d6m066J340M526J268j827j552j774q77L464M052k132n086m60K929J478P79
584B016J33l095k947K637M296n11k933j058m39L82L437K118l886m226J677L669
600A270P45l94r45l082j218M100L598k128l628o61P57J604K982L92m459l266K427
617a906L977Q83j398k171k216L56L521K518j634l467j546J470K953J529j499k731
633a361j302J010K647K036j447l622p77K637J687l54k83j117k112Q12L784M99
$$ plain form
520 2300 -1376 -3189 -2446 611 3806 2881 -1802 -4196 -1678 1802 2946 1765 -1204 -3667 -2089 2330
536 2330 3940 1028 -2491 -3341 -1168 2441 4024 1238 -2957 -3656 -560 2803 3481 751 -2950 -3434
552 -3434 -42 3089 2890 223 -2855 -3677 -344 3888 3414 -1000 -3495 -2341 53 2570 3365 -46
568 -46 -4112 -2772 1754 3022 1195 -357 -2131 -3008 456 4508 2376 -2710 -3170 -241 1237 2016
584 2016 2149 -946 -3893 -1256 3040 2529 -404 -1462 -1901 -1519 1918 4036 150 -4076 -2399 1270
600 1270 2015 1621 676 -2406 -3624 476 4074 1946 -1682 -2343 -1586 18 3000 3392 -1067 -4333 -1906
617 -1906 2071 2954 1556 -615 -2831 -2475 1046 3564 1930 -1537 -3083 -1613 1340 2869 1370 -1361
633 -1361 -2663 -1653 994 3030 1583 -2039 -2816 -179 1508 1154 871 -246 -2358 -1546 2238 2737
649B737l489j331J660O33K90J400j033l333M15L779L85k473k95L52j157J136L109
666B785j146m136M6L095N99n10M82j753k682K080M072q50l166MN32q60J868L053
684C513k268m536R33L748J92j103N54j253k665J566M050l20l380o25J192q4N21
701C5J841n91l015n49K539J412j004j022j59k21J28J100Q02r59j456K83J313J65
719F42o94J21J61p59Q8J395j25j787J46J801k79j456N48Q29j085k04J684k03k060
738a237K90J689m10p05J031l55k046Q82K668p90k274Q64J087j527M3K527m71k941
756a675M67K323o96j071J575Q2k577K64K798l11k187Q10J233j744p34K354O59
773A570k245l69J557m27j120J282J191j544j273J127Q27p12Q7R53o25j596L28
$$ plain form
649 2737 -752 -2083 -423 210 500 1900 867 -2466 -2051 1728 2113 -360 -655 -303 -1460 -324 2785
666 2785 1639 -2497 -2451 644 1243 733 1215 -538 -3220 -1140 2932 2082 -1084 -1080 -548 -1408 460 3513
684 3513 1245 -3291 -2358 1390 1582 479 1033 -220 -2885 -1319 2731 2411 -969 -1594 -402 -486 35
701 35 1876 1285 -1730 -2279 260 1672 668 -354 -513 -734 -606 494 1296 337 -1119 -836 477 642
719 642 -52 69 230 -529 -441 954 829 -958 -812 989 710 -746 -198 631 -454 -658 1026 823 -1237
738 -1237 -947 742 332 -373 658 303 -1743 -861 1807 1017 -1257 -393 694 -833 -790 1737 1266 -1675
756 -1675 -1208 1115 419 -652 923 1005 -1572 -1308 1490 1179 -1008 -198 1035 -709 -1443 911 1570
773 1570 -675 -1044 513 86 -1034 248 1439 -105 -1378 -251 576 -136 -49 904 279 -1317 -989
790i89J886M47j292o78M15m2j90J090Q84j377j767P38J639j0n00J55p89j224J197
809d07K106p02j988K56Q39o08L48J583p55k295M75K088k17j025N57j35j282Q75
827b87J864j054j877J090J252j194k59J547p53k060J365K436j438k240J107J224
843G23j045K22J605j323k502J331K834o06j938K02K08r17J078K368q47l105l79
860b091K215J108k48k20j084j621P17K689Q17j968j701Q0Q27J107J110m85k332
877a080j270J693K302L2j609j172j94O47J458R17j189k024j52J648J192j41q20
894B38j227n77J374J954l82k104p08J017Q54M55K41j114j773N05K463O89j679
911B26j246n2K95J209J590q85k898n40K450J497o55p75r03j251P92K953P30k779
$$ plain form
790 -989 897 1344 52 -626 -211 -253 -443 647 1531 154 -1613 -875 764 754 254 409 -380 -1604 -407
809 -407 1699 997 -991 -735 104 -504 -156 1427 672 -1623 -1148 940 723 -302 255 120 -1162 -287
827 -287 1577 523 -1354 -264 988 -206 -465 1082 329 -1731 -366 2070 632 -1608 -501 723
843 723 -322 -100 1505 182 -2320 -989 1845 1239 -699 -497 -289 -1206 -128 2240 1393 -1712 -2091
860 -2091 124 1232 984 764 -320 -1941 -1224 1465 2282 314 -1387 -1307 -480 627 1737 1252 -1080
877 -1080 -2350 -657 1645 1677 68 -1104 -1298 -651 807 1724 535 -1489 -1641 7 1199 1058 238
894 238 -989 -1566 -192 1762 1380 -724 -1432 -415 439 894 1135 21 -1752 -1247 1216 1905 226
911 226 -1020 -1072 -777 432 2022 1137 -1761 -2301 149 1646 991 216 -687 -1938 -1146 1807 2537 -242
929b42j961R02J425R16P76r66k795n73K946K074j237j830o47j35R51K219M19k621
947c79k050J137K093Q29l79j504j785L55K588J322j472j874m63O47J436J409o23
964A287k474j114J639K111M20j257j821p66J389K216M01j747j774k24J377J861
980A524M87j717k075p2J859J749L7j801j969J41K169J587n69j718j350O6J858
997B06J872n64k397j148J049J633R89k40j911j794J074K718O74j711j531l86O41
1014h26J743J282j343k502l35J808J524K70r96j995r34J954K427k82k142j292
1030a639J75J194J774M63j976k077M39J988J312q6j530j953M1K473J675j108j936
1047g71p24M47J343J524k64k250j399J127J934P33p95j695j122R37K108O73j357
$$ plain form
929 -242 -2203 -1301 124 1040 1816 850 -1945 -2518 428 2502 1265 -565 -1212 -1347 -396 1823 2242 -379
947 -379 -2429 -1292 801 1630 1251 -253 -2038 -1683 905 2227 755 -1119 -1582 -935 501 1910 1287
964 1287 -1187 -2301 -662 1449 1869 612 -1209 -1975 -586 1630 2031 284 -1490 -1714 -337 1524
980 1524 2011 294 -1781 -1853 6 1755 1792 -9 -1978 -1837 332 1919 1350 -368 -1718 -1652 206
997 206 2078 1514 -883 -2031 -982 651 1640 1400 -511 -2305 -1231 1487 2161 450 -1081 -1467 -826
1014 -826 917 2199 856 -1646 -1981 -173 1351 1621 625 -1370 -2304 -350 2077 1795 -347 -1639
1030 -1639 -1464 -270 1504 1967 -9 -2086 -1647 341 1653 1567 37 -1916 -1875 598 2273 1165 -771
1047 -771 -1495 -1048 295 1819 1555 -695 -2094 -967 967 1700 905 -790 -1912 -975 1133 1806 449
1064D49j599m54R60J715O92j411j818l8J376J275L25j042j842m09J941J743n86
1081A277j620r34J42J126J565Oj943j411Q07J593P22k66j258j457K75K034J175
1098A833j053j658o17O66J435R29q30j624n16Q80J194P03m77j706r40J340J819
1115A378k7j303r10j67O09J369N92j341j523K37J265P52L1p16j302l16J453J352
1133A433n06j395o54L47R41Q87k20j228p88M97J064O19k63j106q55O16J335L82
1151A106p54q18l80L37J087O52q78j207L6Q58N15P3k47q47n81P48J185lj025o74
1171h17J57O63O58k8p70o11J99O25M85K8n91p51J06R41M95m04n90l19R5O18O10
1192G99l47q87j41N62K68J0R1l14o69J21R41K52p46m26K76J82L1K60k2n50j91
$$ plain form
1064 449 -1150 -1604 -644 1071 1763 352 -1466 -1504 -128 1147 1472 430 -1412 -1821 120 1863 1277
1081 1277 -343 -1277 -1135 -9 1556 1562 -381 -1792 -985 608 1330 1064 -194 -1651 -1376 658 1833
1098 1833 780 -878 -1495 -829 606 1535 705 -919 -1435 -555 639 1342 865 -841 -1781 -441 1378
1115 1378 1351 48 -862 -1029 -420 949 1541 200 -1323 -1086 179 931 962 246 -1056 -1372 81 1433
1133 1433 927 -468 -1122 -775 166 1053 833 -395 -1183 -686 378 997 734 -372 -1227 -611 724 1106
1151 1106 352 -466 -846 -509 578 1230 352 -855 -819 39 554 627 380 -467 -1048 -300 885 882 -143 -817
1171 -817 -660 3 661 633 -137 -748 -549 76 561 589 -2 -753 -647 294 789 385 -205 -524 -429 189 799
1192 799 452 -435 -576 -14 254 264 355 41 -628 -507 434 686 -60 -486 -210 -28 3 263 241 -309 -500
1213e00N42L29k79j96O6q8j8L50J69m29k67K66K86p5q8l8j57L6K95ll09nK17j19
1237a5j29K47Q4l64j03L74R9l20l6J99n0p6J36j0k01J12K67j65k96J87K75j17
1259I8j67J26O0k24l6L34K06l24m57J15N34J36l56k01K3r6Q5N34J04p78l84N41
1281a27L79j11J05o2p67j77J126N82r23n76L87M6o6P60K52j217o18J027O35m59
1301A96m8Q6q58j86J393N34j275o41O75J52j53O78O0j346l11J355M54p97q8J57
1321C7p07J29J463J21j669m70J179M50l55J78j46r86J8J362N15r39p68J0K78O65
1341C65O29n11j219l30Q83R68J06p91q91q7P19P38L08m68j239n79J242J442l95
1360H90j227l42PK44J197P29j453j567P75J371kj25L1j215q57J657J632j113j486
$$ plain form
1213 -500 42 371 92 -104 -38 -126 -144 206 375 -54 -321 -55 231 156 68 30 -127 -91 204 201 -108 -113 104 -15
1237 -15 -144 103 187 -177 -280 94 193 -127 -163 36 -14 -90 46 36 -165 -53 214 49 -247 -60 215 98
1259 98 -69 57 117 -107 -143 191 397 73 -384 -269 265 401 45 -156 -133 -229 -144 390 494 -284 -668 -127
1281 -127 252 141 246 184 -583 -760 366 948 25 -551 -164 -118 -184 576 828 -389 -1007 20 655 196
1301 196 148 234 -624 -810 583 1117 -158 -799 -124 28 -125 553 613 -733 -1044 311 765 -32 -120 37
1321 37 -670 -541 922 1043 -626 -1096 83 533 178 356 210 -776 -758 604 1119 180 -588 -578 -300 365
1341 365 994 483 -736 -1066 -183 785 891 100 -791 -878 -159 579 887 419 -820 -1399 -157 1285 890
1360 890 -337 -679 -672 -428 769 1498 45 -1522 -747 624 622 497 528 -687 -1544 113 1745 632 -854
1379h54K84K93p1J144O17j889j306J542J266p42k48L15j172n59K053J171j915
1396g1j322J033N89k14P82J38j879o44K004J048j171o18R2n98K85J818K44k075
1414e59j008J104J035K27k3r08j258L71J618O91o55j057q74K56J608R71r31j348
1432g40l69L37J086J278n64k074m89J423Q57K0R5r69j585P30K305J02j653m32
1450f42J73l30R85J596j168k305N88J826k09m61N75q29j515J376K159j080j858
1467a119N46O22m84R38J102j884j776J805J796j079p68N64q41q36K018J571j975
1484B00j832R45R43r9P77J25k070r38K018J447q70p70k72q09L51K002N06j796
1502a42j170M89P12Q07O13r84j647K19J416N69j03m43j173m85J481J228p85r77
$$ plain form
1379 -854 -570 -277 -348 796 1413 -476 -1782 -240 1026 284 36 351 -821 -1380 673 1844 -71
1396 -71 -1393 -360 229 15 797 935 -944 -1588 416 1464 293 -325 -233 -831 -546 1272 1516 -559
1414 -559 -1567 -463 572 799 776 -132 -1390 -1019 599 1290 635 -422 -1296 -1040 568 1539 608 -740
1432 -740 -1109 -772 314 1592 1028 -1046 -1535 -112 745 765 860 -109 -1694 -964 1341 1443 -210 -642
1450 -642 -469 -799 186 1782 614 -1691 -1103 723 514 53 628 -201 -1716 -340 1819 739 -1119
1467 -1119 -573 49 -435 503 1605 -279 -2055 -250 1546 467 -301 263 -578 -1414 604 2175 200
1484 200 -1632 -687 256 157 934 1059 -1011 -1949 69 1516 646 -124 -396 -1205 -854 1148 1654 -142
1502 -142 -1312 -823 -111 696 1309 325 -1322 -1103 313 882 779 336 -837 -1322 159 1387 602 -375
1520c75j05k21L05J496J67j956p14J395N73m23L75k44j537K33K087J36j680j45
1538f33O17n46M12J633p26k317M64K015k11q22N75m75j456J094K147r00j900M88
1556e41O24o18Q57J358j624k055J393J876p80p02O15p89j135J593J707j328j556
1573a105N88M73k06R22N34j643j067J360J077n04k52r4q65K1J465L89j124m74
1591e05J60o0N69R03p07j369L48J016q3q9K67p98p84J124J068q76p37M94j40l49
1611e48J056N57j456p42J237M99o20K38J78j134p0J603J64j385J6O84o57m3J462
1630A039k26j918J78J620k47q10P15o0j347M66J691m67j405M81N70p75K97J274
1648A076o97j503O48J187m82m12N64l65q10P61Q93p00n75M49o9l30O97L56r73
$$ plain form
1520 -375 -480 -701 -396 1100 1267 -689 -1403 -8 565 142 517 273 -1264 -1031 1056 1192 -488 -633
1538 -633 -16 -562 -150 1483 757 -1560 -1096 919 708 -114 461 -14 -1470 -376 1771 871 -1029 -541
1556 -541 83 -535 322 1680 56 -1999 -606 1270 490 -212 403 -386 -1521 72 1779 451 -1105
1573 -1105 -517 -44 -250 672 1206 -437 -1504 -144 933 429 177 83 -782 -761 704 1093 -31 -505
1591 -505 -345 -405 164 1067 360 -1009 -661 355 272 183 450 -348 -1132 -8 1060 184 -553 -59 -199 -548
1611 -548 508 1065 -391 -1133 104 603 -17 221 399 -735 -805 798 962 -423 -407 277 -380 -423 1039
1630 1039 813 -1105 -927 693 446 -364 351 291 -1056 -590 1101 634 -771 -290 280 -495 -198 1076
1648 1076 379 -1124 -476 711 229 -183 381 16 -794 -33 860 160 -415 34 -35 -365 332 688 -285
1667b85l36Q01O9m42L78J14q44P6J025k32q26M05M19o57J9R06l25r29M77O83n32
1688c6k01O19l14o83P22O01q85l12Q65j38p83O09O26r13m39J009O0q77L89O17
1708E36q15l21J070j2j107L71R44p24o51R93K70j066J11J013m53p93P18M43p97
1727b70j5P77m14o39P20M36q26j49P10k28m95N95K81q57o6P96j61n39M69J76q01
1748e00J09R63k24q48L31M45n07O6P43m07q57N08P00m95k20N44l06o85O34P89
1768G83o50o10M38J46k91M28K85p93l36P25K11m33J91J29p42o8J103J30r65j35
1788d54N18j75pO50j87r83J37Q92n7l59K41k16o61M84J000l63r03J14L42r8L32
1809B47L66o82o93N48O39j80j37j8n56j49R26M57p58m95K46O8J49O17j21j031
$$ plain form
1667 -285 -621 180 249 -193 185 299 -545 -469 556 324 -502 -97 322 -335 -316 590 265 -664 -187 496 -36
1688 -36 -237 382 68 -615 107 708 -177 -489 376 238 -545 64 690 -223 -662 347 407 -470 -81 536
1708 536 -279 -600 470 458 -649 -278 666 -58 -709 284 554 -512 -401 612 159 -634 84 527 -270
1727 -270 -285 492 78 -561 159 595 -231 -380 330 102 -393 202 483 -374 -440 356 195 -344 125 301 -500
1748 -500 -391 572 348 -500 -169 276 -231 -165 578 171 -686 -178 522 27 -193 351 45 -640 -6 783
1768 783 133 -477 -39 107 -184 244 529 -264 -600 125 336 -97 94 223 -519 -587 516 646 -319 -454
1788 -454 64 -111 -118 532 345 -638 -501 391 334 -25 216 0 -661 -177 823 460 -443 -329 13 -85 247
1809 247 613 -69 -762 -214 425 245 108 90 -466 -615 311 768 10 -485 -239 -171 -22 595 474 -557
1829e57j77Q98L24l25jj91n83K53J019N0q80k99K30J58L92L78o24q32L16P63P6
1850C88j83j09n23k86P72P38m60p37p4J80L04N87k0r51m40P16N58j22q1k75o20
1871f38J33J035L31p95n80J37K41M18M33m17r46l2Q02M04j68k49m77l62N82Q65
1891G17j36q06l39J51L47N66J68p63p10L48P85K17k07l88m83JP51N56l81p19k45
1912e70K39N37M89k69q45k95N41N98J09l18n50l28L97P30J42n17n40j86M03P45
1932E12K06p21o92J91O21L57%l69o34r8P40O16k38o35l43L7N00O47r5q74m68M54
1954b86N93J84j52m67n29J64Q37L59n07n92j15K37M66M31k63q12k68O25O14m4
1974D75l94m04j91L18O70J79o18n80J07M98L78N4l91o18j06P12O32k91p24k24
$$ plain form
1829 -557 -734 164 488 163 162 -29 -612 -359 660 710 -170 -469 -239 -81 311 689 65 -767 -451 312 388
1850 388 205 96 -427 -713 59 797 337 -400 -474 -294 10 597 577 -374 -814 -98 460 338 257 -18 -638
1871 -638 -505 530 861 66 -514 -377 -136 282 715 298 -648 -680 122 526 358 109 -368 -730 -148 717
1891 717 581 -225 -564 -413 -66 500 668 -95 -805 -457 328 545 338 -50 -533 -532 219 775 394 -325 -570
1912 -570 -331 206 695 426 -419 -714 -173 425 534 216 -334 -662 -265 465 607 90 -450 -636 -233 512
1932 512 718 -3 -695 -504 117 474 474 105 -529 -627 113 729 491 -144 -487 -450 50 697 602 -272 -740 -286
1954 -286 307 491 339 -128 -657 -493 344 703 196 -396 -511 -274 192 623 360 -452 -720 -95 519 475
1974 475 81 -323 -514 -196 474 653 35 -545 -438 60 438 492 101 -517 -623 89 721 430 -294 -518
1994e18K39L15L64J00n70o52K22P95L09l70m44k86Q2O14N06l74p63q9M57L03J33
2015C73j9m61n27L17Q11J02n88l66M1K07L44K62l48o09jN33L05j31k65k77j06
2036d03L38N05l0n80l48K55M45J91j27l39l15P4N32L79k91n87j05L24K71J51%
2057C40m06n34K69P94J36o23k90J11K7J97M65j49p93r5O37K00j93L8j25n43J79
2078c58Q78J4q14j26M99o6j19M28Jp32o6P61J25n04KJ43k94N4O10p2p43rN61K1
2102A94k48J42j4m34P0N89O2m83j51J73L7J41K25j73m10k2L74K26j01k17j34K4
2124a30J33J49J02j37l35q1L83K33k20j89L4q0lL54J04m82j90M20P1l01J84K72
2146B91m69l02O42L05o42j65N50p2m52L68L61n57k50O38Q9n92J31M91l75l73N75
$$ plain form
1994 -518 -279 36 400 500 -70 -722 -500 295 604 234 -210 -496 -414 200 706 332 -431 -520 -63 240 373
2015 373 354 -107 -634 -317 494 596 8 -358 -317 -110 234 496 148 -461 -462 71 376 245 -20 -297 -403
2036 -403 -65 440 410 -170 -518 -263 182 373 246 -93 -408 -334 198 577 286 -301 -406 -82 189 340 340
2057 340 -66 -600 -331 463 599 -24 -314 -203 -176 21 486 337 -456 -551 86 286 93 131 6 -537 -358
2078 -358 520 534 -280 -406 93 27 -92 336 337 -395 -461 300 425 -79 -77 66 -228 -174 436 364 -379 -388 173 194
2102 194 -54 88 74 -360 -290 299 361 -122 -273 -100 -63 78 303 130 -280 -302 72 298 197 -20 -154 -130
2124 -130 3 152 254 117 -218 -299 84 317 97 -92 -58 -138 -141 213 317 -165 -355 65 136 -165 19 291
2146 291 -178 -480 162 467 -175 -340 210 138 -314 54 415 -142 -392 246 335 -257 -126 365 -10 -383 192
2167A92K45o87j16O52m6n31K13L40l92j84N09M5m92O1L94j92k23L20Q0l83OL71
2189A82m9k52Q5J24j42J6J77p6j63O8J14m8l7K4l3j5L2nJ9K0j14n9K13P8k83p7
2215b01K97%k50J19J83k74j08M05N5m25O3L19k01j80M53N6o24j3O50k4n10J75
2237c5K52l71j18N75M6o02k6M03j07j37L64p1n74Q8O04o5l80J22P5l00J18M95
2259C56j23n14P3K98p2K7K14k31l66K21L92q4k26Po9m2K42J67k65k03R3Q3P0J31
2283A79j00l29J4L21Q3r6r3j50q1L16K65k75k71J39N4o7L00J75m98l71M78L71
2305C64k14j53N7k68r5N43K58n38k93K78M6n3L60N2o61k32O28L16l37j18L0k72
2327c02M9N78R1n67j81K77N2M8K93j67n62O1N76R3l00n8o3j72K26M71j84n45J1
$$ plain form
2167 192 437 -250 -366 286 240 -291 -78 262 -130 -314 195 240 -252 -191 203 11 -212 108 188 -195 -189 182
2189 182 133 -119 -34 90 -52 -36 141 65 -98 -30 84 36 -1 23 -10 -25 7 2 21 41 -73 -132 81 159 -124 -201
2215 -201 96 96 -154 -35 148 -126 -234 171 226 -199 -136 183 -18 -198 255 311 -313 -326 324 300 -210 -35
2237 -35 217 -154 -272 303 349 -253 -279 124 17 -120 244 173 -401 -313 291 226 -154 -32 43 -257 -139 356
2259 356 233 -281 -208 90 18 45 259 28 -338 -117 275 191 -35 -28 -97 -139 103 270 5 -198 -105 -22 48 179
2283 179 79 -250 -236 85 168 72 -21 -171 -252 64 329 54 -217 -78 -24 -91 209 384 -114 -485 -7 364
2305 364 150 -3 54 -214 -309 234 492 -46 -339 -61 -15 -68 292 344 -317 -549 79 395 58 -60 -30 -302
2327 -302 -253 325 416 -151 -332 -55 -3 45 338 171 -391 -330 246 339 39 -19 -82 -254 -28 443 259 -286 -275
2350b75L10M6L9J08k86l53K36M48J8k97j74q7J48L45J16l42k72Q0J70J88J49k10
2372A05l95k3M00K32q8j98k62j06L83L93k09m09n1J16Q7K35J38l97m17K38M37
2393B09N8j79j62k16K1M00K71l11l41K5J52J46K15n5m61j55L74L00p1j56j75j85
2415b96J69M44N3m57k23J70J59J30J24j99l89NL93K10j52k00j71n2L11L21j34
2436B16m06j05J96K11J13m1k67k00J31L11J37j40k74k00J92L82Q1k95k48K6J31
2457d9J75J38j57l42p7K85K48Kk02k37q7K67L10m7l05j68Q5J81J81L0k36k54P4
2480a85K95J54r4k01j94N6K85J93j68k78q6J29J97J32j01k82j10J88K25K7j21
2501F1j85j35J28K91P8k21k32JK14J75Kj71j68rJ80J78Mj65k05oK14K20o4k34
$$ plain form
2350 -275 35 81 120 228 -58 -411 -175 273 291 -6 -180 -267 -119 226 342 0 -272 -192 -22 166 315 105
2372 105 -290 -313 87 319 231 33 -229 -335 48 441 232 -177 -228 -112 -25 210 348 -49 -466 -228 209
2393 209 267 88 -74 -290 -269 131 402 91 -250 -225 -73 73 288 233 -228 -383 -9 291 220 64 -111 -296
2415 -296 -127 317 370 -87 -310 -140 19 149 273 74 -315 -310 83 293 141 -59 -230 -282 29 350 216
2436 216 -190 -295 -99 112 225 184 -83 -283 -152 159 296 156 -118 -318 -126 256 337 42 -206 -180 -49
2457 -49 126 264 107 -235 -312 -27 221 223 21 -216 -303 -36 274 227 -78 -246 -161 20 201 231 -5 -259 -185
2480 -185 110 264 170 -31 -225 -169 116 309 141 -137 -223 -94 103 235 134 -148 -258 -70 155 182 61
2501 61 -124 -259 -131 160 238 17 -215 -214 0 175 177 6 -162 -171 9 187 191 26 -179 -185 29 249 185 -49
2525d9j59R9K07R4r8j61j01N3J60J33n0k15j55J20K39P7j45j97k2J27J50M4j05
2548D6j61l7J31J40N4j18j63l4J44J72lj70j38K4J44J12k1j45j23L7J34J01l8
2571H8j41o8J1J08J25l4j69p2Q0J46M5p8j00n5P7J22L0p6r2j6M0R7P3q3j59l8
2597a39J74J09q9q4k4jL5R4Pj12o5L1Q2L1J9q3j03K6J70K9j17n4J1M5QN9K6r8
2625a3p2Q3R3k0n5k9l6K3Q2K5q5o2M3O0j5k8j4j4qL3M7j8n0k1L2M0%k4j7l5M5
2656a0O6jq7j4Q7J9n2jN2m2o6Q1P8p3q5J3M8J9jj4q0KJ02J0q6mN4m8l3R5M6j16
2688d1o3R9P4o3k3K3m0QQ5J5j04l4R3K3m4K2L5j22k2J46O9j36q6N9L3j3O3K2j42
2717f4q0J30J16p1p7J0Mk6J00R0q4j36qJ38O0l0n0o2j9R9P1m3q3l1L9J7M3M7q4
$$ plain form
2525 -49 -208 -109 98 192 94 -67 -168 -115 45 178 128 -87 -242 -122 117 194 49 -148 -170 -43 107 151 46
2548 46 -115 -152 -21 119 173 55 -108 -142 2 174 171 1 -137 -113 31 143 122 -23 -146 -109 25 126 88
2571 88 -53 -121 -110 -2 123 89 -80 -152 -72 74 119 41 -59 -114 -37 85 115 39 -53 -69 -29 68 141 58 -101 -139
2597 -139 35 144 55 -29 -53 -54 -19 75 82 -30 -95 -64 18 49 68 -15 -118 -92 78 107 -10 -64 -53 -8 0 59 85 -13
2625 -13 -85 -2 91 71 16 -13 -49 -26 56 81 -4 -66 -23 37 22 -6 -20 -34 -42 -9 38 20 -30 -51 -19 21 21 -3 -20 -55 -10
2656 -10 56 55 -32 -46 41 60 8 7 59 17 -49 32 110 37 -48 -35 13 32 31 17 -63 -61 41 51 -35 -39 15 -33 -66 29 75 -41
2688 -41 -104 -5 69 6 -17 6 -34 -26 59 74 -30 -64 29 52 8 30 65 -57 -79 67 136 0 -86 -27 6 -7 56 78 -64
2717 -64 -144 -14 102 31 -46 -36 -32 -58 42 132 48 -88 -96 42 102 72 22 -40 -59 40 111 68 -15 -46 -7 10 53 100 16
2746A6j31L3J53M7j19q3L1M7K0L4lj13l6Q6Q0J4n4o2p0P1J75Nj78o5R8O9k5N6
2774I6j1j60p5J95J40j25j50M6J4j3J22P4j95j68J78J42o8o3K4p5o3J59J56j39
2798D1j76N7J05qM6N6j62j35J60K16q1j94MN7j5P1J03j02j84PJ71O2l8n7j14m4
2824a54J57J43p3j71k2Q6L7L2O5p3j53jK03R1j31j09K3N6K7P9J7j70r4J48J31
2849A44q5q1K7m0o8J60J23j85k07J51J72o8n0P5j17j47J86K38j55k40R8Q9o1O7
2873B6J69j65k67J22K97m5j75L3j5r4R1K26r8k35K6J43k7K1Q7j27j96R6K50l1
2897A12j75qM3QJ6J14n6j44j4J21O6k8m9m9k9Q4J06j0j32q4P5J16om0l1n4m9J06
2925IJ49p2k12%J42K3l3O8n5k00O1K66%k30J0R2o9qJ94J0k84k3K37L0j34N6M1
$$ plain form
2746 16 -115 -82 71 118 -1 -84 -53 -6 14 48 45 -68 -104 -18 62 76 22 -40 -110 -39 136 141 -37 -102 -4 65 40 96
2774 96 85 -75 -150 45 185 60 -90 -44 -30 -43 79 153 -42 -210 -32 110 42 -21 3 -72 -135 24 180 41
2798 41 -135 -78 27 19 65 121 -41 -176 -16 200 119 -75 -71 -14 -29 42 145 43 -141 -134 37 99 61 4 -110 -154
2824 -154 3 146 73 -98 -120 -34 3 35 100 27 -126 -127 76 167 36 -73 -50 6 33 112 129 -41 -135 13 144
2849 144 59 -22 5 -35 -103 57 180 -5 -212 -61 111 43 -7 68 -49 -196 -10 228 73 -167 -69 20 -41 26
2873 26 195 30 -237 -115 182 137 -38 -5 -20 -114 -23 203 105 -130 -104 39 12 33 120 -7 -203 -107 143 112
2897 112 -63 -71 -28 -20 -4 110 54 -90 -104 17 83 55 6 -43 -72 12 118 108 -24 -108 -33 83 77 37 6 -48 -97 9
2925 9 158 86 -126 -126 16 39 6 74 19 -181 -120 146 146 -84 -74 18 -51 -59 135 145 -139 -162 75 105 -29 27 68
2952F8j69jK48Qk62lJ86m7r3J28N7k42l8K42O2j92l0Q2o5K9J33k9j86K1J40nm9
2979gP3k7j46K2K03J2j44m1L6K2L4M4n6q5NN2N0Rm8n5j4N4M3Mm0o4k2J09M6o3
3009Fn5L3j0oO4M6j05q8J20R0q9k4O5q0m4J40R7j77j08J38N3r4K7Q5j06j17J43
3036DR5r7n2O5o7k6J39K2j54m4J51Nq9M4O6r4o1J33N0j10oM1k3MP7k0j11K3J01
3065F6l0o4M9J0q0J3R7l1q8K2K4KK2Om2m0L9M7j0k0Ml0J2P4j1n0%K6l6K3Q4l0
3097E8j15K7R5l4m4L1j1p0N5Q5o9q3N1N2o8RQ7o0j11R5R2p2p6O1J4m1N9L3p2k0
3127d2N8jj7M8J4j01k4J22J4r1j6N6l8kP2Lj06MP5k5l4N7j8j02L9J21k6q7J3K9
3157ej2K9N9p8n3M8M1j0%Nn7qP8L6n5k7J9m4J0J04l9j26K6J00k6o2O6J1j05MJ21
$$ plain form
2952 68 -101 -102 146 154 -108 -111 75 28 -65 63 120 -122 -160 82 144 -48 -78 4 -61 -32 101 72 -114 -93 47 42 -7
2979 -7 66 39 -107 -85 118 130 -14 -55 -19 3 37 81 25 -60 -55 -3 47 56 8 -47 -61 -7 36 40 0 -64 -86 23 69 6
3009 6 -49 -16 -26 -32 32 78 -27 -115 5 95 6 -18 47 -33 -77 63 160 -17 -125 13 66 -28 -1 84 -22 -139 4
3036 4 99 2 -50 15 -52 -78 61 83 -71 -115 36 41 -48 -4 62 -32 -93 40 90 -20 -26 15 -8 -4 73 53 -58 -35 66
3065 66 36 -28 21 31 -49 -36 61 30 -58 -36 -12 -10 12 18 -24 -64 -25 22 12 -8 -4 -34 -22 52 41 -9 -9 17 -19 4 88 58
3097 58 -57 -30 65 31 -13 18 7 -63 -8 77 8 -75 -24 28 -40 -31 56 -4 -115 -20 72 0 -76 -15 -1 -42 17 50 -22 -42
3127 -42 16 15 -2 46 60 -41 -65 57 71 -20 -36 20 -18 -20 52 55 -51 -47 28 3 -31 26 8 -94 -55 66 40 -47 -34 -5
3157 -5 -17 12 71 -7 -60 -12 29 19 19 24 -33 -41 37 73 18 -9 10 -34 -24 80 41 -85 -59 41 15 -47 19 30 -75 -71 50
3188E0jr5%L2k0N5N3p1p7O0Q9o1qN6n4p8Q6Q2o9p2M6j0rP4mj14j1J10on5K7K3
3220B8j07nJ43K3j18l8Q5j7k2O9J3j34K1J08Kn9K4j0n8M5R6l7q4K2J8k8M5O5j06
3249a6p7P7P2n3k3J3l6k0Q9K1n4m2M3j5LP7jj41J5J21K3p9RK6p0J4Q7Pq2pK5k3
3281a7L8O3q5j06Q3R3o8m1O3l7o4O1Q8p1p3N8Ol0O5M0j03n1R3N6o4j1M1m6l8Q4
3311B7M7p6m7O2oj0L6%o9k3Q6L0n6j4oj8K7L2j1n5J6J6j4L3L1m3m9K8N7k0%nk3
3344a7kN0kk6J2J1n3kQ2lr5pP4j0n2M6J4p4J3P9m6m5M4L2o9J2Q6k4r7N0Q1m8n4
3377d0O3J8p6K3Q1m0p5N4L1m6k2P2j7p1J4O7k1k6N%j6J5K9k9r%K6l1RL5j1l0j6
3410c4M0K6l0j8K6Pj1l6O5Nn6j0M0J6l7OK0l0j7N3ko3NO4l1o3N8O0p0n3Q5L0q5
$$ plain form
3188 50 49 -46 -46 -14 -34 21 74 3 -74 -14 75 14 6 62 8 -70 16 98 29 -43 3 -7 -16 58 54 -60 -71 39 33 -22 5 28
3220 28 -79 -84 59 82 -36 -74 11 -6 -28 41 54 -80 -59 49 51 -8 16 6 -52 -7 89 52 -32 -10 8 -20 25 90 -16
3249 -16 -93 -16 56 3 -20 -7 -43 -63 26 47 -7 -49 -6 -21 -18 59 58 -83 -68 53 76 -3 6 32 -38 -24 63 70 -12 -19 6 -17
3281 -17 21 84 -1 -107 -24 69 1 -40 23 -14 -78 -17 71 0 -73 -15 -9 -39 26 66 -37 -88 5 61 -3 -14 27 -19 -57 27
3311 27 74 -2 -49 13 7 -3 33 33 -36 -59 27 57 1 -13 -19 -37 -10 22 11 -44 -28 -12 -26 7 38 -5 -54 -26 31 11 11 6 -17
3344 -17 -19 31 29 3 15 26 -27 -29 53 50 -45 -52 22 12 -40 6 20 -54 -41 38 -8 -53 -9 23 -46 -34 52 28 -69 -19 62 14 -40
3377 -40 23 41 -35 -12 69 29 -46 8 39 -7 -29 43 26 -45 -31 36 15 -11 -6 -6 -22 -7 22 -7 -16 -16 10 -21 -12 23 12 -18 -34
3410 -34 6 32 2 -16 10 17 6 -30 35 40 -16 -26 14 30 -7 -1 19 -11 -28 25 23 -40 -35 29 -2 -65 -7 53 -17 -70 15 45 -40
3443d0PQ3m3m8M1N7o4l0P1Qo5J9N9m7m8O1L9o8j8M1km3K7L8m5m5O1J4o1J7O3m4
3475ep2N6O2m5m1K8K5j6qL5Kl4J3K4k6k0N1j2m6J7O0pp4K5L9j9n3L2M4m1m7N1
3507bM2m7j7J7kj1K5J2l0k9N6Rl4J0L6l0l2L1N1l6n4K6L6k7j3N3k6n5J3N3j8k2
3539a5K4pl5j0N5J5m5lK5JmMOm0%M7Ll6K9J1k8l1P4K6q0k4O2L6n9j4M2k6k6L4
3573A1K2n3k8N6Mk3J9J3o0k4P8N2q3j7L5nm3M9N8m2p5K9N3qNJ1m7l9M7O9l5l8
3605ij0J6j0QM2k3o0oP2rj8Nnm3L1N5j6o5J8L9J2l4K7Ol7k8P8K6m8m5M0MQK3q
3640C6n3j6O0K8o8PJ6l6l2Q4N1q9p0M9P6l5k0K5m0m2O2P8l9o7J3K1j5M7M8p0q3
3671g4N3O6j3j7Jl6l9P0M5k4o1mL2qJ0J6j6n8K4O2K2n6m0J6K2K1J6j2n1j0M8M1
$$ plain form
3443 -40 -33 50 7 -41 0 57 -7 -37 34 42 -23 -4 55 8 -40 21 60 -8 -26 15 13 -30 -3 35 -10 -55 6 20 -41 -24 39 -5
3475 -5 -77 -21 41 -4 -45 -17 8 -8 -16 19 21 -13 0 24 -2 -22 29 17 -29 -12 48 41 -33 -8 31 12 -41 -9 35 -6 -53 -2
3507 -2 40 -7 -24 -7 -9 -20 5 17 -13 -42 14 23 -11 -1 35 5 -27 4 55 19 -35 -9 27 0 -13 40 14 -41 -28 25 7 -15
3539 -15 9 2 -33 -43 12 27 -18 -21 4 5 1 5 11 -29 -29 18 21 -15 14 25 -3 -34 40 66 -14 -38 24 60 1 -13 29 3 -23 11
3573 11 33 -20 -48 8 12 -11 8 21 -39 -63 15 67 -16 -33 2 -3 -46 3 61 19 -56 -27 26 18 23 34 -13 -52 -5 64 29 -9
3605 -9 -19 -3 -13 -5 37 14 -46 -52 20 11 -7 -2 -7 -50 -19 36 20 -45 -27 12 24 -10 17 23 -14 -42 36 62 14 -31 9 13 21 44 36
3640 36 -17 -33 27 55 -13 -6 10 -26 -58 26 77 -12 -82 -33 43 8 -12 13 -27 -69 -7 71 32 -35 -22 -1 -16 31 79 9 -74
3671 -74 -21 45 32 15 16 -20 -59 11 56 32 -29 -33 -1 -9 1 17 1 -57 -33 29 51 -5 -45 -29 -7 14 30 18 -33 -43 5 46
3703D6ql1j3rQN0L3q6p4P1M9j7k8K6k4o3M8Q4k6r0rM7KK6K3n5o8N4Q9m0m3L0%
3736Bn0L9Q7l4r4J1O2Pk5K1j4n4K1O6nm9j5J1qJ5L5k2n0NM2J1j2j2k3j6L6N8j4
3769C2m6j7J7K3L1j9k3j9pK3M9Ln9l2L5L3oj2pk2k1N2K0j6l7j0nL3M6k3n3k7O4
3802@K4l8K2J6m8k4O2L9n8k5L2kjL8rn2j2N6J1k2kj1l0MN1J8m8l0K2oK8Lrl6L
3837c4N0j4kmj3kK6K9j8k1j4jRL8Rm5k8J5N3j2nk6jlJ3K6j9j5j3k1L4M6k4l9m
3872c0K1J4J9Ll4l0K0M0Qk1j1j9LL4L2k9m5RL1kK1j2l7k9K7M9qk3j1k2LL2K8l6
3906ek9NJ0L3nol9J3K5J2kok4oJ6M8j2m3j6K5K2Qkl1k0OL1J7rj4l6mM8L7l0m3
3942b6j1J5L5J1mm0kRK8K2jm3k3kP1J5m0j7kJJ5K3j2m3JK0J0J1j4l6j5L5K8ml6
$$ plain form
3703 46 38 7 -6 -15 -7 43 76 -10 -84 -13 36 19 -9 17 -7 -70 -22 62 36 -54 -63 -16 -14 12 35 -20 -88 -34 55 15 -28 2 2
3736 2 -48 -9 78 44 -50 -39 23 30 5 26 12 -42 -21 45 40 -9 -24 -13 -21 -6 29 7 -43 -38 4 15 3 -9 -32 -48 -12 46 32
3769 32 -14 -31 -14 9 40 21 -2 -21 -28 -5 44 47 -12 -44 -9 24 18 6 -1 -23 -44 8 28 12 -25 -35 -40 -7 39 16 -37 -64 0
3802 0 24 -14 8 24 -24 -48 14 53 -5 -30 2 0 -1 37 28 -24 -36 20 31 9 7 -4 -34 -30 21 39 -9 -39 -17 -23 5 8 -1 -37 -34
3837 -34 16 2 0 -4 -17 -19 7 36 18 -3 -17 -18 -9 29 38 -7 -35 -20 33 21 16 -10 -11 -14 -1 25 6 -9 -22 -43 -9 37 13 -26 -30
3872 -30 -9 5 24 27 -7 -37 -17 23 31 10 -1 -20 -17 17 49 20 -25 -16 15 13 34 22 -15 -44 -17 32 24 1 -10 -32 -29 3 31 -5
3906 -5 -34 -29 -19 14 9 3 -36 -23 2 14 12 6 -18 -24 -8 40 28 -15 -31 -6 16 24 22 -9 -29 -23 8 25 16 2 -34 -38 10 47 17 -26
3942 -26 -37 -22 13 24 20 -20 -22 -13 15 37 36 -7 -30 -32 39 54 14 -3 -5 -4 11 34 22 -21 -20 0 10 21 7 -29 -44 -9 19 15 -21
3977b1qNRJ9J3j3m4J5K0L0nj2j7k5L6L8j5l3j2J4K1J5qm5KJ3QjLKk2j5K7L4k2
4012Fl3lQM3oj3qj7LJ9K0Ll0k0J8K2J2k6j2lJ1K8jj9qj1J1J0L3k2m6MK9Qlj0k
4049ek8K3L1lk1kRk9L1K0j1l0oL5PkLk2j5J8K4Kl5QMn%J1Ll8j1L8J7j2k5Jk1K4
4087a2J7J0k5k7K5NJ1J4pl6j9N4K2om4NJ6j0K0J6k7m2KN7J1k0j3l1jJ8L2J4n3
4120b4j1K9lK0K0j7n4NN7L4n7j0Nj0nO7kn7l8N1M2k4l0Rk2jM0L1m2n4J8L0K2%
4154A9j1n6j7N3N2k7l5oMRL5L2m0o6J5P2J0pl2k4j2J9O9Jp9j4K7J8K1Mk2p7jQ0
4188A4L0m2k7Kj0J8N2Kp8k9O2M4j5j4j0l1J3N8K0n5n7K9K5L0jNp0m0P5O9m2m6
4220a9rlLN4M1p0q2K8Q3K1k6m5j2qL4O4Lq4m1N3L3L9Lm6o7K1Q2J4n2l9J1%kO4
$$ plain form
3977 -21 -29 -24 -15 4 17 4 -40 -25 -5 25 20 8 -9 -34 2 40 25 -8 -20 -6 15 30 22 -23 -21 -8 0 -1 2 4 -18 -33 -6 28 6
4012 6 -27 -30 -22 21 15 2 -6 -23 -20 -1 19 22 -8 -28 -10 12 24 -2 -14 -17 -6 22 21 2 -6 -17 -6 4 37 15 -31 -27 2 10 7 -3 -5
4049 -5 -33 -10 21 18 -3 -5 4 -25 6 26 15 -15 -21 14 21 19 22 0 -15 3 27 29 -6 2 6 1 1 12 15 -23 -34 4 21 9 -16 -15 -36 -12
4087 -12 5 15 -10 -37 -12 -7 4 18 11 -25 -44 10 32 26 -18 -13 3 -7 13 29 2 -40 -38 19 30 10 -3 -34 -35 -17 15 29 -24
4120 -24 -35 -6 -9 11 31 14 -40 -35 22 56 -1 -11 -6 -16 -21 46 44 -13 -51 0 42 18 -12 -3 -25 -26 14 45 3 -51 -33 -3 19 19
4154 19 8 -48 -65 -12 40 13 -22 -28 -24 -15 20 52 12 -54 -39 33 43 36 4 -20 -32 -13 56 57 -22 -36 -9 9 30 34 12 -65 -66 14
4188 14 44 2 -25 -23 -33 -15 37 39 -39 -68 -6 38 23 9 -1 -32 -19 39 59 4 -53 -24 1 31 30 35 -35 -75 0 69 27 -19
4220 -19 -28 -31 -28 26 67 -3 -85 -57 26 47 21 -24 -36 -44 -10 54 57 -27 -68 -15 18 57 60 14 -53 -32 50 64 12 -27 -16 -16 -18 46
4254D6ko6o0P9M6jm2rl1LP4J7p1m1K5M0J7Jqm6l1O3P1l8n4rOJ1N0J0o1n8M4O1
4288C6Kj2l8l3lN5N5k6o7k8K1N5J6j0m5l2J6P7K0m2m1rJ9L3L6k0o0k9N9K7Ol3
4320Ej1k3PN1K8m1n9qM3L5Nk9n4jN2M3k3m7pjK4L8K3n6n1K8M6K3j3l0l0rO8M1
4354F7k7n5j4K0K5J8%m5l4L0M5K2m1l3j1J3M3L0l9m8mM4K4mj8l7qJ8O3jl3m3n
4387c8M8J9jk0l3oL8M1j9k5k5k5L4L7Qm8l1J3M8J5j6k1k5qK6O3k5m5j3OM1J8L
4420C4m0k8K9M4jk3k5kQK4K3k8m7J2J4J5J6rm2oJ9M9mm1j9MJ5L1J1j6m1qL4J5
4454A7Pj8k7rL3M3om0j2%K1NJ0rl9kK5L9j5l6rPK6J0qk4pLK4J8j8jl2JK4K5rk8
4492a1rL1RQJk8nNK2Pk8qjnJ0K0j6l0MJ6J1pkk5J0RJ8Rk7JRkJ3J5j5k0JJ3J7n
$$ plain form
4254 46 44 -22 -82 -3 43 42 0 -9 -40 -37 37 54 -17 -58 -33 7 24 25 17 -29 -60 3 74 36 -18 -27 -21 -10 40 50 -11 -69 -25 36
4288 36 38 26 -12 -45 -48 7 62 36 -31 -59 -38 17 33 23 -22 -54 -38 39 59 17 -24 -33 -14 19 55 35 -25 -54 5 32 38 5
4320 5 -6 -29 -22 29 57 16 -43 -51 -8 27 32 3 -51 -52 0 43 20 -27 -34 -35 -11 27 50 -6 -57 -29 17 40 27 -3 -33 -42 26 67
4354 67 40 -15 -29 -9 16 34 34 -11 -45 -15 30 52 11 -22 -33 -20 23 53 14 -34 -38 6 30 26 8 -29 -37 -19 44 43 10 -33 -38
4387 -38 10 29 28 8 -25 -31 7 48 29 4 -21 -46 -12 25 33 -15 -46 -33 15 30 14 -7 -32 -40 -14 49 24 -21 -34 -28 13 31 34
4420 34 -6 -34 -5 39 38 15 -10 -12 -4 20 43 15 -32 -20 -6 9 25 16 -26 -32 -13 36 32 -9 -28 -24 -9 22 33 17 -24 -32 2 17
4454 17 24 6 -21 -30 3 46 40 0 -12 -12 9 14 24 15 -24 -26 -1 38 23 -13 -22 -15 11 21 13 -11 -18 -15 9 27 9 8 -24 -23 1 26 17 -11
4492 -11 -20 11 20 28 29 1 -4 1 23 30 2 -6 -7 -12 -2 18 2 -28 -24 -8 3 -4 -6 -31 -21 -12 6 15 -12 -11 -2 -4 9 24 9 -11 -10 3 20 15
4532A5j4j1J0J4oOo%qj2J9J5k2j1LJ0J6Jk0qnJ0MJ8kj8k0J9J8JKk1%nL0Nk8kj1
4571a4OJ7J0ol0lJ2K2krk3kNQL1j5l5OOJ9JPk7j0J7J8J5j4l4j0M6J7%j4k1oJ4
4608BK1Nj1k7j9M3J5rk6l2J7K9Nkj8j7%K6K6Lm5j3J0K7L1j4l2k6K0L0J7k6ml2
4642b6J8L4K0l7l7kK4K2J2rm8k3M6L9jj1m4j9K6M2Rk7m6PL4L7Lm0l3LM7L9j9m8
4676hrJK8K4Ro0k0NL8M6l1n1k6K0M7J9k6l0l1K7N8K3l9m4k8L1N5L4l5n5k3M4M1
4709C4J1l9l0k2M2M6Ll7m6PL3M7qm9n0J5N9K8lm9m2PN5L5j5m4l9J9N1L4j4n5l5
4742e1K2P0L0m6n1k7M5M9J0k6n6k1K9N5J7k0p0j4N4M0ll3m3kL9M3nl0m8MK5O9
4774E5rn4l2QL9M6j1m8l9K3N0K3k0l7l6MN8M6k2o1l4L4N0J5j6n1l4L2O1Ll0l8
$$ plain form
4532 15 1 -10 0 14 8 14 8 8 0 -12 7 22 0 -11 -8 2 18 19 -1 -9 -14 -4 0 18 16 -2 -22 -3 15 16 18 -3 -3 -8 22 27 -1 -3 -14
4571 -14 -8 9 19 13 -17 -20 -8 14 12 3 -20 -22 -17 -9 22 7 -28 -22 -16 3 4 11 -16 -26 -9 9 24 10 -24 -34 12 29 29 15 -6 -12 2
4608 2 23 28 17 -10 -29 14 29 20 -6 -38 -21 8 13 11 -7 -24 -24 2 28 31 -14 -27 -17 10 41 27 -5 -31 -11 19 36 10 6 -26
4642 -26 -8 26 46 9 -28 -30 -6 16 28 19 -29 -52 -6 33 32 21 -23 -42 -16 26 35 8 -38 -31 3 40 43 3 -30 -27 20 59 40 -8
4676 -8 -17 -16 12 36 45 -15 -35 -30 8 54 23 -28 -54 -34 13 32 6 -24 -55 -28 30 53 14 -30 -58 -27 28 62 27 -28 -51 -7 34
4709 34 45 6 -24 -46 -4 42 45 8 -38 -31 2 49 41 -8 -58 -43 16 44 41 -8 -50 -43 12 47 32 -12 -51 -32 19 53 39 -16 -51
4742 -51 -29 41 71 25 -26 -53 -8 41 51 25 -31 -52 -23 32 49 29 -41 -55 -1 39 36 3 -40 -42 -3 40 35 5 -43 -39 -14 55
4774 55 46 -8 -40 -32 7 53 42 -6 -45 -22 28 51 31 -6 -42 -38 20 66 44 -17 -51 -17 33 48 32 -19 -53 -21 40 43 13 -25
4806b5j6K4M5K4m5m0rL6L5Qk7m7mM6M3No0j0j0K4L5Lk2n8J2M3L2j1l9k2kM5J8
4839C1ml6k8K1L3K4k4l3k1K0N1K2l4m7pK9L5J6j7m2j9J9M8Pl2k8nQM6Mm1m1RK7
4873iL7Jl5k0j5L7M6rm4j5KK1K8J5m1n7L3N3Mql6KlK0M0j9m6pLL7J0pl1j9J4L4
4909A6J3m0j4J9OKL2j2l2k6L3L8%k8j6%J0J8J0l0k3J6J8K6k7J0k3l8M0L5%l7j7
4942b1jJ9J0K1l0l0JM6J0k6lJj2K0K0Ql4j8L5J5j0Pj4k8PK3J7k1j3mKjJ7K2m6
4977a1jJ1J8nj8Okk1K3K3j3j6j2K2MJpj9QJ5Qqk2K6j1Qj0K0mk1%J4Mk4J3Nj0j2
5015a8J4Kjj6L0kj1J4jol0L5MnrRjk0J9K3j2k6OJ2nJ0Qnk7mL9j4j3kJpj1L1Jj8
5055fQKrJ7Nj6j5pK9Qrj0Olj1K0Qj3j2LK9j7lpPj3K7mj6j2%K4Jmjj3k1K8J9Jk9
$$ plain form
4806 -25 -41 -17 28 52 7 -33 -42 -6 29 37 10 -37 -41 5 48 53 -7 -17 -27 -3 32 35 13 -45 -33 10 42 31 -8 -30 -32 13 31
4839 31 27 -9 -37 -16 17 41 17 -16 -37 -17 34 56 22 -25 -32 -3 32 48 31 -11 -30 -11 37 44 12 -16 -21 -13 33 37 -4 -45 -36 -9
4873 -9 28 29 -6 -26 -41 -4 42 33 -11 -26 -24 -3 25 40 -1 -58 -25 28 32 24 -12 -10 -13 7 47 28 -18 -25 -22 15 25 18 -13 -32 -18 16
4909 16 29 -11 -25 -6 0 2 34 22 -10 -36 -3 35 35 7 -9 -9 1 19 29 -1 -24 -8 10 36 9 19 -4 -42 -2 33 33 -4 -21
4942 -21 -22 -3 7 28 -2 -32 -31 15 25 -1 -4 -3 -15 5 25 33 -1 -19 16 31 21 28 14 -14 -7 16 33 12 -1 -5 -3 -4 13 35 -11
4977 -11 -12 -1 17 12 -6 0 -2 -23 0 23 10 -6 -18 4 8 9 2 -17 -9 6 14 6 -16 10 -1 7 -3 17 13 -8 -8 6 10 -14 -1 4 -6 -18
5015 -18 -4 -2 -3 -19 11 9 -2 12 11 5 -25 10 14 9 0 9 8 -12 7 30 18 -8 -2 10 5 15 23 18 -9 -13 26 12 -1 -3 -2 -9 -20 11 12 -6
5055 -6 2 4 -5 12 17 1 -14 -21 8 16 7 -3 3 0 -11 9 17 4 -8 -5 24 7 4 -3 4 -9 18 14 -2 -14 -14 10 11 7 6 -7 -28 0 19 20 -9
5096ilJJ0J7J9l6k9K4QK1j6%j5nJ5J5J3l4k7K5J5J0Pk7k1J3PK8qk6j3LK6L3j6
5131B5m3j0K1K9J1ol3qJ8J6J8ql8kJ3J8K5k5k9j5K5K4Mk0k2j1J6L9Kj2m7kL0K6
5165B9Nl5k8MK6L1Pm0l0K3J9K8Lm4k7J2L7K5k9m1j0K7K1L1k7l6j8K2L3K5l3k3
5197a3k3MN2J9l0l5j9L4M2Ol1k6KK8L8j6k3k6j5L5M3Nm6m8K2L4K6mn0j7OL3K8
5230C5ln0j9J4L9K3j5m6j5J8M6J7k0l6j7NL9K5k1n8mK7M0K7l0m1k0L1M5J0l5l4
5262b3j0L6L1J6n8k3JM3K8mm0k5mL9M3j7m2k1J2L8K3k3k0k5jM8K6j0o2pJ1M1K2
5295D3k2m9j1L7K6J2l0m9mK7L7J1l3k6j2K5M8Ol2m3ML7L4No0pjL6J9Ll2j6PK6
5329A6K6l3k6k2J7N0Qj3l9j5K4J5K8k3l0j2J4N2J0l2l5JJ7K4lLm2OJ8J4J7k2l3
$$ plain form
5096 -9 -12 -11 -1 16 35 -1 -30 -6 2 23 7 7 -8 -13 2 17 30 -4 -31 -6 9 19 26 -1 -22 -9 -2 26 18 -8 -21 -18 8 41 25
5131 25 -18 -28 -7 22 33 27 -6 -14 4 20 38 30 -8 -10 3 21 46 21 -8 -23 2 26 30 10 -12 -23 -7 32 34 22 -25 -27 3 29
5165 29 34 -1 -29 -25 1 32 39 -1 -31 -8 11 39 42 -2 -29 -17 20 45 16 -25 -35 -8 13 44 17 -19 -37 -15 18 43 10 -13
5197 -13 -36 -32 20 39 9 -26 -45 -11 31 37 6 -20 -18 10 48 32 9 -17 -32 3 46 51 5 -43 -21 13 39 35 -15 -32 -26 7 35
5230 35 32 -18 -37 -23 16 39 24 -22 -37 -19 27 44 24 -12 -29 -24 15 40 19 -39 -43 -16 24 51 21 -20 -40 -9 36 46 11 -23
5262 -23 -33 3 34 50 -8 -31 -30 13 41 37 -3 -28 -32 7 50 33 -9 -30 -18 20 43 20 0 -25 -26 22 48 38 -24 -31 -20 21 43
5295 43 21 -28 -39 -2 24 36 6 -43 -47 -20 17 28 -5 -31 -43 -18 30 36 4 -39 -35 2 36 41 -19 -26 -27 9 28 31 -1 -17 -10 16
5329 16 42 9 -17 -39 -22 28 36 23 -16 -31 -7 8 36 13 -17 -29 -15 37 47 15 -20 -19 -2 22 19 22 -20 -14 4 18 35 13 -20
5362b0lK2J8K2l6l4QL0K0rj8l5J1K8K1j8j1j3rL3J3nk8oJ2K2J3j2j1k4K4J6J6
5395C7j1k6k1L0nP%k3mML5opl7J0J3K0j4Jk2qJ8K6Jk3qJJ6J2lj2k3PK8ooRk1J6
5434EJRjk5pK5MJ3j9rp%K2Jj2mJjJ7J2k0krK4Pj3j1Lj0J0RPkpj6NQOlrnNrOkJ
5480bjrPK5l3J5pnLLOJj3K1rmOmRn%rJ8j4lJ2jK%prlQNnM%LmJ2Qk0k3J7POmJK
5529GpQJ3qlj9QMPJ0j1j5J1KRqOl2jJ3J4Mj5j2QJ3pJ9k8Jj2K7NJ3l0lJ3K1pqj3
5570crRJ3K0j0l5J1pL7jj7j0j1K4lJ5pj5j7kL8lj8j1QJ3J3qj3k3J6J0K7nj7k4
5606a5j2K2K5Qk3j0rK1J8ml1j2J6J6Rrj4qLK1Plk8j9L1KJ6Ml5oJ3K8J5j5k0j1
5642iJ3J7J4j4l0rJ8L4pl0j6jK5K9%k7k3pL1K0Kl5l1J4K7J5j2k0j2LJ3L0jl2j5
$$ plain form
5362 -20 -23 -1 17 39 3 -31 -23 7 27 18 0 -35 -24 4 25 7 -4 -17 -26 7 20 15 -13 -19 -7 15 28 16 5 -19 5 21 37
5395 37 26 0 -21 9 4 11 11 -12 -16 -12 23 17 10 -27 -17 -4 16 2 3 -19 -27 -9 17 18 -5 -13 -12 4 16 13 1 -22 -15 13 7 1 10 -11 5
5434 5 6 15 14 -11 -18 7 11 24 5 -4 -11 -11 11 12 0 -4 -3 -4 13 25 5 3 -6 18 25 12 1 4 -6 4 13 20 18 11 -5 0 8 14 11 2 -3 2 -7 -1 -3 -2
5480 -2 -3 -12 -5 20 -13 2 -5 -10 -7 -4 2 3 -10 11 2 -2 4 0 9 4 4 -5 13 -1 -4 8 7 9 9 2 -7 -10 -2 3 -2 2 2 5 1 13 21 1 -22 -5 2 8 4 5 7
5529 7 0 8 21 13 10 -9 -1 3 10 20 9 -6 5 7 16 8 14 -18 -19 -6 8 12 -3 -15 -7 6 -1 18 -10 -9 -21 6 11 24 -6 -9 4 25 18 10 -3
5570 -3 -12 -3 10 30 20 -15 -4 -11 26 25 8 -2 -13 11 8 23 16 1 -16 -18 20 17 -1 -12 -4 9 22 14 1 -22 -6 4 31 26 9 -15
5606 -15 -27 -5 20 28 5 -5 -14 7 25 21 -10 -22 -6 10 19 10 -4 -12 -9 12 19 16 -12 -31 0 2 18 22 -13 -19 -6 22 37 22 2 -9
5642 -9 4 21 35 21 -9 -18 0 34 27 -3 -19 -20 5 34 34 7 -16 -23 8 28 30 -5 -36 -22 5 20 8 -12 -24 -21 -8 22 21 -11 -26
5677b6oN3J0j2k6j9OL9K0k3m1j0K9J8J7j0j8k5J3L0Rk9k2jJ9L9kk5k9j9M4K0q
5710A5j5l1J0K1K2Ok3l9J5K1M1k5k0l7K3K0K9k5k4j7LL9P%m0j0J4M4Jk4k9jK6
5743cL0jk0k0pJ9K2Qk4k2rK5L5Ll0k7%L2K4jm1j3nK4K6%l4j8RK7L2k1l8j8K7K1
5779A2K1k0rk4K3RJ9rl1j7K5L1rnk2k4L1K0Ok5k3MJ9K1Mk7l8PL3K0Jk4k6JK6L1
5815C1j0k1k9J9J7J3J6l8k6J2L7K6l7rk5J4K1K7k1j9k8J8L3kJ3l8oJ0L2J0l6j4
5847a0j3J4L9mj3k0j4J3L0J2k5k4PJ3J5J0j5k7kK6K1k0k3qJ4jJ4Koj6jJ1K1j7
5881CooJ2J6Mj2j8NJJ2Qrj6RmRJ1j0j1jlJ4%lrlNJ5lj0j8LJ3nK2k5pRJ1J1j6J
5923aj6QK5j0momPmJ2Jmj4RrK0OpJloNmj2J0JNloKopK3Kj4R%klPlOk6J8oPrPk0
$$ plain form
5677 -26 -32 21 31 19 -7 -26 -20 19 39 16 -25 -35 -6 12 29 19 1 -24 -11 19 28 -1 -23 -24 -5 34 32 7 -22 -41 3 23 15
5710 15 0 -31 -21 0 22 28 5 -34 -19 2 43 18 -2 -39 -16 4 33 8 -16 -33 -30 9 16 16 -24 -34 -20 24 25 1 -28 -29 -3
5743 -3 27 26 6 -14 -21 -2 20 28 4 -18 -27 -2 33 36 6 -21 -21 11 35 34 -7 -20 -25 -1 25 25 -9 -27 -18 9 41 20 -18 -36 -9 12
5779 12 33 13 4 -20 3 12 31 22 -9 -26 -1 30 21 16 -6 -30 1 21 27 2 -21 -17 2 23 27 0 -38 -31 2 22 23 -1 -27 -26 0 31
5815 31 21 0 -29 -10 7 20 36 -2 -28 -16 21 47 10 1 -24 -10 11 38 17 -2 -30 -12 21 19 32 -6 -12 -2 30 40 4 -10
5847 -10 -23 -9 30 26 13 -7 -21 -8 22 34 9 -15 -8 5 20 30 15 -12 -14 12 33 13 -10 -18 -4 -5 9 11 5 -11 -12 -1 20 3
5881 3 -3 -9 3 19 23 11 -7 -2 -1 11 19 10 -6 3 -1 8 19 9 -2 -3 -6 8 8 5 -4 -7 -2 13 10 0 -18 -15 -2 -7 15 -10 -17 -8 3 14 -2 -1
5923 -1 -17 -9 16 6 2 -4 -8 -1 -5 7 8 4 -10 -1 -10 10 16 9 10 7 1 6 2 -10 0 1 6 3 -3 -1 -7 -14 9 11 -3 6 6 4 1 8 5 11 -15 3 -3 4 -5 2 -18
5972a8J7J2j0MqPj6QjNoNpoJ2jkJ1oKKpP%j5j4L0P%j8NKRLj0qJ2kmJ4nooqJ6K
6018Hjj3mJ2J3pj7lQj1MNMmjLMJ3pj2j0J4PJ1k6j4PJ6LQj3j4PMK2Lk9NJK0Lj3
6060FojJKJ4ooj0jJ0J5j0j4%JL5oj7j4j6L1J0%k1k3MK5LPj4j5rK2K8mj7j4KPJ7
6100A6%k9rQJ7QLk8pJ2J3K6j7j9j4J3J9J5Nl1k8L5lJ8rj7j3JL7J0k8j1oMK2J1
6136B4rk7j4K3K1Rk1l5J9J4J4Lj6j6j1J2L3ll1j4J1J8J2rk2k2J2L8Rj1l0j3J8
6169a4L4lpk6j0K5J1Mkk1lLL5Oj6l7NPM6j2l1j2KJ5J4J6k9qj1K2J8J6l1l1pL5
6205CPmj6KkJ9J2Jm0j3J5J8J8Nl8oPJ5J4k0j7kK0J3J4k3j6k1K2L4Ok6j6j3K4L0
6241B6Jk8j7J3J9KJ2k5k2%K9J8Jk0k7PJ2J6J0k1k5J1J3K3j2j2k5nK2K4j0l0nj
$$ plain form
5972 -18 -1 11 1 5 -3 4 -12 -4 -5 0 -6 -1 -8 -14 -2 -3 -5 6 0 2 4 -3 4 4 -11 -25 5 12 12 -6 -1 1 10 13 3 -5 7 5 1 15 10 4 -2 -10 6 8
6018 8 7 -6 -10 2 15 8 -9 -12 -4 -15 -11 -6 -2 -6 -7 -4 0 13 6 -6 -16 -2 5 16 -10 -24 -17 -1 2 10 -3 -17 -10 -6 16 19 -10 -5 -4 16 19 6
6060 6 0 -1 0 2 16 10 4 -6 -7 3 18 8 -6 -6 -5 30 24 7 -7 -23 8 18 18 -3 -26 -22 3 6 13 -1 -16 -25 -3 25 21 4 -10 -8 -1 16
6100 16 16 -13 -22 -14 3 11 14 -14 -21 -9 4 30 13 -6 -20 -7 12 27 32 1 -27 8 5 23 14 -3 -16 -15 22 32 4 -7 -13 -9 13 24
6136 24 15 -12 -26 -3 18 27 6 -29 -10 4 18 21 5 -11 -22 -10 23 20 -11 -25 -14 4 16 7 -15 -37 -25 13 22 11 -19 -32 -14
6169 -14 20 17 10 -16 -26 -1 10 14 12 -9 -12 -9 26 32 16 -21 -16 -9 37 25 -6 -18 -16 -1 13 29 0 -8 -19 3 21 37 6 -25 -32 3
6205 3 10 6 -10 -8 -10 9 21 22 -18 -31 -16 2 20 25 -13 -19 -12 3 17 -3 -20 -22 -2 11 25 2 -14 -35 -13 21 27 1 -15 -28 -4 26
6241 26 27 -1 -18 -5 14 16 28 3 -19 -19 10 28 29 9 -18 -11 1 17 27 6 -19 -8 5 28 16 4 -21 -26 -4 20 10 -20 -25 -26
6275b6M2nj0k5JPJ7Mj5j8QJ2J5J5j7k4NJ5J7Lk8pnJ7J3J4k2k2j0L5%poj0LKL7
6312B5j3l1nJ3J4NOj9j7J4J3J3nk3oLL9pj6k2mK0J4pjj2MJNJ2k1j2KK1KJ1k4k
6350a0MOJ4Mj5j1mJ9MJ4k2j0NL4j5k4KQj3J6MLqj1NJ3Nj1Nk6J1J0K1j7k0MRnk
6389dJ8j5JMjJOj5LjRnkj3J9kjOj7MoJ4qMLj2LNJ%j4RQnNNLmkJ%%rQPrQkpJ2%
6440A3pQj5JNj2J4rpJ3nj2PLkkMMjNo%jmJ9j3RlnNj1J5j3QqPJnJ0llKolPmMlp
6489fQJ0rMjj0J2KNj1j1nL0%j3k0%J1rJ9K%j8%K0kKj1mMqK6j5j0mJK3nj4j3K1
6530ArJ2J6k2ojJ3LK4k6j3nJ7J7j8j0%lJ3QRl0nJ1K0K2l3k0oK8KRj2moKJ8kql
6570Ck0J0K8j7Mj9lRK2Lk0rNRLqJk3QK2J6jk2k2RJ5J6j1j6mjJ6Roj5j4J2J9J0
$$ plain form
6275 -26 16 11 1 -24 -23 -16 1 5 -10 -28 -20 -8 7 22 5 -19 -14 1 18 21 -7 -14 -19 -2 11 25 3 -19 -29 6 6 -1 -7 -17 -14 -12 25
6312 25 12 -19 -24 -11 3 8 14 -5 -22 -8 5 18 13 -10 -16 -13 26 19 3 -19 -23 -3 11 4 3 -9 -5 -4 1 13 -8 -20 -18 3 5 16 -8 -10
6350 -10 -6 0 14 18 3 -8 -12 7 11 25 3 -7 -2 32 17 -7 -5 3 -10 6 10 13 5 -6 -1 12 17 6 11 -15 -4 6 27 10 -10 -6 3 -2 -4
6389 -4 14 -1 0 4 3 4 10 -5 -2 -3 6 1 -1 -14 5 3 2 8 -9 -5 -11 3 -5 -1 2 -10 -7 -2 -1 -1 -15 -6 2 -3 2 7 10 6 4 5 5 5 -4 4 11 2 10 8 1 13 13
6440 13 6 14 -1 0 5 -7 7 -2 -9 4 -1 -13 -6 -3 -5 -7 -3 1 0 5 -1 -1 -2 -6 13 0 9 6 1 6 -5 10 -3 5 -3 4 5 0 10 7 4 6 0 -3 4 0 4 1 -6
6489 -6 2 12 3 7 6 -4 8 10 15 4 -7 -12 18 18 5 -15 -15 -4 -13 6 8 8 -10 -10 10 8 10 -1 -5 -1 -9 17 2 -8 -12 -11 12 7 -7 -20 1
6530 1 -8 4 20 -2 -8 -9 4 7 31 5 -8 -13 4 21 3 -7 -7 -10 3 11 20 -10 -15 -4 16 38 5 -15 -21 7 9 18 6 2 -4 -2 16 14 6 3
6570 3 -17 -7 21 4 8 -11 -14 -5 17 20 0 -9 -4 5 8 0 1 -22 -14 8 24 23 1 -21 -12 3 19 8 -8 -12 -13 3 12 6 -9 -23 -11 8 18
6609A8j8lj9K0K6qnj6kkL1rmk7j2K2J3J0j4k0mJ6K7qj2k8J3K1KJ4ok3j4K1J7K
6645A9k6j5J4NK1lk2j0K0LK8k8rk1J5K6Lj1k5MPJ2Oj3j4j0J8K5J1k6j3mJ1J6Q
6680B2k4nk3L6Rj3rj6J8LK2j3j1j9J6%J4Jj8pj6L3Rj1rk3K4J6lOk3j1J0J7J9k9
6716hrmJ3J9Qj1l1KK6Qjj4ojJ3J9j2kl6J9MJ9Lj9j5OJ1MMj8loK4J4j5pj1J3Ql
6756EPj2j6J3J5Lmj9qNL4j9Jk0j0K1RLok3lK1K1j7Rk1JJ8%%j0j3QJ3J5nj2qMK4
6796B4Ml0jjkJ0RLl9PJ7NNj2onNK2oj5oN%J5Mj6oj1J7JJMj4jJ6J1j0j4jqK7lQ
6839A3qk7J2MOnoPKJJ1j0j2J1OmJK2k0j1MLLp%j0J4MQnj7J0nJ1lOk0L%Qj8J5p
6882a0J2mOj0KL%KlJ0lj3J0%rLRj9OJ5n%j2J5j1RPlmkLJlKJ3j8jPKmojJ1%Nol
$$ plain form
6609 18 0 -3 -22 -2 24 16 11 -5 -7 -9 22 13 9 -18 -30 -8 5 15 1 -19 -23 -7 20 12 0 -28 -15 6 8 22 16 -7 -21 0 17 19
6645 19 -7 -22 -8 -3 18 15 -7 -17 3 6 34 6 -3 -24 -9 17 20 9 -16 -12 -5 7 13 0 -14 -24 -6 19 30 4 -9 -13 -2 14 22
6680 22 -2 -7 -30 6 15 2 -7 -23 -5 -2 20 7 -4 -23 -7 -7 7 8 -10 -17 -33 0 9 -2 -11 -34 -10 6 3 9 -14 -25 -15 2 21 -8
6716 -8 -17 -21 -8 11 19 8 -23 -21 5 13 12 -2 -8 -9 4 23 11 9 -27 -8 -4 15 18 -1 -16 -10 1 5 9 -9 -12 -18 6 20 5 -2 -13 0 8 5
6756 5 12 0 -16 -3 12 15 11 -8 -16 -11 23 4 5 -15 -25 -4 5 8 2 -21 -24 -3 18 1 10 -11 -10 8 8 8 -2 -15 -7 6 21 16 4 -4 0 24
6796 24 28 -2 -3 -4 -6 4 13 16 -23 -16 1 6 11 -1 -7 -12 -7 15 9 -6 -12 -7 -7 8 12 -4 -10 -21 -4 -3 -2 2 -12 -13 3 14 4 -10 -11 -19 8 5 13
6839 13 5 -22 -10 -6 0 -5 -11 -4 -2 -1 10 0 -12 -1 5 1 2 24 4 -7 -3 0 3 -4 -4 -14 0 4 12 7 -10 0 -5 6 3 9 -11 -8 -8 0 -18 -3 -10
6882 -10 2 -2 4 -6 -4 -1 -1 1 -2 8 5 -8 2 2 -7 -4 5 -14 -8 7 2 2 -10 5 -6 3 10 7 3 1 4 5 2 4 17 -1 -2 5 7 3 -3 -4 7 7 12 6 3
6929CMmMjpPrpJ9rjJ2kj8NQqNlj2J0pPQj2J0JrJ3J%k0J1lPnK%OJ7j7jpMj2K0P
6976A7j9J2j1lJ9pKj1j2OJ0KjpmPmKPj0k%PJ0ppk2J7QOJj2rLJ1%j0PkJ6lRj7p
7020hQPq%jj3J3jJ2Lj2noJ5J0mJ1k0kQKOrJO%J4k3j2JLJ3Q%k4kJJ4Nrj4lJ4KN
7065Foj6QKMK0k1j0QQN%Kj5kKK6nl4J4jOJ7j1j5pNK3Mk2j6J0J5JNj5lqRK6nj3
7107ArrPK4okk0KJ3J3kj1j1OPK0k5Nk0LJ3QMj9k0K0Rjjj1KOJRkk3kK1OJ3%m0J0
7150a1J3J2nknmJ0J4lj6j6NK9Kmk3j1MK0J7j8j6OqK2lJ0l2pJ4J5J0qk7kJ5J5q
7188Djoj4J8Qklj7kJ3J3lj1qJ1lPPj5qMJ5lMj4lkJ2J9ml7J7kJ3LRj9kjMPOk2M
$$ plain form
6929 3 7 3 7 6 -1 6 -3 -10 9 0 -1 11 9 -9 -4 4 -4 1 -2 -14 -4 -11 -4 4 -8 2 3 -6 7 8 8 -12 -1 -4 3 -2 0 0 6 23 6 5 -2 2 -10 10 17
6976 17 -2 10 -1 -4 15 8 10 -1 -13 -7 3 5 4 -3 -7 0 -4 -2 5 -5 -7 -7 0 10 3 -4 -26 -9 -1 5 6 -6 -15 -12 -1 -1 -11 -4 -6 10 7 16 -1 -8
7020 -8 0 7 -1 -1 -2 -15 -2 -3 9 12 0 -5 -11 4 14 10 21 1 -1 7 9 15 6 7 13 13 27 4 -8 -7 -4 9 17 17 -7 -9 -8 6 11 2 -12 -15 -1 1 6
7065 6 0 -16 -8 -6 -2 18 -3 -13 -5 3 8 8 10 -5 -7 -5 21 16 -18 -4 -5 1 18 7 -8 -15 -10 13 17 -5 -21 -11 4 5 10 -5 -8 -16 -7 19 14 1
7107 1 -8 -17 -10 14 8 6 -14 -12 1 14 12 1 -10 -4 3 23 -2 3 -17 -14 -1 7 11 -8 -28 -8 1 0 -1 -12 -10 -4 -3 6 4 -19 -21 0 6 19 19 -21 -11
7150 -11 2 14 9 7 2 -2 8 22 19 3 -13 -8 21 23 19 -4 -15 -11 9 26 8 -8 -2 -10 12 9 19 -13 -20 -6 9 19 11 -16 -18 -3 12 4
7188 4 3 -3 -17 1 9 7 4 -13 -15 -2 11 8 -3 -11 0 -3 4 11 -4 -12 -8 7 4 8 -6 -9 -11 1 20 16 -21 -4 -6 7 10 19 0 -2 -3 1 8 14 -8 -4
$$ [...]
8191B
##END NTUPLES=NMR FID
##END=
