##TITLE=1H_PHDP904M
 CDCl3, 8 sc, 
 9.4.2019
##JCAMPDX= 6.0         $$ Bruker NMR JCAMP-DX V2.0
##DATA TYPE= NMR FID
##DATA CLASS= NTUPLES
##ORIGIN= UXNMR, Bruker Analytische Messtechnik GmbH
##OWNER= root
$$ XWIN-NMR		Version 3.5
$$ Tue Apr  9 15:39:32 2019 Russian Standard Time (UT+4h)  she@DPX200
##.OBSERVE FREQUENCY= 200.1315
##.OBSERVE NUCLEUS= ^1H
##.DELAY= (6, 6)
##.ACQUISITION MODE= SIMULTANEOUS
##.ACQUISITION SCHEME= undefined
##.AVERAGES= 8
##.DIGITISER RES= 18
##SPECTROMETER/DATA SYSTEM= spect
##.PULSE SEQUENCE= zg30
##.SOLVENT NAME= CDCl3
##.SHIFT REFERENCE= (INTERNAL, CDCl3, 0, 15.7039)
##AUDIT TRAIL= $$ (NUMBER, WHEN, WHO, WHERE, WHAT)
$$ ##TITLE= Audit trail, XWIN-NMR		Version 3.5
$$ ##JCAMPDX= 5.01
$$ ##ORIGIN= Bruker BioSpin GmbH
$$ ##OWNER= she
$$ F:/spectra/data/she/nmr/H-F/1/audita.txt
$$ ##AUDIT TRAIL=  $$ (NUMBER, WHEN, WHO, WHERE, WHAT)
(   1,<2019-04-09 15:37:44.06 +0400>,<she>,<DPX200>,
      <created by zg, POWCHK disabled, PULCHK disabled
       configuration hash MD5:
       00 E9 B6 7A A2 85 ED C7 34 08 36 98 17 FE 4E 26
       data hash MD5: 16K
       15 07 DD 9B AF FC 6F A0 62 D7 A0 3C 7E B6 B7 5B>)
$$ ##END=
$$ 
$$ hash MD5
$$ 97 A8 AE B6 5E 4E D1 9A A3 F0 E0 43 BD 8E 68 D7
##$RELAX= 
##$RELAX= 
##$RELAX= 
##$RELAX= 
##$RELAX= 
##$RELAX= 
$$ Bruker specific parameters
$$ --------------------------
##$DU= <F:/spectra>
##$EXPNO= 1
##$NAME= <H-F>
##$PROCNO= 1
##$TYPE= <nmr>
##$USER= <she>
##$AMP= (0..31)
100 100 100 100 100 100 100 100 100 100 100 100 100 100 100 100 100 100 
100 100 100 100 100 100 100 100 100 100 100 100 100 100 
##$AQSEQ= 0
##$AQ_mod= 1
##$AUNM= <au_zg>
##$AUTOPOS= <>
##$BF1= 200.13
##$BF2= 200.13
##$BF3= 200.13
##$BF4= 200.13
##$BF5= 200.13
##$BF6= 200.13
##$BF7= 200.13
##$BF8= 200.13
##$BYTORDA= 1
##$CFDGTYP= 0
##$CFRGTYP= 5
##$CHEMSTR= <none>
##$CNST= (0..31)
1 1 145 1 1 1 1 1 1 1 1 1 1 1 1 1 1 1 1 1 1 1 1 1 1 1 1 1 1 1 1 1 
##$CPDPRG= <>
##$CPDPRG1= <>
##$CPDPRG2= <>
##$CPDPRG3= <>
##$CPDPRG4= <mlev>
##$CPDPRG5= <mlev>
##$CPDPRG6= <mlev>
##$CPDPRG7= <mlev>
##$CPDPRG8= <mlev>
##$CPDPRGB= <>
##$CPDPRGT= <>
##$D= (0..31)
0 1.2 0 0 0 0 0 0 0 0 0 0.03 0 0 0 0 0 0 0 0 0 0 0 0 0 0 0 0 0 0 0 0 
##$DATE= 1554809863
##$DBL= (0..7)
120 120 120 120 120 120 120 120 
##$DBP= (0..7)
150 150 150 150 150 150 150 150 
##$DBP07= 0
##$DBPNAM0= <>
##$DBPNAM1= <>
##$DBPNAM2= <>
##$DBPNAM3= <>
##$DBPNAM4= <>
##$DBPNAM5= <>
##$DBPNAM6= <>
##$DBPNAM7= <>
##$DBPOAL= (0..7)
0.5 0.5 0.5 0.5 0.5 0.5 0.5 0.5 
##$DBPOFFS= (0..7)
0 0 0 0 0 0 0 0 
##$DE= 6
##$DECBNUC= <off>
##$DECIM= 24
##$DECNUC= <off>
##$DECSTAT= 4
##$DIGMOD= 1
##$DIGTYP= 9
##$DL= (0..7)
0 120 120 120 120 120 120 120 
##$DP= (0..7)
150 150 150 150 150 150 150 150 
##$DP07= 0
##$DPNAME0= <>
##$DPNAME1= <>
##$DPNAME2= <>
##$DPNAME3= <>
##$DPNAME4= <>
##$DPNAME5= <>
##$DPNAME6= <>
##$DPNAME7= <>
##$DPOAL= (0..7)
0.5 0.5 0.5 0.5 0.5 0.5 0.5 0.5 
##$DPOFFS= (0..7)
0 0 0 0 0 0 0 0 
##$DQDMODE= 0
##$DR= 18
##$DS= 0
##$DSLIST= <SSSSSSSSSSSSSSS>
##$DSPFIRM= 0
$$ [...]
##$SUBNAM2= <"">
##$SUBNAM3= <"">
##$SUBNAM4= <"">
##$SUBNAM5= <"">
##$SUBNAM6= <"">
##$SUBNAM7= <"">
##$SUBNAM8= <"">
##$SUBNAM9= <"">
##$SW= 24.9337058887773
##$SWIBOX= (0..15)
0 0 2 0 0 0 0 0 0 0 0 0 0 0 0 0 
##$SW_h= 4990.01996007984
##$TD= 16384
##$TD0= 1
##$TE= 0
##$TE2= 300
##$TE3= 300
##$TEG= 300
##$TL= (0..7)
0 120 120 120 120 120 120 120 
##$TP= (0..7)
150 150 150 150 150 150 150 150 
##$TP07= 0
##$TPNAME0= <>
##$TPNAME1= <>
##$TPNAME2= <>
##$TPNAME3= <>
##$TPNAME4= <>
##$TPNAME5= <>
##$TPNAME6= <>
##$TPNAME7= <>
##$TPOAL= (0..7)
0.5 0.5 0.5 0.5 0.5 0.5 0.5 0.5 
##$TPOFFS= (0..7)
0 0 0 0 0 0 0 0 
##$TUNHIN= 0
##$TUNHOUT= 0
##$TUNXOUT= 0
##$USERA1= <user>
##$USERA2= <user>
##$USERA3= <user>
##$USERA4= <user>
##$USERA5= <user>
##$V9= 5
##$VALIST= <valist>
##$VCLIST= <CCCCCCCCCCCCCCC>
##$VD= 0
##$VDLIST= <DDDDDDDDDDDDDDD>
##$VPLIST= <PPPPPPPPPPPPPPP>
##$VTLIST= <TTTTTTTTTTTTTTT>
##$WBST= 1024
##$WBSW= 4
##$XGAIN= (0..3)
0 0 0 0 
##$XL= 0
##$YL= 0
##$YMAX_a= 89965
##$YMIN_a= -225317
##$ZGOPTNS= <>
##$ZL1= 120
##$ZL2= 120
##$ZL3= 120
##$ZL4= 120
##$ABSF1= 10
##$ABSF2= 0
##$ABSG= 5
##$ABSL= 3
##$ALPHA= 0
##$AQORDER= 0
##$ASSFAC= 0
##$ASSFACI= 0
##$ASSFACX= 0
##$ASSWID= 0
##$AUNMP= <proc_1d>
##$AZFE= 0.1
##$AZFW= 0.1
##$BCFW= 1
##$BC_mod= 2
##$BYTORDP= 1
##$COROFFS= 0
##$CY= 11.3945322036743
##$DATMOD= 1
##$DC= 2
##$DFILT= <>
##$DTYPP= 0
##$F1P= 18.9103706918063
##$F2P= -1.10871071338519
##$FCOR= 0.5
##$FTSIZE= 0
##$FT_mod= 4
##$GAMMA= 1
##$GB= 0.15
##$INTBC= 1
##$INTSCL= 1
##$ISEN= 128
##$LB= 0.24
##$LEV0= 0
##$LPBIN= 0
##$MAXI= 10000
##$MC2= 0
##$MEAN= 0
##$ME_mod= 0
##$MI= 1.114404
##$NCOEF= 0
##$NC_proc= 0
##$NLEV= 6
##$NOISF1= 3.799351
##$NOISF2= 2.8
##$NSP= 1
##$NTH_PI= 0
##$NZP= 0
##$OFFSET= 15.70392
##$PC= 1
##$PHC0= -9010.096
##$PHC1= 13.60026
##$PH_mod= 1
##$PKNL= yes
##$PPARMOD= 0
##$PSCAL= 0
##$PSIGN= 0
##$REVERSE= no
##$SF= 200.130013532006
##$SI= 16384
##$SIGF1= 3
##$SIGF2= 2
##$SINO= 400
##$SIOLD= 16384
##$SREGLST= <1H.CDCl3>
##$SSB= 0
##$STSI= 0
##$STSR= 0
##$SW_p= 3612.71676300578
##$SYMM= 0
##$S_DEV= 0
##$TDeff= 0
##$TDoff= 0
##$TI= <>
##$TILT= no
##$TM1= 0
##$TM2= 0
##$TOPLEV= 0
##$USERP1= <user>
##$USERP2= <user>
##$USERP3= <user>
##$USERP4= <user>
##$USERP5= <user>
##$WDW= 1
##$XDIM= 8192
##$YMAX_p= 0
##$YMIN_p= 0
$$ End of Bruker specific parameters
$$ ---------------------------------
##NTUPLES= NMR FID
##VAR_NAME=  TIME,          FID/REAL,        FID/IMAG
##SYMBOL=    X,             R,               I
##VAR_TYPE=  INDEPENDENT,   DEPENDENT,       DEPENDENT
##VAR_FORM=  AFFN,          ASDF,            ASDF
##VAR_DIM=   8192,          8192,            8192
##UNITS=     SECONDS,       ARBITRARY UNITS, ARBITRARY UNITS
##FACTOR=    0.0002004,     1,               1
##FIRST=     0,             0,               0
##LAST=      1.6414764,     0,               0
##MIN=       0,             -225317,         0
##MAX=       1.6414764,     89965,           0
$$ Real data points
##PAGE= N=1
##DATA TABLE= (X++(R..R)), XYDATA
$$ plain form
0 0 0 0 0 0 0 0 -2 8 -8 8 -8 16 -16 19 -24 32 -40 41 -49 58 -72 81 -96 112 -128 145 -163 186 -210 241
30 241 -270 304 -339 379 -425 473 -525 584 -648 718 -796 882 -975 1080 -1196 1328 -1476
47 -1476 1643 -1838 2060 -2324 2644 -3037 3531 -4176 5064 -6364 8461 -12429 22649 -106388
61 -106388 -225317 -129913 -165131 -170027 -148274 -123706 -167374 -170276 -128155 -90219 -114360 -131478
73 -131478 -117615 -98393 -120193 -119128 -66748 -25873 -58273 -79659 -45703 -27941 -59897 -50482
85 -50482 857 2210 -46967 -53187 -22050 -16719 -30080 -11630 18010 10831 -24366 -31647 -5204
98 -5204 3395 -18031 -15881 8511 -7232 -47437 -34156 9021 5728 -16025 2049 17154 -12416
111 -12416 -31692 -5277 17596 5244 -9255 -3619 798 -11364 -17119 7780 34278 22516 383
$$ packed form
0@%%%%%%kJ0j6J6j6K4l2L5m3N6p2Q1r0J07j30J53j77K08k40K73l08L49l96M51
30B41n11N74o43P18q04Q98r98J109j232J366j514J678j857K055k276K524k804
47a476L119l481L898m384M968n681O568p707R240j1428J4825k0890L5078j29037
61a06388j18929R5404l5218m896K1753K4568m3668k902M2121L7936k4141j7118
73a31478J3863J9222k1800J065N2380M0875l2400k1386L3956J7762l1956R415
85e0482N1339J353m9177o220L1137N331j3361J8450K9640p179l5197p281K6443
98e204Q599k1426K150K4392j5743m0205J3281M3177l293k1753J8074J5105k9570
111a2416j9276K6415K2873j2352j4499N636M417j2162n755K4899K6498j1762k2133
$$ plain form
124 383 11716 23354 2430 -3537 27848 33026 -1895 -11153 10918 10209 -3633 9875 29636
137 29636 17640 -6755 -10450 664 1430 -9557 -10221 -37 -9611 -35623 -31712 -4398 -5824 -24249
151 -24249 -12746 -201 -25137 -42687 -19518 -4288 -21793 -29251 -15251 -14560 -27850 -24698 -3138
164 -3138 8937 -988 -12136 -4149 3313 -9629 -12997 11777 19944 -5168 -10934 12702 13897 -2480
178 -2480 10801 33752 21274 -1273 4518 17702 12061 3956 10784 19659 11326 -5300 -1814 18412
192 18412 18709 2172 7079 20140 2732 -17905 -818 16650 337 -11045 4092 6894 -11040
205 -11040 -12443 5780 11870 384 -7454 -2133 2392 -6887 -13180 1676 12851 -3086 -14320
218 -14320 2608 10374 -5420 -3679 17165 13589 -6840 -4516 9183 5225 -2125 5240 13772 9840
$$ packed form
124C83J1333J1638k0924n967L1385N178l4921r258K2071p09j3842J3508J9761
137B9636j1996k4395l695J1114P66j0987o64J0184r574k6012L911K7314j426j8425
151b4249J1503J2545k4936j7550K3169J5230j7505p458J4000O91j3290L152K1560
164c138J2075r925j1148P987P462j2942l368K4774Q167k5112n766K3636J195j6377
178b480J3281K2951j2478k2547N791J3184n641q105O828Q875q333j6626L486K0226
192A8412K97j6537M907J3061j7408k0637J7087J7468j6313j1382J5137K802j7934
205a1040j403J8223O090j1486p838N321M525r279o293J4856J1175j5937j1234
218a4320J6928P766j5794J741K0844l576k0429K324J3699l958p350P365Q532l932
$$ plain form
232 9840 762 1297 12710 17385 8048 6674 19197 16230 -368 4863 22508 17142 5026 14626
246 14626 22725 11407 7473 19969 24574 17765 15051 18109 18724 15793 12850 17332 25130 20854 10918
261 10918 16227 24765 16055 10259 21911 24584 10979 9118 18475 15732 8382 12832 16729 11319
275 11319 7267 8164 9073 9632 7351 4051 6483 7266 -1231 -3729 5003 4516 -5422 -3115 3593 -4068
291 -4068 -10558 -3541 -1601 -8812 -9321 -6012 -9159 -11897 -10104 -10233 -10556 -10000 -13243 -14288 -10134 -11460
307 -11460 -16398 -11764 -7118 -14393 -17393 -9964 -9817 -16383 -13142 -7698 -12083 -14215 -9646 -9737 -11984 -9201
323 -9201 -8243 -9683 -7581 -7071 -9277 -6243 -3029 -7131 -7601 -1541 -2723 -7706 -2827 2054 -2552 -3464
339 -3464 2122 1288 -1894 1425 3105 578 2300 4534 2043 2724 5637 3302 2742 6979 5957 2171
$$ packed form
232I840r078N35J1413M675r337j374J2523k967j6598N231J7645n366j2116R600
246A4626Q099j1318l934J2496M605o809k714L058O15k931k943M482P798m276r936
261A0918N309Q538q710n796J1652K673j3605j861R357k743p350M450L897n410
275A1319m052Q97R09N59k281l300K432P83q497k498Q732m87r938K307O708p661
291d068o490P017J940p211n09L309l147k738J793j29l23N56l243j045M154j326
307a1460m938M634M646p275l000P429J47o566L241N444m385k132M569r1k247K783
323i201R58j440K102N10k206L034L214m102m70O060j182m983M879M881m606r12
339c464N586q34l182L319J680k527J722K234k491O81K913k335n60M237j022l786
$$ plain form
355 2171 6062 8946 3970 3405 8505 6578 2532 5625 7286 3767 4706 7198 4278 3734 6462 4043
371 4043 1609 4538 4387 358 2353 4428 133 -366 3448 1097 -2777 709 1889 -2652 -2062 806
387 806 -2413 -3852 -886 -2592 -5325 -2079 -1522 -5382 -3914 -802 -4288 -5290 -1639 -3139 -5943 -2501
403 -2501 -1227 -4932 -3436 70 -2870 -4119 -377 -1031 -3821 -464 821 -2454 -752 2781 -84
418 -84 -1482 2601 1936 -982 1622 3471 349 1382 4580 2049 677 4447 3938 813 3326 5063
434 5063 1851 2071 4839 2268 686 3839 3253 226 2809 4457 1139 1410 4319 1760 -229 3184
450 3184 2279 -1516 918 3077 -569 -894 2514 929 -1275 1124 1020 -1396 380 1368 -1886 -1555
466 -1555 1123 -1505 -3362 596 464 -2897 -288 2311 -1952 -2687 1455 -218 -3819 -1704 -357 -2839
$$ packed form
355B171L891K884m976n65N100j927m046L093J661l519R39K492k920n44K728k419
371D043k434K929j51m029J995K075m295m99L814k351l874L486J180m541N90K868
387H06l219j439K966j706k733L246N57l860J468L112l486j002L651j500k804L442
403b501J274l705J496L506k940j249L742o54k790L357J285l275J702L533k865
418h4j398M083o65k918K604J849l122J033L198k531j372L770n09l125K513J737
434E063l212K20K768k571j582L153n86l027K583J648l318K71K909k559j989L413
450C184r05l795K434K159l646l25L408j585k204K399j04k416J776R88l254L31
466a555K678k628j857L958j32l361K609K599m263p35M142j673l601K115J347k482
$$ plain form
482 -2839 -2313 -434 -1633 -919 887 -1738 -2762 525 -672 -4532 -1728 451 -4281 -5018 -213 -1294
498 -1294 -4654 -1207 1514 -2072 -2832 -313 -1015 -2312 -1704 -2678 -2842 -892 -2118 -3722 742 2923
514 2923 -1200 -845 3889 1490 -2829 1237 4123 -218 -1089 3088 2341 -342 1699 4034 3807 3763 2872
531 2872 2140 4196 3277 -478 1369 4984 715 -3171 2135 4420 -737 -98 5257 2538 -2802 -779
547 -779 1474 -1766 -2995 -1352 -1189 -2322 -3500 -3928 -851 1165 -2647 -3799 1123 -375 -7101 -4495
563 -4495 1654 -2731 -7246 -2038 680 -4224 -3911 2261 2984 -432 -863 586 558 -851 -2443 262
579 262 4069 647 -3631 1848 6330 888 -962 6921 6956 -2094 -1667 4897 2700 -2431 788 4526
595 4526 1269 -2109 299 4093 4559 800 190 4246 2856 -4940 -3515 5163 2483 -5435 -641 6255
$$ packed form
482b839N26J879j199P14J806k625j024L287j197l860K804K179m732p37M805j081
498a294l360L447K721l586p60K519p02j297O08r74j64J950j226j604M464K181
514B923m123L55M734k399m319M066K886m341q71M177p47k683K041K335k27m4q91
531B872p32K056r19l755J847L615m269l886N306K285n157O39N355k719n340K023
547g79K253l240j229J643J63j133j178m28L077K016l812j152M922j498o726K606
563d495O149m385m515N208K718m904L13O172P23l416m31J449k8j409j592K705
579B62L807l422m278N479M482n442j850P883L5r050M27O564k197n131L219L738
595D526l257l378K408L794M66l759o10M056j390p796J425Q678k680p918M794O896
$$ plain form
611 6255 -122 -4653 3365 7535 561 -2489 1855 2827 -1709 -3018 1304 4467 551 -3978 344
626 344 5743 436 -3799 4267 7550 -3321 -6948 2131 2656 -5935 -4330 3806 1228 -5808 -3920
641 -3920 1571 805 -3887 -4416 -514 -1429 -8630 -9105 -656 -462 -9285 -7519 1285 -3057 -11615 -5087
657 -5087 3061 -3683 -10115 -4716 -1443 -7150 -9545 -3906 17 -3417 -7307 -3934 1256 -1854 -6515
672 -6515 -902 4349 -3748 -9427 -700 3535 -4919 -5607 3895 3531 -5348 -3926 3887 3198 -2245 -1386
688 -1386 2718 1357 -4049 -3933 2637 3909 -2543 -2603 4928 3154 -5113 -1102 7635 2234 -5687 -190
704 -190 4616 -2096 -5437 2176 5439 -346 -3657 5 2607 -822 -3790 541 4396 -1886 -7454
719 -7454 -1399 3411 -3917 -5895 3144 3390 -7040 -6642 2671 1089 -6142 -3801 1854 -2039 -8207
$$ packed form
611F255o377m531Q018M170o974l050M344R72m536j309M322L163l916m529M322
626C44N399n307m235Q066L283j0871l627R079N25q591J605Q136k578p036J888
641c920N491p66m692n29L902r15p201m75Q449J94q823J766Q804m342q558O528
657e087Q148o744o432N399L273n707k395N639L923l434l890L373N190l110m661
672f515N613N251q097n679Q727M235q454o88R502l64q879J422P813o89n443Q59
688a386M104j361n406J16O570J272o452o0P531j774q267M011Q737n401p921N497
704a90M806o712l341P613L263n785l311L662K602l429k968M331L855o282n568
719g454O055M810p328j978R039K46j0430L98R313j582p231K341N655l893o168
$$ plain form
734 -8207 -5778 475 352 -5024 -4818 910 -691 -8571 -5604 3925 329 -8597 -3747 3162 -4070 -9513
750 -9513 -354 5265 -2683 -6628 -144 2540 -3143 -5064 1193 4735 -1333 -6279 -744 4558 -1546
765 -1546 -5090 3935 7229 -3489 -6331 3999 4930 -4398 -2614 6353 3457 -5420 -3199 4423 3268
780 3268 -2571 -1412 4510 3193 -4495 -3784 5330 4989 -4205 -2311 6160 1499 -7104 -734 7782 1289
796 1289 -5161 744 4703 -1604 -4767 1476 5253 236 -4376 -957 3654 -515 -5518 163 5651
811 5651 -1702 -7248 466 4634 -3406 -5447 2859 2855 -5807 -5362 1699 756 -4385 -3687 875 326 -4615
828 -4615 -5003 745 2022 -4257 -5008 2093 1494 -6218 -3768 4018 686 -5989 -1542 3971 -580 -3721
844 -3721 1315 4069 105 -2306 766 3517 1171 -1524 1317 5238 1875 -2557 2187 6864 1614
$$ packed form
734h207K429O253j23n376K06N728j601p880K967R529l596q926M850O909p232n443
750i513R159N619p948l945O484K684n683j921O257L542o068m946N535N302o104
765a546l544R025L294j0718k842J0330R31r328J784Q967k896q877K221P622j155
780C268n839J159N922j317p688P11R114l41r194J894Q471m661q603O370Q516o493
796A289o450N905L959o307l163O243L777n017m612L419M611m169n003N681N488
811E651p353n546P714M168q040k041Q306mq662M45P061r43n141O98M562n49m941
828d615l88N748J277o279p51P101n99p712K450P786l332o675M447N513m551l141
844c721N036K754l964k411L072K751k346k695K841L921l363m432M744M677n250
$$ plain form
859 1614 -1716 4715 6145 -762 -1346 4882 4298 -985 353 4118 2334 -650 504 3631 3399 -81
875 -81 -1085 2208 2278 -2702 -2266 3514 2097 -4111 -1611 3689 -136 -4108 615 3167 -1786 -3784
891 -3784 -406 474 -2042 -2661 -566 628 -1473 -3962 -1280 2219 -641 -3814 195 2649 -3237 -5101
907 -5101 1125 1769 -3694 -2687 2161 419 -3267 -1205 1550 704 -1468 -1399 192 567 -2111 -2530 1504
924 1504 1901 -2786 -2172 3164 1320 -3338 18 4136 37 -2872 652 2029 -1004 -1332 1224 2046
940 2046 855 -129 921 2612 1739 -721 809 3522 661 -2195 1625 3754 -479 -1258 3234 2797
956 2797 -899 -34 2700 1279 -445 172 808 379 -639 -1317 -301 1198 -838 -1922 896 1254 -2515
973 -2515 -2285 1227 -592 -3930 -1467 659 -2320 -3034 -725 -363 -1845 -1727 -1253 -1190 -1050 -1815 -2327 -574
$$ packed form
859A614l330O431J430o907n84O228n84n283J338L765j784k984J154L127k32l480
875h1j004L293P0m980M36N780j417o208K500N300l825l972M723K552m953j998
891c784L378Q80k516o19K095J194k101k489K682L499k860l173M009K454n886j864
907e101O226O44n463J007M848j742l686K062K755q46k172O9J591L75k678m19M034
924A504L97m687O14N336j844m658L356M118m099k909L524J377l033l28K556Q22
940B046j191r84J050J691q73k460J530K713k861k856L820K129m233p79M492m37
956B797l696Q65K734j421j724O17O36m29j018o78J016J499k036j084K818L58l769
973b515K30L512j819l338K463K126k979p14K309L62j482J18M74O3J40p65n12J753
$$ plain form
991 -574 -553 -2786 -1899 698 -1105 -2705 315 1494 -1459 -1265 1567 427 -1675 -76 996 -124
1007 -124 -39 670 340 1118 1409 261 676 2332 1036 -179 1929 2168 -245 607 2787 1037 -249
1024 -249 1873 2239 411 1062 2163 1285 843 1430 764 484 1515 925 -18 1580 1688 -116 542 1964
1042 1964 338 -631 1150 1059 -963 41 1428 -228 -825 681 -98 -1031 67 -53 -1055 -182 212
1059 212 -1521 -1224 169 -1298 -2122 -282 -302 -1921 -931 213 -1518 -1795 -61 -907 -2172 -712 -237
1076 -237 -1626 -983 -194 -1359 -1216 89 -951 -1724 -112 114 -1507 -695 677 -807 -946 650 -57
1093 -57 -1165 317 693 -748 -156 955 -95 -391 932 402 -414 976 971 -401 305 1522 72 -343
1111 -343 1191 738 -597 696 1257 -256 270 1463 129 -471 1003 623 -417 611 897 -324 257
$$ packed form
991e74K1k233Q87K597j803j600L020J179k953J94K832j140k102J599J072j120
1007a24Q5P09l30P78K91j148M15J656j296j215K108K39k413Q52K180j750j286
1024b49K122L66j828O51J101q78m42N87o66k80J031n90r43J598J08j804O58J422
1042A964j626r69J781r1k022J004J387j656n97J506p79r33J098j20j002Q73L94
1059B12j733K97J393j467q24J840k0j619R90J144j731k77J734q46j265J460M75
1076b37j389O43P89j165J43J305j040p73J612K26j621Q12J372j484j39J596p07
1093e7j108J482L76j441N92J111j050k96J323n30q16J390nj372P06J217j450m15
1111c43J534m53j335J293N61j513N26J193j334o00J474l80j040J028K86j221N81
$$ plain form
1128 257 1139 -194 -392 1167 540 -820 316 1086 -478 -265 878 -181 -806 622 488 -739 128
1145 128 879 -279 -172 739 -460 -754 549 105 -1128 191 752 -910 -536 1053 -33 -1047 493
1162 493 498 -1013 -67 752 -552 -625 580 -192 -813 270 141 -652 600 1003 -802 -258 1248 -106
1180 -106 -1221 745 707 -811 25 1125 -134 -424 911 444 -354 324 548 -365 238 477 -413 42
1198 42 1173 -394 -954 1181 892 -1096 3 1438 -304 -1200 399 314 -869 2 589 -261 -291 240
1216 240 -355 -171 575 -649 -773 660 -99 -1680 -29 1262 -1021 -1625 747 265 -1780 -411 756
1233 756 -469 -1031 -117 -541 -793 -492 -719 -578 328 -485 -1491 74 609 -1673 -1222 1261 -28 -2405
1251 -2405 -407 1302 -924 -1510 391 411 -1130 -901 -179 -227 -136 -620 -771 227 -153 -1753 -645 1267
$$ packed form
1128B57Q82j333j98J559o27j360J136P70j564K13J143j059o25J428j34j227Q67
1145A28P51j158J07R11j199k94J303m44j233J319N61j662L74J589j086j014J540
1162D93Nj511R46Q19j304p3J205p72o21J083j29p93J252M03j805N44J506j354
1180a06j115J966l8j518Q36J100j259k90J335m67p98O78K24r13O03K39q90M55
1198D2J131j567n60K135k89j988J099J435j742q96J599q5j183Q71N87q50l0N31
1216B40n95J84P46j224j24J433p59j581J651J291k283o04K372m82k045J369J167
1233G56j225n62R14m24k52L01k27J41R06q13j006J565N35k282M51K483j289k377
1251b405J998J709k226n86J901K0j541K29P22m8R1m84j51R98l80j600J108J912
$$ plain form
1269 1267 -418 -1958 385 1177 -1807 -1802 1145 536 -1857 -853 590 -489 -1166 -545 239 197 -511 -1405
1287 -1405 -345 552 -1077 -1486 1180 905 -2313 -1280 1518 -250 -2414 132 1571 -1054 -2045 31
1303 31 629 -709 -893 -125 394 -363 -1641 -928 1164 88 -2194 -452 1370 -1555 -2786 866 1506
1320 1506 -2005 -1840 986 -80 -2679 -1186 606 -14 -1455 -1588 -420 25 -1315 -1683 673 903
1336 903 -2272 -2449 1049 270 -2849 -883 2027 -727 -3205 -550 1345 -910 -1478 520 928 -822
1352 -822 -1757 -716 1056 339 -1485 -561 1681 -406 -2544 683 2806 -530 -1787 1511 1433 -2024
1368 -2024 -952 2158 1351 -1227 -698 857 468 -732 -249 1777 2109 -693 -1710 1265 1732 -1491
1384 -1491 -662 3018 1245 -2686 -259 2919 529 -987 1554 2274 -634 -1722 527 1785 745
$$ packed form
1269A267j685j540K343P92k984NK947o09k393J004J443j079o77O21P84m2p08q94
1287a405J060Q97j629m09K666k75l218J033K798j768k164K546J439k625r91K076
1303C1N98j338j84P68N19p57j278P13K092j076k282J742J822k925j231L652O40
1320A506l511J65K826j066k599J493J792o20j441j33J168M45j340l68K356K30
1336I03l175j77L498p79l119J966K910k754k478K655J895k255n68J998M08j750
1352h22r35J041J772p17j824R24K242k087k138L227K123l336j257L298p8l457
1368b024J072L110q07k578N29J555l89j200M83K026L32k802j017K975M67l223
1384a491Q29L680j773l931K427L178k390j516K541P20k908j088K249J258j040
$$ plain form
1399 745 -525 411 1739 84 -2178 501 3453 670 -1959 1017 2140 -1888 -2090 2250 2191 -1440
1415 -1440 -1024 1411 462 -1304 119 2061 1529 -886 -1795 547 1090 -1146 -930 2666 1764 -2641 -1430
1432 -1430 2450 958 -1630 1130 2902 -564 -2596 158 1896 345 -397 833 1662 -153 -1604
1447 -1604 556 3285 1451 -1358 657 2257 -1215 -2434 2106 3658 -548 -1056 1894 1288 -1372
1462 -1372 170 3173 2176 -439 -824 903 1173 -454 -104 2811 2501 -1541 -1484 2559 2352 -1077 697
1479 697 3665 459 -2762 98 2518 727 -227 1653 1975 -110 -1315 278 2467 1520 -774 -79
1495 -79 1586 -556 -2536 1005 3679 124 -1667 1305 1636 -1633 -861 2516 1960 -815 -970 259
1511 259 239 -515 -69 1742 1935 -543 -1611 930 1638 -869 -135 2797 874 -2746 -1035 2093 550
$$ packed form
1399G45j270R36J328j655k262K679K952k783k629K976J123m028k02M340n9l631
1415a440M16K435r49j766J423J942n32k415r09K342N43k236K16L596r02m405J211
1432a430L880j492k588K760J772l466k032K754J738j551p42J230Q29j815j451
1447a604K160K729j834k809K015J600l472j219M540J552m206n08K950o06k660
1462a372J542L003r97k615l85J727K70j627L50K915l10m042N7M043k07l429J774
1479F97K968l206l221K860K420j791r54J880L22k085j205J593K189r47k294O95
1495g9J665k142j980L541K674l555j791K972L31l269P72L377n56k775j55J229
1511B59k0p54M46J811J93k478j068K541P08k507P34K932j923l620J711L128j543
$$ plain form
1528 550 -723 1362 1935 -489 -1424 270 1474 1082 54 155 940 -311 -1808 231 2796 909
1544 909 -1154 965 1607 -1392 -1310 2177 1884 -1039 -776 882 98 -848 186 1612 1121 -261 -983
1561 -983 158 976 -602 -521 1648 940 -2175 -1251 1597 469 -1343 755 2132 -495 -1767 185
1577 185 910 -190 -623 120 139 -509 -1338 -382 1340 466 -1331 -111 1183 -1195 -2061 812 1470 -1421
1595 -1421 -1479 745 -6 -1601 -564 1157 424 -883 -827 -253 117 -671 -1002 484 874 -1489 -1536 781
1613 781 702 -1349 -415 1599 -300 -1946 -117 898 -467 -821 421 329 -488 -720 -318 721 480 -645
1631 -645 -544 960 159 -1417 143 1517 -493 -1307 620 826 -852 -374 1418 594 -661 -79 172
1648 172 144 -2 2 312 682 -22 -830 420 1141 -339 -522 1204 644 -931 -92 1026 -76 -605 637
$$ packed form
1528E50j273K085N73k424r35J694J204l92j028J01P85j251j497K039K565j887
1544I09k063K119O42k999Q2L487k93k923K63J658p84r46J034J426m91j382p22
1561i83J141Q18j578Q1K169p08l115R24K848j128j812K098J377k627j272J952
1577A85P25j100m33P43J9o48q29R56J722q74j797J220J294k378q66K873O58k891
1595a421n8K224p51j595J037J721p33j307N6N74L70p88l31J486L90k363m7K317
1613G81p9k051R34K014j899j646J829J015j365l54J242r2q17k32M02J039k41j125
1631f45J01J504q01j576J560J374k010q14J927K06j678M78J792q24j255N82K51
1648A72k8j46ML10L70p04q08J250P21j480j83J726n60j575Q39J118j102n29J242
$$ plain form
1667 637 653 -510 -179 492 295 333 204 -305 284 377 -608 -408 902 266 -971 -4 739 -564 -658 776
1687 776 243 -759 -60 476 -336 -541 227 -132 -119 -172 -398 -333 374 -252 -722 160 475 -842 -774 419
1707 419 -102 -854 148 525 -600 -617 391 -130 -547 66 -184 -337 -38 -229 -544 122 285 -650 -424
1726 -424 570 -115 -798 247 471 -648 -441 395 -238 -739 116 199 -409 -114 332 -287 -90 251 -366 -166
1746 -166 466 49 -626 478 420 -609 -263 594 -87 -470 402 223 -425 93 444 -197 -115 410 -36 -242
1766 -242 367 203 -348 276 377 -433 -77 772 -132 -438 502 411 -435 33 407 -371 -89 363 -79 -443
1786 -443 304 323 -282 219 406 -372 -71 590 -100 -365 592 441 -373 99 564 -192 -206 586 267 -154 504
1807 504 615 -186 402 633 -122 122 622 213 -93 651 513 -152 263 656 -9 -63 969 306 -214 574
$$ packed form
1667F37J6j163L31O71j97L8j29n09N89R3r85K00J310o36j237R67P43j303r4J434
1687G76n33j002O99N36q12k05P68l59J3n3k26O5P07o26m70Q82L15j317O8J193
1707D19n21p52J002L77j125j7J008n21m17O13k50j53K99j91l15O66J63r35K26
1726d24R94o85o83J045K24j119K07Q36o33n01Q55Q3o08K95M46o19J97L41o17K00
1746a66O32m17o75J104n8j029L46Q57o81l83Q72j79o48N18L51o41Q2N25m46k06
1766b42O09j64n51O24J01q10L56Q49r04l06R40r1q46M68L74p78K82M52m42l64
1786d43P47J9o05N01J87p78L01O61o90k65R57j51q14M72M65p56j4P92l19m21O58
1807E04J11q01N88K31p55K44N00m09l06P44j38o65M15L93o65n4J032o63n20P88
$$ plain form
1827 574 592 -198 231 634 -28 -139 620 52 -321 357 396 -280 101 446 -258 -394 301 -51 -796 33 382
1848 382 -504 -389 118 -357 -694 16 -359 -625 -163 27 -809 -298 -65 -634 -635 -4 -317 -804 -146 94 -771
1869 -771 -636 323 -428 -827 -106 -183 -544 -180 -8 -405 -211 220 -322 -448 190 24 -444 201 340 -596
1889 -596 -277 421 26 -462 325 485 -267 -76 420 -56 -53 329 12 -215 249 197 -314 614 637 -326 65
1910 65 797 -38 -418 703 700 -336 119 598 55 -246 447 461 -93 183 66 -124 283 289 -423 -30 402
1931 402 -453 -647 317 274 -596 -148 347 -507 -943 86 174 -721 -508 -30 -442 -574 -356 -613 -35 -143
1951 -143 -587 -685 53 -251 -1165 -68 230 -840 -1079 79 -107 -1019 -330 408 -241 -648 -320 -258 -163 -205
1971 -205 -421 -60 300 -441 -895 91 449 -582 -463 528 -3 -1066 -92 681 -266 -585 297 159 -494
$$ packed form
1827E74J8p90M29M03o62j11P59n68l73O78L9o76L81L45p04j36O95l52p45Q29L49
1848C82q86J15N07m75l37P10l75k66M62J90q36N11K33n69jO31l13m87O58K40q65
1869g71J35R59p51l99P21p7l61L64J72l97J94M31n42j26O38j66m68O45J39r36
1889e96L19O98l95m88P87J60p52J91M96m76LL82l17k27M64n2n11R28K3r63L91
1910F5P32q35l80J121lj036M55M79n43l01O93J4n54K76j17j90M07Op12L93M32
1931D02q55j94R64m3q70M48M95q54m36J029Q8q95K13M78m12j32K18k57N78j08
1951a43m44r8P38l04r14J097K98j070k39J158j86r12O89P38o49m07L28O2R5m2
1971b05k16L61L60p41m54R86L58j031J19R91n31j063R74P73r47l19Q82j38o53
$$ plain form
1990 -494 -406 48 355 166 -229 -391 226 -109 -896 -242 858 -166 -1080 25 478 -680 -592 609 323
2009 323 -932 -525 78 -231 -400 -188 16 -60 -562 -878 -211 570 -311 -620 379 298 -1327 -904 741 25
2029 25 -1036 -110 545 -549 -932 158 408 -214 -417 -285 -94 -164 -642 -225 728 116 -1075 -303 839
2048 839 -426 -741 825 1038 -618 -735 552 213 -615 170 830 297 -224 -278 225 681 170 -194 603
2067 603 839 -696 -708 1205 844 -533 138 1111 -81 -804 491 1161 325 -256 340 330 -97 -278 183
2086 183 870 520 -504 -64 845 -27 -734 621 1287 -479 -1220 408 564 -803 -199 939 227 -698
2104 -698 -456 155 199 -208 -86 269 230 -912 -1022 456 572 -961 -487 779 -71 -1448 -218 1091
2122 1091 -24 -763 -105 321 -867 -854 185 674 80 -526 -188 441 -6 -631 233 1410 -139 -1182
$$ packed form
1990d94Q8M54L07j89l95j62O17l35p87O54J100j024r14J105M53j158Q8J201k86
2009C23j255M07O03l09j69K12K04p6n02l16O67P81q81l09R99q1j625M23J645p16
2029B5j061R26O55j094l83J090K50o22k03J32J91p0m78M17R53o12j191P72J142
2048H39j265l15J566K13j656j17J287l39q28P85O60n33n21n4N03M56n11l64P97
2067F03K36j535j2J913l61j377O71R73j192p23J295O70q36n81N96j0m27j81M61
2086A83O87l50j024M40R09q72p07J355O66j766p41J628J56j367O04J138p12r25
2104f98K42O11M4m07J22L55l9j142j10J478J16j533M74J266q50j377J230J309
2122A091j115p39O58M26j188J3J039M89n94o06L38O29m47o25Q64J177j549j043
$$ plain form
2140 -1182 402 966 -595 -576 1151 893 -645 -288 809 576 -135 108 938 518 -209 -371 840 1196
2158 1196 -17 -54 1103 767 -892 -147 1709 847 -604 342 1069 -61 -738 412 1174 461 -247 103
2176 103 654 188 -392 221 1251 462 -921 79 998 -205 -694 888 1268 -550 -896 555 452 -343
2194 -343 -81 749 424 -504 -523 202 735 12 -245 525 692 -515 -668 960 847 -581 -181 939 -32
2213 -32 -816 181 1022 243 -262 200 352 -98 -222 63 799 535 -542 -288 719 190 -557 370 1103 -217
2233 -217 -733 486 649 -256 -119 834 293 -415 -203 290 282 68 -23 214 398 -279 -667 359 796 -305
2253 -305 -265 891 262 -786 84 809 -35 -447 254 374 -372 -261 293 411 175 -226 -244 314 18 -507
2273 -507 137 695 -198 -833 184 672 -541 -435 768 409 -642 -92 385 -118 -193 130 270 54 -328
$$ packed form
2140a182J584N64j561J9J727k58j538L57J097k33p11K43Q30m20p27j62J211L56
2158A196j213l7J157l36j659P45J856q62j451R46P27j130o77J150P62p13p08L50
2176A03N51m66n80O13J030p89j383J000R19j203m89J582L80j818l46J451j03p95
2194c43K62Q30l25r28j9P25N33p23k57P70J67j207j53J628j13j428M00J120r71
2213c2p84R97Q41p79n05M62J52m50j24K85P36k64j077K54J007n29p47R27P33j320
2233b17n16J219J63r05J37R53n41p08K12M93qk14r1K37J84o77l88J026M37j101
2253c05M0J156o29j048Q70P25q44m12P01J20p46J11N54J18k36m01j8N58k96n25
2273e07O44N58q93o35J017M88j213J06J203l59j051N50M77n03p5L23J40k16l82
$$ plain form
2292 -328 -292 230 466 -226 -390 516 353 -630 -349 975 257 -557 163 641 -217 -397 440 545 -114 -176
2312 -176 146 311 192 -66 97 694 381 -582 15 807 -3 -395 587 703 -380 -340 532 327 -204 -1
2332 -1 467 98 -106 -111 137 427 28 -361 109 411 -248 -496 457 403 -485 -403 408 -110 -642 109 244 -223
2354 -223 -266 -12 -101 -191 -242 -189 8 95 -414 -426 137 -33 -671 -122 340 -322 -631 91 114 -485 -379 36 -128
2377 -128 -508 -212 -116 -230 -76 -240 -339 -113 -244 -644 -248 167 -335 -609 57 46 -499 -124 163 -181 -429
2398 -429 99 -75 -339 -88 11 -141 38 82 -271 171 199 -52 -60 394 174 -381 147 505 -19 -125 537 325
2420 325 -55 269 346 99 187 294 47 55 451 190 158 380 341 -36 255 495 -52 84 561 171 -32 370
2442 370 422 31 -27 519 49 -96 373 60 -89 183 285 62 113 263 -124 116 408 152 -223 320 359
$$ packed form
2292c28L6N22K36o92j64R06j63r83K81J324p18q14P20M78q58j80Q37J05o59o2
2312a76L22J65j19k58J63N97l13r63N97P92q10l92R82J16j083M0Q72k05n31K03
2332aM68l69k04nK48K90l99l89M70L02o59k48R53n4q88Q2Q11n18n32P51J35m67
2354b23m3K54q9r0n1N3J97Q7n09j2N63j70o38N49M62o62l09P22K3n99J06M15j64
2377a28l80K96R6j14J54j64r9K26j31m00L96M15n02k74O66j1n45L75K87l44k48
2398d29N28j74k64K51R9j52J79M4l53M42K8k51qM54k20n55N28L58n24j06O62k12
2420C25l80L24P7k47Q8J07k47QL96k61l2K22l9l77K91K40n47J36M77l90k03M02
2442C70N2l91n8N46m70j45M69l13j49K72J02k23N1J50l87K40K92k56l75N43L9
$$ plain form
2463 359 -187 -70 463 112 -168 129 126 -61 209 169 -11 -71 228 -43 -135 143 -28 -184 135 259 -212 -126
2485 -126 345 6 -97 271 106 -259 100 210 -233 -106 332 -36 -74 241 109 -179 110 274 -239 178
2505 178 243 -78 -72 225 165 -110 239 407 -39 71 284 76 -84 214 59 -123 200 216 -218 -189 270 38
2527 38 -210 220 131 -170 183 169 -153 -94 333 24 -124 176 186 -55 68 240 -32 36 325 13 -122 171
2549 171 126 -203 134 309 -64 -21 230 174 -152 263 147 59 -24 252 43 -49 253 111 53 152 254 -92 210
2572 210 249 -78 -23 433 148 -78 338 265 9 63 266 119 19 266 215 114 203 245 -141 101 263 2
2594 2 -110 246 131 -272 194 286 -173 34 172 -65 -370 229 -37 -214 -158 56 -234 -246 -108 -340 -198 -14
2616 -14 -337 -456 -32 -84 -611 -296 31 -285 -450 -121 -79 -580 -348 -108 -312 -663 -145 -354 -268 -183 -389 -345
$$ packed form
2463C59n46J17N33l51k80K97lj87K70m0j80o0K99k71r2K78j71j56L19J24m71Q6
2485a26M71l39j03L68j65l65L59J10m43J27M38l68l8L15j32k88K89J64n13M17
2505A78O5l21OK97o0k75L49J68m46J10K13k08j60K98j55j82L23J6m34K9M59k32
2527C8k48M30q9l01L53j4l22N9M27l09j48L00J0k41J23J72k72O8K89l12j35K93
2549A71m5l29L37J75l73M3K51n6l26M15j16q8q3K76k09r2L02j42n8R9J02l46L02
2572B10L9l27N5M56k85k26M16p3k56N4K03j47j00K47n1j01Q9M2l86K42J62k61
2594Bj12L56j15m03M66R2m59K07J38k37l05N99k66j77N6K14k90j2J38k32J42J84
2616a4l23j19M24n2n27L15L27l16j65L29M2n01K32K40k04l51N18k09Q6Q5k06M4
$$ plain form
2638 -345 -203 -61 -692 -201 211 -309 -490 -46 57 -386 -300 46 -278 -381 -69 -120 -142 -94 -161 -248 -58 -216
2660 -216 -327 -27 111 -395 -389 275 62 -439 -159 360 -102 -419 84 132 -339 43 73 -146 -121 -96 -39 -15 169
2683 169 -216 -154 259 17 -331 127 442 -199 -411 222 312 -224 -35 184 30 -178 -64 96 -8 94 -109
2704 -109 56 285 -31 -183 151 220 -251 -236 497 38 -558 23 425 -111 -294 90 97 -174 -102 -153 31 140
2726 140 -7 -148 111 63 -210 -126 328 -164 -339 134 343 -128 -200 279 158 -220 -214 214 87 -98 10 22
2748 22 98 40 -126 55 275 -153 -237 242 264 -452 -125 577 73 -314 95 307 -140 -201 71 227 -24 -178
2770 -178 -49 117 105 -270 -105 245 -8 -335 66 406 -112 -328 322 287 -416 -264 206 63 -301 93 164
2791 164 47 -122 -88 -17 215 16 -284 378 226 -309 -282 442 310 -331 79 544 46 -289 297 510 -179
$$ packed form
2638c45J42J42o31M91M12n20j81M44J03m43Q6L46l24j03L12n1k2M8o7q7J90j58
2660b16j11L00J38n06OO64k13n01K80N19m62l17N03M8m71L82L0k19K5K5N7K4J84
2683A69l85O2M13k42l48M58L15o41k12O33R0n36J89K19j54k08J14J60j04J02k03
2704a09J65K29l16j52L34O9m71J5P33m59n96N81M02n36j83L84Pk71P2n1J84J09
2726A40j47j41K59m8k73Q4M54m92j75M73K09m71p2M79j21l78OM28j27j85J08J2
2748B2P6n8j66J81K20m28q4M79K2p16L27P02n04l87M09K12m47o1K72J56k51j54
2770a78J29J66j2l75J65L50k53l27M01L40n18k16O50l5p03J52M70j43l64L94P1
2791A64j17j69L4P1K32j99l00O62j52n35K7P24j32o41M10M65m98l35N86K13o89
$$ plain form
2812 -179 122 316 176 145 -103 94 195 273 -14 -30 481 205 -292 315 610 27 -189 492 325 -95 197
2833 197 634 262 -31 158 372 160 43 69 293 388 -75 -161 278 406 -192 -39 531 62 -370 23 565
2854 565 75 -202 265 239 -127 -297 96 179 1 -142 -104 185 60 -463 -98 379 -52 -484 174 255 -401
2875 -401 -262 402 153 -493 -265 56 -46 -302 -177 83 107 -212 -443 58 212 -461 -413 259 150 -505 -424
2896 -424 498 -42 -551 -38 280 -147 -437 -42 68 -107 -286 28 49 32 -407 -284 299 76 -428 -150 373
2917 373 -232 -493 120 396 -185 -349 155 -47 -317 -169 176 19 -115 -260 -157 -19 -151 -327 -10 193
2937 193 -355 -493 28 191 -446 -77 316 24 -346 15 139 -160 -100 6 71 -38 -104 -114 81 209 -218
2958 -218 -161 231 -28 -369 -157 415 -200 -193 164 285 -246 -277 182 1 -192 -87 -3 18 46 -116 53 254
$$ packed form
2812a79L01J94j40l1k48J97J01P8k87j6N11k76m97O07K95n83k16O81j67m20K92
2833A97M37l72k93J89K14k12j17K6K24R5m63q6M39J28n98J53N70m69m32L93N42
2854E65m90k77M67k6l66j70L93Q3j78j43L8K89j25n23L65M77m31m32O58Q1o56
2875d01J39O64k49o46K28L21j02k56J25K60K4l19k31N01J54o73M8O72j09o55Q1
2896d24R22n40n09N13L18m27k90L95J10j75j79L14K1j7m39J23N83k23n04K78N23
2917C73o05k61O13K76n81j64N04k02k70J48L45j57j34j45J03J38j32j76L17K03
2937A93n48j38N21J63o37L69L93k92l70L61J24k99O0J06O5j09o6j0J95J28m27
2958b18N7L92k59l41K12N72o15PL57J21n31l1M59j81j93J05Q4K1K8j62J69K01
$$ plain form
2980 254 -107 -205 149 257 -221 -136 358 40 -386 -44 255 -46 -139 319 181 -139 -14 79 29 139 -74 -134
3002 -134 182 188 -203 -24 337 131 -213 171 184 -296 -74 367 43 -210 22 244 -107 31 6 77 40 -34
3024 -34 -88 -15 136 -143 -197 273 183 -292 -14 237 59 -297 107 103 59 -235 87 -30 -99 -21 -19 19 119 -90
3048 -90 -154 127 34 -284 -118 221 -24 -272 182 220 -143 -163 153 87 -131 56 136 -49 116 87 -144 182 154
3071 154 -2 -21 204 -107 -108 37 79 -260 -22 230 89 -101 270 59 -64 160 182 -8 143 193 38 82
3093 82 245 79 -101 192 84 -102 -25 136 -162 -12 203 -23 -220 37 154 -80 -81 145 -22 -110 109 -31
3115 -31 -132 -43 148 -110 83 135 -33 -66 216 75 -179 -57 60 -74 -25 119 -92 -236 -20 44 -178 108
3137 108 123 -168 -117 140 -169 54 37 100 -190 25 232 -129 -127 21 -71 -168 179 74 -148 -29 35 -168 -155
$$ packed form
2980B54l61r8L54J08m78Q5M94l18m26L42K99l01r3M58j38l20J25R3n0J10k13o0
3002a34L16Ol91J79L61k06l44L84J3m80K22M41l24k53K32K22l51J38k5P1l7p4
3024c4n4P3J51k79n4M70r0m75K78K51j78l56M04mm4k94L22j17o9P8KL8J00k09
3048i0o4K81r3l18J66L39k45k48M54L8l63k0L16o6k18J87Q0j85J65k9k31L26k8
3071A54j56j9K25l11jJ45M2l39K38K52j41j90L71k11j23K24K2j90J51N0j55M4
3093H2J63j66j80K93j08j86P7J61k98J50K15k26j97K57J17k34jK26j67q8K19j40
3115c1j01Q9J91k58J93N2j68l3K82j41k54J22J17j34M9J44k11j44K16O4k22K86
3137A08J5k91N1K57l09K23j7O3k90K15K07l61KJ48r2r7L47j05k22J19O4k03J3
$$ plain form
3160 -155 89 -58 -206 73 -85 -192 24 68 -249 2 9 -121 -237 -52 26 -318 -65 -12 -110 -137 139 84 -245
3183 -245 -64 -4 -63 -31 198 -78 -6 161 -85 -126 -10 -33 -93 -81 142 32 -169 59 105 -60 45 -46 35 22
3207 22 82 -123 -73 87 -85 -240 61 54 -177 -100 -25 -57 -55 -38 -32 -141 -23 -3 -171 -6 67 -138 -143 67 -48 -103
3233 -103 95 39 -89 -172 168 -85 -170 12 -16 -137 90 163 -105 26 187 -36 -50 69 -24 -117 197 53 -354
3256 -354 -38 33 -56 -207 88 -8 -245 -2 176 -111 55 11 -14 -78 50 -64 -239 -107 8 -85 20 -10 -4
3279 -4 -166 77 94 -246 -62 43 -164 50 77 -147 -189 163 -17 -51 -113 1 -48 -64 156 22 -80 55 -33
3302 -33 -108 23 58 -191 -115 201 80 -108 136 64 -35 -55 70 62 -87 59 4 -63 62 211 -75 60 181 -43
3326 -43 -22 286 90 -60 76 244 -82 67 179 131 -93 183 116 47 201 164 4 217 119 5 109 252
$$ packed form
3160a55K44j47j48K79j58j07K16M4l17K51Pj30j16J85P8l44K53N3r8k7K76n5l29
3183b45J81O0n9L2K29k76P2J67k46m1J16k3o0J2K23j10k01K28M6j65J05r1Q1j3
3207B2O0k05N0J60j72j55L01pk31P7P5l2KJ7Oj09J18K0j68J65P3k05nK10j15n5
3233a03J98n6j28q3L40k53q5J82k8j21K27P3k68J31J61k23j4J19r3r3L14j44m07
3256c54L16P1q9j51K95r6k37K43J78k87J66m4k5o4J28j14j75J32J15r3J05l0O
3279dj62K43J7l40J84J05k07K14K7k24m2L52j80l4o2J14m9j6K20j34j02J35q8
3302c3p5J31L5k49P6L16j21j88K44p2r9k0J25qj49J46n5o7J25J49k86J35J21k24
3326d3K1L08j96j50J36J68l26J49J12m8k24K76o7o9J54l7j60K13r8j14J04J43
$$ plain form
3348 252 29 -68 237 193 -14 108 230 -10 -148 195 194 -49 113 76 77 73 98 97 54 132 68 77 97 81 -30 65 161
3375 161 -80 -80 205 170 -51 91 280 -98 -120 26 -11 23 116 91 -2 158 -30 -42 111 122 20 -85 64 58
3399 58 -155 95 163 -98 -149 73 61 -100 15 -37 -3 95 -62 -53 193 123 -16 -38 127 -18 -112 106 281 -59
3423 -59 -264 117 94 -37 66 223 -34 8 -29 146 16 77 -28 143 123 -18 -82 121 130 -17 -5 225 63
3446 63 -102 -77 151 19 -41 129 161 -45 -4 81 23 136 33 -14 -6 34 -188 -19 288 102 -207 76 188 27
3470 27 -86 304 100 -116 57 211 -35 -60 93 83 39 39 -10 116 129 -19 -116 120 151 -164 -169 211 162 -49
3494 -49 70 100 -123 -135 149 130 -37 -81 -77 -45 -127 -199 40 269 91 -237 63 170 -172 -180 117 158 -149 -94 -12
3519 -12 -58 -199 168 88 67 -79 -69 -99 211 -23 -215 27 88 -203 -191 125 137 -45 -9 54 -88 -284 -60 169
$$ packed form
3348B52k23r7L05m4k07J22J22k40j38L43jk43J62l7JmK5jm3P8o4RK0j6j11R5R6
3375A61k41%K85l5k21J42J89l78k2J46l7L4R3k5r3J60j88j2J53J1j02j05J49o
3399E8k13K50O8k61n1K22j2j61J15n2L4R8j57RK46p0j39k2J65j45r4K18J75l40
3423e9k05L81k3j31J03J57k57M2l7J75j30O1j05J71k0j41o4K03Rj47J2K30j62
3446F3j65K5K28j32o0J70L2k06M1Q5n8J13j03m7QM0k22J69L07j86l09K83J12j61
3470B7j13L90k04k16J73J54k46k5J53j0m4%m9J26J3j48r7K36L1l15nL80m9k11
3494d9J19L0k23j2K84j9j67m4ML2q2p2K39K29j78l28L00J07l42qK97M1l07N5Q2
3519a2m6j41L67q0k1j46J0l0L10k34j92K42O1k91J2L16J2j82L6O3j42j96K24K29
$$ plain form
3543 169 27 -10 20 -16 23 -61 -44 146 1 -193 -161 123 -13 -210 109 97 -155 -91 85 76 -260 -198 42 25
3567 25 -58 0 56 34 40 40 -24 61 -130 -134 97 199 -40 -8 190 -47 -231 -83 165 2 -86 25 33 -109 -140 -31
3593 -31 -7 61 -13 -114 77 122 -113 38 332 149 -300 27 79 -166 -93 146 52 -136 -11 61 14 26 -58 77
3617 77 114 -23 -41 43 135 81 -127 89 148 -341 -155 216 126 -81 96 -19 -138 -153 53 31 -41 -145 -92 -66
3641 -66 90 -9 -202 13 18 -196 -59 91 -36 -182 219 127 -167 -85 241 -21 -226 -91 -68 -113 56 -175 -73
3664 -73 26 91 -223 -19 -54 -264 -109 95 -52 -225 -264 124 -67 -214 -16 -140 -42 -242 -79 -116 15 -108
3686 -108 -72 1 -16 -27 -42 109 -46 -170 9 131 -174 -178 100 27 -110 -109 130 3 -188 -37 -130 -38 46 -75
3710 -75 -21 113 -103 -160 57 203 -129 -273 164 79 -300 31 131 -145 -50 -25 -7 -119 -25 32 -125 29 55
$$ packed form
3543A69j42l7L0l6L9q4J7J90j45j94L2K84j36j97L19j2k52O4J76rl36O2K40j7
3567B5q3N8N6k2O%o4Q5j91mK31J02k39L2J98k37j84J48K48j63q8J11Qj42l1J09
3593c1K4O8p4j01J91M5k35J51K94j83m49L27N2k45P3K39r4j88J25P2m7J2q4J35
3617G7L7j37j8Q4R2n4k08K16N9m89J86L71r0k07J77j15j19j5K06k2p2j04N3K6
3641f6J56r9j93K15Nk14J37J50j27j46M01r2k94Q2L26k62k05J35K3m5J69k31J02
3664g3R9O5l14K04l5k10J55K04j47j73l9L88j91j47J98j24R8k00J63l7J31j23
3686a08L6P3j7j1j5J51j55j24J79J22l05mK78p3j37JK39j27j91J51r3R2Q4j21
3710g5N4J34k16n7K17J46l32j44M37q5l79L31J00k76R5K5J8j12R4N7j57J54K6
$$ plain form
3733 55 -95 -56 44 -55 -93 239 78 -87 261 141 -8 23 182 4 -30 -6 111 -5 -51 174 0 94 69
3756 69 -62 -51 144 38 -110 40 -23 -218 -76 45 64 -91 18 153 -52 -11 136 33 92 -15 -37 78
3778 78 -67 -1 -60 168 -36 -73 -105 104 -25 -174 -1 109 -77 -171 58 31 9 42 8 -154 34 -20 -102 1
3802 1 116 -24 -34 10 -7 -32 120 52 -158 39 -6 153 -174 152 30 64 82 67 -75 13 50 -11 -86 -102 -26 41
3828 41 -32 -82 -148 143 131 -18 -86 66 64 -75 129 -55 -3 -57 209 69 23 37 10 -85 134 42 -24 -98 44 -103
3854 -103 -89 138 2 -49 37 83 12 112 167 155 -1 87 49 11 9 67 -9 54 50 89 -51 53 44 25 132 43 44 -52
3882 -52 33 164 -33 15 152 38 25 182 10 58 131 -3 -72 -25 12 -136 29 18 29 68 18 68 -70 29 120
3907 120 -35 32 -3 -139 -192 10 -109 -15 -10 51 66 -62 -42 -125 -113 -124 -44 -32 91 21 -29 26 58 -98 -80 84
$$ packed form
3733E5j50L9J00r9l8L32j61j65L48j20j49L1J59j78l4K4J17j16m6K25j74R4k5
3756F9j31J1J95j06j48J50o3j95J42J21J9j55J09J35k05M1J47j03N9j07k2J15
3778G8j45O6n9K28k04l7l2K09j29j49J73J10j86r4K29k7k2L3l4j62J88n4q2J03
3802AJ15j40j0M4j7k5J52o8k10J97m5J59l27L26j22L4J8j5j42Q8L7o1p5j6P6O7
3828D1p3n0o6K91j2j49o8J52kj39K04j84N2n4K66j40m6J4k7r5K19r2o6p4J42j47
3854a03J4K27j36n1Q6M6p1J00N5j2j56Q8l8l8kN8p6O3mL9j40J04rj9J07q9Jr6
3882e2Q5J31j97M8J37j14j3J57j72M8P3j34o9M7L7j48J65j1J1L9n0N0j38R9R1
3907A20j55O7l5j36n3K02j19R4NO1J5j28K0q3J2j1Q0J2J23p0n0N5L2j56J8J64
$$ plain form
3933 84 31 -46 63 2 -147 -63 107 -47 -82 65 52 -81 58 41 -8 -34 -21 -30 39 51 -32 64 -19 93 24 -39 22
3960 22 -87 -105 68 -5 -17 -54 68 2 -96 -5 -163 -67 93 77 -34 69 104 -19 -31 53 -32 40 90 18 14 40 141
3987 141 -54 0 161 -103 -16 86 84 -4 88 31 115 -32 61 -38 -77 95 -10 -83 -44 78 51 36 35 90 -123 150
4013 150 -44 41 78 38 3 17 84 49 -193 66 71 44 77 -113 45 4 138 50 -104 92 -13 -142 -152 -74 -69 -16
4039 -16 103 28 -27 176 46 -63 -26 87 49 -164 62 50 -30 22 -102 -65 71 14 -52 9 131 -77 -158 35
4063 35 5 -216 -46 23 -55 -92 100 -50 -108 -31 0 81 68 -103 -18 -93 15 -17 -202 72 19 -119 -17 173 37
4088 37 -149 -47 -30 -41 -92 163 24 78 13 12 14 -60 16 14 42 89 -55 72 268 -54 -118 89 17 4 -51 139 -46
4115 -46 -27 57 -61 -115 136 -29 -1 -28 -4 -43 9 21 -49 -86 44 166 -80 132 -31 29 -133 49 -130 -12
$$ packed form
3933H4n3p7J09o1j49Q4J70j54l5J47j3j33J39j7m9k6J3rO9J2q3R6q3J12o9o3O1
3960B2j09j8J73p3j2l7J22o6r8R1j58R6J60j6j11J03L5j23j2Q4q5P2N0p2mK6J01
3987A41j95N4J61k64Q7J02kq8R2n7Q4j47R3r9l9J72j05p3L9J22k7j5jN5k13K73
4013A50j94Q5L7m0l5J4O7l5k42K59Nk7L3j90J58m1J34q8j54J96j05j29j0P8NN3
4039a6J19p5n5K03j30j09L7J13l8k13K26j2q0N2j24L7J36n7o6O1J22k08q1J93
4063C5l0k21J70O9p8l7J92j50n8P7L1Q1j3j71Q5p5J08l2j85K74n3j38J02J90j36
4088C7j86J02J7j1n1K55j39N4o5jKp4P6kK8M7j44J27J96l22o4K07p2j3n5J90j85
4115d6J9Q4j18n4K51j65K8k7K4l9N2J2p0l7J30J22k46K12j63O0j62J82j79J18
$$ plain form
4139 -12 73 132 -12 -52 40 51 63 54 -40 -120 122 26 -92 -58 111 -16 -81 60 -67 -66 62 33 -41 -102 -12 152 80
4166 80 13 14 -18 -4 -125 -32 -12 -125 -101 12 23 14 -126 -7 88 -26 -131 33 102 9 67 23 -32 -40 -60 -106 92
4193 92 23 -23 -152 47 157 13 177 21 -99 -33 109 72 -27 52 -26 -143 -38 -11 -130 71 138 -80 82
4216 82 191 57 47 58 39 -33 64 223 -73 -16 39 28 -11 -5 22 49 70 196 -71 99 112 0 67 68 -23 -209 14
4243 14 151 5 25 126 92 15 60 167 -17 -37 35 61 54 -91 44 -49 159 48 -72 1 61 -141 -119 138 40
4268 40 -112 48 217 -55 -113 101 -37 -26 -59 33 62 43 -19 81 22 121 -80 -83 98 49 -185 -21 83 -144
4292 -144 -75 86 -36 24 86 150 -66 -26 -7 -50 -31 -30 27 -126 15 -125 -24 14 -31 19 -86 -47 57 -100 -55
4317 -55 132 -36 -139 -21 -69 27 -3 24 -14 -17 39 -63 -45 51 -166 -33 36 -48 -129 38 147 -95 -39 133 -28
$$ packed form
4139a2Q5N9j44m0R2J1J2rr4q0K42r6j18L4J69j27o5J41j27JJ28k9p4o1R0J64p2
4166H0o7Jl2J4j21R3K0j13K4J13J1rj40J19R5j14j05J64O9r3N8m4n5qk0m6J98
4193I2o9m6j29J99J10j44J64j56j20O6J42l7r9P9p8j17J05K7j19K01O7k18J62
4216H2J09j34j0J1j9p2R7J59k96N7N5j1l9OK7K7K1J26k67J70J3j12O7Jr1j86K23
4243A4J37j46K0J01l4p7M5J07j84k0P2K6pj45J35r3K08j11j20P3O0k02K2K57r8
4268D0j52J60J69k72n8K14j38J1l3R2K9j9o2J00n9R9k01lJ81m9k34J64J04k27
4292a44O9J61j22O0O2O4k16M0J9m3J9JN7j53J41j40J01L8m5N0j05L9J04j57M5
4317e5J87j68j03J18m8R6l0K7l8lN6j02J8R6k17J33O9q4q1J67J09k42N6J72j61
$$ plain form
4342 -28 11 -11 -9 53 144 71 -22 123 -34 49 0 -14 56 -5 103 21 24 15 72 -37 -42 -8 153 -53 58 -33 -12 -13 -24
4371 -24 -1 16 53 23 3 107 0 -65 16 165 -57 -56 47 164 58 25 145 -7 59 96 86 -70 47 11 -53
4396 -53 110 -78 1 -28 100 -24 -103 47 -7 -28 2 -25 3 45 90 13 6 -63 -28 30 -2 -29 77 -32 -55 21 -17
4423 -17 150 -50 -53 51 30 -70 40 103 -47 -125 7 6 -111 -74 49 -42 -32 -8 -159 -17 29 67 -56 65 37
4448 37 27 -64 110 -35 -116 50 17 5 -36 48 -109 12 2 -12 -55 179 -92 -76 13 -38 -22 -74 161 58 -155
4473 -155 -76 142 61 -39 26 -36 95 102 42 -230 88 -48 5 213 -9 -107 5 108 -15 3 25 32 -130 139
4497 139 -30 8 104 23 109 -14 103 -43 43 122 98 -35 39 70 -64 -24 -9 98 -15 97 -3 26 -63 -18 15
4522 15 -103 55 54 -2 58 74 49 -59 25 -171 13 30 -3 2 -121 34 -46 -34 -11 71 -98 9 -63 114 36 17
$$ packed form
4342b8L9k2KO2R1p3r3J45j57Q3m9j4P0o1J08q2LrN7j09nL4J61k06J11r1K1jj1
4371b4K3J7L7l0k0J04j07o5Q1J49k22JJ03J17j06l3J20j52O6L7j0j56J17l6o4
4396e3J63j88P9k9J28j24p9J50n4k1L0k7K8M2M5p7po9L5N8l2k7J06j09k3P6l8
4423a7J67k00lJ04k1j00J10O3j50p8J32jj17L7J23r1J0K4j51J42M6L8j23J21k8
4448C7j0r1J74j45q1J66l3j2m1Q4j57J21j0j4m3K34k71J6Q9n1J6n2K35j03k13
4473a55P9K18q1j00O5o2J31Po0k72L18j36N3K08k22r8J12J03j23J8K2Pj62K69
4497A39j69L8R6q1Q6j23J17j46Q6P9k4j33P4L1j34M0J5J07j13J12j00K9q9M5L3
4522A5j18J58jn6O0J6k5j08Q4j96J84J7l3Nj23J55q0J2K3Q2j69J07p2J77p8j9
$$ plain form
4548 17 30 -8 59 48 -66 -90 -18 -71 -33 25 -15 -30 48 -21 -77 -39 98 27 -27 -4 -25 17 42 83 -94 -45 24 -54 -33
4577 -33 51 42 -75 110 -124 -57 60 -85 -170 -15 61 5 99 -79 39 54 -32 7 -78 52 75 -9 79 91 50 -20
4603 -20 51 -46 -33 1 84 -4 -59 66 17 -44 -83 167 -57 -193 -60 -29 -50 -61 -1 -56 -78 44 -94 9 -57 -104
4629 -104 84 16 -4 -6 -35 7 40 -24 103 -120 119 58 152 -85 -32 68 8 29 4 43 -91 72 -90 -45 59
4654 59 -15 16 2 65 96 -28 41 58 -41 -33 160 -37 -97 1 -91 -18 -53 -68 -135 -29 12 -38 0 87 -9 -165 -38 -99
4682 -99 26 -88 76 -121 -56 -11 -65 -113 8 75 -22 -128 -44 -72 -3 87 77 77 -4 65 -75 -9 14 125 -84 21
4708 21 12 -23 21 -98 -67 -21 -4 29 -65 81 -32 -8 136 116 -42 35 91 59 -8 102 40 -160 -80 46 30 -67 -20
4735 -20 -56 -15 76 11 -43 -91 115 -90 78 104 10 -25 -128 58 -63 -68 43 -58 -1 154 -11 -3 119 57 -32 9
$$ packed form
4548A7J3l8O7j1j14k4P2n3L8N8m0j5P8o9n6L8J37p1n4K3k1M2K5M1j77M9O9p8K1
4577c3Q4rj17J85k34O7J17j45q5J55P6n6R4j78J18J5q6L9q5J30K3q4Q8J2m1p0
4603b0P1r7J3L4Q3q8n5J25m9o1l9K50k24j36J33L1k1j1O0n5k2J22j38J03o6m7
4629a04J88o8k0kk9M2L3o4J27k23K39o1R4k37N3J00o0K1k5L9j34J63j62M5J04
4654E9p4L1j4O3L1j24O9J7r9QJ93j97o0R8r2P3l5j5o7J06M1n0L8Q7r6j56J27o1
4682i9J25j14J64j97O5M5n4m8J21O7r7j06Q4k8O9R0j0%q1O9j40O6K3J11k09J05
4708B1rl5M4j19L1M6J7L3r4J46j13K4J44k0j58P7N6l2o7J10o2k00Q0J26j6r7M7
4735b0l6M1R1o5n4m8K06k05J68K6r4l5j03J86j21nJ11j01N7J55j65QJ22o2q9M1
$$ plain form
4761 9 38 26 -76 -17 -35 8 -27 11 -182 48 47 47 -46 -20 -104 -27 12 35 -4 59 76 6 -89 23 -73 67 -57 -96 -52
4790 -52 3 63 -47 -82 93 -10 -10 -75 -28 -52 -31 -21 -27 -115 -30 42 -40 60 9 32 113 -2 -20 -28 21 5 -43 0 -5 -61
4820 -61 -61 -21 63 26 -78 108 -44 -38 -40 26 -5 -8 81 -74 48 -33 0 2 62 151 10 167 -7 130 76 39 -65 -37
4848 -37 37 72 64 2 11 22 40 -229 66 53 53 35 -17 -9 47 -27 109 4 -83 -135 83 -6 -23 21 -20 59 3 86 -90
4877 -90 -126 -13 47 -75 -25 9 -1 9 -47 -139 -50 66 -27 30 48 39 15 -43 30 59 89 -39 86 -160 95 -3 105
4904 105 32 -102 7 -41 50 -119 -39 15 0 -24 -103 98 -68 30 45 -88 22 87 -39 32 30 -79 -50 12 -52 -39
4930 -39 -207 73 -77 66 24 81 36 -93 -10 53 -57 -122 5 10 48 86 -12 -24 25 1 0 -55 14 -16 15 44 22 -88
4958 -88 -58 35 -98 -90 -70 -48 -57 -112 -15 21 132 99 23 31 81 47 -25 -12 -84 -50 -81 -143 -47 -58 7 74 -65 120 93 -74
$$ packed form
4761IK9j2j02N9j8M3l5L8j93K30j%r3K6q4P7L9K3l9O3J7p0r5J12r6J40j24l9M4
4790e2N5O0j10l5J75j03%o5M7k4K1J0oq8Q5P2q2J00n1K3Q1j15j8qM9j6m8M3nn6
4820f1%M0Q4l7j04J86j52OkO6l1lQ9j55J22q1L3KO0Q9j41J57j74J37n4l7j04K8
4848c7P4L5qo2RJ1J8k69K95j3%j8n2QN6p4J36j05q7n2K18q9j7M4m1P9n6Q3j76
4877i0l6J13O0j22N0L4j0J0n6r2Q9J16r3N7J8rk4n8P3K9L0j28J25k46K55r8J08
4904A05p3j34J09m8R1j69Q0N4j5k4p9K01j66R8J5j33J10O5j26P1kj09K9O2o4J3
4930c9j68K80j50J43m2N7m5j29Q3O3j10o5J27NL8L8r8j2M9k4jn5O9l0L1K9k2j10
4958h8L0R3j33QK0K2rn5R7L6J11l3p6QN0l4p2J3p2L4l1o2R6j1O5O7j39J85k7j67
$$ plain form
4988 -74 90 -129 34 -35 -98 48 54 -24 -90 -64 39 60 -7 65 2 40 -8 86 43 42 15 -57 -94 -101 27 99 82 -31
5016 -31 59 -4 1 -52 7 47 149 26 135 129 -4 -29 88 73 32 85 75 -134 55 -62 78 87 7 -100 -8 -31 37
5043 37 86 -22 69 26 -28 92 -5 10 81 101 -105 51 -124 49 -43 -107 -29 -116 -20 -17 -28 41 81 -126 101 -23
5069 -23 43 -22 11 -38 139 48 1 -14 -137 110 37 -3 -76 -22 76 -18 50 -14 49 50 16 -131 19 -9 -49 -40 -66 23 -131
5098 -131 -45 86 -54 49 -65 38 -72 -31 17 -35 74 81 -4 -12 133 -63 -14 -18 -14 -20 -134 25 -48 20 64 -15 31
5125 31 71 -71 -135 -68 -108 39 -36 72 -98 -33 36 39 -58 111 23 -42 81 116 -66 44 1 94 -28 3 36 -32
5151 -32 -44 8 -67 -50 -8 -163 35 109 -29 -67 -101 34 -108 -69 12 -85 -9 124 -25 -171 -10 140 81 45 39 -11
5177 -11 -99 -154 -63 -130 -10 27 139 -100 1 34 47 103 8 86 -21 -53 -20 6 43 81 38 38 -11 -70 146 -23 -186
$$ packed form
4988g4J64k19J63o9o3J46Op8o6K6J03K1o7P2o3L8m8R4m3jk7p2l7pJ28P2j7j13
5016c1R0o3Nn3N9M0J02j23J09oj33k5J17j5m1N3j0k09J89j17J40Rq0j07R2k3O8
5043C7M9j08R1m3n4J20r7J5P1K0k06J56j75J73r2o4P8q7R6Lj1O9M0k07K27j24
5069b3O6o5L3m9J77r1m7j5j23K47p3m0p3N4R8r4O8o4O3Jl4j47J50k8m0Rk6Q9j54
5098a31Q6J31j40J03j14J03j10M1M8n2J09Pq5qJ45j96M9mMoj14J59p3O8M4p9M6
5125C1M0j42o4O7m0J47p5J08j70O5O9Lr7J69q8o5J23L5j82J10m3R3j22L1L3o8
5151c2j2N2p5J7M2j55J98P4j38l8l4J35j42L9Q1r7P6J33j49j46J61J50n9l6on0
5177a1q8n5R1o7J20L7J12k39J01L3J3N6r5P8j07l2L3K6L7L8m3%m9n9K16j69j63
$$ plain form
5204 -186 -15 -117 28 14 -43 123 -81 -33 -8 -45 -95 3 135 103 -80 -26 102 -56 -31 11 -134 -71 -115 -58 -32
5229 -32 -127 -115 -58 23 -25 5 115 10 -25 19 -95 -6 -29 21 -76 -79 -71 -135 -47 -145 -15 -16 -113 91 65 -114 61 181
5257 181 43 -10 95 -78 -48 -20 75 -62 45 40 18 62 83 14 -155 -21 -81 55 -64 -66 -77 0 35 60 -93 -7
5283 -7 -61 -72 34 -10 2 -151 -67 35 -55 48 39 15 23 -7 -68 -20 65 -90 -82 35 3 25 14 -27 -70 -66 89 -64 -35
5312 -35 35 -84 -92 -22 23 129 20 -127 -51 -81 62 15 -67 -23 62 -31 138 -62 -23 36 32 41 -37 0 52 -56 -39 104
5340 104 -51 -14 107 154 -117 -60 -78 -107 -136 4 -51 -36 -8 -63 28 62 39 -110 64 13 -139 -29 3 -160 -33
5365 -33 -59 88 -17 71 -32 -100 -55 -19 59 -52 56 -7 9 75 80 -36 -87 136 -98 -31 -84 44 -165 22 -39
5390 -39 109 85 90 26 -42 -82 -79 118 23 -34 -13 -6 32 139 -10 -52 61 -43 88 44 -44 -113 66 -18 25 -15 19 -66
$$ packed form
5204a86J71j02J45j4n7J66k04M8K5l7n0R8J32l2j83N4J28j58K5M2j45O3m4N7K6
5229c2r5J2N7Q1m8L0J10j05l5M4j14Q9k3N0r7lQo4Q8r8J30jr7K04k6j79J75J20
5257A81j38n3J05j73L0K8R5j37J07nk2M4K1o9j69J34o0J36j19kj1P7L5K5j53Q6
5283gn4j1J06m4J2j53Q4J02r0J03rk4Ql0o1M8Q5j55QJ17l2K2j1m1m3MJ55j53K9
5312c5P0j19qP0M5J06j09j47P6l0J43m7q2M4Q5r3J69k00L9N9mRp8L7N2j08J7J43
5340A04j55L7J21M7k71N7j8k9k9J40n5J5K8n5R1L4k3j49J74n1j52J10L2j63J27
5365c3k6J47j05Q8j03o8M5L6P8j11J08o3J6O6Nj16n1K23k34O7n3J28k09J87o1
5390c9J48k4No4o8m0LJ97r5n7K1PL8J07j49m2J13j04J31m4q8o9J79q4M3m0L4q5
$$ plain form
5418 -66 -66 -150 -33 -34 1 -4 49 37 -38 -35 -91 -104 -60 17 52 126 -102 -38 -14 -12 11 135 74 -132 -74 50 -10 -115 55
5447 55 -75 -147 6 -12 -49 -18 -19 -160 68 -33 17 -145 131 56 -1 -1 -87 -112 4 -46 80 50 -129 -42 -116 20
5473 20 49 58 -32 -14 -44 -59 53 100 -11 -17 67 32 12 16 86 -56 39 -26 -132 -119 30 -41 65 -119 -98 -55 70 -21
5501 -21 -110 58 91 30 1 161 -64 18 35 -13 -154 97 50 -4 -1 77 15 -33 47 49 -32 94 99 -26 -29 -42 119 -9
5529 -9 -28 -66 28 -115 -48 63 -94 0 38 -34 -102 116 -15 91 84 -98 98 90 -2 137 60 -5 -70 -39 -44 12 -186
5556 -186 -90 104 -30 -39 -13 -58 45 24 44 -22 5 21 34 46 87 -34 12 71 -22 31 -95 22 -82 6 132 66
5582 66 -89 -31 50 15 -32 26 -55 -2 2 -24 -40 104 91 124 11 33 48 -128 79 -132 -7 -37 -63 117 39 98 -127
5609 -127 -35 -29 37 24 -149 29 39 -55 -37 6 74 53 52 46 -31 99 108 -26 57 -31 -33 25 -51 -49 -14 11 -3 -79 94 126
$$ packed form
5418f6%q4J17jL5nN3j2p5Ln6j3M4P7L5P4k28O4K4KK3J24o1k06N8J24o0j05J70
5447E5j30p2J53j8l7L1jj41K28j01N0j62K76p5n7%q6k5J16n0J26l0j79Q7p4J36
5473B0K9Rr0J8l0j5J12M7j11oQ4l5k0MP0j42R5o5j06J3J49p1J06j84K1M3J25r1
5501b1q9J68L3o1k9J60k25Q2J7m8j41K51m7n4LP8o2m8Q0Kq1J26Nj25lj3J61j28
5529ij9l8R4j43O7J11j57R4L8p2o8K18j31J06pj82J96qr2J39p7o5o5L1nN6j98
5556a86R6J94j34rK6m5J03k1K0o6K7J6J3J2M1j21M6N9r3N3j26J17j04Q8J26o6
5582F6j55N8Q1l5m7N8q1N3Mk6j6J44j3L3j13K2J5j76K07k11J25l0k6J80p8N9k25
5609a27R2OO6j3j73J78J0r4J8M3O8k1jop7J30Rj34Q3q8kN8p6KL5K5j4p6J73L2
$$ plain form
5639 126 -4 66 -65 -25 255 54 81 -76 -25 5 20 -2 -5 -49 -32 134 -38 -36 132 -35 -91 -18 22 -25 0 3 9
5666 9 64 -25 40 6 107 -29 47 4 0 -108 14 -33 -18 -64 -41 34 -53 -13 -55 77 -4 16 -72 -4 -115 76 -56
5693 -56 33 -63 -57 23 89 -6 -136 4 29 40 39 -75 6 28 -67 -18 45 60 -92 -78 -130 -43 -91 -90 -14 -136 -62 51 -132
5722 -132 93 -51 -88 -71 -80 -55 83 -52 84 69 -42 -111 108 -4 -86 -149 15 35 -41 -76 96 15 139 49 -7
5747 -7 40 77 13 16 120 -105 16 -3 -28 54 47 -29 -77 -6 -79 22 96 147 22 -17 -29 92 18 -36 54 83 115 2
5775 2 25 39 -78 72 -33 122 -48 -4 -6 -137 -189 -33 -10 -5 -7 -30 -11 -73 143 115 31 -12 -99 40 18 -106 -50
5802 -50 -14 -28 59 -10 -15 -11 60 91 -5 140 -55 -28 -2 25 70 74 -103 -135 150 40 -48 39 -65 39 13 39 82 52
5830 52 -120 -93 -146 14 -94 48 97 -6 35 -103 103 -60 42 -147 58 -17 -43 29 -89 -19 -38 -36 -55 18 16
$$ packed form
5639A26j30P0j31M0K80k01K7j57N1L0J5k2lm4J7J66j72KJ68j67n6P3M0m7K5LO
5666IN5q9O5l4J01j36P6m3mj08J22m7J5m6K3P5q7M0m2J32q1K0q8O8j11J91j32
5693e6Q9r6OQ0O6r5j30J40K5J1jj14Q1K2r5M9O3J5j52J4n2Q7m8JP6j22P4J13j83
5722a32K25j44l7J7rK5J38j35J36j5j11o9K19j12q2o3J64K0p6l5J72q1J24r0n6
5747gM7L7o4LJ04k25J21j9k5Q2pp6m8P1p3J01P4N1j25l9j2J21p4n4R0K9L2j13
5775BK3J4j17J50j05J55j70M4kj31n2J56K3Nkk3J9o2K16k8q4m3q7J39k2j24N6
5802e0L6j4Q7o9nMP1L1r6J45j95K7K6K7M5Mj77l2K85j10q8Q7j04J04k6K6M3l0
5830E2j72K7n3J60j08J42M9j03M1j38K06j63J02j89K05p5k6P2j18P0j9Kj9P3k
$$ plain form
5855 16 108 -37 114 -92 10 5 10 -90 2 -51 47 -31 -13 -98 97 -23 63 -33 -32 -27 -3 -26 -39 -14 117 -13 63 -12
5883 -12 57 27 -24 -65 -4 47 -24 163 100 -66 -45 26 65 -11 -28 69 -19 22 138 37 10 -6 11 12 14 16 54 -106 -22
5912 -22 74 14 -106 -202 30 93 4 -155 22 -39 -110 -46 55 -70 -42 -46 51 -24 39 7 66 -56 -4 74 -15 -71 94
5939 94 -87 -89 98 -146 8 -73 61 8 -130 15 12 34 -34 -71 181 44 -52 -98 -39 34 101 18 29 -10 -46 -67 32
5966 32 -91 -84 -4 14 113 92 87 24 -25 2 117 -41 -45 -10 -20 47 17 57 51 13 -71 -13 139 -18 28 106 0 -49 -26
5995 -26 -65 16 -104 66 -148 44 67 -37 5 -2 19 -33 -67 -15 22 -123 -20 -22 -3 -132 170 34 -50 -9 -39 -53
6021 -53 -25 54 -137 -47 0 -101 -33 66 40 11 67 -79 -16 -27 10 -112 50 8 -206 -57 23 -33 -26 47 140 91 51
6048 51 -29 127 -34 -13 -96 9 37 4 160 125 89 17 81 -84 -20 41 -41 -12 18 54 -28 13 -92 100 -53 -2
$$ packed form
5855A6R2j45J51k06J02nNj00R2n3R8p8J8q5J95j20Q6r6JNK4k3j3K5J31j30P6p5
5883a2O9l0n1m1O1N1p1J87o3j66K1P1L9p6j7R7q8M1J16j01k7j6J7JKKL8j60Q4
5912b2R6o0j20r6K32O3q9j59J77o1p1O4J01j25K8mR7p5O3l2N9j22N2P8q9n6J65
5939I4j81kJ87k44J54q1J34n3j38J45lK2o8l7K52j37r6m6N9P3O7q3J1l9l6k1R9
5966C2j23PQ0J8R9k1no3m9K7J15j58mL5j0O7l0M0ol8q4N8J52j57M6P8j06m9K3
5995b6l9Q1j20J70k14J92K3j04M2pK1n2l4N2L7j45J03kJ9j29L02j36q4M1l0j4
6021e3K8P9j91R0M7j01O8R9k6k9N6j46O3j1L7j22J62m2k14J49Q0n6PP3R3m9m0
6048E1q0J56j61K1q3J05K8l3J56l5l6p2O4j65O4O1q2K9L0L6q2M1j05J92j53N1
$$ plain form
6074 -2 113 34 75 -11 11 -61 -16 53 -80 -55 71 -127 -101 -10 29 38 77 5 -102 -90 -82 -55 48 -142 55 -28 15 15
6102 15 -43 -37 -60 18 14 -86 -1 -80 -88 21 24 56 -52 25 64 -71 -51 -62 -27 -50 -95 -21 7 68 -72 -129 84 126 -75
6131 -75 22 -109 3 73 -21 81 30 10 -72 -17 80 -6 76 -31 -36 19 -63 -74 4 44 140 39 -5 -39 -84 -61 -64 8 21
6160 21 14 -47 -6 -83 -211 -23 -52 -124 -66 -20 52 -56 78 -70 29 89 -41 45 72 8 -123 -86 -48 -119 12 89 62
6187 62 -30 -104 17 -33 80 -68 -45 -20 -43 2 -39 -17 -3 -67 -7 -21 93 92 51 17 38 -50 -74 -17 -36 -113 137 -53
6215 -53 -43 -131 -4 116 -41 59 29 -28 5 -35 45 128 50 28 26 71 107 126 81 43 43 -78 -72 76 151 123 80 -71
6243 -71 -28 10 76 -38 -86 73 -87 145 73 -101 72 -56 -31 -42 82 67 59 -32 91 54 -55 -16 -61 -103 120
6268 120 4 -14 -1 34 -33 -16 23 4 12 2 -23 -87 -127 56 -36 104 35 31 -64 -60 43 -150 -80 17 19 -133 28 -9
$$ packed form
6074bJ15p9M1q6K2p2M5O9j33K5J26j98K6R1L9RL9p2j07J2QK7J03j90J97q3M3%
6102A5n8Ok3P8mj00Q5p9qJ09LL2j08P7L9j35K0j1L5k3m5P4K8O1j40n7K13M2k01
6131g5R7j31J12P0r4J02n1k0q2N5R7q6Q2j07nN5q2j1P8M0R6j01m4l4m5K3lP2J3
6160B1po1M1p7j28J88k9p2N8M6P2j08J34j48R9O0j30Q6K7o4j31L7L8p1J31P7k7
6187F2r2p4J21n0J13j48K3K5k3M5m1K2J4o4O0j4J14jm1l4K1q8k4N7j9p7K50j90
6215e3J0q8J27J20j57J00l0n7L3m0Q0Q3p8k2kM5L6J9m5l8%j21OJ48P5k8m3j51
6243g1M3L8O6j14m8J59j60K32p2j74J73j28K5j1J24j5qr1J23l7j09L9m5m2K23
6268A20j16j8J3L5o7J7L9j9Qj0k5o4m0J83r2J40o9mr5MJ03j93P0R7Kj52J61l7
$$ plain form
6296 -9 16 -44 36 -72 84 1 -105 -147 -60 2 -11 83 -17 4 123 6 -81 92 -30 -19 19 -145 12 6 66 6
6322 6 118 -12 -19 -24 78 9 -58 44 -102 -23 -3 -108 -24 -46 -45 25 48 94 -52 -40 37 -17 51 9 21 -73 -11 -52 -76
6351 -76 47 3 64 1 28 -111 -117 86 36 184 20 16 110 70 -4 34 -97 29 146 -114 6 73 -30 75 -9
6376 -9 59 -31 97 126 37 30 19 -2 14 -64 -101 -67 30 -12 -7 1 133 -43 -90 83 -84 46 44 -82 -41 -1 -70 98 -81
6405 -81 -4 -116 -39 8 -74 -73 -83 51 -37 -34 0 -87 -21 37 79 -4 81 59 86 -91 58 9 -95 120 51 4 20 -70
6433 -70 -64 122 -39 17 -2 -23 2 -83 14 -45 99 -7 -88 68 111 2 126 -16 -35 1 -3 -103 -2 -36 -93 78
6459 78 -39 23 44 -9 15 160 -25 -65 -59 -47 -46 -55 32 18 -72 110 0 -110 98 150 49 98 28 -2 -19 -71 -9 11
6487 11 -11 5 73 24 -103 32 -1 -2 -118 100 -54 -39 52 0 41 63 26 -60 -131 -48 -46 -75 88 70 -6 -115 130
$$ packed form
6296iK5o0Q0j08J56q3j06m2Q7O2j3R4j00K1J19j17q7J73j22J1L8j64J57oO0o0
6322FJ12j30pnJ02o9o7J02j46P9K0j05Q4k2JP0K3M6j46J2P7n4O8m2J2r4O2m1k4
6351g6J23m4O1o3K7j39oK03n0J48j64mR4m0p4L8j31J26J17k60J20O7j03J05q4
6376iO8r0J28K9q9pj1k1J6p8l7L4R7m2NQJ32j76m7J73j67J30kj26M1M0o9J68j79
6405h1P7j12P7M7q2Jj0J34q8LL4q7O6N8M2q3Q5k2K7j77J49m9j04K15o9m7J6r0
6433g0OJ86j61N6j9k1K5q5R7n9J44j06q1J56M3j09J24j42j9L6mj00J01l4n7J71
6459G8j17O2K1n3K4J45j85m0OJ2JrQ7j4r0J82j10j10K08N2j01M9p0l0j7n2O2K0
6487A1k2J6O8m9j27J35l3jj16K18j54J5R1n2M1K2l7q6p1Q3Kk9J63j8p6j09K45
$$ plain form
6514 130 -36 53 43 -8 16 -86 9 -44 54 105 -19 -29 21 -33 -61 4 41 -57 -29 -54 10 -45 19 160 -26 54 -3
6541 -3 83 -31 -4 16 17 88 82 -116 40 -71 -98 21 -111 -104 -58 -9 -92 -120 -29 124 -16 14 -29 116 5 42 -87
6568 -87 -41 35 -44 6 -44 87 37 58 38 -45 -55 28 -29 -30 7 -80 48 35 -83 -15 -91 41 -47 71 82 139 -5 52
6596 52 -27 -121 116 -82 31 1 10 20 3 13 44 32 7 2 44 -10 166 66 8 78 -42 29 -27 38 94 27 87 96 -26
6625 -26 -8 -81 -88 -37 -60 -22 -80 6 54 25 -69 -2 54 -83 -18 -57 -65 30 108 -8 -9 -31 -17 -31 -69 71 -95 51 -42
6654 -42 -7 -29 30 52 -30 -92 141 -10 -60 -70 -20 25 6 18 -18 -154 34 -40 -168 1 140 -63 -108 58 -23 70
6680 70 -21 -37 18 -88 -121 -98 11 79 -92 -6 43 -1 42 41 -83 -10 -90 106 -5 -95 55 -23 10 -97 78 214
6706 214 36 41 87 -32 -129 -11 24 40 -138 75 144 68 53 11 -9 -14 13 -12 10 35 -25 -28 -66 -1 100 -58 11 92
$$ packed form
6514A30j66Q9j0n1K4j02R5n3R8N1j24j0N0n4k8O5L7r8K8k5O4n5O4J41j86Q0n7
6541cQ6j14K7K0JP1oj98J56j11k7J19j32PM6M9q3k8R1J53j40L0m3J45j11L7j29
6568h7M6P6p9N0n0J31n0K1k0q3j0Q3n7jL7q7J28j3j18O8p6J32q8J18J1N7j44N7
6596E2p9r4K37j98J13l0RJ0j7J0L1j2k5nM2n4J76j00n8P0j20P1n6O5N6o7O0Rj22
6625b6J8p3pN1k3L8n8Q6M8k9r4O7N6j37O5l9qR5P8j16jk2J4j4l8J40j66J46r3
6654d2L5k2N9K2q2o2K33j51n0j0N0M5j9J2l6j36J88p4j28J69J39k03m5J66q1R3
6680G0r1j6N5j06l3K3J09O8j71Q6M9m4M3jj24P3q0J96j11r0J50p8L3j07J75J36
6706B14j78NM6j19r7J18L5J6j78K13O9p6j5m2k0nK7k5K2K5o0ll8O5J01j58O9Q1
$$ plain form
6734 92 98 -55 -76 37 71 -98 176 10 83 21 46 101 -32 16 18 -48 -65 1 56 96 102 18 -100 -41 52 2 18 -50
6762 -50 -26 40 -143 51 28 81 -11 -28 -150 49 -27 35 -7 -40 79 84 -119 -65 -12 -58 0 -41 42 -88 -1 123 87
6789 87 -110 141 80 131 52 -17 55 -46 25 -31 59 67 96 -48 136 10 8 131 -16 145 -60 41 -50 35 -61 -87
6815 -87 -67 -2 -8 135 27 26 -79 9 48 33 -29 -56 77 47 16 34 -100 93 -16 53 39 -38 -77 153 -72 129
6841 129 107 -17 26 -19 60 86 -27 -25 48 11 -50 55 32 18 -13 97 -180 65 7 140 17 -104 -48 28 -42 -30
6867 -30 37 33 -26 -71 -17 49 31 -6 -35 23 -81 -47 -55 65 83 -34 -86 16 14 31 -14 -15 -8 -112 56 73 -3 -111 -37
6896 -37 0 114 -35 -67 -70 -67 -33 -23 -84 131 15 -40 -31 55 -44 -29 -39 -7 -51 -21 69 -4 -33 -22 0 1 61 -51 82
6925 82 140 -103 159 -41 -100 1 33 -54 23 21 -17 64 36 73 -28 -11 59 178 -11 -2 -137 9 4 47 -33 0 -2 10
$$ packed form
6734I2Oj53k1J13L4j69K74j66P3o2K5N5j33M8Ko6j7O6N5M0Oq4j18N9R3n0J6o8
6762e0K4O6j83J94k3N3r2j7j22J99p6O2m2l3J19Nk03N4N3m6N8m1Q3j30Q7J24l6
6789H7j97K51o1N1p9o9P2j01P1n6R0QK9j44J84j26kJ23j47J61k05J01r1Q5r6k6
6815h7K0O5oJ43j08jj05Q8L9j5o2k7J33l0l1J8j34J93j09O9j4p7l9K30k25K01
6841A29k2j24M3m5P9K6j13KP3l7o1J05k3j4l1J10k77K45n8J33j23j21N6P6p0J2
6867c0O7mn9m5N4O6j8l7k9N8j04L4qJ20J8j17n2J02kJ7m5jPj04J68J7p6j08P4
6896c7L7J14j49l2lLL4J0o1K15j16n5RQ6r9J5j0L2m4L0R0p3k9J1K2JO0j12J33
6925H2N8k43K62k00n9J01L2q7P7kl8Q1k8L7j01J7P0J19j89Rj35J46nM3q0L3kJ2
$$ plain form
6953 10 -68 -32 -42 35 9 -68 -43 123 7 -72 -20 -74 -23 -32 29 51 65 -98 -41 -45 -35 85 -49 -35 -10 8 100 20 0
6982 0 7 -102 -58 -30 149 -52 -8 5 -91 -39 49 6 -25 81 -27 69 -32 -63 3 -48 90 -66 157 78 -88 -68
7008 -68 -156 43 48 128 45 -90 39 81 -117 -31 25 -20 4 -30 -16 48 78 -1 -129 2 -14 -64 -11 69 -82 75 -18
7035 -18 64 -66 -28 88 -99 102 102 38 -37 -47 -10 87 -4 -60 11 30 -14 50 14 18 110 33 -26 -66 -40 79 7 129
7063 129 22 -7 -90 17 -21 -10 -139 -20 26 17 11 40 -206 -99 30 24 83 -2 99 -27 -38 33 -47 6 -83 22
7089 22 -11 -11 108 93 -43 31 13 -12 -21 70 120 -99 -119 -88 77 -50 26 19 -8 32 3 -20 57 -40 73 14 4 27 -72
7118 -72 5 121 -69 -1 -87 72 99 -38 68 31 -27 -6 45 31 67 -131 24 9 120 90 26 -5 109 -13 10
7143 10 -12 -38 52 50 101 143 59 -69 -83 -81 6 -68 -12 73 79 40 107 -11 -28 12 -100 -91 111 94 128 83 -8 -46 13 25
$$ packed form
6953A0p8L6j0P7k6p7K5J66j16p9N2n4N1rO1K2J4j63N7mJ0J20j34J4K5J8R2q0k0
6982@Pj09M4K8J79k01M4J3r6N2Q8m3l1J06j08R6j01l1O6n1J38j56K23p9j66K0
7008f8q8J99NQ0q3j35J29M2j98Q6N6m5K4l4J4O4L0p9j28J31j6n0N3Q0j51J57r3
7035a8Q2j30L8J16j87K01%o4p5j0L7R7r1n6P1J9m4O4l6MR2p7n9m0K6J19p2J22
7063A29j07k9q3J07l8J1j29J19M6roK9k46J07J29oN9q5J01j26j1P1q0N3q9J05
7089B2l3%J19j5j36P4j8k5rR1N0k19k0L1J65j27P6pk7M0k9k3P7r7J13n9j0K3r9
7118g2P7J16j90O8q6J59K7j37J06l7n8K1N1j4L6j98J55j5J11l0o4l1J14j22K3
7143A0k2k6R0kN1M2q4j28j4KQ7p4N6Q5Ol9O7j18j7M0j12RK02j7L4m5r1l8N9J2
$$ plain form
7173 25 4 -82 29 20 73 47 -39 -3 3 -30 -131 103 -96 -93 19 6 -29 55 18 45 10 91 45 -19 -74 -104 101 -26
7201 -26 40 -19 -25 58 33 -106 73 -111 185 -85 -98 34 -100 -160 -59 3 -76 7 -56 2 -72 73 77 -26 -26 47 92
7228 92 -42 -26 42 42 160 -55 -43 136 -25 -5 -42 -26 -7 -145 13 66 32 -45 23 -52 19 4 -101 -43 -67 -15 146
7255 146 -61 -96 62 -76 -47 32 -20 53 56 55 -17 -25 -52 -54 -131 -114 191 83 -55 -49 -49 96 -61 4 3 108 -128 111
7283 111 -3 -114 -65 -90 -89 19 38 -3 -24 21 133 70 -68 66 -2 32 -6 -25 12 -103 67 -61 26 46 74 44
7309 44 -105 78 8 71 -49 79 6 -2 12 -7 -67 -52 75 -96 10 -50 -100 -8 -69 -15 -55 43 -70 127 22 -35
7335 -35 17 -83 19 99 0 -75 -90 37 112 -26 -18 -64 58 -20 105 45 10 44 51 -119 121 33 7 93 18 -48 -1
7362 -1 -124 72 -25 -52 -97 -82 -41 -54 46 3 -53 134 59 31 -32 -21 -13 153 -2 64 40 65 -10 -34 14 71 -66 84
$$ packed form
7173B5k1q6J11rN3k6q6L6Ol3j01K34j99LJ12j3l5Q4l7K7l5Q1m6o4n5l0K05j27
7201b6O6n9oQ3k5j39J79j84K96k70j3J32j34o0J01O2p9Q3o3N8p4J45Mj03%P3M5
7228I2j34J6O8%J18k15J2J79j61K0l7J6J9j38J58N3l4p7O8p5P1j5j05N8k4N2J61
7255A46k07l5J58j38K9P9n2P3Ljp2qk7kp7J7L05j08j38O%J45j57O5jJ05k36K39
7283A11j14j11M9k5JJ08J9m1k1M5J12o3j38J34o8L4l8j9L7j15J70j28Q7K0K8l0
7309D4j49J83p0O3j20J28p3qJ4j9o0J5J27j71J06o0n0R2o1N4m0R8j13J97j05n7
7335c5N2j00J02Q0r9p5j5J27P5j38Qm6J22p8J25o0l5L4Pj70K40q8k6Q6p5o6M7
7362aj23J96r7k7m5J5M1j3J00m3n6J87p5k8o3J1QJ66j55O6k4K5p5k4M8N7j37J50
$$ plain form
7390 84 63 -69 19 47 -11 36 64 -79 1 104 33 -36 33 -78 -4 -29 127 95 62 -38 -32 0 -57 -60 -63 -70 17 -7 -4 189
7420 189 -68 -161 -29 44 19 -31 -15 43 31 -40 62 -97 -71 60 -10 -15 -98 5 -23 -55 -3 8 -89 -25 -59 80 189
7447 189 -120 -39 17 -6 7 -162 -11 -40 -120 8 79 6 -22 32 -4 -53 -7 -59 -47 2 69 105 38 86 -89 65 93
7474 93 44 -119 98 116 -40 -56 91 -40 -12 61 -47 57 1 -2 -20 127 40 -15 29 -34 -15 68 -22 -109 58 27
7500 27 21 -145 35 36 -128 -94 -53 44 9 -25 60 88 -41 -13 -39 -70 62 67 -38 39 73 165 -23 -35 -91 8 63 57 9
7529 9 -26 27 -106 144 -186 42 -69 -19 28 -52 10 -34 -21 -46 -4 0 123 37 -91 3 -51 56 -70 41 -39 135
7555 135 -20 -68 70 35 25 11 -20 9 98 1 42 93 28 -58 97 96 37 -71 27 15 -34 13 -120 -47 37 -60 -118 -7
7583 -7 -61 2 -138 -13 19 -16 43 62 16 12 -30 -20 40 74 -72 -14 32 -29 -3 29 159 70 61 -38 -25 12 1 10 -5 -54
$$ packed form
7390H4k1j32Q8K8n8M7K8j43Q0J03p1o9O9j11P4k5J56l2l3j00OL2n7llpQ7k4LJ93
7420A89k57r3J32P3k5n0J6N8j2p1J02j59K6J31p0nq3J03k8l2N2J1r7O4l4J39J09
7447A89l09Q1N6k3J3j69J51k9q0J28P1p3k8N4l6m9M6n2J2M9O7L6o7M8j75J54K8
7474I3m9j63K17J8j56j6J47j31K8P3j08J04n6lj8J47q7n5M4o3J9Q3r0q7J67l1
7500B7oj66J80Jj64L4M1R7l5l4Q5K8j29K8k6l1J32Nj05P7L4R2j88j2n6R9N5om8
7529Il5N3j33K50l30K28j11N0M7q0O2m4J3k5M2MJ23q6j28R4n4J07j26J11q0J74
7555A35j55m8J38l5j0j4l1K9Q9r7M1N1o5q6J55jn9j08R8j2m9M7j33P3Q4r7n8J11
7583gn4O3j40J25L2l5N9J9m6mm2J0O0L4j46N8M6o1K6L2J30q9rr9J3L7j1Rj5m9
$$ plain form
7613 -54 -8 -27 -21 32 -5 93 -68 -138 -3 160 181 52 4 76 23 24 53 -14 -65 -101 -39 3 38 59 -31 -11 74 -18 -40
7642 -40 -50 -128 -27 -23 -102 47 -91 0 -100 80 49 61 1 -48 43 -85 45 41 -14 97 26 11 -125 -9 1 52
7668 52 1 15 51 74 -30 77 26 6 87 -90 68 101 34 -125 -44 48 47 39 36 -77 -127 64 46 -34 -49 101 -86
7695 -86 -55 65 -70 -12 -49 119 -38 -113 -102 -6 -1 43 79 28 166 76 -1 117 28 23 72 12 -20 50 23 76 -161 -55
7723 -55 10 4 36 89 -51 -33 -4 52 16 -41 71 62 -45 79 -15 -19 -15 -6 -105 21 -77 86 8 82 13 58 22 -64 109
7752 109 -3 3 -70 -4 4 -74 -35 16 -84 -41 7 12 66 56 -74 -2 30 -74 -147 -89 31 28 -22 30 -62 -84 10 -23 26
7781 26 23 -3 -16 10 132 84 26 70 -33 -67 -47 68 -44 -19 64 6 -25 15 -23 57 67 -8 -65 6 48 -3 60 -15 120
7810 120 -83 -80 -144 12 -81 52 15 0 -24 6 -16 3 -24 106 64 25 43 86 -14 66 55 152 67 99 24 -13 33 -67
$$ packed form
7613e4M6j9ON3l7R8j61p0J35J63K1j29m8P2n3JK9o7n1l6O2M2L5K1r0K0Q5r2k2
7642d0j0p8J01Mp9J49j38R1j00J80l1J2o0m9R1j28J30mn5J11p1j5j36J16J0N1
7668E2n1J4L6K3j04J07n1k0Q1j77J58L3o7j59Q1R2jqlj13n0J91j8q0j5J50j87
7695h6L1J20j35N8l7J68j57p5J1R6NM4L6n1J38r0p7J18q9nM9o0l2P0k7N3k37J06
7723e5O5oL2N3j40J8K9N6l6n7J12rj07J24r4mMRr9J26r8J63p8P4o9M5l6q6J73
7752A09j12Op3O6Qp8L9N1j00M3M8NN4j0j30P2L2j04p3N8J20ln0N2r2k2R4l3M9
7781B6lk6j3K6J22m8n8M4j03l4K0J15j12K5Q3n8l1M0l8Q0J0p5n7P1M2n1O3p5J35
7810A20k03Lo4J56r3J33l7j5k4L0k2J9k7J30m2l9J8M3j00Q0j1R7q5L2p5l7M6j00
$$ plain form
7838 -67 92 84 -7 65 -4 4 -43 -6 27 100 -19 -32 45 55 -95 6 18 -15 -28 25 59 0 111 -24 18 26 22 -145 -43
7867 -43 28 -133 -15 -75 27 78 16 -6 79 -90 19 51 -145 46 6 -102 49 16 13 -77 -38 100 -9 51 -7
7892 -7 93 -118 -48 26 -89 -58 32 92 1 -87 73 120 -109 -29 6 -43 77 -33 12 45 40 -40 -129 -73 -100 -57 62
7919 62 9 -41 -35 -50 57 -99 4 -39 105 112 -30 16 80 -52 -17 26 -49 -20 -67 23 72 2 95 -69 18 56 -55
7946 -55 -11 56 46 -15 90 41 133 -65 -70 25 -50 -32 48 -35 33 106 -18 136 45 19 15 66 -2 -85 -33 22 -1 -70 -26
7975 -26 -112 -108 66 74 8 -64 102 37 -42 -35 -101 -10 -36 -29 150 49 0 3 -33 -1 33 151 -22 -3 4 -29 174 -88 53
8004 53 17 -85 -8 73 54 -57 -42 -24 -93 -106 94 -23 65 47 64 57 3 15 105 29 -61 129 120 64 64 -47 27 -119
8032 -119 149 -99 -71 -31 -69 31 -24 68 -47 -9 -51 0 179 12 13 48 -65 -65 -66 -89 -3 -3 -44 -15 -13 111 3 -34
$$ packed form
7838f7J59qr1P2o9Qm7L7L3P3j19j3P7J0j50J01J2l3j3N3L4n9J11j35M2Qmj67J02
7867d3P1j61J18o0J02N1o2k2Q5j69J09L2j96J91m0j08J51l3lr0L9J38j09O0n8
7892gJ00k11P0P4j15L1R0O0r1q8J60M7k29Q0L5m9J20j10M5L3nq0q9N6k7M3J19
7919F2n3n0Oj5J07j56J03m3J44Pj42M6O4j32L5M3p5K9m7R0M9p0R3j64Q7L8j11
7946e5M4O7j0o1J05m9R2j98nR5p5J8Q0q3O8P3j24J54r1k6mN1o8q3N2N5k3o9M4
7975b6q6MJ74Qo6p2J66o5p9Po6R1k6PJ79j01m9Ll6L2L4J18j73J9Pl3K03k62J41
8004E3l6j02P7Q1j9j11J5J8o9j3K00j17Q8j8J7pn4J2R0p6r0J90rn6%j11P4j46
8032a19K68k48K8M0l8J00n5R2j15L8m2N1J79j67JL5j13%jk3Q6%m1K9KJ24j08l7
$$ plain form
8060 -34 -61 77 -26 -149 -72 -13 160 0 -59 -113 137 -32 -130 98 -103 26 76 -25 -58 15 120 85 -54 -128
8084 -128 69 142 -69 -27 33 69 -38 -110 78 51 -41 50 -51 43 52 -94 9 -12 -69 -12 76 34 -39 -12 -42 -59 105
8111 105 -50 -57 20 -39 12 -220 38 109 -80 33 17 -79 -72 -87 21 -1 81 96 -133 -144 -41 -4 1 -53 -49 34 58 -101
8139 -101 -25 46 -109 57 89 17 -14 -24 24 21 -32 97 19 -71 10 13 56 2 -101 80 3 -59 -26 32 57 -46 31 46
8167 46 48 81 -51 116 53 -46 5 54 78 -40 -25 17 -24 -7 -50 52 -147 -37 79 -64 -32 7 -22 20
$$ packed form
8060c4k7J38j03j23P7N9J73j60n9n4K50j69r8K28k01J29N0j01l3P3J05l5j39p4
8084a28J97P3k11M2O0L6j07p2J88k7r2R1j01R4Rj46J03k1n7N7Q8m2p3K7l0j7J64
8111A05j55pP7n9N1k32K58P1j89J13j6r6Pj5J08k2Q2J5k29j1J03L7Nn4MQ3K4j59
8139a01P6P1j55J66L2p2l1j0M8ln3J29p8r0Q1LM3n4j03J81p7o2L3N8K5j03P7J5
8167D6KL3j32J67o3r9N1M9K4j18J5M2m1J7m3J02j99J10J16j43L2L9k9M2
8191B0
$$ Imaginary data points
##PAGE= N=2
##DATA TABLE= (X++(I..I)), XYDATA
$$ plain form
0 0 0 0 0 0 0 0 0 0 0 0 0 0 0 0 0 0 0 0 0 0 0 0 0 0 -1 2 -2 3 -3 4 -4 4 -5 6 -6 6 -8 8 -10 11 -11 14 -15 16 -19 20 -22 24 -26
49 -26 29 -32 33 -33 35 -33 26 -7 -39 177 -716 4485 56201 34414 -5427 17946 33012 -727 -10056
68 -10056 35169 57673 23825 -4714 13987 35838 24743 23687 66796 89965 47035 13812
80 13812 46120 67461 37038 35666 78831 74144 22531 19565 63111 73142 54994 63542 83049
93 83049 66611 31146 29242 59698 68182 43147 36716 55685 43593 9691 24609 67729 58657
106 58657 22316 27590 39074 9085 -11921 13987 32473 9287 -13618 -9179 -2944 -12780 -17859
119 -17859 1 13913 -8424 -37985 -30514 -15684 -32678 -42088 -16519 -12607 -47786 -55631 -25255
132 -25255 -17945 -32789 -23398 -6386 -21095 -44332 -40180 -21419 -16436 -24848 -24202 -12603 -15068 -30702
$$ packed form
0@%%%%%%%%%%%%%%%%%%%%%%%%jLmNoPqQrJ1j2J2j4J6j8K1k2K5k9L1l5L9m2M6n0
49b6N5o1O5o6O8o8N9l3l2K16q93N201N1716k1787l9841K3373J5066l3739r329
68a0056M5225K2504l3848k8539J8701K1851j1095j056M3109K3169m2930l3223
80A3812L2308K1341l0423j372M3165m687n1613k966M3546J0031j8148Q548J9507
93H3049j6438l5465j904L0456Q484k5035o431J8969j2092l3902J4918M3120r072
106E8657l6341N274J1484k9989k1006K5908J8486k3186k2905M439O235r836n079
119a7859J7860J3912k2337k9561P471J4830j6994r410K5569L912l5179p845L0376
132b5255P310j4844R391J7012j4709k3237M152J8761M983q412O46J1599k465j5634
$$ plain form
146 -30702 -20812 9604 9458 -13160 -7402 6865 -11794 -26086 -76 17663 -2697 -14417 568
159 568 4296 -8263 -5367 12642 16440 -1001 -15498 -9456 -1172 -11251 -16504 2489 8072 -17525
173 -17525 -24693 783 5623 -13515 -7307 11408 -3410 -27424 -17686 1283 -2748 -11651 -4496
186 -4496 3886 -3355 -14953 -7526 12937 12996 -5111 -3851 10377 -1513 -18229 220 20622 4263
200 4263 -10115 5646 12791 -3394 -4383 14142 17122 851 -7594 -584 5483 -672 -5036 7405
214 7405 16373 440 -11393 5030 15200 -565 -3327 15138 11785 -9757 -6779 10963 8443
227 8443 -1039 5540 13759 8366 597 3568 14831 17764 7417 3766 14023 13030 -1018 3862
241 3862 22300 17503 2374 9677 19010 8106 1874 13910 17672 6980 2544 6193 6551 3198
$$ packed form
146c0702R890L0416j46k2618N758J4267j8659j4292K6010J7739k0360j1720J4985
159E68L728j2559K896J8009L798j7441j4497O042Q284j0079n253J8993N583k5597
173a7525p168K5476M840j9138O208J8715j4818k4014R738J8969m031q903P155
186d496Q382p241j1598P427K0463N9j8107J260J4228j1890j6716J8449K0402j6359
200D263j4378J5761P145j6185r89J8525K980j6271q445P010O067o155m364J2441
214G405Q968j5933j1833J6423J0170j5765k762J8465l353k1542K978J7742k520
227H443r482O579Q219n393p769K971J1263K933j0347l651J0257r93j4048M880
241C862J8438m797j5129P303R333j0904o232J2036L762j0692m436L649L58l353
$$ plain form
255 3198 1002 3664 8188 2955 -7073 -2990 5627 -1897 -10123 -985 1930 -12299 -15556 -4284
269 -4284 -5023 -13447 -10109 -4947 -10911 -15489 -12898 -11046 -11228 -12823 -15246 -13109 -11202 -16655 -18498 -9614
285 -9614 -8523 -18275 -16550 -8003 -12695 -18894 -10994 -6325 -13601 -14671 -9055 -10215 -12512 -9044 -6826
300 -6826 -7129 -6045 -6921 -7214 -2820 -2235 -5864 -2229 3852 -1221 -4402 4177 6411 121 2590 9303
316 9303 5994 3066 8456 10206 7591 9916 11807 9562 10427 11946 9677 11308 14675 11459 9237
331 9237 14775 14198 8045 11107 16089 11036 8000 13028 12868 8064 9811 11838 8198 7459 9545 7028
347 7028 6015 8837 6923 4511 7428 6761 1932 3815 7104 2204 14 5402 4209 -722 1633
362 1633 4236 291 -368 2543 289 -1461 1440 241 -2884 -659 229 -3750 -2805 205 -3028 -4453
$$ packed form
255C198k196K662M524n233j0028M083Q617p524q226R138K915j4229l257J1272
269d284p39q424L338N162n964m578K591J852j82j595k423K137J907n453j843Q884
285i614J091r752J725Q547m692o199P900M669p276j070N616j160k297L468K218
300f826l03J084q76k93M394N85l629L635O081n073l181Q579K234o290K469O713
316I303l309k928N390J750k615K325J891k245Q65J519k269J631L367l216k222
331I237N538n77o153L062M982n053l036N028j60m804J747K027l640p39K086k517
347G028j013K822j914k412K917o67m829J883L289m900k190N388j193m931K355
362A633K603l945o59K911k254j750K901j199l125K225Q88l979R45L010l233j425
$$ plain form
378 -4453 -235 -1252 -5475 -2868 -652 -4836 -5188 -1392 -3298 -5116 -1876 -2048 -4966 -2498 -849 -4510
394 -4510 -3909 9 -2219 -4153 -211 -94 -3415 -775 1414 -2149 -1876 2166 277 -1983 1828 2248
410 2248 -1071 888 2842 -390 -260 3350 1142 -1404 2233 2492 -1309 -74 2364 -986 -1275 2005
426 2005 78 -2237 1009 1204 -2874 -1599 915 -2373 -3461 -216 -1757 -3958 -1221 -953 -4386 -2932
442 -2932 -534 -3823 -4596 -1374 -2951 -5615 -2754 -2445 -6401 -4986 -1923 -5147 -6418 -2897 -3337 -6404
458 -6404 -4665 -4017 -6707 -6116 -4395 -7034 -7434 -4047 -5699 -7788 -4417 -3679 -7516 -6107 -3052 -6497
474 -6497 -8018 -3632 -3621 -7469 -5270 -2453 -4564 -4352 -1646 -2041 -2268 -239 -1678 -3238 -120 -51 -3645
491 -3645 -1482 2086 -1337 -2328 3173 3316 -785 1572 4496 717 -1558 1364 1385 -756 43 131 -663
$$ packed form
378d453M218j017m223K607K216m184l52L796j906j818L240j72k918K468J649l661
394d510O01L918k228j934L942J17l321K640K189l563K73M042j889k260L811M20
410B248l319J959J954l232J30L610k208k546L637K59l801J235K438l350k89L280
426B005j927k315L246J95m078J275K514l288j088L245j541k201K737K68l433J454
442b932K398l289p73L222j577k664K861L09l956J415L063l224j271L521m40l067
458f404J739O48k690N91J721k639m00L387j652k089L371P38l837J409L055l445
474f497j521M386J1l848K199K817k111K12K706l95k27K029j439j560L118O9l594
491c645K163L568l423r91N501J43m101K357K924l779k275K922K1k141P99Q8p94
$$ plain form
508 -663 859 284 -1802 1029 3228 -1513 -2816 1434 -350 -5490 -2582 1107 -3471 -5302 -603 -230
524 -230 -3446 -1699 965 -336 -1692 -2132 -2655 -1159 -718 -3383 -2024 2217 -507 -4146 977 4377
540 4377 -464 -1245 4359 2351 -3416 -956 2985 -62 -1671 840 1673 352 32 545 2818 4037
556 4037 97 -2316 1397 806 -5220 -3153 3633 483 -4920 -135 3774 -1214 -2239 3551 3542 -1290
572 -1290 -1880 401 536 -430 -887 1544 4461 2103 -1411 3340 8468 3294 232 6951 7464 -1390
588 -1390 -1345 7111 6027 637 4094 8630 5423 2016 4857 8238 7124 2962 1837 5220 4557 -1566
604 -1566 -164 8086 5819 -2900 657 8063 2209 -3772 3317 7186 -1066 -5567 -515 1030 -3263
619 -3263 -3912 509 2873 -944 -4900 -871 4148 -779 -5762 682 4325 -5198 -8527 1878 4445
$$ packed form
508f63J522n75k086K831K199m741j303M250j784n140K908L689m578j831M699L73
524b30l216J747K664j301j356m40n23J496M41k665J359M241k724l639N123L400
540D377m841p81N604k008n767K460L941l047j609K511Q33j321l20N13K273J219
556D037l940k413L713n91o026K067O786l150n403M785L909m988j025N790rm832
572a290n90K281J35r66m57K431K917k358l514M751N128n174l062O719N13q854
588a390M5Q456j084n390L457M536l207l407K841L381j114m162j125L383o63o123
604a566J402Q250k267q719L557P406n854n981P089L869q252m501N052J545m293
619c263o49M421K364l817l956M029N019m927m983O444L643r523l329J0405K567
$$ plain form
634 4445 -4131 -3364 5384 3403 -3955 -1437 5014 3980 -1080 -1287 2750 2347 -2840 -2306 6135 6984
650 6984 -1334 -408 8395 5286 -3278 1998 10169 3384 -4112 1805 6867 1493 -698 5303 8278
665 8278 3856 -147 3259 7834 4871 37 4025 8697 1402 -4127 4458 9983 1576 -780 8543
680 8543 8599 -859 158 8373 6985 102 799 5197 3929 -385 522 6556 7223 593 -678 6210
696 6210 5204 -2961 -153 8509 3187 -5598 -607 5829 -458 -4508 2685 5690 -1091 -4613 -44
711 -44 2540 -1045 -3994 -511 2641 -2781 -7545 -1138 4534 -1917 -5589 2587 3545 -6588 -6544 3596
727 3596 2802 -5464 -3487 2854 -537 -6261 -2845 3719 2583 -3107 -3148 2367 1521 -5080 -2675 6006
743 6006 2762 -6630 -2524 5823 30 -5896 2856 8478 -400 -5518 1952 5173 -794 -2706 3496
$$ packed form
634D445q576P67Q748j981p358K518O451j034n060k07M037m03n187N34Q441Q49
650F984q318R26Q803l109q564N276Q171o785p496N917N062n374k191O001K975
665H278m422m003L406M575k963m834L988M672p295n529Q585N525q407k356R323
680H543N6r458J017Q215j388o883O97M398j268m314R07O034O67o630j271O888
696F210j006q165K808Q662n322q785M991O436o287m050P193L005o781l522M569
711d4K584l585k949L483L152n422m764O407N672o451l672Q176R58j0133M4J0140
727C596p94q266J977O341l391n724L416O564j136n690m1N515q46o601K405Q681
743F006l244r392M106Q347n793n926Q752N622q878n118P470L221n967j912O202
$$ plain form
758 3496 6226 161 -4450 1418 6797 1242 -3169 4393 7805 -2307 -5559 5114 7052 -3013
772 -3013 -2608 6343 3697 -5547 -2554 5712 4068 -2701 -2024 3354 1870 -4973 -4059 4465 3962 -5406
788 -5406 -4790 4069 668 -8229 -2643 6064 -755 -8276 -2046 3059 -3071 -6371 -105 3163 -2629
803 -2629 -6751 -2412 2380 -929 -5438 -605 4844 -1619 -7257 530 5776 -1676 -4579 3780 4737
818 4737 -3668 -3263 4536 4080 -1761 -843 4054 3441 -806 -770 4470 5368 -702 -2117 4648 4811 -2433
835 -2433 -938 6913 4054 -3305 382 6572 1897 -2321 2615 5377 883 -1626 1604 4039 1381
850 1381 -1106 1273 4666 1862 -2254 1782 6468 1362 -2849 2659 4998 -1612 -2637 4245 4105
865 4105 -1536 -625 4062 2134 -1237 89 3087 2332 -1092 -1945 1409 2093 -2334 -2277 2988 2020 -4220
$$ packed form
758C496K730o065m611N868N379n555m411P562L412j0112l252J0673J938j0065
772c013M05Q951k646r244K993Q266j644o769O77N378j484o843R14Q524n03r368
788e406O16Q859l401q897N586Q707o819p521O230N105o130l300O266L268n792
803b629m122M339M792l309m509M833N449o463n638P787N246p452k903Q359R57
818D737q405M05P799m56n841R18M897o13m247L6N240Q98o070j415O765J63p244
835b433J495P851k859p359L687O190m675m218M936K762m494k509L230K435k658
850A381k487K379L393k804m116M036M686n106m211N508K339o610j025O882j40
865D105n641R11M687j928l371J326K998p55l424q53L354O84m427N7N265r68o240
$$ plain form
882 -4220 -2167 3599 530 -4165 -19 2942 -2259 -4690 -574 972 -1828 -2286 96 1040 -1001 -2763
898 -2763 -561 2580 109 -3295 325 3272 -1738 -3600 2697 4246 -1500 -1287 3988 2883 -1166
913 -1166 941 4102 2632 96 558 2368 2251 348 249 3674 4090 -205 -114 4782 3287 -1879 677
930 677 4952 1013 -2627 1127 3334 -116 -1073 1731 2082 81 -832 155 1341 397 -1841 -974 1518
947 1518 -755 -3638 -460 2466 -1572 -3063 1350 1616 -2892 -2280 918 -397 -2779 -1549 -272 -860
963 -860 -1438 -1469 -534 561 -1009 -2377 118 962 -2319 -2520 1333 98 -3393 -1131 1671 -969 -2349
980 -2349 545 1361 -611 -462 325 128 -13 -374 -774 545 1136 -722 -114 2356 1031 -985 1267
997 1267 2771 -248 -521 2355 1718 -498 627 2122 908 498 1477 1322 1411 1975 841 738 2092
$$ packed form
882d220K053N766l069m695M146K961n201k431M116J546k800m58K382R44k041j762
898b763K202L141k471l404L620K947n010j862O297J549n746K13N275j105m049
913a166K107L161j470k536M62J810j17j903r9L425M16m295R1M896j495n166K556
930F77M275l939l640L754K207l450r57K804L51k001r13R87J186r44k238Q67K492
947A518k273k883L178K926m038j491M413K66m508O12L198j315k382J230J277n88
963h60n78l1R35J095j570j368K495Q44l281k01L853j235l491K262K802k640j380
980b349K894Q16j972J49P87j97j41l61m00J319N91j858O08K470j325k016K252
997A267J504l019k73K876o37k216J125J495j214m10R79j55Q9N64j134j03J354
$$ plain form
1014 2092 1051 -488 1111 1837 -465 -64 2316 932 -1019 839 1631 -866 -675 862 -100 -1043
1030 -1043 -23 -387 -987 -81 -507 -1520 -570 86 -1807 -1547 182 -1067 -2440 -741 -358 -2450 -1744
1047 -1744 -98 -1307 -2303 -536 -507 -1718 -953 -578 -1730 -1127 -332 -1629 -1518 92 -712 -1824 -129
1064 -129 251 -1519 -796 715 -524 -1233 781 577 -1083 108 871 -418 -163 1137 403 154 1496
1081 1496 785 -360 1088 1475 -119 436 1919 766 38 1780 1329 -108 1094 1860 182 267 2009
1098 2009 1019 251 1417 1280 61 972 1351 -176 222 1457 310 -420 1132 903 -602 292 1148
1115 1148 -250 -317 1153 196 -795 565 536 -966 -81 593 -632 -453 736 -153 -934 719 333 -1203
1133 -1203 -326 825 -642 -870 757 83 -855 592 675 -793 -131 841 -454 -577 735 144 -711 643
$$ packed form
1014B092j041j539J599P26k302M01K380j384j951J858P92k497J91J537r62r43
1030a043J020l64o00R06m26j013R50O56j893K60J729j249j373J699L83k092P06
1047a744J646j209r96J767K9j211P65L75j152O03P95j297J11J610q04j112J695
1064a29L80j770P23J511j239p09K014k04j660J191P63j289K55J300p34k49J342
1081A496p11j145J448L87j594N55J483j153p28J742m51j437J202P66j678Q5J742
1098B009r90p68J166j37j219R11L79j527L98J235j147p30J552k29j505Q94Q56
1115A148j398o7J470r57r91J360k9j502Q85O74j225J79J189q89p81J653l86j536
1133a203Q77J151j467k28J627o74r38J447Q3j468O62R72j295j23J312n91q55J354
$$ plain form
1151 643 507 -759 250 1206 -296 -477 1318 526 -900 534 992 -603 -290 1101 56 -386 940
1168 940 626 -223 666 694 -392 463 948 -465 -386 1225 426 -1080 597 1246 -600 -378 1223 201
1186 201 -672 753 650 -672 -27 478 -632 -156 553 -301 -80 1047 6 -1075 868 967 -1079 -584
1204 -584 1198 -304 -1492 536 833 -687 -259 774 -229 -419 278 -20 -270 337 -283 -961 349
1221 349 158 -1507 -10 1558 -390 -1401 860 983 -1439 -696 1152 -111 -989 113 138 -327 -89
1238 -89 -73 -236 439 -213 -1172 156 1042 -946 -1096 1448 498 -2202 -481 1566 -371 -1373 674 976
1256 976 -786 -718 388 272 -3 -48 -292 442 208 -944 -113 1825 328 -1606 294 1612 -887 -1375
1274 -1375 1858 1486 -1437 -568 1204 52 -935 144 775 409 -257 -882 115 942 -475 -1066 1097
$$ packed form
1151F43j36j266J009R56j502j81J795p92j426J434M58j595L13J391j045m42J326
1168I40l14q49Q89K8j086Q55M85j413P9J611p99j506J677O49j846K22J601j022
1186B01q73J425j03j322O45N05j110M76P09q54K21J127j041j081J943R9k046M95
1204e84J782j502j188K028K97j520M28J033j003j90O97k98k50O07o20o78J310
1221C49j91j665J497J568j948j011K261J23k422P43J848j263q78J102K5m65K38
1238h9J6j63O75o52r59J328Q86j988j50K544r50k700J721K047j937j002K047L02
1256I76j762O8J106j16k75m5k44P34k34j152Q31J938j497j934J900J318k499m88
1274a375L233l72k923Q69J772j152r87J079O31l66o66o25R97Q27j417n91K163
$$ plain form
1291 1097 1001 -2019 -1365 1826 405 -2195 -87 1787 -945 -2161 374 1060 -610 -888 93 207 -397
1308 -397 -1334 -602 1055 398 -1952 -484 1576 -761 -2474 1066 1972 -1602 -1970 1263 595 -1983 -658
1325 -658 1576 381 -1364 -933 169 692 -515 -774 1062 1428 -1499 -1888 1343 1307 -2006 -646 2667
1342 2667 98 -2603 249 2396 -85 -1274 939 1219 -622 -1175 283 1798 955 -945 -337 1756
1358 1756 357 -1747 1052 3314 -173 -2177 1233 1800 -1570 -975 2405 1560 -1612 -834 1101 760
1374 760 -424 -101 1327 1134 -1459 -2214 960 1701 -1350 -1271 2135 645 -3173 -839 2636 274 -2218
1391 -2218 235 1250 -1860 -2522 -4 1299 -246 -1496 -564 631 -453 -2220 -60 2477 -330
1406 -330 -3120 -531 1326 -2019 -2224 2088 1943 -2167 -1965 983 342 -1551 -208 1723 586 -1794
$$ packed form
1291A097r6l020O54L191j421k600K108J874k732j216K535O86j670k78R81J14o04
1308c97r37P32J657o57k350J468K060k337j713L540R06l574l68L233o68k578J325
1325f58K234j195j745M31J102N23j207k59J836L66k927l89L231l6l313J360L313
1342B667k569k701K852K147k481j189K213K80j841n53J458J515q43j900O08K093
1358A756j399k104K799K262l487k004L410N67l370N95L380q45l172P78J935l41
1374G60j184L23J428j93k593p55L174P41l051P9L406j490l818K334L475k362k492
1391b218K453J015l110o62K518J303j545j250R32J195j084j767K160K537k807
1406c30k790K589J857l345k05M312j45m110K02K948o41j893J343J931j137k380
$$ plain form
1422 -1794 -2134 242 1347 -942 -1064 1741 1321 -2763 -1620 2736 1391 -1956 24 2230 -888 -2942
1438 -2942 372 2431 457 -689 630 1135 -472 -1449 643 2926 857 -2057 -419 1911 -804
1453 -804 -2052 2013 3395 -1080 -2183 1387 1370 -1475 -240 2450 1000 -2020 -1510 432 1003 -242
1469 -242 -363 1722 1394 -2129 -2205 1918 1935 -1669 -735 2109 -581 -3673 -484 2712 459 -1383 479
1486 479 819 -1066 -1653 415 1933 571 -1698 -1099 750 -463 -2162 1058 3316 -437 -2663 513
1502 513 1585 -1602 -1125 2126 1458 -1757 -1567 419 659 -240 177 1400 1143 -1225 -1908 789 1769
1519 1769 -693 -764 1841 500 -2812 -1005 2587 1083 -991 772 1437 -989 -1638 398 1545 537
1535 537 -455 -343 523 -68 -1138 529 2650 547 -1884 51 1467 -1048 -1249 2083 1781 -1674 -1467
$$ packed form
1422a794l40K376J105k289j22K805m20m084J143M356j345l347J980K206l118k054
1438b942L314K059j974j146J319N05j607r77K092K283k069k914J638K330k715
1453h04j248M065J382m475j103L570j7k845J235K690j450l020N10J942N71j245
1469b42j21K085l28l523p6M123J7l604R34K844k690l092L189L196k253j842J862
1486D79L40j885n87K068J518j362k269N99J849j213j699L220K258l753k226L176
1502E13J072l187M77L251o68l215J90J986K40q99M17J223k57k368o83K697R80
1519A769k462p1K605j341l312J807L592j504k074J763O65k426o49K036J147j008
1535E37r92J12Q66n91j070J667K121k103k431J935J416k515k01L332l02l455K07
$$ plain form
1552 -1467 815 520 -465 434 1643 669 -834 -1161 133 939 -239 -760 1161 762 -1976 -1149 2019
1569 2019 1191 -1399 274 1700 -792 -2066 486 1541 -241 -639 267 335 -265 -755 313 1733 728
1586 728 -1181 -207 1418 -236 -1487 1211 2022 -905 -1277 1254 1038 -863 164 1760 717 -822
1602 -822 -345 570 820 245 -71 964 1178 -534 -878 1523 1685 -541 94 1874 396 -1415 343
1619 343 1990 212 -525 979 1082 -3 29 664 1305 829 -65 -127 1047 654 -666 566 1990 131
1637 131 -950 904 1415 -361 -179 1669 760 -631 -97 736 262 135 94 427 545 139 -548 427 1367
1656 1367 -4 -625 775 386 -1084 -340 1330 128 -788 424 619 -511 -362 453 298 -3 -34 -351
1674 -351 1 219 -377 -527 512 444 -1078 -176 885 -389 -767 689 528 -964 -301 541 -217 -487
$$ packed form
1552a467K282k95r85Q99J209r74j503l27J294Q06j178n21J921l99k738Q27L168
1569B019q28k590J673J426k492j274K552J055j782l98R06O8o00m90J068J420j005
1586G28j909R74J625j654j251K698Q11k927l72K531k16j901J027J596j043j539
1602h22M77R15K50n75l16J035K14j712l44K401J62k226O35J780j478j811J758
1619C43J647j778p37J504J03j085L2O35O41m76q94o2J174l93j320J232J424j859
1637A31j081J854N11j776J82J848r09j391N34Q33m74j27m1L33J18m06o87R75R40
1656A367j371o21J400l89j470P44J670j202r16J212J95j130J49Q15j55l01l1l17
1674c51L52K18n96j50J039o8j522R02J061j274l78J456j61j492O63Q42p58k70
$$ plain form
1692 -487 261 177 0 -153 -293 -426 287 24 -744 197 485 -523 -649 689 343 -780 -43 756 -397
1711 -397 -536 504 338 -463 173 359 -225 61 189 -76 255 713 -228 -370 815 309 -492 347 912
1730 912 -261 -129 806 399 -387 497 503 -256 22 564 92 104 596 17 -105 494 259 -452 304 827 -291
1751 -291 -182 813 252 -455 179 472 -240 -10 526 -31 -197 476 161 -150 375 156 -306 174 631 -225
1771 -225 -28 910 278 -506 458 482 -239 40 643 121 -135 710 408 -225 316 521 -154 126 779 -31
1791 -31 -100 675 340 -253 437 492 -255 103 852 12 -220 580 361 -151 372 607 -276 162 580 43 -200
1812 -200 571 316 -351 253 360 -385 48 515 -121 -408 474 167 -529 14 472 -378 -152 483 -184 -439
1832 -439 99 136 -539 83 304 -283 -113 411 -213 -413 275 -66 -673 -78 438 -237 -247 432 31 -447 226
$$ packed form
1692d87P48q4j77j53j40j33P13k63p68R41K88j008j26J338l46j123P37P99j153
1711c97j39J040j66q01O36J86n84K86J28k65L31M58r41j42J185n06q01Q39N65
1730I12j173J32R35m07p86Q84Op59K78N42m72J2M92n79j22N99k35p11P56N23j118
1751b91J09R95n61p07O34K93p12K30N36n57j66O73l15l11N25k19m62M80M57q56
1771b25J97R38o32p84R64K4p21K79O03n22k56Q45l02o33N41K05o75K80O53q10
1791c1o9P75l35n93O90N5p47L58P49q40k32Q00k19n12N23K35q83M38M18n37k43
1812b00P71k55o67O04J07p45M33M67o36k87Q82l07o96N43M58q50K26O35o67k55
1832d39N38L7o75O22K21n87J70N24o24k00O88l41o07N95N16o75j0O79m01m78O73
$$ plain form
1853 226 152 -357 -78 422 -224 -168 556 -20 -144 596 309 -230 395 698 -60 -33 833 375 -133 583 682
1874 682 95 299 937 425 374 751 539 174 804 702 20 694 1052 262 302 1179 664 33 786 1008 -21
1895 -21 346 940 554 175 525 356 92 458 368 11 491 632 -131 -182 642 44 -605 357 355 -601 -359 514
1917 514 92 -457 280 204 -250 -219 -142 -310 -30 -74 -562 -355 203 -420 -727 259 255 -794 -360 255 -277 -912
1939 -912 81 275 -551 -355 182 -157 -209 -51 -126 105 47 -463 -662 282 105 -622 26 790 -321 -807 399
1960 399 518 -496 -60 638 1 -551 56 259 -1 41 41 -69 323 -125 -554 412 911 -207 -375 571
1980 571 74 -885 -52 914 33 -565 281 410 -374 -188 311 399 107 -322 -250 31 141 -535 -268 836
2000 836 -112 -1148 -89 721 -317 -653 596 279 -945 -725 235 -108 -490 -68 136 -182 -474 -488 120
$$ packed form
1853B26p4n09K79N00o46N6P24n76j24P40k87n39O25L03p58K7Q66m58n08P16R9
1874F82n87K04O38n12n1L77k12l65O30j02o82O74L58p90M0Q77n15o31P53K22j029
1895b1L67N94l86l79L50j69k64L66r0l57M80J41p63n1Q24n98o49R62kr56K42Q73
1917E14m22n49P37p6m54L1P7j68K80m4m88K07N58o23l07R86mj049M34O15n32o35
1939i12R93J94q26J96N37l39n2J58p5K31n8n10j99R44j77p27O48P64j111m86J206
1960C99J19j014M36O98o37n52O07K03k60M2%j10L92m48m29R66M99j118j68R46
1980E71m97r59Q33R66q81n98Q46J29p84J86M99Q8k92m29P2K81J10o76K67J104
2000H36r48j036J059Q10j038l36J249l17j224K20R60l43l82M22K04l18k92j4O08
$$ plain form
2019 120 538 -242 -774 150 446 -889 -589 918 379 -821 -66 715 -351 -681 380 708 -124 -247
2037 -247 -82 30 19 -244 147 755 312 -890 -70 1002 130 -652 681 908 -674 -866 541 465 -287
2056 -287 28 545 95 -469 -215 260 576 102 -462 92 319 -841 -850 753 713 -955 -467 538 -411 -1140
2076 -1140 153 832 -308 -1032 -232 -92 -619 -585 -173 182 -376 -1109 -782 81 -271 -1155 -47 530 -1087
2095 -1087 -1535 -73 434 -882 -618 437 -104 -1354 -615 288 126 -442 -434 -96 -86 -828 -859 399 708
2114 708 -682 -707 614 62 -1330 -158 1277 159 -1122 -98 452 -465 -540 526 762 62 -523 -164
2132 -164 433 90 -473 275 1095 -97 -1259 135 1049 -321 -458 1050 690 -1116 -834 728 524 -249
2150 -249 3 366 144 -638 -609 592 868 -167 -515 611 331 -958 -417 1174 410 -1130 -316 786
$$ packed form
2019A20M18p80n32R24K96j335L00J507n39j200P55P81j066l30J061L28q32j23
2037b47J65J12j1k63L91O08m43j202Q20J072q72p82J333K27j582j92J407p6p52
2056b87L15N17m50n64K54M75L16m74n64N54K27j160rJ603m0j668M88J005r49p29
2076a140J293O79j140p24Q00J40n27L4M12L55n58p33L27Q63l52q84J108N77j617
2095a087m48J462N07j316K64J055n41j250P39R03j62n68QL38J0p42l1J258L09
2114G08j390k5J321n52j392J172J435j118j281J024N50r17p5J066K36p00n85L59
2132a64N97l43n63P48Q20j192j162J394R14j370j37J508l60j806K82J562k04p73
2150b49K52L63k22p82K9J201K76j035l48J126k80j289N41J591p64j540Q14J102
$$ plain form
2168 786 -223 -875 397 947 -20 -698 -204 243 -122 -651 -37 731 91 -1236 -374 846 -186 -914
2186 -914 628 859 -895 -1088 534 615 -584 -317 483 107 -751 -534 441 779 15 -562 112 378 -598
2205 -598 -664 903 798 -594 -379 685 95 -714 157 1052 146 -530 252 447 265 -23 303 644 517
2224 517 -456 -347 797 560 -302 325 1054 -96 -727 502 898 -299 -141 777 455 -380 -59 459 409
2243 409 184 -8 187 344 -198 -251 545 755 -331 -338 603 287 -464 134 946 356 -419 339 365 -259 -140
2264 -140 519 487 312 -163 35 535 397 -179 227 801 185 -519 334 971 53 -263 916 562 -418 -2
2284 -2 857 443 -127 345 413 239 -35 10 553 642 56 -253 498 616 -251 55 1080 428 -480 210 720
2305 720 -99 -408 687 612 -111 -171 62 231 131 -30 263 589 226 -492 -125 807 -34 -562 373 617
$$ packed form
2168G86j009o52J272N50r67o78M94M47l65n29O14P68o40j327Q62J220j032p28
2186i14J542K31j754j93J622Q1j199K67Q00l76q58K17R75L38p64n77O74K66r76
2205e98o6J567j05j392K15J064n90q09Q71Q95r06o76P82J95j82k88L26L41j27
2224E17r73J09J144k37q62O27P29j150o31J229L96j197J58R18l22q35L21N18n0
2243D09k25j92J95J57n42n3P96K10j086pR41l16p51N98Q12n90p75P58K6o24J19
2264a40O59l2j75m75J98N00j38n76M06N74o16p04Q53O37r18l16J179l54r80M16
2284bQ59m14n70M72O8j74k74M5N43Q9n86l09P51J18q67L06J025o52r08O90N10
2305G20q19l09J095p5p23o0K33J69j00j61K93L26l63p18L67R32q41n28R35K44
$$ plain form
2325 617 -498 -505 600 370 -360 -241 201 -60 -330 -48 64 131 -182 -454 -138 213 -352 -645 263 267 -627
2346 -627 -593 382 -107 -801 -178 257 -409 -523 -114 -213 -298 -274 -125 -58 -132 -461 -594 36 145 -563 -250 119
2368 119 -304 -674 45 392 -514 -456 204 -90 -476 -80 -7 -154 67 -10 -123 24 -95 -347 72 270 -112
2389 -112 -348 250 285 -335 -75 624 -104 -281 157 142 -188 -4 200 -146 -30 42 -194 -67 154 -100 -180
2410 -180 246 98 -424 139 401 -107 -229 174 1 -307 -66 261 -67 -157 115 -24 -217 105 -3 -231
2430 -231 -28 78 -331 -41 116 -256 -381 167 108 -529 -115 181 -318 -315 72 -74 -310 -166 -181 -436 -339 -86
2452 -86 -395 -411 55 -258 -419 47 -145 -607 -79 2 -262 -272 26 -105 -319 8 -112 -259 -206 163 -263 -93
2474 -93 29 -109 -258 26 31 -301 -66 177 -22 -141 375 -23 -243 29 123 -317 -15 276 31 -30 133 25
$$ packed form
2325F17j115pJ105k30p30J19M42k61k70K82J12O7l13k72L16L51n65k93R08Mq94
2346f27L4R75m89o94O23M35o66j14M09r9q5K4J49O7p4l29j33O30J09p08L13L69
2368A19m23l70P19L47r06N8O60k94l86L96P3j47K21p7j13J47j19k52M19J98l82
2389a12k36N98L5o20K60O99p28j77M38j5l30J84K04l46J16P2k36J27K21k54q0
2410a80M26j48n22N63K62n08j22M03j73l08K41L27l28r0K72j39j93L22j08k28
2430b31K03J06m09K90J57l72j25N48n9o37M14K96m99LL87j46k36J44j5k55R7K53
2452h6l09j6M66l13j61M66j92m62N28Q1k64j0K98j31k14L27j20j47N3L69m26J70
2474i3J22j38j49K84Nl32K35K43j99j19N16l98k20K72R4m40L02K91k45o1J63j08
$$ plain form
2496 25 -145 133 85 -130 2 213 -258 -7 143 20 -252 -23 164 -222 -96 144 -70 -143 255 82 -263
2517 -263 88 224 -201 127 230 -177 -25 310 148 -61 270 424 -156 116 313 29 -45 279 165 -81
2537 -81 149 278 20 158 212 119 52 328 269 -98 214 389 -14 110 491 210 49 386 275 -19 236 343
2559 343 79 84 531 189 1 286 189 -31 144 201 -34 76 465 -99 -87 254 27 -216 43 287 -59 -138
2581 -138 256 28 -259 -72 81 -240 -256 -24 -84 -104 92 -229 -161 44 -80 -435 32 56 -264 -309 141 -170
2603 -170 -454 30 55 -251 -139 24 -255 -263 -60 -145 -315 -25 -92 -412 34 144 -294 -122 71 -9 -336 11
2625 11 214 -96 -140 80 -105 -65 -68 -28 -103 66 7 -149 146 197 -242 -21 318 -20 -373 292 333 -191 36
2648 36 292 154 -121 122 187 134 107 137 181 139 152 -112 70 337 2 -166 443 399 -264 -21 446 66 -211
$$ packed form
2496B5j70K78m8k15J32K11m71K51J50j23k72K29J87l86J26K40k14p3L98j73l45
2517b63L51J36m25L28J03m07J52L35j62k09L31J54n80K72J97k84p4L24j14k46
2537h1K30J29k58J38N4r3o7K76n9l67L12J75m03J24L81k81j61L37j11k94K55J07
2559C43k64NM47l42j88K85r7k20J75N7k35J10L89n64J2L41k27k43K59K44l46p9
2581a38L94k28k87J87J53l21j6K32o0k0J96l21O8K05j24l55M67K4l20m5M50l11
2603a70k84M84K5l06J12J63k79qK03q5j70K90o7l20M46J10m38J72J93q0l27L47
2625A1K03l10m4K20j85M0lM0p5J69n9j56K95N1m39K21L39l38l53O65M1n24K27
2648C6K56j38k75K43O5n3k7L0M4m2J3k64J82K67l35j68O09m4o63K43M67l80k77
$$ plain form
2671 -211 146 375 -114 -131 143 51 -34 -11 94 99 140 -168 -152 302 67 -327 -91 393 -175 -554 91 250 -443
2694 -443 -180 231 -112 -382 -95 85 -52 -100 -250 -37 47 -102 -249 179 272 -177 -306 352 55 -475 -203
2715 -203 353 72 -304 96 250 -179 -179 -11 -29 -2 -163 -215 101 119 -247 -131 267 -15 -522 -11 426 -293
2737 -293 -451 373 85 -418 -255 74 173 -173 -36 -19 45 -200 -272 -15 172 -246 -321 133 156 -419 -281 282
2759 282 -32 -578 -30 267 -240 -351 52 273 -155 -205 -8 35 168 -178 -136 285 213 -358 -131 357 -151
2780 -151 -311 168 314 -388 -214 253 9 -263 3 177 48 -152 132 167 237 49 -111 208 332 -78 -150
2801 -150 456 379 -256 -58 507 58 -276 219 488 -60 -80 154 304 165 -76 176 273 115 -238 -111 432
2822 432 150 -259 302 593 -145 -414 229 228 -270 -14 347 10 -276 6 103 42 6 -113 144 186 -150 -232
$$ packed form
2671b11L57K29m89j7K74r2q5K3J05NM1l08J6M54k35l94K36M84n68l79O45J59o93
2694d43K63M11l43k70K87J80j37m8j50K13Q4j49j47M28R3m49j29O58k97n30K72
2715b03N56k81l76M00J54m29%J68j8K7j61n2L16J8l66J16L98k82n07N11M37p19
2737b93j58Q24k88n03J63L29R9l46J37J7O4k45p2K57J87m18p5M54K3n75J38N63
2759B82l14n46N48K97n07j11M03K21m28n0J97M3J33l46M2M21p2n71K27M88n08
2780a51j60M79J46p02J74M67k44k72K66J74j29k00K84L5P0j88j60L19J24m10p2
2801a50O06p7o35J98N65m49l34M95K69n48k0K34J50j39k41K52R7j58l53J27N43
2822D32k82m09N61K91p38k69O43jm98K56L61l37k86K82R7o1l6j19K57M2l36q2
$$ plain form
2844 -232 224 248 -329 -254 400 141 -550 -101 442 -177 -429 133 255 -254 -264 52 174 72 -263 -56 135
2865 135 44 -436 31 442 -192 -556 126 377 -305 -403 452 313 -344 -162 152 89 -116 30 297 201 -101
2886 -101 -261 118 361 -30 -213 286 391 -295 -68 530 344 -195 106 506 -24 -179 266 348 142 -57
2906 -57 106 185 221 -221 -72 387 161 -228 -131 424 161 -425 304 442 -107 -307 205 306 -213 26 220
2927 220 218 -100 -102 128 123 90 -152 46 370 -185 -422 274 156 -257 -123 361 -127 -209 5 256 -67 -143 13
2950 13 -39 -144 -119 -167 97 110 -154 -233 2 97 -350 -37 371 -110 -421 178 245 -294 -50 232 114 -99 -114
2973 -114 -29 -89 -78 10 17 153 -34 -283 -3 61 -182 -177 214 60 -412 -83 358 -153 -281 80 -7 -290 -112
2996 -112 9 -127 -84 -135 -162 32 16 -166 -136 171 -119 -373 -39 174 -303 -463 172 17 -439 -182 26 -65
$$ packed form
2844b32M56K4n77P5O54k59o91M49N43o19k52N62J22n09j0L16J22j02l35K07J91
2865A35r1m80M67M11o34l64O82K51o82r8Q55j39o57J82L14o3k05J46K67r6l02
2886a01j60L79K43l91j83M99J05o86K27N98j86n39L01M00n30j55M45Q2k06j99
2906e7J63P9L6m42J49M59k26l89R7N55k63n86P29J38n49k00N12J01n19K39J94
2927B20kl18kK30nl3k42J98L24n55k37O96j18m13J34M84m88q2K14K51l23p6J56
2950A3n2j05K5m8K64J3k64p9K35R5m47L13M08m81l11N99O7n39K44K82j18k13j5
2973a14Q5o0J1Q8PJ36j87k49K80O4k43NL91j54m72L29M41n11j28L61q7k83J78
2996a12J21j36M3n1k7J94j6j82L0L07k90k54L34K13m77j60O35j55m56K57K08r1
$$ plain form
3018 -65 -274 -40 -157 -114 -100 -214 -129 -23 -193 -257 12 38 -418 -186 243 24 -376 38 208 -244 -243 122 155
3041 155 -84 -46 -6 -19 -34 -133 -42 10 166 -129 -1 163 -43 -278 173 197 -303 -153 248 96 -247 90 118
3064 118 1 -33 72 -38 61 29 -186 -53 187 -51 -164 152 202 -195 -275 211 155 -270 -9 70 -189 -69
3086 -69 101 -77 -66 -24 -148 -71 123 -98 -177 -4 24 -199 77 291 -149 -256 119 38 -173 -47 125 -66
3108 -66 -88 18 -49 -94 72 -30 -176 3 -154 -129 47 123 -6 -227 16 110 -138 -149 32 -155 -74 -115 -50 -154
3132 -154 -94 77 -42 -80 43 -75 -130 46 -6 -154 157 98 -188 -67 176 -143 44 58 -9 -162 14 237
3154 237 -79 44 87 87 -11 251 38 -184 115 65 -91 4 7 -23 -80 247 103 -138 106 119 -81 102 159 79
3178 79 -45 120 210 -140 39 10 -133 33 154 -100 -19 149 -40 -35 52 128 -53 -43 149 68 -240 141 170 33
$$ packed form
3018f5k09K34j17M3J4j14Q5J06j70o4K69K6m56K32M29k19m00M14J70m52JL65L3
3041A55k39L8M0j3j5r9R1N2J56k95J28J64k06k35M51K4n00J50M01j52l43L37K8
3064A18j17l4J05j10R9l2k15J33K40k38j13L16N0l97q0M86n6m25K61P9k59J20
3086f9J70j78J1M2j24P7J94k21p9J73K8k23K76K14m40j07L75q1k11J26J72j91
3108f6k2J06o7m5J66j02j46J79j57K5J76P6j29k21K43R4k48j1J81j87Q1m1O5j04
3132a54O0J71j19l8J23j18n5J76n2j48L11n9k86J21K43l19J87J4o7j53J76K23
3154B37l16J23M3%r8K62k13k22K99n0j56R5Ll0n7L27j44k41K44J3k00J83N7q0
3178G9j24J65R0l50J79k9j43J66J21k54Q1J68j89NQ7P6j81J0J92q1l08L81K9j37
$$ plain form
3202 33 49 124 -50 76 197 9 11 168 79 60 163 153 -66 -34 218 -54 -44 153 170 -91 87 105 -85 120
3226 120 170 -93 -64 67 21 -105 -38 62 -161 -33 87 -112 -166 184 113 -147 -76 63 25 -229 -71 -107 -135
3249 -135 27 77 -172 -1 116 -160 -117 39 -161 -152 98 32 -285 -27 194 -116 -201 52 -48 -105 16 -6 -281
3272 -281 -122 78 -151 -114 83 -97 -253 45 -35 -181 49 157 -200 -168 40 -107 -135 -126 109 -193 -82 3
3294 3 -87 -161 187 60 -98 60 -100 -156 55 19 -119 -139 -52 2 -53 107 90 -128 -94 147 -9 -94 57 66 23
3319 23 95 116 -153 34 108 -15 -146 79 101 -187 -149 151 -38 13 112 32 -82 -19 16 -112 31 101 0 -51
3343 -51 95 -112 -152 96 96 -105 15 2 -239 -101 174 -29 -132 6 222 -132 -77 21 55 -61 16 16 -124 12
3367 12 24 -173 197 74 -200 -77 73 55 -227 86 241 -276 -118 132 -39 -137 89 156 -144 -51 -88 -10 -16
$$ packed form
3202C3J6P5j74J26J21j88KJ57q9j9J03j0k19L2K52k72J0J97J7k61J78J8j90K05
3226A20N0k63K9J31m6j26O7J00k23J28J20j99n4L50p1k60P1J39l8k54J58l6k8
3249a35J62N0k49J71J17k76M3J56k00RK50o6l17K58K21l10q5K53j00n7J21k2k75
3272b81J59K00k29L7J97j80j56K98q0j46K30J08l57L2K08j47k8RK35l02J11Q5
3294Cr0p4L48j27j58J58j60n6K11l6j38k0Q7N4n5J60j7k18L4K41j56q5J51Rm3
3319B3P2K1k69J87P4j23j31K25K2k88L8L00j89N1R9q0j14O3L5j28J43P0j01n1
3343e1J46k07m0K48%k01J20j3k41J38K75k03j03J38K16l54N5R8L4j16P7%j40J36
3367A2J2j97L70j23k74J23J50j8k82L13J55n17J58K50j71r8K26O7l00R3l7P8o
$$ plain form
3390 -16 66 -187 78 149 -170 -66 91 226 -102 9 177 50 -234 129 243 -69 -8 70 49 30 -1 47 -2
3413 -2 111 -97 -130 113 85 -98 46 352 24 -173 112 84 -126 67 361 82 -81 53 36 29 219 -6 -15
3436 -15 44 -33 -100 10 182 -137 -136 232 92 -229 94 237 4 -57 78 65 -67 -89 43 120 -34 -81 -16 -36
3460 -36 7 -83 9 327 -48 -145 17 287 -52 -139 264 104 -177 -43 196 32 -85 -17 257 -9 -70 -169 36
3483 36 241 -75 -103 80 28 -210 18 331 43 -251 44 10 -115 -110 109 70 65 -90 45 -86 37 62 -40
3506 -40 112 -56 -141 -124 179 -71 -107 103 97 -266 -158 219 -42 -79 90 131 34 -43 -6 -47 48 23 39 -98 86
3531 86 -109 -58 154 140 -74 -50 168 -30 -257 102 84 -46 18 38 108 -1 88 -64 57 3 -139 -167 275 192
3555 192 -101 146 324 24 -148 143 209 -55 -50 195 28 -39 -12 -46 78 -42 -98 26 202 -46 -116 183 257
$$ packed form
3390a6Q2k53K65P1l19J04J57J35l28J11J68j27k84L63J14l12O1P8k1j9l1M8m9
3413bJ13k08l3K43k8j83J44L06l28j97K85k8k10J93K94k79j63J34j7pJ90k25r
3436a5N9p7o7J10J72l19JL68j40l21L23J43k33o1J35j3j32k2J32P7j54m7O5k0
3460c6M3r0R2L18l75r7J62K70l39q7M03j60k81J34K39j64j17O8K74k66o1r9K05
3483C6K05l16k8J83n2k38K28L13k88k94K95l4j25NK19l9nj55J35j31J23K5j02
3506d0J52j68q5J7L03k50l6K10ol63J08L77k61l7J69M1r7p7L7m1R5k5J6j37J84
3531H6j95N1K12j4k14K4K18j98k27L59j8j30O4K0P0j09Q9j52J21n4j42k8M42q3
3555A92k93K47J78l00j72K91O6k64NK45j67o7K7l4J24j20n6J24J76k48p0K99P4
$$ plain form
3578 257 -115 -17 222 206 -157 120 358 -35 -123 138 45 21 -31 238 160 106 -35 -11 62 26 -49 -12 178 53
3602 53 -225 31 124 -20 -27 132 183 -253 -136 127 -92 -62 98 -95 9 -87 -165 -14 95 123 -198 126 118 -405
3626 -405 -146 197 -11 -161 -57 149 61 -253 -25 163 -89 -95 -195 -45 29 9 -80 114 -90 -177 -68 54
3648 54 -22 -117 30 155 -90 -166 177 -12 -16 28 246 -25 -52 26 -34 22 107 -71 22 126 -9 -67 73 256 -167
3673 -167 -136 96 -31 -199 52 99 -44 -36 34 -25 14 -84 -14 107 33 -59 -165 61 72 -49 9 37 -43 -149 0
3698 0 211 -19 155 122 -105 -162 90 24 -20 7 98 101 69 104 -41 -1 203 59 -94 167 -45 -118 169 129 -30
3723 -30 -147 42 -26 -115 27 129 -46 -62 -22 -81 -44 78 -7 -67 219 -99 -45 56 277 12 -149 51 -94
3746 -94 -181 42 191 114 -101 6 13 -158 64 -132 -88 104 7 -232 46 59 -61 -156 128 -23 -152 45 19
$$ packed form
3578B57l72R8K39j6l63K77K38l93q8K61r3k4n2K69p8n4j41K4P3l6p5L7J90j25
3602E3k78K56R3j44pJ59N1m36J17K63k19L0J60j93J04r6p8J51J09K8l21L24qn23
3626d05K59L43k08j50J04K06q8l14K28J88k52oj00J50P4k0q9J94k04q7J09J22
3648E4p6r5J47J25k45p6L43j89mM4K18k71k7P8o0N6Q5j78R3J04j35n8J40J83m23
3673a67L1K32j27j68K51M7j43QP0n9L9r8P0J21p4r2j06K26J1j21N8K8q0j06J49
3698@K11k30J74l3k27n7K52o6m4K7R1Ll2L5j45M0K04j44j53K61k12p3K87m0j59
3723c0j17J89o8q9J42J02j75j6M0n9L7J22q5o0K86l18N4J01K21k65j61K00j45
3746i4q7K23J49p7k15J07Pj71K22j96M4J92r7k39K78J3j20r5K84j51j29J97k6
$$ plain form
3769 19 -26 -134 58 -17 -97 -22 17 63 66 27 -116 15 -1 -58 -143 0 176 -38 -2 -12 -90 -37 97 -85 -3 6 26
$$ packed form
3769A9m5j08J92p5q0P5L9M6Ll9j43J31j6n7q5J43J76k14L6j0p8N3J34j82Q2RK0
$$ [...]
8191A3
##END NTUPLES=NMR FID
##END=
