##TITLE=1H_PHDP904
 CDCl3, 8 sc, 
 9.4.2019
##JCAMPDX= 6.0         $$ Bruker NMR JCAMP-DX V2.0
##DATA TYPE= NMR FID
##DATA CLASS= NTUPLES
##ORIGIN= UXNMR, Bruker Analytische Messtechnik GmbH
##OWNER= root
$$ XWIN-NMR		Version 3.5
$$ Tue Apr  9 15:30:09 2019 Russian Standard Time (UT+4h)  she@DPX200
##.OBSERVE FREQUENCY= 200.1315
##.OBSERVE NUCLEUS= ^1H
##.DELAY= (6, 6)
##.ACQUISITION MODE= SIMULTANEOUS
##.ACQUISITION SCHEME= undefined
##.AVERAGES= 8
##.DIGITISER RES= 18
##SPECTROMETER/DATA SYSTEM= spect
##.PULSE SEQUENCE= zg30
##.SOLVENT NAME= DMSO
##.SHIFT REFERENCE= (INTERNAL, DMSO, 0, 15.7039)
##AUDIT TRAIL= $$ (NUMBER, WHEN, WHO, WHERE, WHAT)
$$ ##TITLE= Audit trail, XWIN-NMR		Version 3.5
$$ ##JCAMPDX= 5.01
$$ ##ORIGIN= Bruker BioSpin GmbH
$$ ##OWNER= she
$$ F:/spectra/data/she/nmr/H-F/1/audita.txt
$$ ##AUDIT TRAIL=  $$ (NUMBER, WHEN, WHO, WHERE, WHAT)
(   1,<2019-04-09 15:28:37.93 +0400>,<she>,<DPX200>,
      <created by zg, POWCHK disabled, PULCHK disabled
       configuration hash MD5:
       00 E9 B6 7A A2 85 ED C7 34 08 36 98 17 FE 4E 26
       data hash MD5: 16K
       03 E1 A7 BE 31 4F 86 40 69 67 E7 DC 23 41 FD BD>)
$$ ##END=
$$ 
$$ hash MD5
$$ B1 81 F1 2D 57 C1 96 1A 13 57 33 AA D2 66 C9 4C
##$RELAX= 
##$RELAX= 
##$RELAX= 
##$RELAX= 
##$RELAX= 
##$RELAX= 
$$ Bruker specific parameters
$$ --------------------------
##$DU= <F:/spectra>
##$EXPNO= 1
##$NAME= <H-F>
##$PROCNO= 1
##$TYPE= <nmr>
##$USER= <she>
##$AMP= (0..31)
100 100 100 100 100 100 100 100 100 100 100 100 100 100 100 100 100 100 
100 100 100 100 100 100 100 100 100 100 100 100 100 100 
##$AQSEQ= 0
##$AQ_mod= 1
##$AUNM= <au_zg>
##$AUTOPOS= <>
##$BF1= 200.13
##$BF2= 200.13
##$BF3= 200.13
##$BF4= 200.13
##$BF5= 200.13
##$BF6= 200.13
##$BF7= 200.13
##$BF8= 200.13
##$BYTORDA= 1
##$CFDGTYP= 0
##$CFRGTYP= 5
##$CHEMSTR= <none>
##$CNST= (0..31)
1 1 145 1 1 1 1 1 1 1 1 1 1 1 1 1 1 1 1 1 1 1 1 1 1 1 1 1 1 1 1 1 
##$CPDPRG= <>
##$CPDPRG1= <>
##$CPDPRG2= <>
##$CPDPRG3= <>
##$CPDPRG4= <mlev>
##$CPDPRG5= <mlev>
##$CPDPRG6= <mlev>
##$CPDPRG7= <mlev>
##$CPDPRG8= <mlev>
##$CPDPRGB= <>
##$CPDPRGT= <>
##$D= (0..31)
0 1.2 0 0 0 0 0 0 0 0 0 0.03 0 0 0 0 0 0 0 0 0 0 0 0 0 0 0 0 0 0 0 0 
##$DATE= 1554809317
##$DBL= (0..7)
120 120 120 120 120 120 120 120 
##$DBP= (0..7)
150 150 150 150 150 150 150 150 
##$DBP07= 0
##$DBPNAM0= <>
##$DBPNAM1= <>
##$DBPNAM2= <>
##$DBPNAM3= <>
##$DBPNAM4= <>
##$DBPNAM5= <>
##$DBPNAM6= <>
##$DBPNAM7= <>
##$DBPOAL= (0..7)
0.5 0.5 0.5 0.5 0.5 0.5 0.5 0.5 
##$DBPOFFS= (0..7)
0 0 0 0 0 0 0 0 
##$DE= 6
##$DECBNUC= <off>
##$DECIM= 24
##$DECNUC= <off>
##$DECSTAT= 4
##$DIGMOD= 1
##$DIGTYP= 9
##$DL= (0..7)
0 120 120 120 120 120 120 120 
##$DP= (0..7)
150 150 150 150 150 150 150 150 
##$DP07= 0
##$DPNAME0= <>
##$DPNAME1= <>
##$DPNAME2= <>
##$DPNAME3= <>
##$DPNAME4= <>
##$DPNAME5= <>
##$DPNAME6= <>
##$DPNAME7= <>
##$DPOAL= (0..7)
0.5 0.5 0.5 0.5 0.5 0.5 0.5 0.5 
##$DPOFFS= (0..7)
0 0 0 0 0 0 0 0 
##$DQDMODE= 0
##$DR= 18
##$DS= 0
##$DSLIST= <SSSSSSSSSSSSSSS>
##$DSPFIRM= 0
$$ [...]
##$SUBNAM2= <"">
##$SUBNAM3= <"">
##$SUBNAM4= <"">
##$SUBNAM5= <"">
##$SUBNAM6= <"">
##$SUBNAM7= <"">
##$SUBNAM8= <"">
##$SUBNAM9= <"">
##$SW= 24.9337058887773
##$SWIBOX= (0..15)
0 0 2 0 0 0 0 0 0 0 0 0 0 0 0 0 
##$SW_h= 4990.01996007984
##$TD= 16384
##$TD0= 1
##$TE= 0
##$TE2= 300
##$TE3= 300
##$TEG= 300
##$TL= (0..7)
0 120 120 120 120 120 120 120 
##$TP= (0..7)
150 150 150 150 150 150 150 150 
##$TP07= 0
##$TPNAME0= <>
##$TPNAME1= <>
##$TPNAME2= <>
##$TPNAME3= <>
##$TPNAME4= <>
##$TPNAME5= <>
##$TPNAME6= <>
##$TPNAME7= <>
##$TPOAL= (0..7)
0.5 0.5 0.5 0.5 0.5 0.5 0.5 0.5 
##$TPOFFS= (0..7)
0 0 0 0 0 0 0 0 
##$TUNHIN= 0
##$TUNHOUT= 0
##$TUNXOUT= 0
##$USERA1= <user>
##$USERA2= <user>
##$USERA3= <user>
##$USERA4= <user>
##$USERA5= <user>
##$V9= 5
##$VALIST= <valist>
##$VCLIST= <CCCCCCCCCCCCCCC>
##$VD= 0
##$VDLIST= <DDDDDDDDDDDDDDD>
##$VPLIST= <PPPPPPPPPPPPPPP>
##$VTLIST= <TTTTTTTTTTTTTTT>
##$WBST= 1024
##$WBSW= 4
##$XGAIN= (0..3)
0 0 0 0 
##$XL= 0
##$YL= 0
##$YMAX_a= 42762
##$YMIN_a= -81085
##$ZGOPTNS= <>
##$ZL1= 120
##$ZL2= 120
##$ZL3= 120
##$ZL4= 120
##$ABSF1= 10
##$ABSF2= 0
##$ABSG= 5
##$ABSL= 3
##$ALPHA= 0
##$AQORDER= 0
##$ASSFAC= 0
##$ASSFACI= 0
##$ASSFACX= 0
##$ASSWID= 0
##$AUNMP= <proc_1d>
##$AZFE= 0.1
##$AZFW= 0.1
##$BCFW= 1
##$BC_mod= 2
##$BYTORDP= 1
##$COROFFS= 0
##$CY= 11.3945322036743
##$DATMOD= 1
##$DC= 2
##$DFILT= <>
##$DTYPP= 0
##$F1P= 18.9103706918063
##$F2P= -1.10871071338519
##$FCOR= 0.5
##$FTSIZE= 0
##$FT_mod= 4
##$GAMMA= 1
##$GB= 0.15
##$INTBC= 1
##$INTSCL= 1
##$ISEN= 128
##$LB= 0.24
##$LEV0= 0
##$LPBIN= 0
##$MAXI= 10000
##$MC2= 0
##$MEAN= 0
##$ME_mod= 0
##$MI= 1.114404
##$NCOEF= 0
##$NC_proc= 0
##$NLEV= 6
##$NOISF1= 3.799351
##$NOISF2= 2.8
##$NSP= 1
##$NTH_PI= 0
##$NZP= 0
##$OFFSET= 15.70392
##$PC= 1
##$PHC0= -9011.272
##$PHC1= 14.80026
##$PH_mod= 1
##$PKNL= yes
##$PPARMOD= 0
##$PSCAL= 0
##$PSIGN= 0
##$REVERSE= no
##$SF= 200.130013532006
##$SI= 16384
##$SIGF1= 3
##$SIGF2= 2
##$SINO= 400
##$SIOLD= 16384
##$SREGLST= <1H.CDCl3>
##$SSB= 0
##$STSI= 0
##$STSR= 0
##$SW_p= 3612.71676300578
##$SYMM= 0
##$S_DEV= 0
##$TDeff= 0
##$TDoff= 0
##$TI= <>
##$TILT= no
##$TM1= 0
##$TM2= 0
##$TOPLEV= 0
##$USERP1= <user>
##$USERP2= <user>
##$USERP3= <user>
##$USERP4= <user>
##$USERP5= <user>
##$WDW= 1
##$XDIM= 8192
##$YMAX_p= 0
##$YMIN_p= 0
$$ End of Bruker specific parameters
$$ ---------------------------------
##NTUPLES= NMR FID
##VAR_NAME=  TIME,          FID/REAL,        FID/IMAG
##SYMBOL=    X,             R,               I
##VAR_TYPE=  INDEPENDENT,   DEPENDENT,       DEPENDENT
##VAR_FORM=  AFFN,          ASDF,            ASDF
##VAR_DIM=   8192,          8192,            8192
##UNITS=     SECONDS,       ARBITRARY UNITS, ARBITRARY UNITS
##FACTOR=    0.0002004,     1,               1
##FIRST=     0,             0,               0
##LAST=      1.6414764,     0,               0
##MIN=       0,             -81085,          0
##MAX=       1.6414764,     42762,           0
$$ Real data points
##PAGE= N=1
##DATA TABLE= (X++(R..R)), XYDATA
0 0 0 0 0 0 0 0 0 0 0 1 -8 8 -8 8 -9 16 -16 17 -24 25 -32 40 -42 49 -57 65 -74 84 -97 109 -123 139 -155
33 -155 171 -194 214 -239 265 -296 328 -362 401 -444 491 -543 603 -670 748 -835 935 -1056
51 -1056 1200 -1377 1601 -1892 2292 -2878 3819 -5585 10082 -47394 -81085 -32888 -65406 -64800
65 -64800 -41622 -41882 -67315 -53398 -39936 -38085 -35967 -36491 -49682 -41533 -35899 -45852 -33624 -3367
79 -3367 -19684 -43502 -20074 -6387 -37422 -32011 6226 -3111 -34373 -20770 -3919 -14518 -11279
92 -11279 6452 7558 5619 3454 -9478 -5983 14189 5409 -9625 9052 11812 -20467 -16235 18530
106 18530 9786 -10449 11484 20112 -10057 -13430 11626 12093 3539 9631 8119 3690 10213 7299
120 7299 5747 27686 31069 1996 2083 24218 8156 -9207 17914 27674 -3010 -5221 16541 6913
134 6913 -4384 14873 21635 6240 3039 2746 -3163 4283 8158 -4537 805 13668 -7429 -22297
148 -22297 5111 13455 -13973 -11410 8512 -11159 -30779 -11365 -2616 -17399 -13304 -3931 -14179
161 -14179 -16537 -7226 -8609 -4903 5071 -6728 -16682 -223 133 -19792 -6107 17702 -1304 -17887
175 -17887 4246 10565 -8853 -1674 15883 5244 -3774 4160 1756 -1213 10083 10360 4383 13846
189 13846 13948 -1670 7436 24413 8874 -793 19941 16854 -8940 351 21183 8248 -1379
202 -1379 13086 12312 -286 5079 9347 4020 10253 12409 -1246 1214 13622 2900 -2466 17250
216 17250 16361 -4683 3885 18811 1620 -5343 15339 13633 -5151 710 9314 184 957 9047
230 9047 3185 2859 10485 728 -5774 10423 11035 -6238 1415 14234 -2466 -9278 10023 8714
244 8714 -7253 2713 11459 -3853 -6478 6232 1948 -4032 4023 1356 -5893 3210 4347 -7154
258 -7154 1495 13390 -1633 -8110 9271 7229 -8236 1992 12305 -1666 -4143 8817 2971
271 2971 -4645 6465 7931 -2413 2807 7388 -2525 411 9895 282 -3957 10175 6414 -8534
285 -8534 2238 12842 -1892 -4985 9357 3787 -6852 3255 5771 -5036 -130 6559 -4091
298 -4091 -5160 5533 -774 -7460 3498 2694 -9393 -1933 6013 -7820 -8880 5693 -873 -12863
312 -12863 -1934 2763 -10128 -7202 1983 -6813 -9800 331 -4758 -12805 -2265 -339 -12445 -7743
326 -7743 1127 -9335 -12137 229 -4628 -14364 -3378 462 -12985 -9651 1684 -6821 -12234 -1106
340 -1106 -2767 -11427 -3192 461 -9853 -5541 4080 -5430 -9386 3110 998 -8975 -134 4757 -6311
355 -6311 -3754 6566 -1800 -6757 5318 4410 -6365 1088 7485 -2535 -1517 7842 1111 -3378
369 -3378 7548 6015 -4392 3728 10327 -981 -940 9939 3483 -2960 7182 6965 -3536 3398
383 3398 9723 -1194 -1581 9508 3658 -3581 6193 6994 -2785 3119 9360 -1171 -1218 9850 3415
398 3415 -4369 5813 7538 -3488 817 7921 -1361 -2678 7415 1720 -5666 4207 6010 -5049
412 -5049 -847 7164 -1766 -3991 5883 1562 -5788 3623 5381 -5444 -1162 7360 -1620 -4968 4996
427 4996 1947 -6065 1798 4171 -5766 -1963 6215 -2391 -5691 5120 2685 -5806 1692 5423 -4133
442 -4133 -1430 6688 -1359 -4800 5737 3468 -5717 1813 6611 -2919 -1797 6273 -256 -4393 5101
457 5101 2942 -5611 1875 6714 -3213 -1985 7529 1346 -3500 5943 4974 -4300 2386 7874 -2345
472 -2345 -2242 7426 1938 -4294 4275 5013 -3243 2024 6466 -2603 -2010 6782 384 -5722 4015 4508
488 4508 -5497 -261 6606 -2466 -3502 6162 1079 -6312 1787 3317 -6378 -3161 3320 -3922 -5301
503 -5301 2308 -2171 -7121 1756 1926 -7984 -2616 4207 -5517 -8032 2596 -258 -8177 -416 2992
518 2992 -5876 -3256 4057 -2130 -5082 2435 -293 -6577 -19 1119 -6292 -1422 4879 -4147 -5558
533 -5558 5514 1876 -7293 1068 6017 -4511 -4808 3357 -1374 -5599 2088 1318 -4708 394 2339
548 2339 -4906 -2004 3968 -3799 -5714 3149 -1432 -9760 -399 4778 -6216 -5383 5439 -343 -7609
563 -7609 327 2724 -4524 -1949 1178 -4795 -3745 1711 -3319 -4319 4165 893 -7259 304 4361
578 4361 -6255 -5160 5786 -979 -9551 -305 2932 -6198 -3883 3786 -977 -4077 -51 -2942 -4997
593 -4997 777 -1682 -7941 -1278 1201 -9062 -6997 4404 -1243 -9170 598 2750 -8744 -6781
607 -6781 2865 -2409 -7291 -701 -599 -5498 -2118 -475 -2877 1580 3176 -5045 -3275 5589 -1325
622 -1325 -7468 4168 7078 -5513 -3337 7403 1790 -3642 5547 7380 -649 881 4410 497
636 497 1643 5086 1298 2141 7182 1251 -2701 8321 9552 -2160 1549 11511 1711 -5670 5768
651 5768 8985 -758 1203 7565 2576 216 5161 4197 3230 6472 2628 -1469 4770 4727 -3495 2500
667 2500 11074 826 -5115 6853 7639 -3999 348 10102 2462 -4196 1685 2828 -1187 1688 2414
682 2414 -114 2591 1640 -4465 139 6553 -1736 -5450 4609 2109 -9841 -3304 7133 -1799 -7347
697 -7347 2337 2541 -6273 -4152 1376 -1068 -1894 -1414 -4844 -3135 483 -5058 -5597 4388 1513 -9293
713 -9293 -3034 5164 -4771 -8003 4340 3313 -8242 -4476 2962 -2278 -4454 1454 1433 -1108 -494
728 -494 -3229 -2798 3892 1505 -5735 1037 6050 -5196 -7096 6703 5259 -5755 51 7321 -1857
743 -1857 -5252 3630 4302 -1101 755 1740 -567 1236 749 -1586 4335 6421 -3438 -3740 6988 2576
759 2576 -6953 2000 9603 -2114 -6307 4060 3423 -3907 255 4737 82 -1692 -586 -2045 423
774 423 2304 -2670 -2197 4158 -1695 -8742 1353 6454 -5161 -6162 5064 685 -9304 -2561 4464
789 4464 -2128 -4378 -145 -1545 -3469 -1594 -2670 -1918 2289 -1871 -7116 -260 2693 -6676 -4573
804 -4573 6076 -165 -9609 -1175 4354 -4957 -5562 3392 1061 -4921 -2434 -997 -2103 209 -746
819 -746 -3807 443 1137 -6688 -4238 5297 -230 -7325 1149 4245 -6735 -5709 4865 1056 -5965
834 -5965 -484 2200 -3539 -3013 214 -715 577 933 -3835 -2225 3786 -1247 -5696 3107 4891 -5977
850 -5977 -4392 5165 131 -5995 1821 4534 -3586 -3205 2013 -379 -2266 855 -555 -1680 830
865 830 -2450 -4913 2078 3123 -5342 -2760 5075 -1911 -7904 1317 4059 -4923 -3562 2745 -1732
880 -1732 -4990 331 812 -2135 108 -277 -3464 -144 1216 -3968 -1287 4524 -1755 -6026 2853 3990
896 3990 -4837 -1397 6498 422 -4407 2120 2910 -1854 866 3142 -280 636 2867 -847 320 5236
912 5236 1100 -2231 4412 4165 -4005 116 7153 529 -3363 4558 4713 -2583 622 5329 1135 68
928 68 3307 720 -422 3326 1135 -1769 3416 3878 -2997 15 5737 -192 -3033 4661 3599 -4013
944 -4013 -148 4844 -929 -2353 3309 1597 -2031 1287 1190 -1915 1274 2255 -3090 -1175 3457 -1993
960 -1993 -4779 2417 1817 -5082 -1188 3468 -2922 -4186 2252 300 -4585 -537 1019 -3808 -1946
975 -1946 912 -3006 -2425 1714 -2205 -4696 1401 640 -5689 -1733 3046 -3183 -4844 1989 33 -4674
991 -4674 172 2114 -3259 -1603 2494 -1312 -2555 2050 70 -3175 1411 1631 -3535 -239 3905
1006 3905 -1753 -2955 3881 1610 -3726 1071 3786 -1886 -1154 3599 107 -1915 3110 1915 -2085
1021 -2085 1935 3609 -1563 -24 4327 -187 -1903 3754 2124 -2982 1607 4323 -1715 -1251 4337
1036 4337 939 -2225 2675 2395 -2024 1175 3404 -1622 -638 4035 254 -2420 2941 2444 -2933 781
1052 781 3590 -2071 -1604 3868 116 -3283 1928 2361 -3078 -162 3236 -1684 -1697 2956 -159 -2916
1068 -2916 2032 1983 -3350 -127 3429 -1918 -2425 2927 295 -3466 1468 1969 -3395 -718 3134 -1687
1084 -1687 -2647 2585 396 -3405 964 1869 -3078 -631 2831 -1997 -2870 2549 482 -3778 724 2200
1100 2200 -3215 -1417 2538 -1729 -3134 2060 323 -3959 364 2260 -3112 -1654 2560 -1323 -3073
1115 -3073 1958 498 -3834 347 2076 -3136 -1972 2599 -1118 -3263 1456 683 -3674 8 1987
1130 1987 -3096 -2140 2395 -1014 -3542 1667 1110 -3465 1 2373 -2639 -1909 2737 -846 -3559 1790
1146 1790 1627 -3455 -241 2833 -1975 -1750 2776 -193 -2835 1906 1786 -3009 -7 3031 -1596 -1559
1162 -1559 3345 365 -2390 2421 2553 -2511 373 4061 -989 -1794 3362 1221 -2348 1736 2783
1177 2783 -1785 514 3547 -838 -1136 3516 985 -2396 2254 3080 -2169 187 3924 -542 -1763
1192 -1763 3571 1793 -2667 1411 3273 -1680 -630 3236 -287 -1657 2631 914 -2491 1708 2563
1207 2563 -2472 -633 3742 -894 -2850 2641 1511 -3319 244 2710 -2223 -1716 2544 -263 -2630
1222 -2630 1375 749 -2875 133 1386 -2872 -1366 2389 -1703 -3557 2107 1040 -4247 -505 2763
1237 2763 -2574 -3136 2035 -403 -3535 428 768 -3058 -938 1432 -2305 -1616 1923 -1379 -3070 1834
1253 1834 556 -4243 -263 3102 -2669 -3200 2791 430 -3781 227 2090 -2088 -971 1905 -1243
1268 -1243 -1555 1715 -400 -2206 1806 1214 -3069 382 3236 -1982 -2181 3722 1114 -3677 1202 3577
1284 3577 -1815 -1236 3190 515 -1296 1824 1226 -1001 1893 1894 -1568 1059 3668 -1118 -1306 4263
1300 4263 1744 -3022 2007 4411 -1803 -1111 4371 1609 -2092 1980 2841 -809 830 2249 -363
1315 -363 907 2789 -792 -809 3987 1052 -2958 2175 4273 -2182 -1635 4353 833 -3295 1628 3206
1331 3206 -1744 -849 2229 -270 -709 1488 -260 -938 2025 -2 -3113 1457 2736 -3444 -2023 3916
1347 3916 -175 -4644 1106 2834 -2876 -2211 2211 -481 -2651 399 -35 -1690 26 -454 -2533 288
1363 288 1133 -3388 -1759 3201 -1239 -4946 1249 2553 -4090 -2851 3047 -384 -4087 102 1089 -2312
1379 -2312 -919 251 -1599 -584 346 -2661 -1545 2115 -1340 -3891 1740 2234 -4368 -2032 4026
1394 4026 -521 -4344 1176 2530 -2993 -2032 1632 -432 -1356 577 -765 -820 1617 -741 -2510 2078
1410 2078 2071 -3707 -1051 4021 -1034 -4201 2572 3216 -3299 -1303 3291 -54 -2456 1039 1100 -690
1426 -690 327 -234 -1412 1405 1352 -2589 40 3931 -1161 -3601 2815 2947 -3537 -910 3923 -543
1442 -543 -3503 1649 2175 -1447 -82 1563 -378 101 586 -1484 341 2727 -1222 -2678 2666 1738
1458 1738 -3926 -267 4883 -529 -3468 2389 2356 -2669 -583 2711 -15 -1211 820 -41 -398 1474
1474 1474 -236 -1030 2697 985 -3723 194 4012 -1600 -3251 3459 2394 -3793 -852 3600 -319
1489 -319 -1941 1703 824 -1312 72 -32 -908 1302 702 -2398 162 2602 -2301 -2667 3523 1617
1505 1617 -4214 -251 3481 -1858 -3386 2159 1605 -2355 -452 851 -1082 -382 475 -1230 137 1631
1521 1631 -2239 -2533 2266 565 -3871 414 3328 -2639 -3487 2691 1305 -3290 -224 2270 -1457
1536 -1457 -1983 299 -461 -516 970 -916 -1391 1841 90 -3314 853 3113 -2285 -2522 2988 637
1552 637 -3725 563 3311 -1376 -1665 2089 481 -1291 934 980 -400 1435 619 -1851 1170 2892
1568 2892 -1412 -971 3841 1279 -3024 1540 3824 -1224 -1067 3518 1198 -1862 1492 2126 -256 1198
1584 1198 2134 -149 942 2332 -514 -240 3505 1060 -2344 1959 3438 -1700 -891 4006 1417 -2104
1600 -2104 1418 2399 -1270 8 2134 -22 -352 1554 -159 -859 1981 613 -1801 1309 2219 -2271
1616 -2271 -1399 2888 -55 -2965 1201 1987 -2500 -1258 1732 -692 -1639 967 64 -1851 360 86
1632 86 -2297 -103 1432 -2233 -1598 1835 -960 -3143 912 1462 -3062 -1552 1853 -1261 -2916 679
1648 679 468 -2162 -286 462 -1933 -672 1061 -1487 -1411 1598 -707 -2782 745 1425 -2602 -902
1664 -902 2467 -966 -2490 1391 885 -2113 -24 1660 -1092 -874 1423 -440 -1123 1617 340 -1853
1680 -1853 1009 1709 -2008 -364 2744 -346 -1912 1860 1360 -1794 309 2337 -607 -776 1891 285
1696 285 -1124 1447 1099 -1145 874 1836 -1375 -361 2401 -133 -1785 1754 1551 -1828 133 2251
1712 2251 -821 -1033 1965 385 -1569 1137 1155 -1610 98 1658 -1028 -953 1768 -235 -1752 1333
1728 1333 1110 -2164 -269 2092 -1169 -1601 1540 328 -1962 571 1164 -1686 -313 1444 -950 -1327
1744 -1327 1509 21 -1928 775 1019 -1828 -481 1847 -1050 -1543 1624 442 -2042 519 1435 -1531
1760 -1531 -749 1701 -699 -1544 1318 323 -1818 620 1499 -1562 -578 1865 -644 -1361 1356 614 -1947
1777 -1947 447 1415 -1489 -717 1830 -367 -1635 1120 639 -1858 162 1346 -1457 -815 1730 -451
1793 -451 -1750 1085 713 -1883 -82 1456 -1267 -1185 1536 -351 -1748 1064 781 -1783 -91 1350
1809 1350 -1287 -1281 1467 -313 -1696 1005 737 -1710 -47 1461 -1165 -1200 1437 -72 -1895 651
1825 651 871 -1799 -172 1554 -1079 -1238 1550 91 -1623 769 1051 -1504 -81 1631 -802 -1024
1841 -1024 1750 264 -1681 875 1402 -1386 -247 1904 -398 -857 1583 661 -1326 942 1474 -1159
1857 -1159 -95 1916 -372 -793 1740 488 -1311 976 1447 -1153 -276 1918 -177 -1273 1361 864
1873 864 -1374 462 1262 -1045 -582 1293 -601 -1401 1124 362 -1892 193 1130 -1701 -899 1385 -716
1890 -716 -1911 639 348 -2224 -350 897 -1569 -1493 747 -795 -1981 433 13 -2077 -389 731
1906 731 -1939 -1471 959 -922 -2188 432 383 -2202 -740 1109 -1500 -1621 851 -331 -1868 179
1922 179 342 -1731 -366 845 -1221 -852 1291 -537 -1780 917 835 -1804 -316 1771 -802 -1389
1938 -1389 1335 637 -1456 681 1308 -788 -173 1549 -238 -462 1636 402 -865 1505 1446 -1121
1954 -1121 669 2565 -157 -800 1997 1141 -1073 886 2154 -344 -71 1663 443 -305 1696 927
1970 927 -355 1263 1446 -921 379 2153 -270 -813 2036 928 -1736 419 2111 -645 -609 1621
1986 1621 382 -1178 500 671 -668 416 843 -1062 -308 1222 -814 -1144 1578 402 -2038 180
2002 180 1309 -1531 -1419 1594 265 -1883 -27 729 -1067 -372 685 -579 -726 533 -898 -1170
2018 -1170 1048 329 -1778 351 1522 -1618 -1399 1786 331 -1798 523 1496 -1341 -1030 1035 14
2034 14 -591 674 -30 -794 525 209 -1141 714 1535 -1186 -962 1868 46 -1807 1012 2113 -1041
2051 -1041 -897 1402 283 -924 735 979 -448 195 242 -812 432 1187 -715 -181 1857 -23 -1899
2068 -1899 1042 1772 -1316 -708 1948 -58 -1746 491 1296 -573 -110 806 -301 -278 403 -573 -120
2085 -120 1517 -243 -1471 969 1106 -1700 -366 2326 32 -2016 694 1287 -1391 -414 1373 55
2101 55 -795 189 -202 -411 873 80 -655 968 715 -1691 -324 2073 -242 -1490 1300 1267 -1937 -789
2119 -789 1831 200 -1084 757 640 -700 -215 139 -178 714 670 -1202 -151 1333 -700 -1295 1590
2136 1590 1441 -1732 -539 1683 -434 -1535 1015 1222 -1008 -534 434 -524 -183 435 -413 -128 687
2153 687 -1043 -1455 1067 731 -1864 -164 1641 -1271 -2296 898 799 -1742 -577 909 -857 -1399
2169 -1399 -19 -276 -512 78 -629 -1081 385 -352 -1855 33 1515 -1338 -1876 1032 405 -2216 -303
2186 -303 1745 -729 -1499 469 142 -1023 -6 305 -365 118 -5 -1054 200 1230 -807 -922 1668
2203 1668 357 -2100 225 2167 -398 -1121 1388 840 -1124 -26 1004 190 255 785 -69 184 975
2220 975 -372 -178 1926 716 -1256 807 1921 -855 -733 2158 1201 -1342 298 1533 -186 -356
2236 -356 1129 551 9 502 -43 -199 1106 555 -816 814 1406 -1053 -916 1818 734 -1413 482
2253 482 1535 -1022 -943 1083 403 -716 253 238 -656 41 53 -867 349 843 -1226 -1068 1033 -174
2271 -174 -1887 391 1344 -1402 -1342 780 -306 -1560 24 625 -881 -628 4 -793 -497 351 -557 -687
2289 -687 644 -369 -1819 359 1074 -1390 -1027 1071 -305 -1811 309 821 -976 -546 600 -626
2305 -626 -774 199 -265 -641 578 -78 -1031 305 681 -1272 -469 1496 -94 -1487 604 861 -1241
2322 -1241 -473 1199 -204 -802 397 173 -679 365 442 -718 167 524 -954 -512 1229 53 -1103
2339 -1103 787 916 -1198 -383 1321 -107 -899 772 563 -765 136 711 -428 48 790 -473 -400
2356 -400 917 12 -895 888 916 -1094 -248 1305 -392 -857 930 725 -956 -67 1035 -328 -306 826
2374 826 -72 -469 638 179 -798 562 925 -862 -89 1029 -373 -1092 936 644 -1014 180 1076
2391 1076 -526 -545 893 158 -709 593 454 -771 262 769 -765 -310 1090 -264 -968 640 614
2408 614 -1009 39 1157 -523 -740 926 183 -772 476 492 -789 19 705 -620 -250 831 -93
2425 -93 -983 647 415 -1181 -190 970 -648 -835 849 49 -1004 255 509 -863 -233 596 -468
2442 -468 -737 714 94 -977 452 564 -834 -136 835 -464 -696 905 164 -998 217 633 -700
2459 -700 -277 994 -280 -617 734 320 -811 374 752 -659 -106 1053 -190 -642 950 461 -792
2476 -792 374 892 -472 -182 1137 58 -568 743 562 -644 509 946 -384 -180 1141 109 -584
2493 -584 924 783 -614 327 984 -438 -191 1139 178 -610 819 662 -746 277 942 -339 -173
2510 -173 1015 150 -719 708 611 -642 104 955 -516 -490 949 153 -762 448 562 -774 -170 834
2528 834 -619 -676 702 99 -1104 192 413 -823 -318 771 -797 -773 468 -83 -1245 110 420
2545 420 -1048 -500 600 -616 -970 354 -116 -1107 -22 328 -1099 -514 471 -689 -938 480 -304
2562 -304 -1118 5 439 -1088 -523 634 -590 -986 425 60 -937 16 460 -867 -437 692 -388
2579 -388 -738 516 61 -866 210 671 -740 -278 902 -248 -654 697 342 -822 175 805 -467
2596 -467 -283 846 57 -386 645 463 -601 371 889 -434 -115 1048 24 -570 815 749 -667 281
2614 281 1122 -303 -274 1002 193 -576 726 796 -383 233 926 -48 -270 930 83 -383 780 520 -615
2633 -615 17 1012 -276 -439 921 318 -726 454 752 -521 -17 787 -164 -303 632 -5 -796 434
2651 434 559 -707 32 925 -406 -684 838 340 -957 226 864 -505 -350 752 3 -527 474
2668 474 213 -630 65 473 -678 58 795 -425 -753 782 231 -1150 233 920 -614 -534 659 95
2686 95 -731 396 448 -482 107 293 -446 -134 921 -287 -476 762 134 -982 223 1063 -575 -517 821
2705 821 57 -916 361 717 -487 -79 513 -365 -302 504 -68 -306 636 236 -909 245 870 -629 -519
2724 -519 989 130 -1085 384 650 -626 -229 805 2 -548 282 124 -407 498 252 -570 264 646
2742 646 -681 -376 1058 149 -881 492 834 -787 -422 912 88 -552 558 343 -492 99 325 -335
2760 -335 190 638 -466 -304 826 -110 -795 643 775 -905 -511 1197 -44 -778 591 679 -549 -170
2778 -170 533 -161 -115 431 -76 -208 532 -265 -871 570 677 -915 -221 1102 -235 -1195 647 834 -716
2797 -716 -178 542 -306 -724 199 136 -324 191 -222 -754 -31 154 -835 -268 918 -522 -1296 497 317
2816 317 -1150 -411 866 -451 -976 119 38 -583 -139 33 -497 -233 1 -836 -309 631 -338 -842 599
2835 599 300 -1451 -250 976 -447 -956 459 268 -868 -196 532 -260 -194 293 -269 -191 395 -129 -507
2854 -507 789 285 -968 64 911 -502 -561 931 639 -808 -15 860 -178 -199 756 235 -291 367
2872 367 15 -240 617 398 -517 181 893 -397 -509 1188 690 -706 189 1131 -316 -416 832 447
2890 447 -369 345 464 -198 214 496 -82 275 801 -373 -390 846 430 -787 213 1125 -497 -597 850
2909 850 414 -702 210 634 -166 -106 298 -169 -104 380 -292 -308 580 112 -817 305 845 -652 -626 931
2929 931 44 -968 98 625 -527 -431 416 -217 -374 232 -65 -356 279 62 -728 91 436 -657 -517
2948 -517 938 73 -1093 134 649 -720 -518 594 -247 -661 68 187 -654 39 125 -399 21 352 -632
2967 -632 -446 822 20 -1066 253 582 -784 -459 807 -22 -865 220 352 -718 -303 350 -203 -60
2985 -60 206 -266 -421 553 126 -757 400 532 -694 -287 755 -218 -807 351 586 -627 -231 599 -141
3004 -141 -264 360 112 -329 298 159 -621 261 625 -576 -118 723 -200 -624 486 728 -539 -230 669
3023 669 -23 -429 502 326 -423 226 291 -468 239 454 -301 -150 676 73 -656 424 458 -565 -72 749
3043 749 -120 -704 456 249 -629 48 400 -342 -26 350 -242 -239 384 -48 -557 386 254 -685 -228 745
3063 745 -288 -628 327 166 -705 -65 402 -398 -334 335 -185 -366 337 -97 -582 100 130 -676 -146 473
3083 473 -282 -701 489 224 -802 -40 397 -433 -368 461 11 -482 233 290 -493 -53 428 -321 -308 427
3103 427 -150 -523 449 330 -568 82 634 -351 -555 516 161 -655 287 325 -481 -128 519 -201 -227 541
3123 541 -12 -411 398 372 -511 127 689 -311 -428 725 236 -482 347 602 -411 -40 609 -84 -261
3142 -261 678 197 -382 389 387 -435 80 768 -199 -321 778 290 -574 307 626 -278 -79 714 -192 -219 510
3163 510 321 -429 267 430 -245 -156 461 -136 -350 524 237 -454 259 581 -318 -191 426 -38 -439 401
3183 401 204 -475 75 597 -304 -190 467 -131 -375 502 160 -509 -21 452 -476 -184 521 -157 -480 243
3203 243 236 -492 28 387 -427 -375 310 -109 -472 267 182 -634 -1 334 -379 -281 307 -126 -551 112 217 -481
3225 -481 -93 426 -357 -424 451 -23 -559 197 340 -469 -126 385 -185 -311 355 70 -586 218 337 -515
3245 -515 -115 468 -276 -398 394 86 -506 125 336 -260 -46 539 -303 -296 492 110 -545 172 362 -427 -160
3266 -160 681 -25 -261 476 181 -436 92 481 -281 -90 429 -10 -241 531 210 -271 191 412 -312 -113
3286 -113 550 1 -342 607 263 -482 86 503 -230 -199 492 54 -346 283 291 -347 106 329 -224 -187 514
3307 514 -117 -370 307 290 -449 19 474 -225 -279 475 86 -431 306 187 -355 -32 417 -262 -103 444 -13
3328 -13 -383 311 232 -472 -44 465 -290 -493 513 126 -493 156 393 -342 -19 306 -188 -190 236 56 -382
3349 -382 298 120 -450 54 653 -295 -308 475 103 -613 165 424 -350 -253 305 -15 -309 260 158 -264 151
3370 151 219 -336 58 479 -307 -321 522 131 -528 47 587 -341 -220 480 79 -408 192 357 -303 132 313
3391 313 -290 79 489 -140 -202 475 182 -278 324 542 -355 -224 613 79 -407 333 416 -258 118 307 -123
3412 -123 -58 320 -34 -81 386 119 -303 267 624 -305 -93 643 118 -453 340 485 -411 -21 453 -52 -198
3433 -198 255 177 -89 270 97 -324 240 359 -279 -251 515 -75 -593 342 322 -430 -152 553 -61 -432 193
3454 193 213 -264 -50 125 -453 -147 74 -273 -237 260 -263 -555 277 345 -637 -316 459 -262 -557 234 206
3475 206 -588 -124 212 -319 -176 261 -224 -234 130 -185 -529 244 216 -536 -267 456 -260 -716 327 252 -626
3496 -626 -138 398 -302 -373 183 -22 -363 160 45 -231 221 95 -400 97 355 -258 -381 427 228 -567
3516 -567 49 564 -209 -339 392 229 -267 3 287 -190 17 250 -182 177 464 -107 -260 492 208 -485
3536 -485 81 550 -176 -444 419 175 -353 34 401 -164 -41 202 -39 -126 300 -47 -133 430 131 -613 199
3557 199 404 -332 -338 511 183 -487 101 459 -181 -327 259 28 -335 183 -1 -263 37 73 -384 36 183
3578 183 -404 -258 393 -84 -668 152 422 -469 -361 308 94 -378 162 90 -274 -58 61 -234 -51 206
3598 206 -340 -180 370 -6 -720 77 424 -459 -364 342 117 -585 195 272 -300 -259 115 -167 -65 148 -239
3619 -239 -129 202 -61 -443 180 372 -443 -204 443 -134 -455 157 248 -373 -1 317 8 -108 127 155 -182
3640 -182 96 24 -328 139 292 -391 -168 565 -46 -339 208 364 -360 -52 528 -56 -314 250 130 -182
3660 -182 73 75 -68 -36 255 -276 -53 337 -99 -413 305 286 -439 -105 485 -15 -248 355 240 -142 82
3681 82 148 -129 -64 304 -2 -15 296 67 -206 291 344 -305 2 429 -194 -314 346 244 -200 -46 319 -213
3703 -213 -68 242 -71 -235 74 -184 -150 178 99 -366 -82 348 -169 -298 275 88 -448 -67 315 -222 -345
3724 -345 203 -38 -222 212 69 -318 -128 138 -315 -117 262 -133 -381 214 28 -404 -39 222 -332 -383
3744 -383 284 60 -335 166 145 -351 -114 154 -77 -154 285 -110 -400 135 218 -441 39 323 -346 -298 273
3765 273 103 -254 165 236 -147 24 293 -64 -20 196 63 -278 192 171 -280 -9 268 -41 -135 357 244
3786 244 -240 198 272 -212 -23 388 98 -147 358 40 -192 196 155 -143 36 407 -92 -265 297 225 -208
3807 -208 29 240 -166 -121 234 133 -321 266 157 -347 69 287 -35 -162 147 -35 -181 315 41 -245
3827 -245 39 258 -235 -48 356 25 -272 205 90 -256 74 178 -213 -196 187 -31 -322 144 120 -308 -4
3848 -4 343 -247 -173 181 -75 -416 -66 57 -471 -89 177 -154 -335 288 -10 -280 82 31 -323 -16 212
3869 212 -196 -332 248 -65 -177 132 101 -345 -19 299 -69 -219 101 70 -324 128 137 -92 -11 370 -74 -174
3891 -174 176 30 -276 127 105 -140 -132 186 -134 -286 209 102 -201 -82 161 -183 -132 115 -156 -187 345 -20
3913 -20 -139 113 185 -56 -104 311 27 -303 256 189 -226 -21 175 -150 -182 272 85 -342 143 202 -154 93
3935 93 214 -73 -70 192 6 -142 221 129 -104 27 313 -91 -154 244 47 -121 187 106 -232 -17 251 -67
3957 -67 -152 185 43 -217 203 203 -152 63 304 -237 -194 277 86 -275 119 165 -224 -43 232 -139 -162 97
3979 97 -81 -370 40 143 -281 -30 208 -90 -299 163 67 -332 -8 182 -259 -140 175 -143 -227 109 52
4000 52 -248 154 94 -266 -295 142 -64 -337 116 -15 -221 19 134 -244 -137 39 -133 -305 86 12 -224
4021 -224 -20 -31 -275 -143 130 -38 -242 231 116 -159 68 230 -285 -160 341 142 -362 145 106 -71 -20
4042 -20 154 -31 -16 175 -33 -205 63 97 -151 47 226 -132 -158 305 72 -318 253 310 26 -66 342 170
4064 170 -220 310 160 3 129 188 -162 27 288 -80 -162 245 -7 -249 145 242 -124 -46 284 0 -204
4085 -204 26 126 -108 5 104 -165 -135 128 -181 -52 77 139 -183 -67 266 -203 -208 288 -133 -214 112 134
4107 134 -252 -94 118 -87 -69 49 -33 -119 235 53 -242 40 220 -128 -70 99 -116 -222 222 210 -228 -64
4129 -64 83 -132 -246 241 21 -159 58 8 -168 21 79 -95 -47 215 -36 -351 71 174 -254 11 363
4150 363 -53 -186 135 127 -210 41 101 -56 85 229 -178 28 188 2 -187 145 22 -367 -73 241 -68
4171 -68 -137 209 158 -250 26 232 31 -104 148 -12 -95 194 53 -146 181 214 -309 -18 389 -15 -218 278
4193 278 214 -409 -51 372 -3 -141 213 125 -38 -25 47 -44 85 78 -110 -119 106 -81 -107 195 154 -193 36 233
4217 233 -80 -157 254 149 -203 53 247 -101 -189 -10 -137 -22 32 5 -62 206 70 -407 115 292 -247 -199
4239 -199 232 -26 -216 231 204 -96 -52 20 -88 -37 68 -9 -88 109 121 -183 -91 168 -191 -127 156 -4 -300
4262 -300 -24 209 -241 -153 149 51 -110 55 79 -194 -61 -9 -251 -24 27 -276 -127 209 -55 -308 119 167
4284 167 -124 -66 234 33 -164 -96 95 -137 -34 -9 -41 -17 125 -47 30 267 117 -228 17 158 -251 -158
4306 -158 358 -25 -98 199 168 -131 -81 147 5 -57 90 101 -46 253 53 -228 159 212 -157 -49 315 41
4328 41 -152 214 184 -130 -36 185 103 -93 146 143 -42 92 108 -86 60 162 -78 -113 216 -96 -208 57 174
4351 174 -188 47 206 -59 -168 84 55 -128 136 78 -189 15 28 -44 -26 234 -1 -261 123 155 -131 -131 251
4374 251 -30 -206 159 -3 -173 58 53 -100 -8 106 -24 -113 51 -62 -173 117 50 -303 -87 248 -51 -185
4396 -185 190 30 -274 -63 120 -86 -116 164 -95 -196 1 -106 -149 54 144 -192 -98 66 -166 -182 173 -19
4418 -19 -171 -46 289 -90 -196 138 148 -165 33 125 18 82 104 -73 -32 164 87 -25 118 17 -141 -95 162
4441 162 -91 -156 263 -38 -48 30 225 -163 -18 112 -76 -79 218 92 -65 66 22 -127 62 99 61 -190 95
4464 95 51 -165 92 157 -117 -92 141 -101 -128 16 15 -125 127 158 -195 -54 202 13 -81 159 29 -249 40
4487 40 128 -147 -33 233 -64 -159 149 87 -41 -8 41 -128 -39 164 -34 -117 112 14 -286 -11 -37 -170 -64
4510 -64 50 -63 -237 181 158 -65 19 87 -143 -59 179 -92 -195 107 -1 -94 -24 147 -31 -173 91 -62
4532 -62 -181 91 90 -234 -17 50 -171 -75 97 -150 -33 130 -8 -88 92 135 -155 -108 111 -10 -118 78 187
4555 187 -142 66 261 63 -136 146 19 -44 108 184 -42 116 76 69 -61 75 70 -134 112 139 -235 1 55
4578 55 -130 -53 32 182 -125 164 213 -80 -146 23 -67 -60 159 7 -131 153 109 -99 -16 233 58 -208 121
4601 121 42 -82 32 98 -4 -149 173 116 -11 216 89 -157 89 162 -107 -18 119 82 -59 96 -57 -80
4623 -80 17 120 -30 -123 89 16 -177 51 169 -21 -21 107 -32 -85 68 -49 -117 22 66 -251 -28 -38 -76 -143
4647 -143 48 69 -149 67 219 -247 -162 62 -175 -121 118 12 -229 69 66 -150 -49 36 -184 -108 93 26 -92
4670 -92 88 145 -141 -110 147 -45 -158 68 13 -153 71 75 -134 29 43 -11 -174 208 49 -231 187 47 -100
4693 -100 -48 168 -2 -228 126 26 -59 97 299 -132 -47 252 57 -114 43 -28 -137 150 109 13 34 169
4715 169 -147 -168 228 192 -152 -83 134 -141 -136 185 13 -62 122 67 -74 137 104 -103 -89 185 43 -14 67 108
4739 108 -53 18 221 52 -110 61 40 -53 28 36 -91 -48 154 -23 -36 81 89 -88 115 89 -19 -70 67 12
4763 12 -231 219 -20 -175 31 47 -95 -11 41 -55 -82 65 38 -114 110 156 -104 -169 95 -44 -110 92 60 -103
4787 -103 51 105 -139 38 20 -198 -115 119 -67 -40 103 74 -241 -49 70 -9 -103 117 147 -21 -30 145 -47
4810 -47 -52 78 -147 -99 31 54 -54 30 131 -12 -35 196 -127 -66 154 160 -229 -1 83 -64 -61 104 -43 -137 61
4835 61 106 -27 -66 79 -95 -39 106 -18 -173 97 59 -15 -38 210 -49 -8 184 74 -27 23 34 -65 -20 12
4859 12 -2 -76 153 -60 -141 -26 88 -119 122 189 -67 -19 99 81 -67 98 52 -163 56 71 -30 -104 70
4882 70 -124 -37 25 47 -222 -65 118 -112 -125 132 57 -136 -18 120 -127 -26 8 -47 26 -11 73 0 107 11
4906 11 -28 -33 119 -56 -60 107 17 -181 -110 159 -127 -127 43 6 -5 -51 -96 24 47 38 131 -100 -40 11 -13 177 41
4933 41 -53 50 62 -148 43 143 54 -25 76 23 -147 -28 173 27 45 124 101 -29 153 -75 -45 63 138 -20
4957 -20 -10 217 22 -193 95 55 -14 -3 146 67 -89 128 50 -95 58 -39 24 120 62 -52 -22 241 147 12
4981 12 112 115 -53 -30 222 -104 -112 24 38 -103 -54 -31 44 -81 106 -24 -63 148 -100 -148 119 59 -160 27
5005 27 152 -18 -111 58 102 -71 52 181 -30 48 -77 137 92 -37 -74 -185 56 32 -29 -76 161 -69 -126
5028 -126 81 148 -135 -10 109 62 -86 74 -123 -90 80 10 -68 -15 -41 -105 7 82 -46 -63 9 43 -119 46
5052 46 219 -140 41 91 68 -205 17 -15 -118 -85 -116 19 -28 71 -52 -13 60 -28 -182 -20 130 -124 -152 225
5076 225 -32 -143 37 84 75 -133 27 -35 -30 72 -28 -104 49 52 -114 41 67 6 -75 207 65 -55 134 149
5100 149 -50 1 122 67 56 30 159 -26 69 94 -36 -40 149 28 -71 208 146 -169 104 33 -63 -33 54 -113 -71
5125 -71 46 32 65 -43 33 -3 -51 53 -63 -31 162 4 -21 44 80 -164 -59 70 -59 -186 83 -15 -134 -9
5149 -9 -119 5 -3 134 -52 -34 66 85 -4 -77 155 -198 -13 76 19 -52 75 3 -62 -85 28 -77 -40 136 -108
5174 -108 -114 29 63 -30 235 2 33 -89 93 8 -15 38 -90 -88 28 61 -26 -106 83 7 -81 -35 37 -50 92 123
5200 123 -110 -1 38 23 -18 87 96 6 48 100 23 -111 160 49 -114 165 163 -9 77 145 -158 26 111 56 20
5225 20 -25 210 -56 -29 115 -65 -165 113 41 4 -39 -10 -101 87 78 39 100 85 76 -106 134 42 -114 -73 31 61
5251 61 -94 153 -3 -108 -7 77 -33 91 115 102 26 43 1 -98 24 27 -104 -7 -35 -16 -115 -8 72 -37 -5
5276 -5 70 66 -80 41 95 -55 115 106 -10 -39 231 -128 40 174 -161 -66 92 156 -191 -32 101 -77 68 9
5300 9 156 -185 -17 81 -92 30 94 43 -17 30 117 -78 -44 32 -60 -5 54 -161 -58 65 101 23 -28 -28 0 -24 46
5327 46 -56 -38 92 22 -252 40 75 -46 -92 112 35 -59 -8 3 -67 64 -18 20 -79 303 -6 -86 106 -98 -47
5352 -47 -68 -59 -32 100 -36 9 -102 134 -12 -26 -8 -9 -122 -44 173 -75 -98 115 12 -139 120 52 -97 -8 121
5377 121 -111 -9 221 33 -127 -33 -86 19 26 66 -65 71 -73 128 75 -32 123 86 96 59 -19 -40 40 -77
5401 -77 -16 48 -29 -8 -99 130 -23 12 -14 74 -57 -4 153 13 -42 94 -144 -16 115 97 19 22 96 -81 -141 1
5427 1 20 -116 -13 -33 7 -71 196 -39 -106 28 -147 -50 -39 -47 -81 36 89 89 -168 -87 -22 -45 -25 36 -20 -3 70 -103
5455 -103 -86 89 -38 -72 67 95 -37 -178 65 21 -96 54 85 -130 0 86 17 -100 199 -13 54 38 187
5478 187 -54 -13 120 -47 34 57 -52 -112 48 4 -21 -121 65 -84 -9 128 79 -101 77 32 -78 -11 -48 -70
5502 -70 -146 114 29 -137 50 78 -134 0 128 35 -57 -4 -18 -143 77 -43 -70 -165 172 -35 -68 138 67 -108
5526 -108 9 159 0 -16 130 49 -23 -14 68 -53 8 116 -24 -7 210 -98 -27 129 -26 -108 76 7 -84 58
5550 58 2 -79 -21 -31 54 11 5 191 -133 -98 84 -76 -51 49 -23 -56 56 36 -2 -71 106 -39 -80 26 -11 -163
5576 -163 -40 39 -84 19 -52 10 -59 80 74 -105 178 143 -121 -14 48 -68 -41 47 4 -61 42 -18 -23 9 105 5
5602 5 -51 55 125 -29 -25 29 -38 -47 77 81 -112 -25 76 10 -15 156 -64 -72 83 -49 -92 -3 -89 7 -79 56 56 -29
5630 -29 86 -140 -159 37 -5 -57 -41 61 -31 -22 -91 13 13 -20 94 -33 -13 -39 -67 -44 42 -28 -29 26 -117 -114 29 67
5658 67 -31 -146 54 -13 -9 36 77 -67 -32 106 33 21 131 -86 -95 107 -15 -60 19 247 -125 -25 102 -99 -171
5683 -171 -77 34 24 -36 80 -157 -179 -72 -128 -11 96 39 -76 -51 32 15 -72 21 -148 -43 -81 27 -135 -126 130
5708 130 -5 -46 201 71 -21 -141 159 3 68 4 31 -87 -97 -58 -45 77 109 -59 1 189 -19 2 37 -54
5732 -54 15 -97 48 -12 -13 89 -131 -13 30 43 -139 73 22 -44 28 44 -140 -128 88 90 -149 92 157 -39 -148
5757 -148 32 -37 -41 21 -47 -124 34 -5 -9 -195 111 -54 82 14 3 -48 -163 87 -35 -103 63 18 100 20 -50 -39
5783 -39 47 93 -63 -23 194 84 -6 55 14 -100 32 89 56 -22 18 34 -16 -21 42 -82 -107 89 -27 0 17 -81 -84
5810 -84 -76 159 -61 -59 38 -20 -2 1 125 -72 -56 -105 -104 -101 8 80 93 -3 38 14 2 103 84 2 80 -103 7 72 107
5839 107 28 52 -47 65 -95 75 -65 -4 -36 -82 -72 -81 -18 -6 -22 138 150 -32 75 68 -41 37 26 -76 35 90
5865 90 14 -192 80 43 -75 -38 69 -34 -50 -53 62 -6 71 90 -12 5 125 70 -70 -120 -36 -56 -22 -48 25 -42
5891 -42 -44 101 59 91 -83 -89 31 -19 -113 52 -39 -44 -86 88 37 9 78 -19 58 134 160 95 -102 34 175 14 -48
5918 -48 53 8 -20 88 -10 -56 99 125 -112 23 205 -17 -74 64 79 -84 7 50 -85 27 4 6 -142 -46 23
5943 23 -140 -41 35 56 -133 -49 68 -78 129 -128 28 36 13 20 28 54 -25 72 90 5 -48 49 -116 0 10 118 59
5970 59 55 84 -114 -9 41 97 -80 -11 -18 91 -2 5 89 17 -134 36 66 -26 28 124 99 6 -10 -91 26 82 -124 70
5998 70 63 -26 7 173 109 -75 -12 91 -72 -50 45 117 -32 -84 141 -76 78 91 -162 -74 -6 -21 -57 99 136 -52
6024 -52 -126 17 -4 41 144 -20 21 -40 18 -53 44 -59 -105 -21 109 -56 -23 181 -4 -49 -9 19 48 -135 43
6049 43 -47 -79 24 25 -49 -166 55 -121 53 -67 -1 -77 -10 -15 19 -138 37 15 -24 141 0 3 -40 7 -122 71
6075 71 74 143 47 16 26 -55 -19 4 -53 -74 139 -50 -153 20 41 -59 58 -62 35 -4 33 -16 93 53 -39 -92 114
6102 114 89 -6 166 -92 12 -129 111 56 -18 95 136 -63 -23 -4 -24 -8 7 35 -14 -8 -8 3 -20 32 71 -41 35
6129 35 -53 -32 -23 15 -92 -31 -70 11 22 -93 -22 -96 -31 43 -180 -42 97 59 -80 143 64 113 12 103 -68 13
6155 13 190 -50 -63 98 -65 -76 -26 94 6 -156 18 -4 -59 -4 -81 5 25 205 54 -146 88 21 -38 84
6179 84 29 -66 -61 92 -19 -35 -8 -15 26 53 97 45 -105 36 -42 42 1 7 -17 24 50 -90 -210 141 93 -30 -20 62
6207 62 -92 20 -7 -9 -22 10 -25 -110 -10 -117 8 2 10 -47 49 94 -27 -42 20 -61 -92 -47 -9 -108 0 112 110 99
6235 99 -14 -7 17 -78 -61 -35 30 74 62 19 43 28 89 -106 124 -120 -13 24 29 -42 67 -71 -78 -126 -35 -117 -130 -35
6263 -35 18 -69 -44 86 -10 -61 194 -35 17 95 -172 -3 195 99 -22 59 25 -35 -103 -7 -2 -2 59 3 -102 -64 158
6290 158 42 54 62 54 -52 57 9 37 45 127 -152 102 -39 -18 -20 -42 54 2 -2 63 -122 -16 -29 -60 -99 26 130
6317 130 -101 -79 111 60 63 -7 -29 58 7 37 -64 41 24 -131 36 2 -3 -63 -121 11 9 35 133 11 -11 39 73
6344 73 41 77 143 43 64 -85 -26 9 -26 52 -120 -23 69 -135 67 69 68 -52 177 149 -55 -3 -12 -64 -57 -118 63 -41
6372 -41 -11 25 -41 9 35 19 111 15 109 82 34 79 -61 -70 37 67 7 85 18 -112 19 27 104 104 67 39 22 184 101
6401 101 61 119 30 -35 19 52 -41 92 -4 -58 -12 31 81 -4 75 -47 -38 14 72 -129 75 13 -15 -43 55 -62 14 -47
6429 -47 106 83 -64 -43 25 -20 57 -30 25 -53 19 -26 -74 141 43 -155 38 28 -78 -38 -36 22 -138 -66 -90 -34 -249
6456 -249 9 -51 4 -41 45 -15 -54 15 -1 -51 -85 33 38 86 58 -97 62 45 79 73 25 27 -178 -118 8 -21 -49 127
6484 127 -43 68 61 -21 -46 -46 -45 -85 64 35 -104 102 -14 1 -87 4 10 -137 -36 78 13 7 91 136 67 66 -50 35
6512 35 4 110 84 65 6 33 -58 11 7 -4 33 53 148 28 86 106 91 139 64 -87 34 -69 -65 -7 60 -15 -159 96
6540 96 86 39 -96 92 -66 -46 -15 37 -92 -127 -28 11 -50 -111 -58 -18 84 78 -43 -45 -25 68 6 120 14 -107 28
6567 28 88 -165 62 -49 43 -32 135 -10 -11 130 -8 59 -25 33 11 -23 60 -23 44 81 65 7 66 102 -36 -21 168
6594 168 -28 -11 26 -61 -39 52 39 -55 19 47 27 -63 46 11 89 18 -19 -9 -136 -151 -41 -18 9 42 29 -13 -14 143
6622 143 93 36 67 -52 1 -40 21 -62 -65 7 -32 -38 -37 -104 38 33 -41 121 129 29 -20 70 23 89 77 -170 -46 -77 24
6651 24 51 -78 -19 -145 -64 -51 28 16 -157 -21 -24 -70 96 18 -86 -46 138 -31 6 16 -8 -72 24 53 14 -90
6677 -90 92 -34 -65 44 0 53 115 204 -3 -2 -2 3 -116 81 -94 11 153 167 -69 -111 58 -54 -125 -118 7 71
6703 71 84 -57 -32 -88 -9 84 -33 -85 100 12 88 37 -93 45 47 -8 -78 26 139 -61 37 19 33 -51 170 -53
6729 -53 -122 188 45 -17 -53 28 -42 -39 -48 33 13 -5 -47 -80 -30 38 13 78 17 -60 -11 -92 32 -83 -19 94 74 -21 5
6758 5 53 -161 -53 15 57 -54 -36 -60 -22 113 73 -18 48 -5 -47 -107 34 -20 26 30 -1 10 67 10 96 -77 109 -48
6786 -48 -49 -23 -34 41 -96 131 21 -32 -22 -54 -61 22 18 48 -6 -35 49 175 -67 46 -60 50 37 91 18 -41 10 150
6814 150 -19 39 -123 150 60 -47 69 50 40 32 50 -30 36 31 47 -145 -15 70 84 22 -9 -33 31 21 12 -15 -27 5
6842 5 -8 -62 -61 -87 7 -46 54 -75 60 -65 -152 -39 127 -104 -40 -10 8 -61 93 66 38 88 4 67 -79 -8 -128
6869 -128 16 -15 -55 -27 -4 -83 11 -81 62 43 -21 105 -12 -114 -23 76 -12 76 62 85 -55 21 27 -2 -88 -31 -27 -63
6897 -63 55 40 43 -2 67 -179 -137 180 78 -123 -77 60 -92 -72 28 -169 -61 52 -129 -64 -27 9 -28 -40 -15
6922 -15 -105 -11 41 75 -145 116 27 -1 -61 22 -53 -151 -61 -81 -110 98 25 -36 -78 81 6 -24 84 -73 -49 -2 -17
6949 -17 -55 -17 86 -33 7 65 -9 16 -149 -13 15 -34 140 72 -88 23 67 18 -54 39 -82 -51 53 14 -37 45
6975 45 -12 -124 -88 -86 -2 -149 -36 27 -116 64 16 -34 -40 107 -173 -57 3 30 -73 107 -75 -11 -39 -41 -34 140
7001 140 -8 20 0 -61 -20 3 -70 3 -52 12 44 -117 -236 77 -66 -101 -1 -44 -133 56 67 -59 45 27 -27
7026 -27 32 66 108 43 -53 61 94 -52 119 56 64 39 69 144 -38 125 22 -20 -53 -97 42 -6 89 -14 8 11 46
7053 46 -6 -31 -41 70 22 119 19 -3 95 -96 3 -62 38 -5 -27 95 20 3 17 45 -31 49 -27 -4 -14 76 2 -23
7081 -23 40 -56 -53 -13 130 8 -31 -35 66 28 19 120 -59 5 -51 30 144 42 -66 -131 -12 14 -107 -100 -107 -90 42
7108 42 -33 56 23 96 -36 -108 120 -17 -56 51 -26 28 70 153 -108 -25 -49 36 -28 -133 19 -74 -45 7 61 15 -31
7135 -31 -97 -68 -196 3 28 109 60 32 -40 40 80 32 33 175 -17 -56 133 -162 -89 88 -10 -32 -22 100 -108 18
7161 18 -90 2 40 -9 132 -54 29 0 -43 -97 129 95 -161 51 -44 -99 77 110 78 54 -84 61 -1 -101 109
7186 109 -50 22 33 -54 -13 -37 -11 87 -35 -19 -20 -92 -102 70 -7 -160 65 163 -87 15 72 -70 113 65 33 -36
7212 -36 76 -177 178 138 -6 -88 16 64 22 -47 -54 -28 -42 -68 139 15 45 39 115 -65 -11 -67 -44 36 12 14 59 82
7240 82 10 -30 -54 44 -158 -10 -95 -98 -41 -64 -22 -8 91 -11 -20 27 26 19 -19 81 -8 -28 -55 125 -56 -43 144 -82
7268 -82 55 42 14 -39 5 94 -1 -133 35 109 -1 -96 -71 -37 57 54 -104 -112 -6 83 -9 13 -8 -12 104 116 -79 4
7296 4 -125 -149 27 -24 -64 -36 -73 104 -28 41 18 23 -36 50 102 -17 -28 142 54 27 -31 -56 -2 -154 -46 204 -80
7323 -80 -3 -125 36 -59 3 95 90 64 66 58 -54 -66 17 53 80 -15 123 -55 96 -46 21 29 91 84 -32 92 -58 97
7351 97 -1 -35 -25 -145 -90 -23 -86 62 -63 157 3 -107 -111 -32 -116 -42 1 128 85 26 59 21 20 72 12 -64 -16 63
7379 63 1 -39 8 172 54 -22 14 64 66 15 27 198 -106 -49 125 -82 -5 143 71 -27 -43 -11 -49 24 -19 -84 -17
7406 -17 -39 61 -26 120 -26 39 20 138 -69 -28 -82 19 -30 -52 1 113 -78 -29 40 -73 115 24 3 -7 -31
7431 -31 -136 -30 6 -117 2 -44 57 70 -16 161 -5 -6 76 -16 -111 84 54 -4 -56 23 -135 -97 -93 -81 -55 -19 -16
7458 -16 -52 -48 124 97 -43 -11 14 -48 -5 44 -13 26 0 -14 -65 2 -63 -13 -4 46 55 -80 86 25 3 36 -27 114 50
7487 50 89 147 166 -4 -70 76 -48 -97 -66 93 -76 -39 86 34 116 -26 60 -92 -59 88 107 -62 145 -36
7511 -36 -4 -11 116 -48 17 67 -36 4 -32 32 -71 -123 132 -42 -21 -57 -10 -37 153 0 -108 28 59 12 150
7536 150 41 45 -88 -64 -29 -45 11 25 38 -41 9 18 21 -32 -29 12 -99 16 54 -69 -45 -29 -67 -81 84 47 -20 45 -48
7565 -48 31 -110 -57 -61 24 46 -27 -1 -17 -65 105 21 127 -59 -31 84 -79 -109 -88 -65 -87 -48 -34 81 -95 -12 -53
7592 -53 47 71 141 138 7 171 56 139 17 62 12 70 15 -73 88 -39 4 18 -114 -44 -13 135 -56 8 -2 -85
7618 -85 35 -30 -35 22 -3 36 110 -84 -49 -70 -7 37 32 156 40 -70 -6 45 -59 -27 80 -54 71 -55 -264 23
7644 23 7 108 -150 4 27 -11 -86 -25 -37 80 152 37 79 -69 49 40 -31 -110 2 -10 -22 5 -289 -26 21 -31
7670 -31 50 24 8 45 62 69 -15 26 -32 69 105 135 82 81 128 -23 0 46 -65 82 15 2 13 -47 -3 49 -138 33
7698 33 23 -3 -46 2 56 -93 -29 -29 -30 -45 -47 -92 -20 -27 -91 13 50 104 124 96 -89 -4 -109 -172 -86 57 -92 65 85
7727 85 -63 -7 40 80 -65 -117 90 5 -56 -69 54 6 8 -21 52 68 -90 -14 67 -111 -18 -83 54 -27 176 4
7753 4 -19 -14 -75 40 48 -189 -50 54 -16 -54 -53 57 -112 19 -6 80 4 72 -99 117 -37 10 54 -54 19 27 -38
7780 -38 -82 -94 -19 83 -35 58 32 158 4 -219 -36 44 -125 29 121 -8 8 -23 24 -10 -68 -2 36 45 34 37 145
7807 145 -92 20 99 32 28 -73 56 -15 -45 48 62 36 80 -51 -20 122 -1 -13 88 43 53 -106 78 48 -28
7832 -28 -5 78 55 25 -56 96 21 32 10 -18 -5 -52 126 -57 11 -68 84 58 113 43 4 -79 7 -51 0 205 35
7859 35 4 73 24 -88 -34 -58 129 -21 98 62 30 15 -119 -13 -144 -1 -106 -28 -56 17 36 -11 18 58 6 40
7885 40 54 100 146 5 -13 49 15 -38 -46 131 51 10 107 34 -71 149 -31 11 10 40 -28 -93 23 -45 4 -92 -6 -97
7913 -97 -54 -9 39 15 48 -13 27 -46 50 23 -22 126 27 144 -20 91 29 -11 -15 44 52 -64 66 121 -126 106 9
7940 9 113 62 53 -23 -25 -30 29 -2 45 20 -32 12 95 -155 -19 3 -122 -26 23 34 54 140 -6 -39 29 48 -14 -3 52 -99
7970 -99 -19 -68 -34 -75 -35 -22 79 -2 91 26 152 14 -25 59 115 9 5 2 -77 67 28 180 -119 -140 34 44 95
7997 95 -9 65 16 92 45 99 24 85 85 -90 81 -18 -100 24 71 -102 12 28 -15 -88 -103 -50 74 -58 4 28 70
8024 70 83 5 9 51 5 -26 -109 -49 -99 80 -21 -21 53 -30 -38 -68 118 14 -1 -180 -68 -24 -18 -93 -98 -51 50 110 68
8053 68 -176 90 -12 -25 13 -21 -33 -14 -28 -83 45 -39 -96 -24 126 3 1 9 61 3 68 47 -8 -1 7 -32 -18 -19 -31 -44
8083 -44 51 -46 -76 58 71 -15 -160 -41 -90 -32 -14 -36 96 -6 -23 69 -64 -4 -69 37 -29 81 -69 -13 -29 37
8109 37 18 -17 -61 -30 -101 10 -44 95 54 -105 21 -98 84 -42 -17 1 26 -98 56 59 -58 6 -104 -131 177
8134 177 21 -181 -43 52 21 61 -68 -43 40 56 -38 92 33 -56 45 44 40 -107 -52 15 26 97 -86 -22 106 -69
8160 -69 -79 -3 -117 53 -21 53 88 37 -97 -9 -23 -48 -48 -51 69 2 129 4 72 4 27 -39 81 -3 3 11 94 -52
8188 -52 193 44 -26
8191b6
$$ Imaginary data points
##PAGE= N=2
##DATA TABLE= (X++(I..I)), XYDATA
0 0 0 0 0 0 0 0 0 0 0 0 0 0 0 0 0 0 0 0 0 0 0 0 0 0 0 0 0 0 0 1 -2 2 -3 3 -3 5 -5 7 -7 8 -9 9 -11 11 -13 14 -15 17 -19 19
50 19 -22 23 -23 25 -21 16 -2 -37 139 -520 2701 33711 10141 -9337 17061 16206 -9372 -293 19991
69 19991 13514 7469 5851 -3058 1870 14709 8230 13070 35114 20802 -7641 12894 33594 7673
83 7673 5802 42762 35920 1037 14356 40923 30844 26353 41997 39204 26718 23511 16180 17707
97 17707 34479 27700 7464 19093 26676 -552 -143 34284 26707 -3405 9587 20925 -8554
110 -8554 -15790 11761 12399 -6406 -5174 -4046 -11825 -8388 -7708 -13458 -2949 -2566 -31701 -36257 -10957
125 -10957 -18868 -38772 -15920 -1835 -31617 -37026 -8837 -11433 -26457 -9948 -974 -19510 -24586
138 -24586 -16215 -17170 -11700 -4490 -14201 -13780 -215 -13169 -27108 -1167 11605 -16732 -20592 3085
152 3085 -8701 -28161 -6239 9605 -7073 -8234 4550 -3135 -8349 2961 3575 306 5877 -2758
166 -2758 -14480 30 6560 -11086 -3632 19350 2741 -17968 3522 15943 -4373 -2898 16564
179 16564 7149 -6253 4455 8725 4423 13576 16342 7014 11722 15419 2384 6832 23925 11112
193 11112 -3423 14218 17188 -6854 79 24473 13186 -2714 10994 14640 -136 3390 12005
206 12005 5659 6341 9861 -1540 -2149 11703 5227 -4439 10909 12747 -9496 -5220 12839 -720
220 -720 -11997 7412 9605 -10916 -6639 7698 435 -2762 7068 3402 -1016 6121 1485 -5867
234 -5867 7846 12390 -5030 -1659 14235 1716 -7974 10967 14104 -4148 1656 14026 654
247 654 -4765 9964 8992 -419 6135 7674 -415 6014 10791 142 3805 15849 3333 -6878
261 -6878 9570 12040 -4990 1018 14270 1250 -5564 8604 6463 -4220 4663 9147 -2523
274 -2523 -789 6803 -1256 -2444 7849 1007 -6579 5541 5536 -9767 -2387 10626 -3031 -10237 4470
289 4470 2420 -10712 -2748 4056 -7142 -6200 2945 -5523 -9863 1404 -1321 -10593 -1577 1377 -10929
304 -10929 -6814 3943 -7146 -11910 2982 155 -13875 -4480 4228 -7962 -8612 3031 -3053 -8989
318 -8989 1257 166 -9160 -674 4799 -6909 -5466 5825 -2023 -7854 4332 3459 -8037 475
332 475 7659 -4979 -5024 8129 2093 -6557 3984 6055 -4019 1265 7876 -1732 -1211 9382 2275
347 2275 -4723 6749 7503 -4030 1648 9475 -829 -2166 9118 3659 -4304 6543 8630 -3336
361 -3336 972 9908 885 -1991 8230 4130 -3395 5835 7205 -4050 847 9529 -806 -4468
375 -4468 6857 3171 -6108 2405 5326 -5405 -1962 6641 -2855 -6598 5063 1951 -7735 361
389 361 4291 -6183 -3431 4703 -3843 -7577 3684 288 -9818 -1152 3690 -7537 -6048 3546
403 3546 -4038 -8161 2115 -152 -9211 -847 4031 -6945 -5442 4678 -2040 -7247 2601 1683 -7173
418 -7173 -60 4897 -5505 -4327 5983 -838 -7050 2893 3153 -6132 -209 5433 -3613 -2815 7027
433 7027 684 -5214 5002 5649 -4373 1041 7400 -1581 -2039 7245 1547 -4366 5490 5985 -4437
448 -4437 644 7950 -1135 -3159 6015 2012 -4534 3946 4783 -4593 564 7431 -1523 -3345 6649
463 6649 2551 -5121 2952 4714 -5272 -1425 6158 -2821 -5689 4806 1808 -6458 861 4326 -4563
478 -4563 -2083 4548 -3076 -5142 4343 743 -7192 1612 5175 -5013 -2611 6162 -1266 -5333 4199
493 4199 1967 -7169 -472 4247 -5067 -4226 4151 -1224 -5123 2611 903 -5693 1307 3819 -6055
508 -6055 -3541 5074 -2830 -7809 3070 2990 -6815 -1302 4631 -4187 -4514 3783 -901 -6377 935 769
524 769 -6331 -1258 2845 -4031 -1747 5532 -1560 -5582 4977 3797 -6567 -237 6837 -3229 -5741
539 -5741 4130 1792 -4543 2380 4068 -3263 -403 3753 -2931 -2590 4190 -1549 -5935 2398 1304
554 1304 -7590 -479 6666 -3944 -6411 4585 699 -8935 -1901 2814 -5611 -5416 -77 -4849 -5797
569 -5797 509 -2480 -5983 1240 159 -8869 -3492 3080 -6230 -7487 3670 -478 -10297 -1374 4996
584 4996 -4269 -4286 4497 532 -5171 -446 -127 -3416 1181 1481 -4900 -63 4674 -3679 -3868 7715
600 7715 3915 -6195 1420 6384 -4592 -4712 6416 2676 -4821 1460 4109 -1880 59 3939 593
615 593 2098 4140 -2962 -3096 5773 1713 -5657 3835 8524 -3726 -3924 8107 4526 -3834 4012
630 4012 7370 -1978 -2114 3991 1307 184 4451 1755 120 4831 1479 -3220 5325 8040 -4042
645 -4042 -3216 7478 616 -8321 2473 8037 -3066 -3712 4313 297 -4255 1110 1430 -2238 -261
660 -261 -1997 -6373 -1137 1138 -6166 -3260 5228 -3203 -10896 649 4087 -8310 -6540 4212 -2187
675 -2187 -10477 -3353 562 -4255 -2792 -507 -3377 -2559 -1314 -5837 -2991 3884 -2774 -8313 955
690 955 1914 -9149 -4033 8002 63 -8008 1429 4365 -5276 -3663 3908 1432 -1917 -291 -1798
705 -1798 -832 3373 -23 -1923 5982 4777 -6025 -1265 8603 593 -5025 6463 7389 -5032 -2364
720 -2364 7837 3384 -1302 4775 5406 894 1292 1224 1128 6107 4937 -2385 1900 8231 -809 -4152
736 -4152 8666 9036 -3902 -460 8601 643 -4603 4793 6669 -825 -257 2718 345 894 2089
751 2089 -178 2750 5062 -3236 -4917 5597 3761 -6806 -27 8702 -2226 -8337 3069 4880
765 4880 -4305 -1569 4248 -942 -4146 -1075 -965 -392 1470 -2268 -3451 2217 -1033 -7819 378 6782
781 6782 -4442 -7735 3722 1866 -9003 -2872 5862 -1237 -5832 -379 -213 -3397 -1119 -523 -1493
796 -1493 1366 -1176 -6031 -402 4045 -4080 -4401 5707 1493 -8902 -1201 6701 -2226 -5035 4276
811 4276 3077 -4519 -1739 2062 212 905 1144 -1911 569 2743 -3472 -2468 6494 2501 -6178 772
827 772 5935 -4058 -4713 6051 3463 -5633 -977 3744 -2024 -2904 1850 917 -253 479 -2852 -2413
843 -2413 3270 212 -5258 1688 4939 -5217 -5398 5152 2087 -5815 802 5273 -3246 -4304 2807
858 2807 1164 -2180 1101 1010 -1282 830 201 -2395 3006 5165 -2970 -2318 6030 1165 -5639 2649
874 2649 7070 -2060 -2979 4927 1922 -2902 2587 4286 -246 816 2134 -949 1104 3764 -632
889 -632 -59 5816 1128 -4222 3869 6823 -2228 -1091 7500 2337 -4096 2471 5243 -418 709 4371
905 4371 1133 508 3441 1072 426 5020 2375 -2161 3313 4764 -2759 -461 7188 1628 -4114 3451
921 3451 5186 -2736 -914 5171 1158 -2101 1649 520 -1872 1551 1052 -2652 1079 2531 -3793
936 -3793 -2570 3889 -676 -5316 1811 2616 -5624 -3055 3492 -1497 -4920 1269 965 -4012 -1170 647
952 647 -2933 -1293 1062 -3394 -3110 2249 -1434 -5285 1414 2759 -4470 -2359 3771 -1390 -4422 2276
968 2276 1952 -3924 -755 2536 -2173 -1716 2426 -661 -1721 2440 216 -3280 1936 3062 -3554 -1035
984 -1035 4706 -466 -3766 3316 3151 -3000 762 4438 -906 -1312 3868 916 -1797 2652 2043 -1964
1000 -1964 1382 3468 -1678 -173 4913 55 -2740 3731 3205 -3117 271 4802 -738 -1811 3702
1015 3702 1470 -2153 2259 2644 -2206 542 3212 -1522 -1501 3294 -70 -3312 2065 1993 -3690 -291
1031 -291 3837 -1994 -2989 2977 815 -3704 604 2087 -2853 -1221 2475 -2014 -2656 2319 -57 -3910
1047 -3910 825 1745 -3749 -1667 2438 -2323 -3610 2127 59 -4370 345 2343 -3192 -1985 2445
1062 2445 -1294 -3226 1833 402 -3739 363 2027 -3453 -1719 2912 -1503 -3725 1904 734 -3737
1077 -3737 208 2394 -2880 -1783 3014 -904 -3380 1984 1454 -3473 94 2428 -2469 -1649 2918
1092 2918 -769 -3248 2031 1552 -3610 -112 2849 -2313 -2018 2808 -387 -3042 1707 1756 -3243 15
1108 15 3116 -1890 -2067 3022 155 -3008 1697 1852 -2999 -115 3264 -1731 -2103 3136 499 -3024
1124 -3024 1672 2343 -2497 -151 3341 -1294 -1905 3295 1080 -2770 1981 3027 -2000 -23 3617
1139 3617 -896 -1681 3383 1069 -2651 1983 3255 -2048 -323 4019 -246 -1840 3172 1580 -2298
1154 -2298 1870 3010 -1996 -247 3802 -274 -1812 3279 1746 -2535 1476 3159 -2149 -785 3803
1169 3803 -476 -2870 2496 1856 -2785 464 2844 -1676 -1129 2781 -681 -2527 2056 1052 -3454
1184 -3454 301 2532 -2674 -1881 2700 -813 -3532 1585 1212 -3779 -852 2249 -2459 -2888 1570 -802
1200 -802 -3365 607 324 -3486 -394 1577 -3182 -2679 2213 -1328 -4374 652 1157 -3915 -1494 2127
1216 2127 -2385 -3381 1489 -351 -3838 -89 892 -3214 -1311 1351 -2396 -2340 1915 -1072 -3834 1359
1232 1359 1742 -3894 -1368 3029 -1605 -3486 1884 907 -3315 66 2087 -2216 -1134 2127 -935
1247 -935 -1738 2037 223 -2672 1602 2099 -3040 -303 4087 -1033 -2875 3155 2408 -2836 444 3785
1263 3785 -855 -1120 2741 584 -1216 2421 1411 -1525 1873 2653 -1752 361 4210 -485 -1934
1278 -1934 3964 2474 -3112 943 4487 -810 -1618 3420 1710 -1664 1363 1969 -888 914 2268
1293 2268 -1170 138 3136 -765 -1965 3190 1959 -3446 535 4070 -1637 -2621 3518 1533 -3312
1308 -3312 555 2627 -1424 -988 1679 -683 -735 1713 -938 -2092 2369 972 -3794 249 3504 -2497
1324 -2497 -3422 3117 914 -4322 -133 2815 -2303 -2630 1622 -162 -2143 491 -37 -1756 543 -11
1340 -11 -3275 336 2497 -3076 -3078 3216 657 -4874 165 3467 -2512 -3154 2309 353 -3062 53
1356 53 1161 -1460 -241 535 -1655 204 2013 -1771 -1367 3387 401 -4159 1189 3873 -2626 -2422
1372 -2422 3952 1432 -3355 607 2999 -872 -612 1758 24 -92 1535 -590 -675 3028 771 -2511
1388 -2511 2169 3763 -2506 -1528 4977 1450 -3756 1471 4078 -1674 -1595 2980 1334 -782 1264 806
1404 806 -300 1898 736 -1533 2086 2890 -2544 -1132 4491 756 -3518 2409 4194 -2466 -1922 3835
1420 3835 950 -2711 989 2002 -881 -235 762 -760 965 1787 -1765 -586 3461 -555 -3642 2158
1436 2158 3507 -3210 -1998 3888 132 -3812 1216 2931 -1647 -1138 1596 -296 -965 410 -848
1451 -848 -506 1900 -1006 -3002 1836 2117 -3622 -1308 4352 -521 -4555 1233 2566 -3130 -1989 2480
1467 2480 -249 -2521 72 136 -1102 438 -282 -1795 898 534 -3722 -1147 3409 -1474 -4250 1931
1483 1931 2247 -4381 -2135 3291 -255 -3357 494 661 -2483 -996 30 -1266 -4 237 -2520 -1065
1499 -1065 1914 -2004 -3451 2272 1582 -4692 -1827 3196 -1510 -4157 1499 1981 -2979 -1515 1119
1514 1119 -991 -1209 358 -1014 -900 973 -1692 -2700 1887 1277 -3399 -393 3461 -1799 -3667 2693
1530 2693 2453 -3130 -766 2818 -701 -2118 1217 1020 -268 1076 139 -997 1618 1120 -2126 776
1546 776 3650 -1264 -2621 3153 2206 -2859 510 4309 -428 -2100 2290 1547 -1079 820 1690 -279
1562 -279 786 936 -1169 735 3084 -515 -1454 3117 1523 -3282 601 3976 -952 -1914 2790 1488
1578 1488 -2309 472 2332 -478 -242 1366 -450 -637 1474 -597 -1192 2241 800 -3105 100 2785
1594 2785 -1850 -2326 2875 851 -3382 -202 1811 -1788 -1602 1501 -331 -1655 458 -325 -1714 691
1610 691 442 -2342 -261 1723 -2409 -2429 2323 170 -3566 207 2072 -2386 -2216 1985 149 -2065
1626 -2065 574 397 -1912 -58 773 -1497 -240 1606 -1245 -1677 2110 455 -2540 1066 2675 -1986
1642 -1986 -1516 2662 485 -2166 1280 2028 -1166 103 1820 -465 -62 2107 52 -732 2236 881
1658 881 -1830 1267 2771 -1048 -614 3324 538 -1903 1912 2428 -1262 157 2730 19 -586 2095
1674 2095 898 -590 1650 1485 -1261 830 2321 -955 -563 2787 596 -1894 1549 2115 -1628 -342
1690 -342 2551 -120 -1351 1630 888 -1456 844 1333 -1130 92 1708 -1036 -1144 1959 172 -2110
1706 -2110 973 1525 -2180 -768 2143 -510 -1916 1292 583 -2109 -3 1217 -1556 -736 1626 -852
1722 -852 -1506 1271 212 -1978 653 1358 -1954 -771 2035 -656 -2152 1371 829 -2224 23 1534
1738 1534 -1479 -979 1690 -422 -1619 1327 726 -1852 423 1525 -1435 -898 2000 -347 -1825 1502
1754 1502 1076 -1912 174 1950 -1109 -895 1780 90 -1389 1264 1102 -1633 356 1895 -930 -896
1770 -896 1925 135 -1574 1291 1304 -1605 86 1987 -860 -1093 1901 340 -1801 1056 1187 -1450
1786 -1450 -180 1647 -814 -1028 1755 286 -1689 883 1405 -1595 -322 1849 -629 -1291 1561 555
1802 555 -1689 830 1367 -1434 -312 1753 -435 -1303 1621 686 -1515 871 1436 -1354 -225 1934
1818 1934 -343 -1095 1767 1024 -1427 768 1857 -1039 -276 1984 -56 -1103 1654 1084 -1287 733
1834 733 1870 -962 -242 2006 -68 -1129 1603 965 -1408 634 1748 -1044 -713 1902 -4 -1398
1850 -1398 1202 1008 -1448 111 1443 -1065 -936 1496 -275 -1657 885 597 -1700 -91 1294 -1297
1866 -1297 -1237 1325 -228 -1977 508 807 -1904 -597 1001 -1299 -1597 841 -526 -1988 440 240
1882 240 -1984 -494 788 -1577 -1613 957 -535 -2272 213 707 -2274 -1160 1184 -990 -1707 705
1898 705 -136 -1732 215 576 -1598 -428 1094 -1271 -1403 1278 130 -1918 698 1241 -1429 -635
1914 -635 1753 -316 -1261 1439 911 -1288 379 1319 -695 50 1600 -18 -483 1618 563 -1251
1930 -1251 1158 1875 -1041 -88 2184 108 -1134 1650 1435 -1040 516 1754 -455 -426 1483 322
1946 322 -656 1140 387 -1105 789 1413 -1174 -302 2055 -297 -1813 1058 1040 -1752 -230 1519 -581
1963 -581 -1285 796 39 -1336 404 369 -1411 -187 569 -1524 -897 1141 -557 -2096 842 535 -2483
1980 -2483 -660 1597 -1084 -1905 552 -34 -1898 -474 510 -1200 -640 352 -1124 -1015 716 -524
1996 -524 -1618 860 522 -2270 -724 1380 -1137 -1833 1368 691 -1874 -204 1167 -694 -689 1128 -103
2013 -103 -613 560 -336 -815 1124 971 -1283 148 1831 -766 -1272 2038 1197 -1656 385 1721 -624
2030 -624 -1074 1470 961 -522 717 617 -448 530 824 -544 577 1837 -706 -1086 1949 896 -1513
2047 -1513 867 2332 -891 -1180 1571 703 -1074 638 1348 -277 -97 607 -474 194 1371 -337
2063 -337 -576 1420 180 -1778 888 2104 -999 -1148 1775 485 -1830 371 1753 -581 -493 809
2079 809 -125 -537 417 97 -188 1212 97 -1607 664 1525 -1323 -602 2187 365 -2123 399 1724
2096 1724 -993 -722 1513 388 -1020 190 381 -119 550 487 -768 457 781 -1383 -603 2007 145
2113 145 -1874 898 1447 -1706 -1121 1914 499 -1475 199 668 -1008 -406 443 -100 149 291 -1260
2130 -1260 -728 1031 -477 -1678 1039 1150 -2132 -1379 1489 -300 -1997 517 1038 -1535 -1228 381
2146 381 -457 -675 162 -359 -689 146 -945 -1497 908 901 -1864 -679 1572 -854 -2264 836 1227 -1605
2164 -1605 -974 1039 -429 -1428 344 474 -368 -61 -306 -902 338 455 -1117 97 1746 -695 -1825
2181 -1825 1181 1133 -1666 -129 2244 -107 -1440 662 954 -542 295 1146 -104 82 405 -494 463
2198 463 1716 -31 -750 1482 983 -1534 150 2546 -70 -1260 1277 1212 -1088 -71 1587 254
2214 254 -47 530 -7 -121 724 -76 -433 1228 550 -1567 77 1727 -606 -1261 1590 969 -1787 -486
2232 -486 1426 -413 -962 635 366 -776 -285 -249 -579 536 183 -1263 -90 902 -1200 -1449 1248
2249 1248 493 -1944 -240 1191 -1171 -1625 897 520 -1234 -276 155 -772 -336 224 -591 -109 774 -1026
2267 -1026 -1255 958 128 -1736 249 1335 -1124 -1399 927 480 -1297 110 1032 -646 -626 419 -157
2284 -157 -169 645 -109 -543 683 178 -1285 412 1668 -781 -941 1357 481 -1406 399 1557 -436
2301 -436 -495 991 97 -618 634 470 -400 718 560 -730 349 1199 -496 -480 1518 394 -1408 439
2319 439 1379 -707 -643 1421 183 -881 411 552 -513 251 698 -362 -212 800 -364 -475 1199
2336 1199 204 -1214 502 1014 -1115 -581 1347 90 -1292 401 549 -955 -325 753 -283 -379 696
2353 696 -252 -822 631 196 -995 372 841 -1064 -825 1094 -127 -1311 564 774 -1096 -527 891
2370 891 -361 -658 498 89 -693 195 209 -945 217 866 -948 -591 875 -227 -1241 340 694
2387 694 -1174 -513 899 -686 -1037 524 46 -1101 -55 375 -861 -318 499 -663 -733 578 -289
2404 -289 -1306 382 454 -1078 -608 830 -632 -1075 573 157 -1116 -17 707 -1040 -429 613 -437
2421 -437 -882 633 90 -1017 270 508 -942 -319 1020 -363 -921 730 462 -999 154 756 -649
2438 -649 -461 945 -149 -603 677 508 -592 333 873 -546 -216 1042 -20 -670 891 664 -876
2455 -876 254 1094 -268 -301 1204 286 -596 682 810 -471 371 1136 -246 -167 1102 227 -615 950
2473 950 878 -555 312 1268 -244 -230 1131 397 -541 696 909 -417 184 992 -152 -322 893 221
2491 221 -726 701 745 -596 -36 1091 -262 -572 743 315 -767 370 608 -724 -329 968 -342
2508 -342 -688 694 196 -847 307 514 -921 -303 712 -363 -731 694 3 -970 -69 624 -858
2525 -858 -516 774 -474 -858 467 236 -1069 -57 590 -889 -450 705 -420 -893 607 238 -1053
2542 -1053 83 676 -789 -597 845 -278 -887 567 237 -820 16 712 -571 -374 721 -201 -688
2559 -688 528 441 -685 158 937 -466 -390 1005 113 -679 520 756 -537 53 949 -222 -323 812
2577 812 107 -561 608 644 -472 226 927 -246 -265 904 178 -722 630 694 -667 18 928 -150 -547
2596 -547 687 353 -658 380 563 -730 -74 872 -387 -504 685 27 -995 395 613 -876 -311
2613 -311 751 -319 -818 648 86 -827 19 497 -605 -319 579 -484 -669 452 -70 -995 163 492
2631 492 -938 -517 641 -575 -923 309 298 -1018 -333 474 -571 -597 493 -280 -748 269 69 -941
2649 -941 -31 547 -860 -217 782 -374 -910 434 406 -1052 -170 825 -519 -678 642 162 -764 109
2667 109 405 -647 104 496 -452 -214 726 -228 -874 697 435 -881 18 1124 -525 -817 869 400
2685 400 -620 187 669 -449 -20 490 -208 -202 786 -12 -568 645 460 -664 117 1243 -308 -611 822
2704 822 474 -824 269 973 -252 -233 732 37 -376 554 215 -307 468 524 -709 203 1060 -432 -631
2723 -631 1084 609 -987 243 1014 -400 -528 1029 193 -663 278 420 -116 314 500 -255 268 769
2741 769 -258 -492 1140 383 -932 377 1068 -362 -510 1055 486 -674 363 630 -400 -48 562
2758 562 -46 -60 616 -459 -400 712 222 -724 339 982 -871 -664 950 241 -979 329 830 -704
2776 -704 -394 450 -176 -403 175 -56 -407 276 -17 -766 266 660 -915 -512 746 -171 -1201 285
2794 285 660 -864 -728 545 -95 -888 117 178 -555 -159 -42 -651 -25 399 -594 -354 639 -283 -1262
2813 -1262 290 763 -1024 -427 950 -111 -1066 124 453 -373 -189 320 -371 -221 131 -481 -257 748
2831 748 -214 -683 512 537 -898 -288 1248 -74 -884 438 697 -756 -205 770 -30 -142 386 -101
2849 -101 -96 541 -62 -460 616 495 -795 -136 1321 -227 -819 851 793 -852 -388 875 22 -422 691
2868 691 227 -429 -93 180 -263 385 365 -568 -5 803 -360 -754 620 629 -922 -119 937 -224 -793
2887 -793 620 403 -610 -138 232 -404 -171 255 -248 -13 498 -325 -822 513 312 -943 -135 898
2905 898 -695 -1034 532 215 -956 -50 487 -393 -441 224 -128 -341 220 -216 -523 108 256 -773 83
2924 83 962 -399 -845 715 229 -1040 -64 872 -390 -685 491 133 -465 243 320 -335 154 192 -485
2943 -485 147 760 -264 -436 752 268 -1023 58 881 -344 -515 935 351 -705 179 569 -34 21
2961 21 430 -157 -12 582 -171 -219 828 347 -700 262 894 -457 -376 1021 295 -719 322 816 -283
2980 -283 -177 663 131 -250 359 25 -247 530 280 -496 352 651 -304 -252 977 289 -612 438 702 -435
3000 -435 -200 721 63 -290 420 169 -302 174 187 -402 252 520 -363 -448 805 160 -873 294 672 -621
3020 -621 -512 769 -83 -733 356 254 -499 -39 337 -424 -142 515 -281 -353 355 -173 -819 156 531 -699
3040 -699 -410 543 -94 -787 159 308 -682 -160 332 -382 -421 236 -267 -447 242 -61 -710 9 448 -602
3060 -602 -397 571 -184 -912 230 448 -731 -264 480 -305 -428 353 91 -529 64 204 -597 45 459
3079 459 -529 -378 544 -71 -629 291 449 -701 -208 749 -241 -454 437 282 -480 149 314 -266 147 669
3099 669 -210 -278 649 116 -457 425 532 -359 -106 786 -96 -478 569 408 -442 114 448 -371 -186 597
3119 597 -156 -141 462 226 -352 277 586 -461 -103 833 -42 -428 463 301 -532 133 605 -379 -172 536
3139 536 -4 -300 349 316 -311 164 526 -470 -114 606 -144 -401 378 149 -479 63 579 -379 -247 485
3159 485 -82 -527 305 300 -394 -108 450 -297 -363 412 -122 -465 276 236 -432 12 483 -414 -406 534 -109 -592
3181 -592 202 404 -404 -123 425 -256 -322 435 12 -614 234 252 -538 -100 591 -276 -369 498 42 -544 117
3202 117 314 -556 -30 415 -145 -392 376 121 -438 177 377 -315 -43 542 -270 -270 471 154 -443 301 515
3223 515 -342 -141 637 -19 -366 311 317 -458 112 586 -247 -70 580 -95 -306 481 278 -380 185 508 -239
3244 -239 -251 596 -51 -410 489 285 -405 38 577 -281 -196 476 6 -400 462 338 -473 17 539 -302 -178
3265 -178 537 175 -406 267 338 -491 -114 458 -172 -413 406 125 -525 253 158 -489 -53 555 -368 -348 362
3286 362 -97 -509 237 390 -512 -274 421 -291 -430 280 -10 -712 178 113 -425 -172 366 -376 -567 356
3306 356 -59 -622 163 245 -616 -288 396 -259 -501 219 151 -566 -40 254 -413 -257 204 -291 -338 236 5
3327 5 -518 16 373 -642 -179 426 -148 -523 394 276 -500 -41 407 -418 -357 373 -18 -279 249 124 -458
3348 -458 225 201 -324 -178 388 -130 -530 329 266 -438 -50 552 -181 -347 457 141 -405 188 256 -347 110
3369 110 487 -224 -158 330 -3 -290 540 353 -438 48 707 -179 -361 576 250 -386 112 375 -249 -57
3389 -57 414 -180 -198 358 38 -176 384 344 -495 132 530 -250 -278 485 177 -504 184 474 -366 -141 399
3410 399 13 -306 262 190 -193 89 149 -353 155 405 -335 -240 335 78 -479 117 519 -278 -230 346 -90
3431 -90 -532 195 202 -328 -119 145 -424 -126 188 -296 -455 367 -50 -541 250 446 -528 -375 333 -161 -660
3452 -660 75 234 -329 -49 138 -221 -176 217 -203 -303 248 -119 -489 78 394 -503 -248 619 -1 -656
3472 -656 197 420 -357 -261 332 -22 -305 193 3 -123 289 179 -64 221 276 -347 -188 574 39 -413 482
3493 482 502 -346 -32 642 94 -253 281 294 -236 107 266 -151 108 420 -113 46 664 -66 -422 500 534
3514 534 -505 -140 676 -25 -395 317 325 -261 -19 351 -149 -86 213 -57 -168 285 -56 -355 394 343 -509
3535 -509 23 589 -199 -574 390 293 -414 -140 460 -253 -174 219 -83 -155 73 13 -317 307 201 -360 -41
3556 -41 492 -123 -485 332 334 -699 -120 611 -193 -445 273 27 -370 -80 76 -287 -59 96 -309 107 305
3577 305 -180 -533 329 126 -703 18 495 -282 -353 448 74 -400 -56 200 -195 -27 165 -112 -99 109 -73
3598 -73 -121 416 136 -498 160 383 -309 -387 514 192 -448 162 414 -151 -110 259 -80 -197 237 -107 -194 251
3620 251 28 -369 220 393 -228 -307 590 162 -394 189 568 -195 -241 379 125 -210 136 168 -133 120 123 -151
3642 -151 21 445 -189 -165 447 249 -307 262 454 -145 -149 478 115 -376 251 333 -24 -59 209 -96 -95 353
3664 353 -177 -187 345 -29 -417 225 319 -483 -193 440 113 -409 265 295 -251 -195 320 1 -181 214 -82
3685 -82 -191 -18 -55 -356 80 241 -371 -245 361 27 -337 202 274 -469 -152 393 -134 -382 62 -25 -349
3706 -349 -77 -46 -350 89 65 -331 -179 324 -11 -459 221 280 -336 -221 444 -181 -265 240 65 -275 9
3727 9 76 -224 -179 184 -154 -218 318 -139 -345 212 356 -305 -64 452 -55 -251 236 131 -179 104 179 -175
3749 -175 -130 298 -86 -197 353 47 -280 73 149 -183 -27 368 56 -259 311 314 -344 19 403 -6 -57 364
3771 364 6 -141 214 241 -166 140 237 -176 56 316 27 -285 316 129 -432 6 330 -186 -106 265 58
3792 58 -219 75 234 -228 96 233 -74 -73 223 70 -234 254 231 -277 -53 197 -243 -245 74 109 -266 58
3814 58 276 -360 -2 16 -118 -269 226 -107 -283 31 -14 -330 3 328 -236 -144 306 146 -324 171 133 -354
3836 -354 -122 103 -68 -170 95 221 -238 -7 158 -184 115 82 -147 -167 214 -6 -258 118 196 -104 -9
3857 -9 384 -91 -277 165 145 -210 51 125 -240 -198 212 -90 -177 289 113 -317 127 258 -172 -130 233 -110
3879 -110 -254 271 137 -158 -42 237 -262 -195 208 -37 -98 221 203 -228 -2 265 -179 -111 299 31 -136
3900 -136 197 187 -242 -19 357 -91 -75 291 47 -234 253 137 -246 -44 255 -116 -55 254 -56 -172 37
3921 37 264 -331 -67 335 29 -159 265 -44 -204 82 294 -267 5 184 91 -167 225 28 -201 183 225
3942 225 -89 -27 232 -171 -234 212 66 -328 71 172 -310 -186 225 -167 -289 31 -23 -291 138 182 -260
3963 -260 -111 253 -59 -305 167 26 -347 112 87 -264 -274 119 -8 -216 176 5 -140 93 194 -180 -126
3984 -126 137 -20 -270 58 -19 -252 -101 187 -155 -102 214 55 -245 1 25 -240 54 192 -134 -60 203
4005 203 -31 -187 155 126 -249 17 250 -164 -181 217 60 -195 78 238 -163 -118 310 24 99 297 51
4026 51 -212 106 187 -148 8 196 61 -198 307 65 -244 183 243 -134 25 176 -68 -197 272 79 -101
4047 -101 47 140 -112 -117 234 -43 -158 231 57 -233 75 189 -57 -57 225 46 -247 116 74 -251 48 282
4069 282 -228 -29 75 -51 -312 133 151 -344 -69 90 -198 -227 236 -8 -256 -9 36 -172 -52 62 -114
4090 -114 -184 87 -12 -183 38 -34 -265 24 79 -249 -61 289 -133 -345 107 80 -258 -38 288 3 -144 47
4112 47 -53 -92 51 151 -222 64 197 -198 -219 257 17 -222 103 170 -213 -57 366 -4 -228 218 77
4133 77 -207 -2 41 21 93 182 -50 -164 232 26 -201 90 269 -204 -147 300 -77 -129 290 110 -71 33
4155 33 258 -83 -177 188 -27 -66 130 137 -227 65 153 -117 -67 387 -55 -369 274 90 -211 52 313 4
4177 4 -32 24 84 -106 24 29 -169 177 246 -56 -61 235 -37 -266 396 140 -237 -148 256 -119 -182 181 9 -167
4201 -167 24 44 -161 28 85 -88 -23 191 -124 -134 235 117 -250 -41 294 -116 -280 84 67 -165 -39 236
4223 236 -193 18 72 -46 -26 114 -140 -162 -20 120 -103 -9 260 -233 -376 229 207 -346 -40 200 -55 -288
4245 -288 110 -19 -210 104 -53 -64 90 -3 -177 159 270 -244 -230 170 60 -321 -113 308 -140 -207 125
4266 125 14 -190 110 68 -92 -4 136 -10 113 46 -64 -75 160 143 -271 -66 289 -122 -79 151 23 -65
4288 -65 77 194 -80 34 195 18 -107 181 7 -69 184 67 -104 78 280 -201 -239 134 116 -197 10
4309 10 269 -191 -154 106 38 -69 60 -10 -16 0 52 -223 81 73 -161 -156 221 100 -200 106 117 -204 -53 223
4333 223 104 -61 136 153 -243 -6 -8 -154 35 213 -160 -94 69 -73 -190 38 -44 -321 -210 174 -23 -241
4355 -241 106 230 -162 -47 92 -117 -196 119 8 -150 75 -80 -181 33 210 -174 -276 218 3 -267
4375 -267 128 61 -177 -91 137 -37 -18 30 -28 -119 157 39 -116 80 207 -177 -163 183 35 -132 20 118 -138
4398 -138 -128 272 -90 -118 112 -47 -91 -95 75 -149 14 178 -3 -111 300 69 -54 268 132 -161 23 184
4420 184 91 -50 38 30 -124 35 188 -69 -61 187 -94 -144 87 -27 -171 146 267 -292 -148 194 -116 -217
4442 -217 228 47 -270 62 7 -62 -51 27 73 20 118 127 -140 128 22 -218 -109 193 26 -202 197 206 -181 -7
4466 -7 243 -43 -161 32 51 -128 82 170 -98 -42 102 -76 -43 137 -45 -201 266 107 -217 -99 185 -159
4488 -159 -116 107 27 -217 62 138 -141 -38 -16 58 -146 194 7 -144 -6 85 -67 42 223 15 -197 0
4510 0 -10 -104 24 51 -69 -65 197 25 -78 72 43 -75 34 171 -190 29 159 -110 -262 55 164 -201 48
4533 48 47 -132 -114 141 1 -48 69 20 -289 92 237 -85 43 162 -7 -80 186 105 0 -5 23 -36 -26 167
4557 167 30 -84 53 176 -109 -30 179 -137 -9 67 77 -100 202 31 -102 -90 228 -189 -13 218 -128
4578 -128 -102 202 88 -163 27 133 -81 -78 101 41 -142 109 38 21 26 121 -63 -66 -17 4 -147 76 109 -125 17
4603 17 114 26 -124 142 43 -97 5 10 -210 -42 192 -41 -63 108 -111 -175 -20 124 -128 26 138 -146 -140
4626 -140 16 -17 -172 172 131 -158 -38 -22 -165 -149 110 61 -195 51 157 -187 10 237 -47 -251 217 -83
4648 -83 -173 94 93 -91 -56 170 27 -75 166 39 -181 158 88 -50 19 61 -9 -152 21 251 -165 33 163
4671 163 -112 -27 111 -122 -68 50 183 -155 -11 157 -74 -48 265 -5 -125 55 73 -12 -40 245 -103 30
4693 30 202 23 -130 6 223 -89 8 119 44 0 86 -77 -61 155 44 -75 -33 169 -42 -182 140 -52
4715 -52 -51 35 104 -126 16 130 -123 -78 51 15 -227 108 74 -58 -96 91 -129 -77 139 -45 -124 -34 125 -210
4739 -210 -59 171 -138 -181 -110 57 -115 108 -77 -120 -41 56 -173 -237 78 0 -337 130 235 -208 -40 162
4761 162 -232 -137 57 201 40 -27 99 -136 -68 124 -82 -66 163 55 -33 89 97 -114 -92 76 112 -139 50
4784 50 64 -197 -86 106 -46 -35 158 -22 -112 74 38 -57 79 28 -76 -17 135 36 -136 8 133 -147 -70
4807 -70 215 -94 -40 1 -29 -61 67 75 15 -20 23 -61 -62 156 -6 -81 102 84 -134 -5 131 -80 -62 119 -76
4832 -76 -119 168 45 -13 88 185 -196 -95 72 41 -41 63 179 -201 -127 178 -17 -3 119 -1 -132 -1 70
4855 70 -112 75 136 -101 -14 144 53 -160 -53 151 -185 -25 112 -202 -308 49 19 -150 10 67 -63 -35
4877 -35 114 -58 -136 21 36 -33 10 52 -124 -99 53 -81 -256 46 159 -91 -89 96 -200 -180 179 -23 -115 5
4901 5 -101 -64 -36 44 -16 -110 110 -38 -80 98 -6 -109 -74 61 -300 -166 133 -17 -118 47 10 20 -84 -26
4925 -26 2 -81 24 10 -212 38 -26 -226 -23 82 -23 27 116 48 -160 -6 127 4 -61 122 -23 59 70 105
4949 105 -64 160 105 -73 82 186 -120 11 121 102 -141 63 268 -66 -54 150 77 -155 58 119 -13 197
4971 197 162 46 -36 27 -8 -25 193 -63 -101 -50 83 -1 -118 80 5 -126 -19 81 57 -18 106 -39 -4 139
4995 139 -152 24 -58 63 -171 82 92 -173 -96 77 15 -185 14 62 -63 -31 18 23 -67 8 -120 -34 -79 102
5019 102 -41 3 55 -37 -82 -4 -82 -90 38 97 -98 -80 -66 -5 -76 17 97 -120 -6 43 -125 -79 15 -44 -49 52 25
5046 25 -204 111 45 -67 -41 110 6 -158 134 19 -173 71 84 -23 50 144 1 73 8 25 -116 117 8
5069 8 -116 126 70 -13 33 74 71 -29 31 -3 -32 -109 122 189 19 110 43 -121 -13 125 -40 14 156 -49 -136 113
5095 113 117 -108 -99 28 -50 -72 81 74 50 4 79 -72 -30 144 22 -31 124 -120 11 27 -26 -108 52 96 -212 -3
5121 -3 125 34 -69 55 175 -94 -28 106 -101 -116 65 -90 23 73 -65 -85 -44 143 -71 -66 131 -94 -180 56
5145 56 95 62 -33 37 -38 -24 -10 -60 -113 -65 65 -91 21 3 -118 -129 202 34 -148 -24 61 -56 -95 50 18
5170 18 -154 -90 56 -3 -7 -39 -23 -34 99 6 -119 105 58 -98 -33 2 -155 22 44 132 6 32 61 12 15 -9 107
5197 107 -25 142 -42 -20 -23 -28 -142 -37 144 54 56 70 -18 -82 97 -41 -35 -59 62 1 -4 -37 82 -262 -17 67
5223 67 -18 164 117 -48 -61 65 -4 -92 97 0 -60 14 -58 -55 -152 -3 -9 -129 157 -10 -126 -16 -38 -89 -226 7
5249 7 -58 -129 35 104 -56 136 102 12 -117 38 4 -107 55 94 -54 -24 -17 -90 26 -45 -22 -73 6 56 -63 28
5275 28 120 -60 -132 9 22 13 15 45 -167 10 104 -96 65 13 -46 -78 54 100 -45 -159 30 12 2 79 27 -40
5301 -40 -15 -36 -13 38 168 61 -32 33 11 33 105 104 50 20 -35 -73 -60 96 96 -51 41 130 -129 -91 74 -7 -15 -9 72
5330 72 -8 65 65 103 -71 101 9 7 93 -13 -49 104 16 -78 50 17 164 -137 96 125 -111 -26 -24 -58 -93 61 85
5357 85 -99 -62 198 -109 -28 -39 -23 -161 113 -15 -80 -5 26 -13 72 74 -47 38 74 22 -147 -83 97 1 100 117
5383 117 -43 -154 -13 -1 -147 14 26 -37 60 177 -122 -68 -65 -32 -101 -10 -49 -16 -43 147 -83 13 34 -78 23
5408 23 67 87 -92 -58 -50 -124 -41 -8 -86 -161 -84 -30 -57 -62 -42 -158 104 -73 120 -63 40 -10 -97 40 -1 -64 -29
5435 -29 69 27 -143 23 146 -105 73 122 -60 -69 89 10 30 52 80 -81 25 103 -41 79 98 154 -50 11 57
5460 57 75 -161 128 48 -20 -21 31 -192 3 125 17 -142 113 -68 -177 97 45 7 75 98 68 -105 50 128
5484 128 -20 -36 66 -55 -71 22 33 10 100 54 -29 39 92 60 107 73 -124 -32 -6 82 -47 123 110 -36 57 191
5510 191 -16 -93 -92 -127 -20 8 54 -6 -16 44 45 -52 -31 -57 -199 -2 100 -84 -130 89 -59 -55 -72 66 -65 -126
5536 -126 91 -87 -40 76 -21 -65 22 97 -84 -37 -83 -14 -88 78 9 -121 123 -87 -108 -62 7 47 -110 128 0
5561 0 -90 26 51 7 40 22 -76 -32 60 -29 74 -55 5 -75 -53 113 -29 -69 -55 62 94 39 -3 37 62 47 -73
5588 -73 -65 -14 -11 -80 -93 -12 -41 -32 92 39 -7 77 -22 21 -33 -92 -12 -14 114 -171 -6 69 -22 -164 82 40 -92 -47 9
5617 9 8 -46 36 132 -81 113 -123 89 41 -11 -13 -143 -15 120 -18 35 30 -157 16 164 6 -94 28 98 35
5642 35 -49 47 -1 43 128 32 -68 -35 -55 31 139 -80 -97 28 191 -81 -129 87 -27 -112 -164 -26 51 -64 -42
5667 -42 -112 102 -2 -106 -94 -22 -17 -12 -11 49 23 -30 46 -1 -86 47 125 38 107 62 -37 -139 -9 56 45 -109 71 36
5695 36 50 100 -82 -6 84 35 -45 29 72 39 -58 158 -64 -56 18 -5 20 73 155 -2 -163 60 11 19 -14 -16 -20 16 43
5724 43 73 -30 108 7 -57 16 52 -37 -12 36 -88 -95 -11 44 -31 22 -48 -43 -3 189 -13 -31 40 58 20 39 -104 -128
5752 -128 8 97 5 16 44 5 81 92 56 -112 18 27 43 -87 60 24 -98 31 35 -53 126 -19 62 129 -76 56
5778 56 -69 46 63 25 -123 -69 7 -96 153 -24 -159 -4 45 27 -43 -29 -76 -144 44 94 18 -7 -83 10 -79 -41
5804 -41 -6 -43 -43 33 -115 -93 26 11 -14 30 -38 -72 29 21 -75 -117 77 -33 -31 48 -63 -62 15 9 77 62 -29 -105 -80 -47
5834 -47 26 -80 -41 52 -195 4 18 91 -44 -56 -20 -127 -75 -37 -17 -27 90 -5 49 116 108 -155 -88 123 -28 -29 78
5861 78 -8 -89 -35 -108 -29 32 38 66 12 62 -20 41 80 -20 -19 -42 -50 -21 57 206 34 -52 182 -125 -15 -64 68 64 -32
5890 -32 84 -38 0 53 2 -19 -65 64 14 -63 -41 34 84 -13 -16 33 24 71 2 -30 41 -132 -5 -62 4 -71 -72 16 -135
5919 -135 -4 47 -36 -54 14 11 -31 -54 -35 -62 -126 -25 89 32 4 25 34 -138 81 -61 20 74 -38 -81 95 24 -10
5946 -10 -58 -24 145 38 119 182 -146 92 137 -10 -86 46 -59 148 70 39 -16 -7 89 -68 -63 47 66 -35 134
5971 134 22 -83 107 65 -164 0 66 -71 -58 -11 77 76 -116 -20 47 6 38 2 62 49 62 -98 -67 28 123 32
5997 32 49 -46 -123 -28 72 47 -50 76 -163 98 120 14 46 132 105 -1 3 96 86 -119 6 -28 -10 83 -91 -30
6023 -30 -91 110 38 -82 69 97 -67 86 -74 -25 -56 44 -64 -39 53 3 -145 3 1 -46 -54 3 -79 -90 -38 -82
6049 -82 -8 -187 129 -99 -7 90 -13 -55 69 48 -110 136 -21 46 53 118 101 -30 52 -4 -114 -43 74 94 8
6074 8 11 28 -147 -34 82 -86 2 -88 146 -32 -26 -79 -108 32 70 -92 -76 90 75 32 114 83 -58 -20 10 -73 -56
6101 -56 129 111 -98 0 1 -160 39 109 -71 -50 4 2 -42 28 114 87 43 81 26 59 30 -19 9 -56 23 -18 55 35 -115
6130 -115 49 92 56 -71 109 98 -39 108 31 21 -83 51 -67 -66 86 -24 32 -51 41 -43 29 97 -55 -42 19
6155 19 38 19 -2 24 25 -158 118 -27 8 -83 -19 -117 103 7 -119 23 46 36 -7 48 -39 -31 107 21 -44 -64 -45 20
6183 20 -63 2 26 -57 -70 -71 29 -118 87 -63 -19 -10 21 -85 -10 -66 -44 -1 -11 -63 -88 -84 128 -91 -84 -106 -18 44 -32
6212 -32 60 -21 48 95 -30 -53 82 -9 -40 120 -58 -145 -48 68 -45 -34 19 64 -117 105 -7 -86 -23 -42 -2 7
6238 7 12 16 -39 62 -109 -33 95 146 76 -45 61 -43 46 -57 5 -108 -12 -20 50 22 -14 76 -37 -22 -28 -64 108 9
6266 9 72 -33 61 -62 6 30 144 -86 -40 44 -102 -99 108 -3 7 -5 -93 -53 -12 14 -130 130 -71 -62 -32 11 -80
6293 -80 -60 -88 75 -8 -51 -15 -40 -62 -19 -143 55 -35 96 37 -42 6 -10 -33 -88 121 -62 74 47 -85 -17 3
6319 3 14 8 -35 89 26 79 91 -24 19 39 -12 -139 94 -6 15 61 81 -69 -62 -19 -121 -8 -32 -72 -96 -223 4
6346 4 -146 -31 55 66 35 104 -78 -14 68 90 -77 143 -97 51 -95 115 59 25 23 192 3 -77 48 -103 3
6371 3 16 -3 18 87 -29 -34 2 63 73 -20 71 57 25 -80 -67 112 1 102 -47 -6 48 -14 -34 -65 -12 -3 -119 -42
6399 -42 -34 -59 10 -35 63 -127 24 101 -43 -88 99 42 -37 -34 7 -109 -37 -64 -144 -8 31 -7 -54 26 -70 -44 117 -76
6427 -76 10 14 21 -144 -69 66 -82 -104 -25 -18 -104 -84 17 -13 -10 -17 3 22 16 -77 -103 8 8 -79 -7 -6 -23 -82 43 5 -25
6458 -25 -140 -54 -46 -73 13 -2 -21 81 58 -66 -14 75 -49 21 80 -19 -58 144 69 -113 -12 57 -9 -141 84 12
6484 12 15 68 16 -2 -16 12 -5 19 -40 -101 -27 0 108 -76 -39 31 -102 70 -45 22 -103 -81 107 95 7 -73 -14
6511 -14 -16 169 83 -106 93 0 -37 -19 147 10 79 39 33 -98 42 154 49 103 0 -82 -81 8 76 89 80 39 -133
6538 -133 -63 116 -117 -35 83 -109 -19 22 -55 -112 55 -47 -78 -106 -5 129 -45 28 -118 -78 61 129 2 13
6562 13 203 -42 -83 0 -21 45 -6 -48 -60 -35 2 7 -128 -133 -17 -77 -8 119 -9 -46 -23 -125 -158 35 58 -48 37
6589 37 -101 -11 -23 158 32 -121 49 109 5 -120 79 -135 91 75 87 115 -83 -133 -78 184 152 -103 3
6612 3 37 -45 29 93 -29 -88 13 -16 -7 100 39 87 -10 43 -99 -101 4 32 22 18 0 -24 -14 113 -47 -82 -101 55
6640 55 -9 25 24 93 -50 -108 80 -123 11 -96 -99 8 23 -41 -29 83 158 -7 -116 56 144 138 74 62 -83 -19
6666 -19 186 -111 65 1 -53 -11 136 143 -216 -107 15 28 -1 14 111 -16 -13 55 21 -68 77 -136 18 41 -24 -29
6692 -29 -42 174 -30 62 -62 -124 -98 -60 5 -4 0 -54 99 -39 118 17 42 22 -75 -68 -6 38 57 156 3 -11 -51 -12
6720 -12 -66 2 -43 -8 -93 34 63 -19 -41 -8 -2 -54 -100 116 -42 -6 106 -68 -39 17 -50 64 -34 -80 18 2 51 50
6748 50 -50 72 50 -83 -50 -25 -60 36 -118 -100 90 14 74 47 -111 41 -56 0 2 -12 -65 127 190 0 -116 92
6774 92 59 -24 129 -23 -21 143 5 -85 1 66 27 -66 -24 43 -44 -111 -22 -87 87 108 9 38 12 -65 -114 24 48 -97
6802 -97 -97 77 -19 -206 -60 11 -73 12 128 -32 34 43 -77 -49 30 -119 -116 -31 -14 -110 -9 -85 -75 -143 119 -8 10
6829 10 -117 -4 48 -15 31 84 -51 9 -48 -57 52 -104 16 -129 -16 24 -24 19 78 -78 8 -84 -28 -152 72
6854 72 14 -18 -12 58 -33 10 123 -109 100 66 100 51 18 -39 -68 -58 54 41 -94 -7 -56 -39 -42 18 -36 15 -40 14 -112
6883 -112 27 21 -47 151 114 -23 30 -29 -20 -87 31 11 18 3 78 1 -73 73 -17 -75 -18 45 -24 -6 19 -65 82 45
6911 45 -92 13 31 -52 -128 -18 72 26 -23 120 -146 0 86 96 -77 6 31 54 2 24 152 -114 -43 13 41 -28
6937 -28 84 -5 -54 108 41 -25 25 85 -88 31 14 9 -16 4 -41 26 31 103 -105 16 -18 -107 48 23 37 -48 149
6964 149 -86 -8 120 104 8 -14 18 65 -76 -18 22 -83 -56 62 33 -54 -37 29 -112 -105 11 29 2 44 -5 -9 -59
6991 -59 154 -54 -19 109 -80 43 -38 -58 19 -21 45 36 41 -33 -126 108 -63 37 57 -50 62 97 58 37 70 24
7017 24 19 -19 4 -60 -32 137 1 83 92 -111 48 -84 -58 91 -20 31 42 17 -176 43 35 -46 -73 33 -18 24 -44
7044 -44 62 33 71 88 -52 -1 98 54 36 134 -23 31 -17 -100 65 -50 39 -35 67 -68 39 3 -71 103 40 -61
7070 -61 46 -17 -54 -84 -41 -41 -131 -12 33 32 -16 86 -114 -81 111 160 -8 -21 -58 68 38 24 -24 -116 11 -95 6
7097 6 71 178 2 96 34 -88 -40 15 -37 10 29 -83 27 43 -103 13 112 60 63 14 -59 0 75 90 58 49 19 52
7125 52 -12 -82 81 4 -34 95 -57 61 -25 -76 114 -50 -1 -29 -56 -70 20 -72 -60 138 -24 41 68 -44 -174
7150 -174 -10 48 1 -50 34 83 -59 43 102 -36 82 143 -88 -46 -84 -9 -22 30 -29 20 83 38 -77 -87 -21 12
7176 12 -5 29 37 -16 2 43 65 94 -23 11 9 80 85 67 118 54 -79 -17 120 -33 -241 33 45 -65 -96 38 55 27
7204 27 139 8 82 2 22 103 6 32 -90 -53 16 -82 -25 98 14 107 25 -51 -35 -26 -2 -45 -1 -89 64 60 -90 108
7232 108 -82 -22 71 37 -53 -120 82 -51 -15 53 -50 -116 -6 -66 -35 -147 -69 3 54 27 -49 28 39 -85 -57 63
7258 63 43 3 -30 13 9 -109 57 -23 -63 94 12 -130 -79 -18 82 71 43 -1 -22 6 -37 5 6 139 -90 -27 36 25
7286 25 -64 27 14 41 -23 77 -33 -52 -11 46 115 -79 85 50 -3 70 122 -37 45 26 -40 -52 -32 -26 11 -23 -65 -53
7314 -53 67 29 -29 -10 139 -49 -54 3 104 -44 -151 53 -12 4 31 35 -34 -70 -41 53 -56 110 -71 -36 37 64
7340 64 2 -16 45 -54 37 -6 88 24 110 -2 91 -130 -20 -79 34 43 -14 23 51 -90 103 113 -17 8 -66 49 -103
7367 -103 -26 34 6 -217 134 -20 20 133 61 -32 -116 48 31 7 15 60 -57 18 55 -106 -29 25 60 -47 12 44
7393 44 6 36 -66 -39 94 99 77 -29 -62 -7 -156 -65 50 -6 75 -43 90 132 19 61 -63 -1 -11 -17 -53 9 -37
7420 -37 3 -15 54 -29 45 -39 32 13 95 35 -72 4 -23 -111 13 -45 -84 -89 16 16 -107 29 -83 14 45 -96 86
7447 86 -97 33 0 -66 49 61 -13 -37 -122 -120 -35 49 -129 -23 -31 78 -52 8 -57 -49 -52 17 39 -34 83 14 -14 87
7475 87 64 -55 -110 -12 49 -16 -42 5 -7 -112 -71 -13 45 -127 0 -23 -143 -29 -7 38 69 30 -16 29 22 -35 -81 98
7503 98 9 -18 -67 -45 46 -61 -72 59 -56 21 -129 -23 75 -18 -18 -97 -24 -51 -13 56 -192 7 131 -24 -20 -20 -51
7530 -51 -11 135 1 52 -17 51 98 -58 99 59 79 2 28 4 87 46 79 32 -21 21 -44 64 115 43 -19 8 -13 -26
7558 -26 -127 -36 -5 -114 -21 10 51 -3 -64 -62 -11 3 -21 -46 -4 11 17 173 -24 62 -18 173 24 -9 -64 39 -9 43
7586 43 -133 -58 83 -23 105 6 -18 -7 -75 -28 46 -115 -6 -63 34 115 58 63 1 21 144 -70 -38 19 127 38
7612 38 -25 38 7 16 -67 -53 33 -17 -35 -35 -48 -59 -89 18 41 -11 -44 -23 -84 9 -29 102 -202 46 -106 -32 -184 -75
7640 -75 16 -24 -39 -159 32 92 1 -138 5 -69 12 31 -3 1 8 24 82 29 -38 24 55 70 116 40 4 -46 -25 -61 39
7669 39 34 97 -74 27 -34 -51 -32 -44 51 6 10 46 13 70 84 -33 44 70 40 58 -12 17 -63 -2 9 41 -39 191 24
7698 24 25 121 -73 39 39 17 12 81 122 -97 10 166 -65 -13 -30 34 69 -28 -49 -27 130 -9 30 -5 18 226 52
7725 52 96 114 14 -45 57 76 -55 -19 68 -23 60 -15 -96 -28 72 18 -159 -119 -43 9 31 40 -84 59 -39 -9 45
7752 45 -9 37 27 75 -20 143 -114 124 74 12 102 72 91 -46 -96 71 59 -71 58 21 -70 47 -116 64 -92
7777 -92 41 42 -139 -103 1 7 27 45 -9 153 5 -140 30 69 1 -9 -72 -22 3 82 3 -48 55 -72 -88 -45 17
7804 17 -30 40 21 18 -95 -15 -40 13 15 -17 -61 -62 -4 -25 30 -17 26 -177 -16 -65 59 -21 30 16 11 -39 -19 -84 88 75
7834 75 -79 13 -92 25 -64 106 93 -70 -32 20 128 10 144 10 -11 59 -62 -123 -42 65 55 -188 -14 -48
7858 -48 20 -35 -66 -42 65 104 -35 -38 103 -157 67 144 -40 -46 -132 -40 -56 -87 35 -20 45 172 84 -86 -16 -161
7884 -161 120 -14 27 14 70 65 55 -113 64 23 -20 92 -81 61 15 44 -82 57 -144 -12 -16 8 41 -115 30
7909 30 15 70 39 -11 -86 -52 -85 -52 55 61 -57 8 -21 12 23 3 5 -22 81 6 19 0 96 37 32 -69 -12 39 -89
7938 -89 -121 -110 72 22 45 -39 186 -33 31 11 -38 175 -35 16 15 28 52 -76 -36 13 -16 -121 -11 42 28 -42 111
7965 111 -33 -21 64 -56 -47 18 25 13 -62 34 -60 0 87 -51 -95 81 -77 123 -114 11 57 -54 29 47 -69 31
7991 31 -15 -72 -64 -84 39 -2 -93 2 28 3 78 -15 44 -57 20 -66 -57 -3 -34 10 -118 57 33 97 -135 48 -65 5
8019 5 26 -46 -113 -21 114 -72 53 -24 94 79 57 -20 11 81 23 34 41 23 -33 -62 3 75 39 60 -40 110 6 97
8047 97 -103 58 -18 160 -75 -79 -39 60 75 -65 -153 -115 36 51 71 -25 7 -42 1 -62 84 38 -35 37 -20 62 -28
8074 -28 -12 65 -56 -4 -34 -34 100 61 13 80 -46 89 53 40 -66 48 -57 48 135 -23 48 -62 -80 18 46 -20
8100 -20 38 -2 -84 19 -84 77 -62 113 -117 29 -116 -90 -112 78 52 -24 86 12 55 126 -59 58 -12 15
8124 15 -4 -2 34 48 -104 -104 46 80 3 -28 23 -150 -49 165 4 15 -107 -35 -39 -20 29 -63 -152 67 45 -80 81
8151 81 17 -24 47 142 83 -10 61 35 70 49 -7 87 117 -13 13 -83 -42 70 79 -15 -23 111 -65 142 -123 68 31 -10
8179 -10 -32 -104 -113 122 153 -15 -19 -80 -15 -22 -123 -12
8191a2
##END NTUPLES=NMR FID
##END=
