##TITLE=1H_PHDP0603
 CDCl3, 8 sc, 
 6.3.2019
##JCAMPDX= 6.0         $$ Bruker NMR JCAMP-DX V2.0
##DATA TYPE= NMR FID
##DATA CLASS= NTUPLES
##ORIGIN= UXNMR, Bruker Analytische Messtechnik GmbH
##OWNER= root
$$ XWIN-NMR		Version 3.5
$$ Wed Mar  6 16:21:39 2019 Russian Standard Time (UT+4h)  she@DPX200
##.OBSERVE FREQUENCY= 200.1316
##.OBSERVE NUCLEUS= ^1H
##.DELAY= (6, 6)
##.ACQUISITION MODE= SIMULTANEOUS
##.ACQUISITION SCHEME= undefined
##.AVERAGES= 8
##.DIGITISER RES= 18
##SPECTROMETER/DATA SYSTEM= spect
##.PULSE SEQUENCE= zg30
##.SOLVENT NAME= CDCl3
##.SHIFT REFERENCE= (INTERNAL, CDCl3, 0, 15.7039)
##AUDIT TRAIL= $$ (NUMBER, WHEN, WHO, WHERE, WHAT)
$$ ##TITLE= Audit trail, XWIN-NMR		Version 3.5
$$ ##JCAMPDX= 5.01
$$ ##ORIGIN= Bruker BioSpin GmbH
$$ ##OWNER= she
$$ F:/spectra/data/she/nmr/H-F/1/audita.txt
$$ ##AUDIT TRAIL=  $$ (NUMBER, WHEN, WHO, WHERE, WHAT)
(   1,<2019-03-06 16:19:42.25 +0400>,<she>,<DPX200>,
      <created by zg, POWCHK disabled, PULCHK disabled
       configuration hash MD5:
       00 E9 B6 7A A2 85 ED C7 34 08 36 98 17 FE 4E 26
       data hash MD5: 16K
       AD BA 01 51 3D F1 9E 1F D4 18 28 59 0D 86 C7 E6>)
$$ ##END=
$$ 
$$ hash MD5
$$ 4E 4E 42 A8 30 F3 23 98 9B F4 ED 86 9A AD 36 CC
##$RELAX= 
##$RELAX= 
##$RELAX= 
##$RELAX= 
##$RELAX= 
##$RELAX= 
$$ Bruker specific parameters
$$ --------------------------
##$DU= <F:/spectra>
##$EXPNO= 1
##$NAME= <H-F>
##$PROCNO= 1
##$TYPE= <nmr>
##$USER= <she>
##$AMP= (0..31)
100 100 100 100 100 100 100 100 100 100 100 100 100 100 100 100 100 100 
100 100 100 100 100 100 100 100 100 100 100 100 100 100 
##$AQSEQ= 0
##$AQ_mod= 1
##$AUNM= <au_zg>
##$AUTOPOS= <>
##$BF1= 200.13
##$BF2= 200.13
##$BF3= 200.13
##$BF4= 200.13
##$BF5= 200.13
##$BF6= 200.13
##$BF7= 200.13
##$BF8= 200.13
##$BYTORDA= 1
##$CFDGTYP= 0
##$CFRGTYP= 5
##$CHEMSTR= <none>
##$CNST= (0..31)
1 1 145 1 1 1 1 1 1 1 1 1 1 1 1 1 1 1 1 1 1 1 1 1 1 1 1 1 1 1 1 1 
##$CPDPRG= <>
##$CPDPRG1= <>
##$CPDPRG2= <>
##$CPDPRG3= <>
##$CPDPRG4= <mlev>
##$CPDPRG5= <mlev>
##$CPDPRG6= <mlev>
##$CPDPRG7= <mlev>
##$CPDPRG8= <mlev>
##$CPDPRGB= <>
##$CPDPRGT= <>
##$D= (0..31)
0 1.2 0 0 0 0 0 0 0 0 0 0.03 0 0 0 0 0 0 0 0 0 0 0 0 0 0 0 0 0 0 0 0 
##$DATE= 1551874781
##$DBL= (0..7)
120 120 120 120 120 120 120 120 
##$DBP= (0..7)
150 150 150 150 150 150 150 150 
##$DBP07= 0
##$DBPNAM0= <>
##$DBPNAM1= <>
##$DBPNAM2= <>
##$DBPNAM3= <>
##$DBPNAM4= <>
##$DBPNAM5= <>
##$DBPNAM6= <>
##$DBPNAM7= <>
##$DBPOAL= (0..7)
0.5 0.5 0.5 0.5 0.5 0.5 0.5 0.5 
##$DBPOFFS= (0..7)
0 0 0 0 0 0 0 0 
##$DE= 6
##$DECBNUC= <off>
##$DECIM= 24
##$DECNUC= <off>
##$DECSTAT= 4
##$DIGMOD= 1
##$DIGTYP= 9
##$DL= (0..7)
0 120 120 120 120 120 120 120 
##$DP= (0..7)
150 150 150 150 150 150 150 150 
##$DP07= 0
##$DPNAME0= <>
##$DPNAME1= <>
##$DPNAME2= <>
##$DPNAME3= <>
##$DPNAME4= <>
##$DPNAME5= <>
##$DPNAME6= <>
##$DPNAME7= <>
##$DPOAL= (0..7)
0.5 0.5 0.5 0.5 0.5 0.5 0.5 0.5 
##$DPOFFS= (0..7)
0 0 0 0 0 0 0 0 
##$DQDMODE= 0
##$DR= 18
##$DS= 0
##$DSLIST= <SSSSSSSSSSSSSSS>
##$DSPFIRM= 0
$$ [...]
##$SUBNAM2= <"">
##$SUBNAM3= <"">
##$SUBNAM4= <"">
##$SUBNAM5= <"">
##$SUBNAM6= <"">
##$SUBNAM7= <"">
##$SUBNAM8= <"">
##$SUBNAM9= <"">
##$SW= 24.9336934301222
##$SWIBOX= (0..15)
0 0 2 0 0 0 0 0 0 0 0 0 0 0 0 0 
##$SW_h= 4990.01996007984
##$TD= 16384
##$TD0= 1
##$TE= 0
##$TE2= 300
##$TE3= 300
##$TEG= 300
##$TL= (0..7)
0 120 120 120 120 120 120 120 
##$TP= (0..7)
150 150 150 150 150 150 150 150 
##$TP07= 0
##$TPNAME0= <>
##$TPNAME1= <>
##$TPNAME2= <>
##$TPNAME3= <>
##$TPNAME4= <>
##$TPNAME5= <>
##$TPNAME6= <>
##$TPNAME7= <>
##$TPOAL= (0..7)
0.5 0.5 0.5 0.5 0.5 0.5 0.5 0.5 
##$TPOFFS= (0..7)
0 0 0 0 0 0 0 0 
##$TUNHIN= 0
##$TUNHOUT= 0
##$TUNXOUT= 0
##$USERA1= <user>
##$USERA2= <user>
##$USERA3= <user>
##$USERA4= <user>
##$USERA5= <user>
##$V9= 5
##$VALIST= <valist>
##$VCLIST= <CCCCCCCCCCCCCCC>
##$VD= 0
##$VDLIST= <DDDDDDDDDDDDDDD>
##$VPLIST= <PPPPPPPPPPPPPPP>
##$VTLIST= <TTTTTTTTTTTTTTT>
##$WBST= 1024
##$WBSW= 4
##$XGAIN= (0..3)
0 0 0 0 
##$XL= 0
##$YL= 0
##$YMAX_a= 60380
##$YMIN_a= -74912
##$ZGOPTNS= <>
##$ZL1= 120
##$ZL2= 120
##$ZL3= 120
##$ZL4= 120
##$ABSF1= 10
##$ABSF2= 0
##$ABSG= 5
##$ABSL= 3
##$ALPHA= 0
##$AQORDER= 0
##$ASSFAC= 0
##$ASSFACI= 0
##$ASSFACX= 0
##$ASSWID= 0
##$AUNMP= <proc_1d>
##$AZFE= 0.1
##$AZFW= 0.1
##$BCFW= 1
##$BC_mod= 2
##$BYTORDP= 1
##$COROFFS= 0
##$CY= 11.3945322036743
##$DATMOD= 1
##$DC= 2
##$DFILT= <>
##$DTYPP= 0
##$F1P= 18.9103706918063
##$F2P= -1.10871071338519
##$FCOR= 0.5
##$FTSIZE= 0
##$FT_mod= 4
##$GAMMA= 1
##$GB= 0.15
##$INTBC= 1
##$INTSCL= 1
##$ISEN= 128
##$LB= 0.24
##$LEV0= 0
##$LPBIN= 0
##$MAXI= 10000
##$MC2= 0
##$MEAN= 0
##$ME_mod= 0
##$MI= 1.114404
##$NCOEF= 0
##$NC_proc= 0
##$NLEV= 6
##$NOISF1= 3.799351
##$NOISF2= 2.8
##$NSP= 1
##$NTH_PI= 0
##$NZP= 0
##$OFFSET= 15.70392
##$PC= 1
##$PHC0= -8857.315
##$PHC1= 9.80014
##$PH_mod= 1
##$PKNL= yes
##$PPARMOD= 0
##$PSCAL= 0
##$PSIGN= 0
##$REVERSE= no
##$SF= 200.130013532006
##$SI= 16384
##$SIGF1= 3
##$SIGF2= 2
##$SINO= 400
##$SIOLD= 16384
##$SREGLST= <1H.CDCl3>
##$SSB= 0
##$STSI= 0
##$STSR= 0
##$SW_p= 3612.71676300578
##$SYMM= 0
##$S_DEV= 0
##$TDeff= 0
##$TDoff= 0
##$TI= <>
##$TILT= no
##$TM1= 0
##$TM2= 0
##$TOPLEV= 0
##$USERP1= <user>
##$USERP2= <user>
##$USERP3= <user>
##$USERP4= <user>
##$USERP5= <user>
##$WDW= 1
##$XDIM= 8192
##$YMAX_p= 0
##$YMIN_p= 0
$$ End of Bruker specific parameters
$$ ---------------------------------
##NTUPLES= NMR FID
##VAR_NAME=  TIME,          FID/REAL,        FID/IMAG
##SYMBOL=    X,             R,               I
##VAR_TYPE=  INDEPENDENT,   DEPENDENT,       DEPENDENT
##VAR_FORM=  AFFN,          ASDF,            ASDF
##VAR_DIM=   8192,          8192,            8192
##UNITS=     SECONDS,       ARBITRARY UNITS, ARBITRARY UNITS
##FACTOR=    0.0002004,     1,               1
##FIRST=     0,             0,               0
##LAST=      1.6414764,     0,               0
##MIN=       0,             -74912,          0
##MAX=       1.6414764,     60380,           0
$$ Real data points
##PAGE= N=1
##DATA TABLE= (X++(R..R)), XYDATA
0 0 0 0 0 0 0 0 0 0 0 0 8 -8 8 -8 8 -16 16 -16 24 -24 32 -35 40 -48 54 -62 70 -80 93 -102 117 -133 148
33 148 -164 181 -203 227 -251 278 -309 342 -378 419 -463 513 -569 632 -705 788 -882 997 -1132
52 -1132 1299 -1508 1781 -2154 2699 -3569 5197 -9332 46619 60380 18623 41516 30948 11000
66 11000 7954 21622 -4548 -26733 -16280 -776 -20541 -33995 -32069 -39286 -54907 -41527 -23182
79 -23182 -28327 -37278 -25073 -19943 -23086 -7871 13896 6056 -5614 12209 29549 22299 24318 42665
93 42665 34187 6143 11476 35190 29179 10374 19126 26373 6188 -1584 19105 19642 -9406 -21018
107 -21018 -10071 -12047 -18522 -5121 5220 -7283 -13156 2417 11400 7200 11541 15942 5804
120 5804 3824 22834 32088 22195 21742 29144 19660 9929 25119 35059 15106 1021 12858 13999
134 13999 -3211 -2797 9143 -5205 -28839 -22009 -4758 -11114 -19049 -8200 -5179 -18084 -16424
147 -16424 660 824 -11387 -9288 -2723 -3080 2147 16884 17494 7581 9791 16485 11209 9230 17862
162 17862 13580 -3699 -2576 12181 8610 -4076 305 4486 -10270 -16875 -83 6147 -9196
175 -9196 -13121 -381 -358 -8989 -1109 10357 2375 -5940 5139 15460 13861 15462 22359 18465 11342
190 11342 15612 20876 15182 11028 13324 8717 2316 9102 14913 4320 -5348 -596 -1939 -13768
204 -13768 -12672 -2252 -8798 -22953 -17081 -4646 -10004 -16870 -7929 -3242 -13585 -13742 -105 4365
218 4365 -3986 -3419 4298 2313 -1117 5475 8906 3749 1603 6348 7437 5276 8140 8543 801 -697
234 -697 4367 2756 -2416 1295 5718 -1374 -4793 5008 9159 78 -2090 5930 5524 -2435 1498 10989
250 10989 6193 -1894 2886 9436 4877 554 4727 5113 -1339 -2694 2068 1192 -3090 -4468 -4112 -6327
266 -6327 -6239 -4290 -5728 -7684 -5136 -4288 -7147 -5343 325 -1515 -6394 -2770 3022 590 -2398 3363
282 3363 7297 1401 -635 6275 7756 1641 -279 4483 3449 -2292 -1662 2118 -81 -4623 -4061 -1799
298 -1799 -2894 -4503 -4041 -3442 -3696 -3266 -2843 -1986 311 1769 205 1129 5415 6227 3861 4869 9027
315 9027 8033 4462 6303 10234 6930 2708 4136 6469 2303 -1768 -185 847 -3624 -7187 -5207
330 -5207 -4101 -7676 -9788 -8307 -7123 -8236 -8600 -6962 -5295 -4952 -5302 -3424 -648 624 -95 1343
346 1343 4589 5736 4074 4534 8554 8189 5013 4667 6938 5929 1838 1259 3274 1539 -2438 -2982
362 -2982 -580 -2316 -5995 -5688 -3960 -4528 -7088 -6170 -3955 -3512 -4646 -3343 -344 1449 296 1501
378 1501 4386 5830 4463 4746 7413 8458 6130 5121 7104 7524 4374 2892 4159 4184 671 -1530
394 -1530 -548 -772 -4458 -6664 -5181 -4622 -7439 -8677 -6343 -5036 -6593 -7033 -4283 -2363 -3319 -3451 -696
411 -696 1506 660 335 3440 4814 3971 3102 4983 6600 5367 3383 4152 5309 3095 567 527 1909
428 1909 -340 -3084 -2177 -290 -2120 -4080 -2986 -1375 -2513 -4505 -3072 -445 -1025 -2728 -236 2430
444 2430 1965 1048 2447 4887 4415 3021 3717 5679 5152 2717 2794 4027 2762 376 -405 949 101
461 101 -2501 -3467 -1263 -1714 -4274 -4887 -2860 -3141 -5965 -5721 -2717 -2007 -3787 -2594 792 1082 -576
478 -576 743 3349 2571 1233 1940 3963 3942 3231 2802 3593 3315 1391 388 1163 1065 -390 -2369 -1600
496 -1600 -33 -1841 -4243 -3034 -1409 -4174 -5581 -2128 325 -2067 -2801 938 2862 389 -94 3561
512 3561 3840 1275 1998 5413 5751 4037 5090 5716 4503 3006 3016 2399 1185 567 -482 -1639 -868
529 -868 -198 -2911 -4846 -4124 -3814 -7379 -7499 -3396 -3292 -7227 -6608 -1220 -2105 -5722 -3476 798 -2116
546 -2116 -4130 1103 4907 1630 250 4207 5254 2160 2760 5369 4140 981 2909 4542 3231
561 3231 3230 4019 1592 -650 701 1025 -1954 -2177 563 -1115 -4736 -1297 2390 -1905 -5548 -1779 93
578 93 -4673 -4227 2190 1713 -4336 -3099 2905 1117 -3519 -381 2422 -1858 -3590 2099 4085 217
594 217 -684 1967 92 -2320 397 2081 -1843 -2068 1473 427 -1380 1684 2610 -3504 -5158 150
610 150 975 -3933 -2079 2939 -802 -6281 -674 4209 -2179 -6208 -298 1119 -4402 -2182 4898 3049
626 3049 -3612 -1205 3719 624 -1088 3145 3550 -1353 194 5044 4289 1441 3569 2835 -1965 -1039
642 -1039 4626 2513 -2922 -203 2645 -2076 -4046 2334 1710 -7409 -7597 -253 -1563 -6993 -2781 1900
658 1900 -4770 -8743 -1323 2161 -4349 -4989 666 -331 -4150 609 6176 1497 -1968 2040 2502 -597
674 -597 1885 5982 1666 -2387 2221 5166 53 -501 4046 -94 -7269 -2151 4736 -969 -5827 278
690 278 1502 -6012 -5034 3993 1701 -7048 -3908 3494 685 -2654 3932 5781 -1656 -2424 4872 5167
706 5167 -245 2262 5171 128 -1573 4829 5227 -1423 -1446 1958 -2428 -5816 756 2798 -5714 -7736
722 -7736 -364 -941 -7667 -3929 2017 -4907 -10174 -1730 3900 -2695 -4303 2566 1955 -4664 -501 7712
738 7712 3302 -2731 2355 5911 1311 1087 7293 4527 -2622 327 4876 1073 -1417 3653 2185
753 2185 -4883 -3188 4209 725 -5118 -686 1796 -5162 -5414 3836 4005 -4987 -3756 4711 1149 -3845
769 -3845 3220 7718 -1088 -4203 4783 6405 1 744 5505 762 -4239 1156 5419 -1047 -4235
784 -4235 290 -1139 -5456 -2243 2326 -3488 -7963 -2388 -361 -5484 -4060 2539 -1331 -7446 -1395
799 -1395 5485 -287 -3261 3848 4992 -2253 -9 8879 6538 -1089 2604 8060 3057 190 6283
814 6283 7477 -846 -1588 4179 2648 -1772 1151 2583 -3680 -5069 697 717 -4618 -3402 46 -4599
830 -4599 -6501 669 2493 -4244 -4937 1742 771 -3872 652 6168 154 -3932 3115 6433 902 347
846 347 5787 4293 -2281 1040 6725 2831 -1365 1636 3279 -1628 -929 2920 864 -4272 -2048 708
862 708 -2466 -2752 1342 -57 -5578 -3230 1461 -1115 -4128 326 1608 -3431 -3037 3978 3414 -2368
878 -2368 -686 4026 785 -2012 2926 5542 298 -1415 3882 4263 225 1435 4044 1087 -1807
893 -1807 1639 3676 336 -188 2275 566 -2078 740 2474 -1263 -2679 742 192 -3098 -946 2747
909 2747 -536 -4231 -749 2162 -1789 -2682 1608 1306 -2860 -1643 3335 1924 -1800 -73 2479 -376
925 -376 -1231 2112 3037 -497 -371 2204 1039 -269 1312 1712 -1110 -1452 1371 678 -1412 378 1627
942 1627 -1576 -2221 1009 1174 -2384 -1531 1554 175 -2384 349 2535 -283 -1865 1361 2541 -484
958 -484 0 2747 2068 -560 579 2779 1376 -383 723 744 -675 -319 1113 -17 -1192 -444 -116
975 -116 -1855 -1259 11 -1299 -2618 -1041 397 -1320 -1636 1073 957 -1427 -918 1870 1201 -482 551
992 551 2405 1132 -56 1667 2559 702 176 1407 1221 193 -108 768 -177 -933 -372 -664 -1455 -1272
1010 -1272 -1313 -2081 -2302 -951 -1076 -1764 -1251 132 -457 -1682 213 1436 -21 -171 1741 2347 1123
1027 1123 1038 2953 2863 1352 1529 2555 2108 626 862 1498 650 -926 -700 -589 -1305 -1953 -1755 -2049 -2163
1046 -2163 -1872 -2539 -2481 -1747 -2048 -2129 -1716 -629 -519 -885 -340 1112 904 138 1770 2533 1821 1052 2260
1065 2260 3163 1748 1279 1904 2363 1026 72 1041 934 -304 -1293 -906 -691 -1770 -2204 -2170 -1846 -1903 -2270
1084 -2270 -2149 -1612 -1443 -1703 -1228 -487 -80 -353 15 1041 1428 1044 1114 2297 2097 1494 1854 2184 1772
1103 1772 903 1064 1570 1093 -179 39 17 -313 -1301 -1160 -872 -1471 -2325 -1752 -1592 -1620 -1703 -2027 -1387 -1383 -1522
1124 -1522 -908 -237 339 3 -103 937 1580 1038 1081 1566 2021 1178 1098 2030 1821 619 610 1180 812 48
1144 48 -740 -1 -173 -1159 -1021 -995 -737 -1967 -1957 -1460 -1251 -1546 -1693 -700 -531 -550 -448 -8 316 459 -290
1165 -290 488 1387 1133 886 1309 2014 1466 845 1275 1998 460 70 409 1132 -77 -405 -3 261 -486
1184 -486 -1158 -671 -1009 -1492 -1384 -815 -952 -1112 -694 -984 -775 -433 -716 -511 -69 354 61 -226 859 1226
1204 1226 241 192 1030 1405 313 142 1526 1103 -125 326 1871 326 -891 226 676 -612 -1092
1221 -1092 -136 -56 -895 -897 -57 -689 -966 -583 -325 -914 -734 545 -250 -451 633 897 -499 -267 1349
1240 1349 1002 -685 644 1836 513 -446 1237 1902 -118 -653 1586 1394 -815 -484 1412 520 -1268
1257 -1268 -249 1023 -806 -1355 -109 -284 -1544 -1110 251 -876 -1664 -392 105 -1249 -1271 780 -262
1274 -262 -1652 63 1386 -700 -1375 1313 1259 -1041 -602 2164 886 -1107 663 2187 138 -1020
1290 -1020 1438 2383 -828 -610 1775 818 -1123 88 1676 -225 -1231 893 823 -1185 -783 914
1306 914 -557 -1752 264 886 -1233 -1478 1428 502 -1422 -45 2226 -383 -2040 1074 1961 -1371
1322 -1371 -918 2175 682 -2099 -157 2264 -35 -2346 458 1326 -2021 -1699 1349 189 -2429 -1165
1338 -1165 522 -1363 -2025 679 397 -2186 -1007 1880 259 -1629 829 2182 -546 -712 2481 2243
1354 2243 -1090 643 3819 1002 -1033 2392 3400 -568 -1300 2704 1683 -1962 -553 2113 -514
1369 -514 -2616 -372 1051 -2548 -2923 278 -539 -3505 -1458 1218 -1530 -3019 385 545 -2554 -1340
1385 -1340 2276 122 -1876 1207 3260 -208 -884 3117 2442 -1175 -8 3765 1155 -2139 1108
1400 1108 2333 -1647 -2330 1605 859 -2891 -1912 1183 -1055 -3194 -526 856 -2340 -2517 891 250
1416 250 -2340 -397 2674 -388 -1353 2388 3034 -374 -13 3994 2209 -1309 1658 4257 666 -978
1432 -978 2601 2270 -1470 -683 2786 116 -3492 -1213 1626 -2234 -3520 179 -132 -4228 -2969 736
1448 736 -1293 -3888 -875 1220 -1967 -2110 1905 1179 -2025 -98 2885 14 -1327 2554 3498 -868
1464 -868 -191 3360 1592 -1669 896 3347 -674 -2375 1117 2138 -1930 -1626 1772 -47 -3647 -901
1480 -901 2024 -1502 -3037 387 1424 -1811 -896 2601 369 -1985 873 2818 -131 -591 2929 2088
1496 2088 -1372 247 3364 296 -1908 1277 2202 -1622 -2307 1539 1236 -3211 -1533 1379 -1770 -4170
1512 -4170 -138 610 -2904 -2910 596 43 -2704 -423 1529 -1122 -2628 1247 2436 -963 -332 2589
1528 2589 1340 -1176 1649 3533 -117 -977 2423 2000 -1067 -37 2809 -20 -2439 447 1983
1543 1983 -1415 -2290 1215 714 -2843 -1448 1984 -178 -2346 52 1863 -1673 -1627 1793 1342 -1596
1559 -1596 -151 2131 54 -1141 1602 2018 -719 -800 1812 823 -1515 223 1590 -1363 -2334 755
1575 755 1264 -1809 -1903 983 -724 -2654 -283 1426 -1601 -2463 514 1003 -1946 -1270 1667 462 -1603
1592 -1603 359 2344 -51 -785 1949 1604 -637 404 2180 1052 -530 1285 1844 -715 -101 1655
1608 1655 833 -1303 188 1652 -190 -1606 781 885 -1644 -1633 909 57 -2412 -856 766 -959
1624 -959 -1919 366 745 -1449 -1591 870 63 -1547 69 1197 -360 -973 538 617 -660 -8 906
1641 906 86 -742 522 1196 -380 -572 882 514 -1028 -26 1427 -399 -945 477 1038 -883 -407
1658 -407 1144 496 -791 -406 877 422 -847 244 689 -542 -443 951 413 -524 -164 772 -116 -270
1676 -270 731 627 -530 166 1039 343 -455 447 986 -453 -620 653 261 -736 -649 222 -440 -1300 -407
1695 -407 -54 -1013 -1382 -169 -449 -1254 -887 188 -396 -976 -451 436 -203 117 421 562 467 465 935 566
1715 566 619 1378 836 314 433 1159 320 -355 585 441 -386 -800 -184 -406 -821 -932 -381 -890 -1583 -960
1735 -960 -389 -1092 -1262 -725 -62 -459 -374 373 466 131 555 1142 858 829 1280 1084 792 1358 1274 827 990
1756 990 852 335 -219 -27 53 -307 -1050 -526 -692 -1392 -1372 -1053 -1092 -1396 -1257 -719 -495 -855 -794 -71 -249
1777 -249 -324 127 496 313 768 1026 1222 940 904 972 1038 1046 492 343 587 380 -11 -316 -177 -76 -1104 -1059
1799 -1059 -1249 -824 -1448 -1241 -1018 -917 -1287 -1182 -837 -297 -205 -259 -196 416 690 835 756 1057 1076 1172 1039 1451
1821 1451 1302 1192 945 1112 852 490 398 172 87 -606 -676 -703 -1015 -1254 -1249 -1410 -1252 -1702 -1271 -878 -1448 -1448
1843 -1448 -1270 -589 -657 -331 -137 180 320 129 672 965 1062 694 1254 1066 1018 1091 603 794 618 634 64
1864 64 306 -11 38 -500 -697 -11 -642 -938 -946 -439 -1041 -1052 -44 -118 -279 -15 108 599 -15 291 1062 489
1886 489 424 1053 1204 717 466 579 518 274 360 230 -331 -206 -1 -551 -702 -961 -728 -979 -1788 -729 -750
1907 -750 -1388 -1435 -627 -555 -1172 -434 406 -355 -754 265 722 -90 220 1146 1116 655 703 1136 1257 529 894
1928 894 1268 671 397 993 876 64 290 440 72 -141 348 48 -840 -761 4 -307 -978 -398 511 -558
1948 -558 -1089 390 468 -823 -432 338 -256 -1116 44 580 -197 -766 46 280 -686 -350 715 344 -684
1967 -684 -124 737 -205 -761 400 -32 -775 -91 502 25 -727 348 367 -829 -667 868 -42 -1078 -82
1986 -82 895 -167 -670 891 745 -789 -598 1411 1054 -600 27 1237 164 -547 1026 1285 89
2003 89 46 1464 647 -197 915 1671 -71 -635 739 1031 -934 -112 995 -786 -1870 -335 666
2020 666 -1191 -1713 63 -580 -2241 -1181 494 -1019 -2297 -293 416 -956 -954 988 432 -1242 -117
2037 -117 1556 614 -377 1249 1632 -341 -108 1995 1523 -524 621 1129 -472 -925 1314 1034 -1406
2054 -1406 -1379 507 -283 -1515 -38 892 -1478 -1870 800 1113 -942 -412 1426 -20 -1521 1205 2439
2071 2439 -35 -245 1453 1529 -218 528 2464 653 -1302 565 1346 -551 -631 844 -310 -2555 -1057
2088 -1057 608 -1213 -2362 -797 6 -2520 -2127 623 -367 -2423 -1364 928 -1076 -1522 1057 1578
2104 1578 -851 -509 2361 1565 -403 1365 2639 586 -416 2409 2266 -387 312 1749 277 -1129
2120 -1129 688 1272 -1009 -1865 156 -408 -1909 -585 818 -1417 -3216 -76 639 -1214 -1157 1018
2136 1018 338 -2024 100 2233 664 -944 824 1278 -588 64 2581 1353 -1192 40 1402 43
2152 43 -991 599 525 -2274 -1836 563 -217 -2352 -1263 2 -2067 -2336 345 229 -2234 -1372 702
2169 702 -514 -1286 1162 1722 -835 -759 1832 1790 -199 901 2695 477 -803 1701 2280 116 -579
2186 -579 1443 514 -1085 76 1758 -268 -1922 -256 358 -1736 -1339 765 -790 -2104 -728 662
2202 662 -865 -1214 842 3 -1750 -572 1685 708 -1030 554 1654 -988 -574 1674 1373 -918
2218 -918 -438 1392 324 -1329 542 1006 -1679 -1714 463 312 -1553 -679 705 -1337 -1866 239 837
2235 837 -1428 -918 917 -216 -1522 810 1571 -192 -1002 1197 1726 -351 743 1984 729 -1023
2251 -1023 690 2002 408 -532 994 1027 -926 -325 1513 266 -1477 -213 641 -1034 -992 752 358
2268 358 -1774 -824 660 -488 -1341 69 410 -1355 -1063 1047 295 -878 -379 1333 -404 -1172 1022
2285 1022 1502 -560 -758 1278 448 -882 251 1125 -279 -1202 550 1026 -629 -613 550 -136 -1257
2302 -1257 -14 817 -393 -943 186 230 -929 -327 938 -94 -1122 109 529 -376 -272 1356 734
2319 734 -710 157 1343 265 -459 746 1131 -304 -217 1121 1137 -316 34 817 485 -295 642 721 -521
2338 -521 -1074 280 183 -1191 -194 122 -859 -1436 -90 -284 -1021 -905 147 -570 -1083 -166 430 -605 -668
2357 -668 547 406 -174 86 1313 182 -441 277 770 395 -132 853 437 -102 86 618 271 -550 110
2376 110 494 -407 -479 442 88 -789 -313 -59 -322 -321 493 67 -519 -61 605 507 -47 502 774 420 186
2397 186 1126 985 352 315 515 557 161 558 304 112 -190 -197 137 -659 -697 -483 -647 -938 -948 -719 -1081 -1009
2419 -1009 -470 -867 -867 -674 -99 -552 -275 261 399 -81 120 1019 672 96 884 857 596 669 995 935 340
2440 340 239 799 694 121 442 196 69 -222 -135 -290 -359 -346 -412 -581 -442 -445 -128 -613 -383 -32 12 -299
2462 -299 57 412 -168 169 574 466 325 268 561 528 81 -16 362 499 -168 17 -28 -99 -511 -348 -354 -888
2484 -888 -907 -536 -592 -607 -750 -838 -540 -293 -303 -170 -447 135 -21 -153 707 578 655 533 873 1043 686 791
2506 791 1025 886 872 1060 848 710 527 -115 222 35 -101 -139 -167 -328 -522 -655 -445 -727 -590 -376 -589
2527 -589 -163 -354 -621 -284 -182 209 -113 114 419 387 115 125 476 425 93 201 462 215 -58 -109 165
2548 165 -267 -692 -316 -330 -725 -678 -397 -757 -608 -823 -473 -420 -486 -592 -316 -334 -127 -261 28 -157 655 385
2570 385 54 510 581 894 572 736 986 533 439 807 601 362 240 97 360 -87 61 120 -746 -462 -579
2591 -579 -349 -877 -538 -221 -453 -776 -476 -356 -428 -621 -363 -19 -33 30 114 -28 16 593 133 21 -38 702
2613 702 295 36 52 772 85 -22 112 14 -473 -231 87 29 -404 -437 47 -470 218 -238 -40 -266 -220 27
2635 27 -102 -539 37 455 218 246 499 551 -60 263 462 399 -77 635 717 75 -364 723 420 -386 71
2656 71 180 -329 -1136 -182 -14 -467 -986 -95 -308 -1003 -580 -3 -221 -906 -329 291 -1003 -795 334 -21
2676 -21 -708 -79 225 -9 -318 232 398 -493 -16 823 278 -321 548 594 -190 -94 653 394 -342 -145 713
2697 713 -460 -604 -70 141 -357 -849 370 155 -891 -248 134 -125 -646 535 395 -453 -259 874
2715 874 542 -220 505 857 -1 21 658 1079 -51 -236 841 -54 -681 131 1111 -690 -946 151 91
2734 91 -1175 -572 342 -561 -1576 -681 44 -930 -1163 -150 -290 -1481 -804 558 -464 -1034 111 536
2752 536 -706 -78 1293 930 -363 330 1039 327 -368 1485 1292 -616 -313 1326 672 -555 -80 628
2770 628 -329 -1214 328 699 -1138 -1104 567 -467 -1101 -227 968 -572 -758 191 407 -623 -122 1058
2788 1058 3 -1115 546 1363 -4 -201 783 305 -1125 231 1258 143 -987 388 376 -996
2804 -996 -676 693 70 -1622 -1026 475 -524 -1306 203 311 -1581 -999 769 259 -986 112 828
2821 828 -275 -495 921 1134 -323 -52 1366 582 -259 1124 1729 -73 -635 1012 852 -516 59
2838 59 1081 -404 -1296 6 937 -474 -1024 -19 -84 -1490 -643 1100 -275 -1473 -188 639 -413
2855 -413 -382 923 286 -1023 -235 1375 350 -419 618 648 -345 -284 1358 581 -970 -165 441 -530 -838
2874 -838 968 517 -1272 -821 187 11 -1506 -108 466 -719 -975 447 502 -786 -359 954 285
2891 285 -841 648 1477 37 -127 1030 1062 51 744 1745 194 -637 756 757 -131 107 1153 -146
2909 -146 -982 -496 726 -302 -1308 94 -193 -1282 -857 479 -159 -1725 -639 588 -595 -652 362
2926 362 322 -1077 -670 934 381 -582 379 709 -380 -578 991 1031 -259 -6 723 -65 -677 907 863
2945 863 -718 -754 427 241 -791 86 737 -338 -904 304 448 -641 -798 481 -76 -754 61 1054
2963 1054 0 -380 470 628 -203 303 1058 419 -545 536 1002 262 -286 675 665 -346 -229 833 135
2982 135 -1015 157 47 -748 -792 371 124 -937 -748 413 -536 -1090 33 289 -1036 -1030 455 137
3000 137 -530 146 354 -152 -422 598 928 -191 164 794 191 -445 770 1033 110 -366 619 794 -242
3019 -242 -72 361 216 -631 -109 515 -258 -851 94 -37 -595 -348 187 -41 -555 100 46 -317 -213 347
3039 347 290 -262 37 640 252 100 478 598 -406 123 477 585 -119 -117 387 -63 -694 -61 341 -568 -568
3060 -568 88 -225 -932 -204 -377 -769 -1156 -316 85 -739 -327 72 124 -166 -54 572 -105 -3 604 564 -52
3081 -52 478 475 228 -93 460 531 351 148 440 468 -60 -54 310 -368 -266 -132 -152 -582 -547 -235 -192 -503 -518 167
3105 167 -385 -346 182 295 -170 143 134 91 199 415 380 380 70 644 119 157 339 396 179 -176 194 -77 73
3128 73 -462 -179 -303 -403 -466 -630 -469 -532 -447 -472 -575 -412 1 239 -378 -5 251 -148 -83 525 -100 363
3150 363 244 543 681 342 257 357 587 584 199 57 186 -152 -34 54 -219 -326 -178 -263 -656 -225 -368 -615
3172 -615 -476 -327 -500 -304 -228 -101 -14 -98 69 268 365 17 483 554 295 462 670 647 560 556 474 452 521 -24
3196 -24 130 -234 236 -402 -250 -46 -283 -214 -677 -234 -504 -450 -362 -416 -344 -263 -157 -136 -23 -135 -28 228 49
3219 49 268 491 399 442 244 89 562 454 226 260 572 268 178 -113 -5 -202 -526 -24 -111 -227 -568 -534
3241 -534 -213 -311 -561 -438 -233 -548 -429 -269 31 -104 -352 175 54 30 48 181 253 98 167 305 314 493
3263 493 180 382 168 211 -14 137 -180 24 42 -41 -302 -179 -18 -367 -266 -320 -369 -360 -478 -325 -150 -413
3285 -413 -182 167 -227 -15 312 242 220 231 533 264 128 293 198 261 26 70 230 47 49 91 206 -431 -340
3308 -340 163 -422 -354 -162 -78 -565 -304 -85 -378 -443 150 -239 -245 -103 171 431 -385 -160 374 200 -188 147
3330 147 291 -85 154 589 429 163 195 351 86 -114 129 136 -232 35 48 -104 -658 -403 -9 39 -529 -174
3352 -174 187 -383 -264 319 351 -290 -170 449 -72 -254 587 166 -71 383 527 -42 80 466 350 -128
3372 -128 -486 228 234 -455 -258 373 -219 -401 29 310 -386 -340 -74 -198 -766 -319 289 -254 -473 -193 39
3393 39 -538 13 276 -48 -291 261 476 -300 -409 533 280 -34 55 770 257 -332 334 255 153 -264 393
3414 393 343 -329 -337 171 -457 -616 80 123 -279 -572 51 33 -834 65 497 -585 -341 419 410 -525 -398 584
3436 584 342 -377 274 685 -39 -208 440 401 -35 228 332 157 -420 152 571 -152 -526 -181 -103 -675 -651
3457 -651 225 -387 -790 -103 -190 -713 -537 175 18 -475 -10 686 72 -453 250 777 4 -226 1042 862
3477 862 -227 531 985 234 -71 529 633 -218 -163 576 -84 -602 177 415 -612 -890 334 463 -494
3496 -494 -683 154 -150 -809 -111 140 -776 -560 216 -11 -490 -206 972 392 -636 286 832 -268 -85
3515 -85 979 811 -258 -166 453 46 -221 109 853 -259 -486 305 71 -579 -402 373 -446 -776 26 451
3535 451 -356 -496 644 333 -745 112 499 6 -424 618 629 -142 -81 555 519 -72 435 869 -291 -526
3555 -526 567 641 -657 -225 309 -170 -896 -124 -6 -383 -579 156 -143 -1299 -459 170 -108 -708 207
3574 207 441 -382 -374 510 501 -410 33 825 67 -428 546 793 -340 -342 687 546 -558 245 735 -23 -704
3595 -704 396 219 -473 -583 140 -235 -719 -198 372 -103 -642 -117 -6 -836 -400 369 -104 -373 160 548
3615 548 -37 -15 868 401 -6 280 827 543 -270 183 337 -53 -464 580 414 -692 -201 170 -443 -588
3635 -588 265 -285 -449 -449 312 -8 -454 81 342 -346 -647 404 -2 -166 28 395 -26 -382 466 704
3655 704 190 -2 323 469 -397 -95 520 32 -295 -83 222 -120 -491 166 29 -431 -244 400 -250 -627
3675 -627 219 323 -476 -31 591 -106 -475 245 505 434 -449 385 549 -22 -50 743 384 -121 296 628 452
3696 452 -73 644 191 93 -136 234 -521 -607 -129 66 -32 -528 360 171 -625 -551 374 -556 -604 -17 457 -238
3718 -238 -329 439 31 -434 189 626 119 81 625 518 -145 -223 548 488 -272 348 479 115 -168 302 226 -511
3740 -511 -22 28 181 -486 -228 212 -412 -489 -37 111 -623 -178 101 58 -138 -186 339 -21 -131 312 116
3761 116 -135 102 374 245 72 306 185 -96 -227 400 256 -127 30 -151 -191 -631 -187 -259 -263 -266 -219 -237 -638
3784 -638 -332 27 -288 -517 169 108 -110 -197 39 92 -226 -3 218 241 240 329 241 72 101 360 393 204 341
3807 341 280 232 -146 356 18 -327 -204 -121 -283 -540 -241 10 -359 -296 -220 -177 -282 48 -241 -151 120 25 261
3830 261 -28 -5 -8 -36 -169 503 350 266 172 473 390 249 247 96 88 -30 120 36 -299 -172 -269 -344 -320 -227 -208 -197
3856 -197 -371 -39 -341 -577 -133 -198 -36 -265 -117 114 283 33 220 21 193 534 131 341 219 572
3876 572 -83 16 131 265 208 168 111 -45 -57 0 -14 -159 -180 -401 -275 -296 -462 171 -166 -439 -251 115 -34
3899 -34 308 175 134 -13 -91 45 140 364 438 240 397 293 78 223 186 -96 -50 -8 39 87 260 70 -171
3922 -171 -272 -180 -720 -86 8 -97 -216 -256 -102 -161 -222 -168 87 240 103 -59 267 200 582 306 362 336 275
3945 275 297 230 -124 251 70 350 59 142 219 -374 -366 14 -71 -142 -57 -120 -240 -389 -165 -381 -422 -425 -57 -258
3969 -258 -242 -201 170 112 93 -18 2 -61 374 233 284 -175 103 17 -126 287 -14 -39 -54 -187 104 25 -174 -196
3993 -196 21 -568 -224 -197 -236 25 35 48 -544 74 -62 307 6 124 16 -218 -169 -157 353 279 294 441 345
4016 345 200 343 335 186 176 -59 344 32 -279 81 -45 -162 -33 57 -111 -241 -147 -102 -225 -244 -98 -237
4038 -237 -87 68 -233 -160 35 135 308 33 59 -21 397 102 273 473 118 158 181 338 1 144 401 53
4060 53 -137 317 214 -159 -297 -102 -246 -456 -381 283 -259 -284 80 287 -317 -85 226 -13 -527 -31 170
4081 170 -163 24 174 299 14 146 339 397 -42 278 410 -236 -142 609 66 -74 174 367 53 -355 -143
4102 -143 -127 -398 -440 -104 224 -705 -53 82 -372 -593 345 -155 -419 -128 355 193 130 246 254 49 -16 198
4124 198 451 -82 327 533 216 389 294 364 -144 -268 -129 -113 -306 92 361 -197 -380 65 281 -468 -646
4145 -646 -118 -304 -450 -252 12 -253 234 76 129 -576 131 -24 401 -175 53 726 145 253 158 278 51
4166 51 141 383 153 104 -26 101 -379 -711 159 133 -534 -569 49 -246 -393 311 -141 -519 -242 54 -90 -196
4188 -196 182 561 103 -15 574 611 -32 329 578 596 -119 256 386 176 7 371 360 -162 -134 384 -71
4209 -71 -561 -29 385 -286 -380 -114 8 -435 -470 -25 -67 -568 -124 487 -289 -145 402 235 -391 -63 629
4230 629 357 60 288 850 -87 -104 377 356 -269 101 354 -293 -488 -40 335 -658 -481 279 -332 -625 -242
4251 -242 206 -338 -574 204 206 -537 -362 270 124 -252 33 373 246 174 551 337 -93 2 918 402 -260
4272 -260 -116 435 55 -272 316 310 -348 -40 328 -41 -333 -105 45 -521 -404 189 82 -646 -341 180 -160
4293 -160 -615 225 691 -104 -243 310 365 -149 307 485 203 -319 462 667 -136 -13 272 252 -260 330 239
4314 239 31 -332 312 312 -259 -444 226 222 -436 -191 309 -248 -500 82 43 -324 -91 202 -44 -269 62 421
4336 421 -23 -44 439 465 -293 30 551 285 -163 245 340 -9 -287 162 59 -410 53 173 -187 -438 -117
4357 -117 -410 -343 -383 146 -62 -623 -247 -29 -9 -45 243 351 -165 232 389 189 -38 276 298 237 -70 255
4379 255 69 11 165 400 189 -187 118 220 -362 -185 -24 -57 -127 28 273 -280 -519 -55 -3 -305 -227 484
4401 484 108 -141 -53 524 -234 -117 147 233 353 125 341 -59 181 162 531 -8 8 309 -253 -245 -25 -251
4423 -251 -132 -273 -189 60 -272 -419 174 31 -334 -41 -212 -363 -104 -82 356 -239 -327 215 -155 -266 -110
4444 -110 329 16 146 503 315 111 321 132 211 -102 219 48 -211 29 -53 69 -159 29 39 -208 -131
4465 -131 -199 62 -224 -454 207 58 -243 -428 177 107 -258 93 42 123 174 42 119 -67 332 490 219 143
4487 143 6 345 105 -71 295 296 -180 -505 -210 -71 -229 -35 -156 -220 -174 -10 2 -344 -68 -326 -311 -5
4509 -5 169 -204 -104 245 182 373 31 81 184 283 217 161 397 78 263 -78 -23 6 190 73 -43 1 146
4532 146 220 -508 -381 -330 48 46 -46 -546 -286 -94 22 -163 -131 -176 -452 -125 -173 101 218 67 324 430 216
4555 216 155 267 352 295 14 385 303 145 -124 69 -50 -23 40 -35 -259 -422 153 -41 25 -259 -95 -68 56
4578 56 -225 -253 -298 292 43 133 -6 72 149 56 351 -63 139 448 -186 -154 275 58 27 -53 148 265 -6
4601 -6 35 -49 -77 66 -124 -23 -290 23 -193 -315 -170 -174 -92 -132 -210 -40 -189 -59 112 49 -42 -127 146 299
4625 299 234 450 186 236 119 124 122 215 159 68 165 -74 194 159 -217 -142 -43 -163 -212 -349 -165 -217 -181 -69 -92 -30
4651 -30 -116 -321 11 152 429 276 33 129 59 -32 143 191 203 298 60 214 168 284 173 244 2 -455 277
4674 277 -288 -239 -102 -131 -133 33 -189 -304 -244 -186 -197 -335 -129 -111 -108 -106 -144 -119 -165 -31 -3 67 -244 68 -75 135
4700 135 -56 47 394 150 51 125 331 24 140 53 44 -203 19 4 146 -521 -136 -87 -367 -344 -170 361 -231
4723 -231 20 21 -73 -195 263 100 114 -10 455 28 285 183 76 -133 103 103 158 175 45 305 76 -192 -290
4746 -290 61 135 -273 139 -90 -289 -499 -315 -98 -275 -74 250 68 -359 195 153 -210 -116 195 50 -239
4767 -239 34 250 122 -194 197 185 -246 1 373 258 -68 249 76 184 -313 -87 164 -56 -93 65 -31
4788 -31 -286 -14 160 -299 -449 146 138 -407 -215 215 113 -213 80 276 15 -18 367 207 41 76 373 57
4810 57 52 208 372 -194 -67 103 172 -43 -237 -49 189 -287 -54 67 -348 -395 -68 -175 -399 56 -120 -39
4832 -39 -276 -93 251 -137 -189 137 24 -83 498 578 71 133 383 328 4 44 642 122 250 41 165 -216
4854 -216 -477 405 -115 -286 45 -353 -310 -35 -283 43 -133 -248 253 -27 -411 -149 237 -14 94 217
4874 217 297 27 -429 405 64 55 12 477 163 -459 210 170 -143 -236 -50 -137 -294 -166 -3 -414 -369 -11 99
4897 99 -475 -268 238 -213 -443 42 39 21 70 228 263 -169 -63 679 -14 75 422 459 209 32 198 90 -54
4920 -54 172 307 -238 -275 113 65 -137 -337 169 234 -297 -372 168 -136 -257 -97 11 -207 -431 236 -90 -224
4942 -224 36 123 -48 -248 95 125 181 231 114 -194 -260 -58 537 -202 273 517 48 -99 63 348 41 -222
4964 -222 -60 -15 14 -320 267 -64 -323 -237 180 -154 -173 -116 206 -430 -108 167 175 -286 134 313 335 -164 455
4987 455 389 -82 -20 470 307 -277 85 362 72 -165 280 107 -245 -429 88 -127 -486 -90 161 -218 -430
5008 -430 273 18 -254 -197 268 45 -185 -147 218 61 -111 242 150 -187 166 382 149 -432 409 264 -3
5029 -3 185 625 -15 -326 145 251 110 -12 67 58 -651 -2 346 135 -414 -168 -19 -365 -266 19 -55 -403
5051 -403 -168 81 -4 -225 158 409 37 -208 28 271 37 17 279 292 -333 0 426 -62 -184 80 103
5072 103 -547 -185 -12 -206 -456 94 -9 -386 -258 232 -180 -496 -198 -73 136 -192 237 440 217 153
5092 153 199 132 26 -15 426 118 -37 547 339 -134 192 339 273 -228 48 245 -38 -44 242 -102 -608 -113
5114 -113 103 -392 -269 -54 -148 28 -163 62 -180 -260 95 156 -78 -181 210 207 -188 -120 259 9 -83 334
5136 334 334 194 211 420 227 -347 164 -136 -58 -148 -387 -328 -18 -417 236 -203 -130 -139 189 180 -160 2 299 116
5160 116 -72 260 -72 -94 340 402 123 93 318 217 28 114 286 -71 262 -179 322 -42 9 73 -24 -52 -160
5183 -160 -234 -74 -273 -191 96 -29 -129 -407 -186 -375 86 43 -217 -195 -197 -140 239 201 178 236 209 157 154 -13 -245
5208 -245 164 113 175 11 56 -13 -140 -242 -16 56 -9 -46 -111 -114 -187 -290 -77 -182 -137 176 -91 60 17 40 7
5233 7 11 -309 -177 45 -91 112 15 -49 -85 38 -71 99 137 192 -251 -104 -304 -11 349 -335 235 46 -175
5256 -175 -151 -246 -326 -275 -58 -300 -233 141 12 -448 115 10 201 -99 -101 26 203 122 467 178 264 100 124
5279 124 90 269 65 172 193 67 123 49 243 92 -37 146 -245 -162 -157 -7 -375 12 -236 -27 88 59 -241
5302 -241 109 441 -33 129 -99 -94 32 71 268 409 -79 -44 41 -135 188 162 371 146 -141 49 152 38
5324 38 95 -124 -323 -283 -195 -412 -288 -107 -226 3 100 -35 44 175 195 146 284 36 17 32 -194 235 59
5347 59 301 115 4 44 265 -67 19 97 -161 318 1 89 -124 41 16 -122 -194 -243 -18 -224 -170 36 -329
5370 -329 -173 47 76 -11 -134 -222 122 -72 -196 320 135 14 90 82 101 22 163 34 108 90 74 -137 110 -181
5394 -181 70 -283 96 -66 -422 -52 -331 -102 -7 -44 -18 78 199 -289 -301 141 94 -29 87 -147 -284 120
5416 120 135 182 176 234 178 330 299 431 12 103 137 -14 -154 111 108 -157 -178 -306 5 25 -98 -206 130 -60
5440 -60 -420 -131 -206 -250 -211 240 82 -263 -264 270 -165 -143 68 104 218 -46 -63 296 208 284 147 100 149 257
5464 257 222 -87 91 167 11 -290 -89 224 91 -253 6 31 -13 29 -61 -38 -247 146 -44 473 -82 105
5486 105 196 -10 405 18 91 72 369 321 -157 -129 143 80 49 -98 344 -105 3 -289 -1 -62 -95 -11 118
5509 118 -245 -380 -153 -395 -319 29 -171 -126 -229 253 -56 -168 171 26 155 98 302 295 -30 136 289 161
5531 161 94 383 -56 13 -118 -264 -3 -265 -247 54 -67 -131 -179 -244 -5 -191 -176 67 154 -65 25 -146 -151 108
5555 108 34 240 -205 -156 -139 -76 226 141 311 -80 22 365 61 175 125 -131 -207 -3 170 -19 -124 16
5577 16 202 -406 -300 -108 -370 -251 105 -22 -540 -261 -31 173 27 -138 357 317 43 249 330 63 132
5598 132 40 68 95 104 166 -31 -199 124 35 -62 -389 14 113 -373 -41 243 -447 -29 96 203 -183 -264 2
5621 2 -93 -340 -110 53 -105 187 97 211 34 -103 -20 286 -104 212 322 0 120 376 24 -72 -46 142
5643 142 -22 31 -17 70 -521 47 376 -140 -502 -181 -10 -34 -23 -382 40 -271 -97 -72 134 -34 439 10
5665 10 -91 -2 223 209 170 35 58 327 -249 86 190 -43 128 188 118 -164 -161 -16 104 -394 7 -10 -143
5688 -143 -445 -14 156 -16 -85 -27 -89 -39 -17 -169 -43 -477 -10 62 -327 138 68 -11 -73 215 -208 72 194
5711 194 167 181 -190 111 184 -9 99 272 -66 55 41 -232 -31 74 -165 102 291 -263 -2 231 -32
5732 -32 121 244 68 -143 57 288 72 -130 -128 -58 14 -83 -99 63 -313 187 247 17 -80 169 -144 -55 -390
5755 -390 -94 170 34 96 -23 -140 -211 139 -41 -55 -31 28 -340 78 -95 107 -243 248 24 -201 -272 146
5777 146 247 -173 -227 276 235 -178 -212 -17 213 -276 345 66 123 -75 90 -77 -26 84 -57 202 -41 -234
5799 -234 4 21 -318 61 -135 -94 -158 255 45 34 -5 26 -143 59 529 86 117 35 -2 103 -180 38 315
5822 315 -68 80 58 335 72 -58 121 -150 -168 -243 -181 35 -134 125 -119 -195 6 305 -344 -246 -26 60
5844 60 -120 -23 515 55 -14 143 74 147 98 323 40 218 177 192 3 -60 41 41 -92 -1 -98 65 -265 -180 -215
5869 -215 -59 -86 144 -303 -412 -246 17 -43 138 -20 -39 181 -165 316 223 8 20 156 222 45 104 286
5891 286 116 262 167 45 -20 -181 207 111 109 -144 37 -394 -319 72 45 -60 -184 -93 -137 -22 136 71 -126
5914 -126 -164 -225 96 36 277 -36 -4 -52 416 255 227 129 90 200 5 275 89 61 326 -237 97 -4 -365
5937 -365 216 -22 57 -9 -57 -104 -257 -143 -150 -232 -213 153 -172 51 145 42 -147 -124 -7 -40 185 182 140 32 72
5962 72 19 84 115 95 129 299 36 -71 -221 -246 -49 7 49 -36 34 75 -264 -200 -161 -66 -58 51 -68 202 -40 -64
5988 -64 265 -286 -197 9 210 -104 -112 -83 288 10 -87 80 99 -63 203 -211 187 -93 -3 36 89 -43 -30 31
6012 31 39 21 -160 -91 -150 139 -169 -86 -38 -206 74 218 -25 275 -20 -29 -130 -297 31 269 -21 -166 158
6035 158 194 169 115 126 -239 -127 104 132 -368 -74 -228 -266 -45 -65 -170 -85 -79 -297 108 -32 43 -10 -155 234
6059 234 60 158 -26 -165 -180 42 383 -2 74 422 390 -307 240 134 120 253 -89 82 -35 33 -198 -112
6081 -112 -179 160 -63 -122 35 534 -181 -12 -224 89 -77 -323 354 9 -102 150 195 -103 124 38 61 -308
6103 -308 267 12 -6 107 -186 40 148 -43 84 -51 -39 -103 -47 -63 -152 78 -1 11 77 -57 22 -166 94
6126 94 -339 -96 71 -267 108 -55 78 -52 -25 -165 -98 62 46 113 -125 112 -59 -236 164 -30 -66 -40
6148 -40 -76 186 103 -177 -109 104 -72 59 18 -81 -434 -229 -236 70 -239 -171 -185 194 -235 -410 -172 34 84 -57
6172 -57 -104 -149 133 113 283 484 78 -99 149 95 97 -205 -18 144 -81 168 87 -184 131 73 -13 -401 144
6195 144 20 123 55 -177 316 90 -59 -34 84 -81 -138 198 348 452 291 329 -56 -253 272 138 105 65
6217 65 -16 -1 -251 -157 101 -8 -67 -36 -98 -156 -119 21 74 -95 -158 225 -88 -471 -23 104 96 29 272 -33 171
6242 171 67 -130 56 -23 252 31 34 -118 413 114 -2 -71 122 61 86 124 -121 -399 -13 -99 61 81 -7
6265 -7 -119 -2 42 -129 -107 -115 287 217 116 3 185 -166 -107 -126 69 145 147 226 44 -31 71 317 130 23 100
6290 100 -64 -38 -477 -19 341 -174 -205 -41 81 -1 25 201 245 -32 -133 -249 -62 -384 -73 -168 71 217
6312 217 -50 -199 -287 155 181 -136 -132 154 187 0 126 2 -111 -1 269 147 142 -97 225 -18 -173 -166 -89
6335 -89 45 -150 -136 107 -107 -81 -128 213 -33 134 -108 -175 61 -137 243 23 102 106 -31 123 45 24 -74 50
6359 50 85 127 -137 -230 262 -124 85 299 -261 132 -115 -223 129 -300 -238 -17 -514 -111 -103 118 -361 -341 89
6382 89 -3 -172 42 343 102 115 150 -120 -37 14 151 372 334 -23 444 76 -15 -12 90 174 55 252 -226 -129
6406 -129 157 -169 -37 -277 76 -213 -144 -119 -13 -153 -277 -113 -141 -232 -125 60 38 70 130 3 102 -117 370
6429 370 64 -53 47 123 116 -295 -18 57 87 -311 399 72 -106 224 70 187 -256 179 -109 -182 -28 157
6451 157 123 -218 -195 -183 48 -229 0 60 42 203 304 -24 31 -72 43 124 -120 12 50 -165 191 -109 -33
6474 -33 -84 -65 92 -120 -2 -173 -68 -139 -80 -67 -128 -192 -26 -147 419 76 -35 103 -89 -243 -62 -108 -156
6497 -156 187 289 87 -57 336 -141 -46 -145 60 108 -120 14 -205 -252 -143 119 16 -157 55 -198 22
6518 22 -513 -147 -11 -65 -376 -22 -49 -279 -187 47 359 -145 120 -200 55 5 42 -146 -207 -105 171 -33
6540 -33 -279 115 464 -61 -154 -32 -33 -199 111 -78 -17 -259 53 -294 51 171 82 8 -260 25 66 -160 232
6563 232 167 -46 -168 -117 33 64 -154 -198 133 192 26 129 295 -94 -328 139 -165 -137 -77 148 -44 -22 -145
6586 -145 38 -298 -90 245 -28 -11 -101 28 78 -110 90 117 -300 -27 6 3 51 53 416 112 245 52 257
6609 257 417 169 256 171 21 -115 15 253 171 -79 -148 201 194 -184 -144 -118 84 169 -16 -5 39 -209 -295 199
6633 199 120 -1 146 21 229 241 -47 158 -130 -231 59 31 -271 -176 44 602 77 403 -57 -66 86 252
6655 252 52 99 61 -83 -47 -10 -142 125 -185 -344 -200 -31 225 -101 3 142 -191 -187 24 -27 8 61 39
6678 39 70 -73 -19 -126 -352 -57 115 271 -26 7 463 24 -47 56 -175 -295 -48 -39 -424 -44 264 -243
6700 -243 -213 -140 -54 62 157 136 -404 205 -85 -114 -5 -298 -101 -216 339 -183 -155 82 94 -84 -60 -234 19
6723 19 -99 75 207 -253 -107 -12 -2 -49 -139 -104 -9 -93 132 -92 -267 19 83 302 -75 -76 -434 83 29 136
6747 136 144 208 -93 230 6 13 289 191 -66 -9 -41 66 158 -100 190 159 -183 331 -34 -74 -70 -257 -41 -219
6771 -219 -26 60 54 -234 374 171 160 -307 107 -155 -153 19 -68 -171 -148 57 324 -29 5 342 -89 -61 31 -24
6795 -24 -96 5 -29 -311 -161 289 13 116 188 -150 -20 -167 -141 -52 -18 283 164 37 72 -310 -53 -30 125
6818 125 146 -16 -20 -111 -81 -116 63 66 122 61 91 27 24 220 334 304 15 175 0 7 -112 -50 116 -276 24 -260
6844 -260 17 231 -145 -281 -86 173 77 97 10 -105 54 307 116 138 164 -225 -21 319 -2 47 112 -162
6866 -162 80 -47 -214 284 260 -81 30 -105 97 104 -227 -100 131 -11 64 14 290 -202 45 -93 -420 -121
6888 -121 153 -32 -201 113 -87 -88 135 16 -59 87 14 250 -19 -127 190 -259 320 -88 -274 103 -86
6909 -86 -139 150 29 108 140 159 -194 -35 221 187 144 318 172 -201 -52 95 -224 164 300 155 43 139 38
6932 38 51 -19 250 80 79 -175 312 168 -20 189 55 208 194 -148 -213 128 -9 -32 -99 -88 27 -37 -383 -97
6956 -97 28 -39 -37 -208 28 68 121 157 194 -65 -170 -153 261 330 -314 98 49 63 -78 68 -95 -101 -202 -5 -166
6981 -166 118 481 22 8 0 218 -75 -49 -31 -46 -214 220 110 -403 -202 195 -143 14 -134 285 67 -45
7003 -45 36 90 187 41 26 70 -42 56 271 125 -130 -237 199 -97 -436 -61 -136 -94 -152 -181 -49 -281 247 -45
7027 -45 43 -91 81 164 26 -16 22 50 88 182 152 8 7 275 237 123 -137 108 165 170 51 37 -60 -269 -113 -198
7053 -198 34 107 133 -131 -221 114 -231 -31 -230 -133 -277 -17 -100 -68 -113 -187 451 -68 52 -64 269 -78 -151
7076 -151 170 168 154 -181 123 283 -282 1 239 -14 -163 122 340 22 -262 -46 65 -223 -29 103 -147
7097 -147 63 74 242 -97 1 105 -42 52 -187 -115 -83 100 53 -149 -1 271 224 -9 -57 159 34 -153 -212
7120 -212 295 213 -25 -225 -140 227 -191 -376 127 -198 230 -194 -431 -78 -64 274 163 186 -225 156 -26
7141 -26 -5 57 -57 -50 28 162 -69 60 -25 40 99 -47 -189 -53 -30 296 342 265 -238 119 96 -164 -139 -174 -25
7166 -25 -74 167 163 -121 142 274 -113 118 -391 244 -109 -225 14 138 -74 121 302 183 179 252 -13 -72 -40
7189 -40 -146 51 -4 -120 117 27 -85 86 215 -3 -32 122 24 -120 -19 57 -89 77 -56 -46 -156 -281
7211 -281 -30 -113 34 -55 94 372 -109 -3 59 22 -143 157 188 177 86 -6 17 -65 -129 151 124 18 126 145
7235 145 -41 -223 -27 -235 -174 120 126 -32 -160 112 246 -22 100 102 228 -175 -22 276 88 -129 -220 171
7257 171 -1 -82 175 313 -133 113 349 -180 137 -266 -7 -215 -60 -174 -196 120 -122 44 -138 -139 261
7278 261 124 -86 -39 260 127 -124 146 150 -44 132 -35 -9 -28 240 -38 59 35 -35 -23 71 35 -44 54 -148
7302 -148 -90 95 -376 -432 -140 -324 -64 -148 -142 -219 -179 -228 371 43 175 294 89 156 77 80 109 46 -60 -14 -155
7327 -155 11 369 -133 -113 -22 69 130 -186 -84 -44 145 -224 15 51 -275 39 -304 85 -247 -92 -204 -188
7349 -188 41 -249 226 62 167 -10 47 32 315 108 365 -40 223 385 -62 59 -5 -49 -95 -32 -8 135
7371 135 4 -132 -81 -217 48 25 -169 226 -8 -257 74 -81 -44 56 -426 -21 -139 105 -147 -85 -10 -123
7393 -123 -86 166 39 -42 -90 168 98 115 176 -90 54 -50 344 53 -255 -242 -130 69 140 69 60 -35 -87 134
7417 134 -73 -126 -318 14 141 -106 -134 15 -216 -135 165 -35 -73 114 -49 279 -174 -185 180 -73 363 311
7439 311 26 93 129 31 -75 92 50 -269 81 297 39 26 81 -6 -313 -254 87 41 -172 -93 -30 152 -468 5
7463 5 275 -397 -53 -68 31 -147 -52 -213 -33 -147 -13 -92 -113 -178 105 -17 -176 169 72 295 40 160 58
7486 58 -187 142 -90 -282 -282 -146 -263 56 -110 -147 -127 -360 247 -62 -44 -209 92 367 21 -166 210 -84
7508 -84 26 287 106 -2 37 -59 -138 -277 -154 -176 99 -36 152 -412 280 -5 -146 -16 -74 -93 -8 -80 113
7531 113 -109 -27 79 250 144 -104 206 103 68 80 -7 227 58 -19 264 -235 82 -16 13 -140 -44 -52 140
7554 140 -219 -170 54 39 -139 210 232 -346 274 -365 -223 51 201 127 -126 -209 -359 113 159 -76 73 228
7576 228 178 161 225 164 159 149 -76 195 160 173 189 178 261 246 -115 133 69 68 95 -171 -306 -164 -270 18 24 48 -33
7603 -33 78 -8 18 51 180 -212 -9 121 26 62 -239 35 -176 77 -18 -205 24 348 -70 219 211 -34 -98
7626 -98 133 242 318 -27 35 146 -130 169 -16 18 -320 52 -95 45 -169 114 335 -112 -69 -151 -163 237
7648 237 -83 -186 39 -42 119 -86 84 -24 34 164 -136 110 135 64 22 18 -230 -111 408 -7 62 -266 227
7671 227 -56 111 -81 80 136 -259 116 47 -244 -258 -208 -90 -137 97 247 -123 208 11 98 48 231 -114
7693 -114 -24 194 16 178 59 -225 62 344 -34 38 -55 -77 14 -71 -77 -44 68 5 -156 275 -96 -94 109 174
7717 174 -50 5 164 306 159 130 -305 55 -218 0 79 -186 -4 232 -244 119 110 -3 -139 -15 258 -120
7739 -120 124 79 -160 47 -275 83 174 -360 -231 -269 -103 -73 142 -139 56 304 39 -154 214 53 -270
7760 -270 77 -154 203 -92 -68 51 255 -60 161 125 -47 280 -75 -14 -438 -125 -15 -251 -229 -31 -63 -253
7782 -253 116 103 141 -257 -54 19 255 41 180 31 -194 226 230 508 -79 -148 -156 -54 -122 123 172 3 167
7805 167 105 -128 -1 60 -291 240 -278 -174 -77 -25 -1 7 -39 -232 -17 201 -136 -65 -81 -260 110 120 39 151
7829 151 -183 -80 176 20 386 119 199 163 -49 -139 226 -293 -145 359 151 66 65 -104 -81 -348 -128 54
7851 54 -30 -280 25 -99 -63 218 83 -211 -199 -101 -115 7 91 -39 64 -12 316 152 -60 309 -25 99 -289
7874 -289 -60 -55 -177 33 -83 -324 18 -130 158 132 -24 -236 -57 46 -191 -98 185 168 -247 -95 208 0
7896 0 -226 -26 204 -175 57 69 -47 -141 207 -83 -341 -201 -4 -59 -16 -27 -23 -130 160 92 149 51 239 93
7920 93 30 85 -225 -200 -151 -160 -141 -83 86 27 -103 -81 173 -182 -91 70 252 -43 -11 270 52 90 212 306 -61
7945 -61 -71 58 118 404 71 36 216 199 -91 -88 -46 -69 -104 -128 107 31 187 -227 20 -29 189 124 181 -23 129
7970 129 -126 -149 -164 -138 -135 -15 149 199 -55 50 265 109 28 -38 178 -5 207 -174 -106 -258 91 -91 -225
7993 -225 -65 -88 20 -33 -61 -173 202 -131 9 20 -232 -97 -337 -92 -122 110 89 -34 -89 189 197 38 -122
8016 -122 -28 -39 -272 -31 71 -32 -40 131 174 -376 86 -137 -91 -610 226 138 -197 -21 152 239 -3 3 167
8039 167 -259 68 -9 167 112 -232 290 130 -42 -33 87 -44 81 -182 -31 -208 371 -303 -162 13 -293
8060 -293 122 -91 -253 101 63 18 82 -140 72 128 22 122 -80 -93 15 -335 -30 -15 -148 159 -201 8
8082 8 80 126 154 -77 -209 -111 278 26 21 -28 -17 -7 -26 179 10 54 -156 -131 -173 53 310 52 -348 1 36
8107 36 -70 -150 54 -232 12 -36 -193 -181 -87 21 -28 111 -284 201 -40 -81 212 -62 -21 4 165 -276 -231
8130 -231 -100 -202 107 129 54 -96 -93 -42 -313 -195 -374 329 -83 -22 -27 145 -341 -504 129 300 -21 -44 -63
8153 -63 93 98 131 -108 -93 -48 3 38 79 64 17 126 85 -54 21 194 -354 -106 -95 -117 4 -76 -76 -72 -111 -85 55
8180 55 -100 -207 280 -217 1 -91 14 185 208 189 35
8191C5
$$ Imaginary data points
##PAGE= N=2
##DATA TABLE= (X++(I..I)), XYDATA
0 0 0 0 0 0 0 0 0 0 0 0 0 0 -6 8 -8 8 -8 8 -12 16 -16 19 -24 25 -30 35 -38 43 -51 57 -64 72 -81 89 -98 110
36 110 -123 135 -151 168 -186 205 -226 251 -279 307 -342 382 -429 481 -545 619 -710 830 -985
55 -985 1201 -1519 2044 -3059 5759 -29334 -74912 -44313 -41207 -58452 -59513 -40206 -53772 -68456
69 -68456 -49117 -25388 -39129 -50085 -37056 -28269 -30534 -11227 12181 8756 -555 12548 23602
82 23602 20040 28888 42886 31257 14123 25605 39324 24138 12821 21019 10473 -16776 -12592
95 -12592 12369 4704 -18730 -14021 -3756 -19493 -27721 -8650 -5634 -31422 -36804 -14105 -4963
108 -4963 -9284 2151 13963 2329 -4161 11707 21135 10992 8131 11473 3744 604 15360 19958
122 19958 2903 -5144 206 -7019 -17951 -7668 149 -20499 -35246 -21263 -14227 -28760 -29832
135 -29832 -15194 -22601 -38493 -24800 -112 -3478 -13905 -3260 3983 -6155 -4872 11825 11979
148 11979 -1940 32 11417 11270 12311 20000 16170 1210 -324 5996 547 -5776 -611 -3580
162 -3580 -17662 -15010 1233 -1406 -15734 -11913 -3565 -12335 -16310 1556 9549 -5738 -10043 5615
176 5615 9246 -374 4817 15748 8383 -1046 9162 19380 12316 6327 8813 2913 -6142 -4155
190 -4155 255 -7006 -13078 -10543 -12275 -17166 -11916 -6332 -16794 -25451 -18588 -13755 -20852 -18308 -5814
205 -5814 -8145 -18558 -10198 5208 2045 -6455 2156 8984 787 -509 13052 16033 4531 2625
219 2625 10352 9280 3450 6810 10143 3315 -439 4231 4929 865 1393 1335 -5282 -6761 -224 433
235 433 -4895 -1921 3020 -1862 -5317 3264 7216 -2191 -6049 2159 3378 -4509 -2337 6214 1515
250 1515 -7704 -3818 3263 -2038 -8095 -4409 -2719 -8171 -9636 -4159 -3441 -7952 -8068 -5093 -5393 -4762
266 -4762 -1450 -1621 -2852 -226 1999 -8 1853 6260 4869 233 3035 8571 5656 1143 5081
281 5081 8190 1738 -1939 4055 5405 -2193 -4703 26 58 -5275 -4281 337 -1273 -5077 -3831 266
297 266 -126 -1485 352 2132 2114 2962 4041 4677 6444 6540 4689 4844 7072 6495 3028 2650 4923 2693
315 2693 -1767 -1049 1443 -2144 -7243 -6014 -3097 -6657 -10491 -7838 -5448 -8250 -10077 -6282 -3624
330 -3624 -5184 -5864 -2105 705 209 900 3459 5286 5920 5318 6654 8699 8619 6936 6882 8230 8097 4945
348 4945 3450 5271 4001 -493 -1652 515 -1402 -5240 -5690 -2742 -3255 -6841 -6250 -2641 -3346 -5542
364 -5542 -4145 -408 -173 -1500 286 3532 4666 3544 4605 7287 7591 5825 5500 7228 7152 4610
380 4610 3179 3692 3572 313 -1573 -774 -712 -4003 -6178 -4788 -3901 -7185 -8628 -6558 -5321 -7633 -8123
397 -8123 -4977 -3068 -4018 -3797 -41 2096 1168 1290 3940 6128 5015 4018 6012 7708 5811 4107
413 4107 5958 6218 4093 2269 3047 3440 968 -1428 -1157 -605 -2553 -4794 -4203 -2519 -3534 -5363 -3380
430 -3380 -1092 -1663 -3695 -1867 1062 358 -1098 607 3516 2812 1356 3083 5343 3968 1806 2350
446 2350 4147 2496 -200 399 1141 -447 -2708 -3132 -2263 -3219 -5285 -5532 -3549 -3990 -5191 -5238 -2919
463 -2919 -2420 -4232 -3802 -816 -398 -2056 -1111 2743 3485 1411 2407 5230 4615 1946 2523 4055 2970
480 2970 628 882 2325 1819 -259 -1052 -766 -1133 -2932 -4091 -3495 -2581 -3854 -4603 -3305 -1529 -2306
497 -2306 -3936 -2187 399 -1108 -1991 1590 4269 2132 387 3855 5162 2094 855 3598 3772 399
513 399 179 3349 2606 -957 -1455 -765 -2634 -4748 -4489 -4747 -5562 -6190 -6119 -5964 -5237 -4095 -5759 -7128
531 -7128 -4850 -2696 -4623 -4110 414 1486 -2129 -939 4413 3886 -158 2062 6034 3589 1076 5513
547 5513 8312 3908 601 3617 4190 109 -576 1681 262 -2669 -1443 352 -1048 -2744 -2486 -4099
563 -4099 -5832 -4263 -2756 -4431 -4752 -1585 -2158 -5202 -2096 1181 -2412 -6144 -1922 1373 -2403 -2978
579 -2978 3259 3248 -3557 -2622 3420 2093 -3105 -1168 2807 -601 -2766 1665 3988 -1149 -3013 -338
595 -338 -950 -3347 -639 903 -2539 -2910 321 491 -2432 -606 794 -3954 -5659 321 2059 -2981
611 -2981 -2279 2860 -33 -5132 -157 5088 -676 -5205 825 3924 -1368 -590 5783 3681 -3209 -1479
627 -1479 4671 1671 -1729 1837 2798 -1897 -1546 3761 1786 -3154 -1834 -1132 -4760 -3880 759 -694
643 -694 -6095 -4262 -192 -3721 -6352 -849 -407 -7623 -6991 1431 1871 -4031 -1374 4203 -1327 -5125
659 -5125 2531 6371 -90 -2281 4097 4635 -48 2883 7682 2375 -2549 977 3348 -163 40 3709
675 3709 -482 -4615 -158 3170 -2312 -4035 86 -1886 -7631 -2509 4653 -439 -6182 -294 3161
690 3161 -3383 -3129 5249 4166 -4797 -1970 6461 3801 -1392 3612 5664 -1786 -3793 4408 4315 -2576
706 -2576 -1466 1805 -2057 -4573 793 1571 -5947 -6445 -1251 -3561 -6862 -725 2209 -5741 -7503 1248
722 1248 2175 -3889 -1441 5314 -35 -5118 3395 10203 2419 -1500 5291 6001 -1191 1562 9542 4199
738 4199 -3621 1552 5965 690 -1157 3542 1885 -5742 -3224 2721 -775 -4396 -274 1 -5827
753 -5827 -4018 3635 777 -5843 -1528 3210 -2207 -3351 5394 5936 -3863 -2744 6029 3367 -2647
768 -2647 2307 6203 -1839 -5418 2692 5481 -2531 -3763 1785 -1369 -6875 -1913 3133 -3194 -6667
783 -6667 -1712 -542 -4613 -1791 3060 -1575 -5838 586 4434 -410 131 6125 3436 -2559 2751
798 2751 9901 4153 -857 5153 7228 -164 305 8399 6015 -3102 -1077 4853 332 -3870 1408
813 1408 2291 -5456 -6762 -97 -303 -5283 -3284 -579 -5049 -6708 120 1287 -4040 -3038 1771 -666
829 -666 -2678 3338 5867 -1025 -2145 4969 4583 -794 2285 7133 1716 -3164 3398 7351 618 -2248
845 -2248 3397 2011 -4137 -1674 4275 -6 -5599 -1821 725 -3302 -3406 1220 -646 -5361 -3040
860 -3040 1130 -1338 -2663 1593 1444 -3760 -1513 4304 2010 -1550 1775 4130 -443 -679 5806 5256
876 5256 -1411 -358 4580 2479 -1209 2563 4881 -669 -2768 2647 3429 -1647 -1507 1681 -506 -3772
892 -3772 -134 2148 -1712 -2906 -79 -888 -3001 -787 1252 -2098 -3614 198 851 -1954 -1189 2773
908 2773 -7 -3537 -318 3266 -177 -1878 2281 2937 -1722 -560 4095 2469 -2247 -51 2635
923 2635 335 -1341 2192 2588 -1336 -1513 1326 709 -1617 -176 440 -1883 -1890 1122 693 -1597 -555
940 -555 1287 -1278 -1906 1688 1417 -1438 -1119 2049 1149 -1456 879 3368 643 -1694 1292 2821
956 2821 -384 -723 1912 1220 -1537 -1055 1606 -97 -2069 -970 -295 -1611 -1586 -123 -717 -1694 -1138
973 -1138 -588 -1588 -1237 547 -224 -1222 44 1992 301 -328 1776 2207 -325 88 2770 2194 -447
990 -447 330 2388 567 -1017 221 1073 -827 -1868 -170 69 -2008 -1480 -474 -1263 -2067 -1506 -684
1007 -684 -1378 -920 -177 -519 -205 906 998 -27 1063 1987 1493 661 1928 2872 1373 741 2397 2661
1025 2661 484 117 1534 1017 -954 -1181 69 -564 -2643 -2091 -1158 -2013 -2978 -2249 -1538 -2302 -2004 -1595
1043 -1595 -1066 -997 -778 -620 -138 626 1061 665 1265 2181 2126 1190 1966 3109 2273 1282 1637 2279 1191 136
1063 136 540 931 -555 -1068 -1055 -416 -1458 -2171 -1828 -1436 -2485 -2417 -2100 -1499 -1631 -1782 -977 -443 -285 -459
1083 -459 233 1314 1298 1029 1308 1927 2426 1572 1835 2306 2334 1443 1342 1780 1258 4 -47 40 -175 -1424
1103 -1424 -1318 -710 -1084 -2271 -2289 -1519 -2024 -2377 -1696 -947 -852 -1274 -871 26 81 -398 -4 978 1470 1025
1123 1025 1303 1575 2224 1753 1325 1565 1890 793 641 1029 605 63 -882 128 -17 -902 -1742 -1111 -733
1142 -733 -1855 -1863 -1104 -1083 -1846 -1550 -616 -471 -731 -749 121 389 354 507 1056 1398 1579 953 1372 1759 1577
1163 1577 880 1014 1565 1138 636 546 1285 153 -1017 -295 -169 -840 -1751 -971 -710 -1423 -2233 -771 -791
1182 -791 -1850 -1458 -867 -680 -1012 -632 -12 320 72 391 437 536 439 911 545 947 1632 1047 467 1277 1601
1203 1601 747 -283 924 883 -109 -521 767 434 -1223 -549 473 -336 -1959 -901 292 -985 -1204
1220 -1204 -93 346 -732 -829 480 195 -496 266 338 101 254 916 526 -40 851 1093 -12 -229 1221
1239 1221 869 -834 121 1459 91 -1005 -115 1042 -943 -1904 544 512 -1474 -1522 474 -337 -1822
1256 -1822 -801 648 -1419 -1774 49 235 -1200 -998 521 -160 -1015 109 1144 -575 -547 1139 817
1273 817 -611 809 2296 164 -597 1872 1858 -1069 -274 2337 1129 -1286 77 1942 -293 -1791
1289 -1791 681 1510 -1423 -1809 1096 785 -1711 -1015 938 -623 -1842 198 717 -1603 -1122 939
1305 939 16 -1483 508 1534 -710 -1354 1387 1298 -1426 -191 1894 -290 -2046 983 2003 -889
1321 -889 -1604 1384 949 -2293 -930 1844 -345 -2540 134 1266 -1469 -1873 1110 656 -2491 -641
1337 -641 1477 57 -1263 1002 2212 -748 -72 2830 1647 -522 1339 2836 -125 -900 2500 2159
1353 2159 -1746 -500 2404 348 -2192 18 1861 -2165 -3039 623 575 -3079 -2133 966 -1112 -4266
1369 -4266 -1076 991 -2120 -2631 863 850 -2048 -468 2448 547 -1485 1536 2283 -243 44 3514
1385 3514 1587 -1079 1188 3447 176 -1739 1764 1866 -2481 -1518 2429 191 -3323 -809 1398
1400 1398 -2061 -3410 503 576 -2952 -2105 1902 346 -2561 316 2641 -576 -1303 2433 2292 -546
1416 -546 798 3539 1289 -962 2196 3114 -433 -742 2624 1011 -2504 -6 2460 -1305 -3552 166
1432 166 372 -3269 -3194 919 -986 -4690 -1802 1626 -1745 -3554 388 1113 -2568 -1587 2423 1331
1448 1331 -1742 1212 3582 430 -331 3166 2752 -1061 582 3411 1278 -1525 1906 3084 -1409
1463 -1409 -1479 2087 888 -3130 -1011 1930 -1239 -3806 538 1779 -2510 -2174 1347 445 -3271 -481
1479 -481 2607 123 -2184 1230 2508 -571 -445 3134 1144 -1779 872 2990 -20 -1167 2065
1494 2065 1641 -2132 -999 1878 -367 -3107 -413 1290 -2624 -3068 1150 500 -3500 -1758 1595 -639
1510 -639 -2861 443 2899 -1015 -1659 2546 2500 -1113 400 3267 465 -937 2308 3504 246 -339
1526 -339 2527 1494 -1506 704 2373 -696 -2651 1148 1142 -2266 -1220 1668 -765 -3523 -446 1943
1542 1943 -1458 -2600 1115 1231 -2426 -1051 2387 893 -2515 321 2315 -285 -1294 2190 2287 -1230
1558 -1230 -569 1958 417 -1403 869 1319 -1406 -1846 1190 691 -2209 -769 1029 -1566 -2590 367
1574 367 1257 -2029 -1461 1534 674 -1886 215 2449 -368 -1588 1553 2365 -554 184 2567 1157
1590 1157 -859 829 2479 513 -675 1283 1270 -384 -197 1809 71 -1430 -74 832 -1149 -1263
1606 -1263 611 98 -2309 -1141 730 -685 -2122 56 493 -1711 -1607 784 600 -1678 -467 1360
1622 1360 -90 -1728 757 1322 -617 -1177 1253 1115 -629 154 1415 174 -485 910 1047 -276
1638 -276 -75 1172 342 -688 305 1163 -250 -340 971 387 -871 -373 1235 -187 -1310 -17 773
1655 773 -543 -997 622 419 -1013 -673 699 386 -1033 194 1185 -432 -710 732 786 -267 -11
1672 -11 929 176 -352 456 599 -355 -308 448 -292 -698 42 27 -942 -1092 -148 8 -1523 -951 525 -229
1692 -229 -1034 -437 728 -467 -856 683 639 -361 375 828 632 -25 667 1122 587 476 750 732 395
1711 395 655 786 157 -488 154 32 -1082 -802 -71 -794 -901 -760 -237 -848 -1350 -729 -430 -1150 -626 251
1731 251 -177 -459 66 634 195 10 954 1213 626 554 1298 1148 852 921 1310 821 531 208 359 61 -146
1752 -146 -85 -601 -892 -521 -963 -1439 -1062 -1006 -1113 -1291 -998 -606 -1047 -1194 -416 187 -160 -88 523 1149 698
1773 698 1036 1244 1415 699 1173 1250 1273 452 800 843 538 43 -286 -44 -241 -679 -901 -566 -659 -755 -1588 -1199
1795 -1199 -1178 -1043 -1041 -888 -284 -258 -473 -440 365 708 270 1141 1169 1391 1095 1386 1431 1255 964 1129 1056 758
1817 758 569 94 282 -187 -170 -449 -757 -1053 -1079 -1425 -1328 -1521 -1630 -1529 -1376 -1168 -952 -1026 -660 -396 -97
1838 -97 -82 461 258 323 910 1483 1049 985 1406 1391 1313 1010 1321 1290 818 625 333 462 -54 196 -172 -667
1860 -667 -343 -840 -955 -869 -360 -591 -1054 -660 -180 -440 -454 -49 587 282 -65 737 757 416 341 644 1094
1881 1094 596 225 583 674 61 310 292 23 -346 -343 -385 -754 -710 -762 -900 -1271 -778 -678 -1100 -639 -733 -844
1903 -844 -770 177 395 -66 -44 660 849 366 559 1533 1107 439 1188 1620 1140 617 1398 1242 91 260
1923 260 820 421 -5 -115 322 -266 -646 -53 -203 -897 -971 -193 -582 -933 -249 -409 -1026 -804 32 -15 -873
1944 -873 -278 285 -387 -498 585 641 -415 -670 516 288 -587 141 1297 -156 -703 342 764 -438
1962 -438 -131 709 235 -536 -235 624 -195 -609 519 385 -512 -207 838 103 -928 115 634 -185 -245
1981 -245 1029 822 -1088 -99 1348 478 -586 797 1055 -317 -755 1108 904 -538 -35 960 170
1998 170 -486 532 962 -593 -829 860 454 -1079 -305 406 -1125 -1744 -410 -26 -1487 -1179 -43
2015 -43 -902 -1661 -303 964 -739 -1290 246 242 -897 4 1953 541 -905 492 1962 471 -14
2032 -14 1776 1527 -412 337 2202 876 -414 686 1191 -838 -677 1020 755 -1429 -590 627 -1024
2049 -1024 -1430 461 231 -2149 -1712 581 141 -1484 -17 1166 -589 -1157 1563 1459 -656 -68 1805
2066 1805 611 -864 1086 2305 -194 -1147 492 989 -1071 -838 1100 -508 -2533 -910 554 -1413
2082 -1413 -1955 -167 -870 -2573 -1403 749 -354 -1846 63 522 -1314 -639 2119 1370 -1169 190
2098 190 2611 948 355 2422 2148 -273 408 2991 2209 -171 580 1734 -227 -1521 899 1058 -1558
2115 -1558 -1872 115 -506 -2703 -918 402 -1703 -2535 -266 -28 -1670 -479 1134 -433 -2018 660
2131 660 2128 -3 -761 1610 1203 -728 601 2884 713 -1334 354 1584 -590 -698 1527 68
2147 68 -2255 -1239 888 -698 -1772 -389 17 -2102 -1836 926 152 -1933 -356 935 -910 -883 1498
2164 1498 1757 -605 -40 2172 1284 -326 1726 2667 -11 -427 1998 1933 -423 56 1830 -89 -2020
2181 -2020 493 1745 -1208 -2004 -13 -454 -2211 -845 765 -1261 -2359 -603 437 -1232 -1033 1013
2197 1013 -122 -1574 18 2073 208 -859 1115 1240 -1092 -2 2352 1134 -1588 76 1544
2212 1544 -202 -1102 912 1167 -1733 -1300 1113 -27 -1697 145 746 -1380 -1589 873 865 -1366 -721
2229 -721 1055 -259 -1217 1022 1677 -282 -422 1393 1363 -158 932 2433 609 -931 1084 1851 -322
2246 -322 -399 1666 208 -1554 -132 1591 -436 -1716 143 16 -1266 -1054 673 -303 -1818 -876 366
2263 366 -1043 -1317 882 143 -1281 -849 1096 29 -647 611 1247 -600 -583 1503 916 -699 2
2280 2 1260 -43 -799 1117 1644 -593 -905 856 724 -1053 -270 1073 -552 -1414 245 809 -682
2297 -682 -915 442 -118 -923 -134 1174 -458 -982 427 654 -295 18 1303 361 -580 515 1400 -30
2315 -30 -499 994 650 -541 -184 1374 356 -924 321 798 -470 -641 473 374 -1150 -732 378
2332 378 -351 -843 -72 141 -962 -1355 58 97 -1050 -747 313 -641 -962 433 698 -305 -290 689 479
2351 479 -327 752 1239 254 -98 766 604 14 392 1092 544 -490 238 546 -244 -378 92 181 -383 -544
2371 -544 486 -257 -771 -486 73 -387 -541 190 46 -297 -111 255 215 39 468 503 231 286 753 701 -307
2392 -307 -9 599 -133 -111 215 497 -504 -625 30 -124 -928 -255 -119 -904 -1044 -599 -518 -880 -889 -327 -256
2413 -256 -651 -265 -42 -185 127 592 690 395 693 872 946 721 984 995 631 514 1022 770 274 459 932
2434 932 262 77 190 68 -538 -421 -126 -339 -878 -694 -434 -1046 -788 -384 -568 -727 -551 -294 128 -179
2454 -179 -194 238 172 232 357 388 287 423 408 629 486 271 362 13 -199 196 7 -436 -253 -319 -562 -830
2476 -830 -256 -344 -407 -771 -488 -228 -213 -303 -129 255 -81 -149 325 177 546 635 660 747 977 743 690 680 1042
2499 1042 980 693 358 394 311 -132 -67 49 -349 -570 -318 -484 -789 -771 -645 -627 -879 -1043 -370 -972 -820 -519
2521 -519 67 -126 -439 33 108 61 338 270 543 474 279 581 422 584 316 462 74 334 233 -79 -235
2542 -235 -247 -287 -501 -339 -323 -406 -773 -542 -188 -405 -252 -193 8 -29 -142 68 321 519 565 556 408 883 775
2565 775 688 553 503 669 612 816 732 188 149 89 267 35 -546 -52 -429 -732 -735 -437 -738 -1093 -716 -551 -470
2588 -470 -997 -214 -233 -555 -369 205 -78 38 91 244 242 75 598 403 113 272 447 395 247 -223 506 -79
2610 -79 -109 119 227 -157 167 42 -381 -290 -474 19 -406 -752 -37 50 -513 -252 316 -102 -49 452 235 16
2632 16 265 700 412 236 64 923 249 144 678 722 -285 -179 393 33 -330 -27 171 -439 -450 21 -37
2653 -37 -750 -590 -49 -716 -1153 -463 179 -689 -934 -14 45 -644 -439 597 176 -364 282 928 -79 -69
2673 -69 732 303 -1 390 900 408 -11 661 313 68 71 645 459 -376 118 498 -606 -784 384 429 -531
2694 -531 -424 593 78 -1110 -279 368 -250 -502 563 791 -117 133 614 157 -362 614 917 -366 -248
2713 -248 1029 587 -151 -146 509 -48 -915 280 562 -751 -513 51 -313 -984 -267 318 -850 -1274 163
2732 163 193 -1164 -452 386 -59 -1044 -18 1007 -253 -491 520 589 23 384 1408 604 -13 875 1375
2751 1375 166 169 1529 919 -683 -18 987 -26 -416 208 649 -853 -941 575 249 -1234 -656 229
2769 229 -1010 -1070 337 599 -695 -998 356 250 -796 -68 990 -349 -922 573 951 -236 -64
2786 -64 965 -199 -896 112 1053 -79 -570 367 193 -1010 -353 813 -317 -1553 -530 498 -573
2803 -573 -912 596 393 -1464 -544 1264 356 -861 522 757 -90 -119 1489 1266 -521 407 1271 529
2821 529 -21 1355 1460 -441 -404 785 847 -604 14 669 -732 -1275 369 140 -1104 -841 156 -656
2839 -656 -1758 16 807 -693 -1328 -39 234 -830 -24 1321 208 -1164 324 935 378 -151 1137
2856 1137 471 -631 -35 1477 480 -812 400 594 -690 -756 895 192 -1335 -687 319 -414 -816
2873 -816 341 323 -1121 -832 972 280 -915 263 880 -89 -326 911 1714 19 130 963 324 -265
2891 -265 913 1603 89 -490 699 439 -479 -127 687 -203 -1502 -73 179 -840 -1047 57 -602 -1790
2909 -1790 -557 527 -361 -1390 -203 191 -797 -747 808 -45 -1102 16 913 326 -395 937 815
2926 815 -351 -113 1310 1108 -443 308 1284 138 -481 709 543 -617 -376 570 -91 -666 336 666
2944 666 -894 -1122 149 445 -631 -176 648 -298 -1015 367 932 -267 -289 817 495 -625 204 1194
2962 1194 4 -631 598 1074 -425 -65 821 265 -1043 -166 547 -216 -828 38 214 -1004 -762 536
2980 536 -193 -1241 -202 221 -827 -1008 723 587 -875 -190 596 126 -496 430 730 23 -568 766
2998 766 686 -331 95 987 99 -366 472 1153 -15 -175 428 400 -473 102 717 -451 -837 -60 293 -583
3018 -583 -371 141 -158 -855 146 293 -592 -652 524 278 -345 -221 483 664 -222 218 850 172 -207 702
3038 702 738 -148 129 792 31 -451 77 262 -481 -343 23 128 -554 -464 83 -548 -613 -111 -306 -733 -807
3059 -807 -98 228 -521 -105 419 -7 -155 316 919 262 120 531 467 192 277 723 533 3 534 852 489
3080 489 -175 212 127 -125 28 252 -251 -464 -83 -272 -942 -388 -226 -424 -640 -334 -115 -472 -206 -101
3100 -101 274 -294 137 438 531 272 455 68 183 138 273 229 227 408 542 656 -72 -166 152 -124 -234 -63
3122 -63 -130 -342 -157 -96 -239 -599 -102 -508 -161 -126 153 164 -5 147 398 200 132 539 425 294 576 592
3144 592 712 411 591 488 540 -27 291 264 -23 61 -71 -113 -402 -16 -326 -77 -369 -511 -390 -548 -422
3165 -422 -105 -206 -209 -183 -1 -229 168 229 189 206 263 311 268 232 569 819 -80 311 448 463 23 58 223 70
3189 70 -122 -361 -189 -305 95 -174 -382 -621 -433 -386 -592 -313 -212 -136 -222 139 -246 -2 29 284 362 149
3211 149 434 563 773 441 613 403 684 252 239 468 247 86 -18 -129 24 -203 -169 -483 -556 -358 -398
3232 -398 -82 -384 -237 -611 -332 -38 -180 -37 -104 191 7 -216 253 336 291 150 229 562 301 430 14
3253 14 224 483 221 296 -51 219 -20 -14 -106 -261 -45 -131 -265 -441 -113 -383 -503 -438 -333 -284 -407 -372 -173
3276 -173 147 -63 140 -14 107 314 352 307 -45 686 273 -123 356 333 109 179 501 373 -101 -66 46 -60
3298 -60 -217 -162 -44 -333 -445 -125 -343 -328 -445 -183 -488 -192 378 -361 9 -147 119 -104 -36 175 578
3319 578 230 -129 500 572 198 90 375 337 -82 -27 375 -94 76 127 -10 -345 -161 59 65 -167 -197 -30
3341 -30 -199 -467 199 -201 -443 79 -10 207 -23 53 270 -23 208 497 501 -161 431 532 168 -184 630 311
3363 311 -477 -66 204 18 -292 134 269 -339 -465 -77 -98 -511 -210 -22 -343 -778 -29 319 -544 -271
3383 -271 276 -35 -250 -255 567 -80 -256 273 615 177 207 356 149 -30 -78 514 383 -79 71 585 -141
3404 -141 71 795 266 -377 -415 338 -52 -468 151 180 -606 -316 126 -257 -808 -10 310 -525 -507 148 401
3425 401 -170 -112 647 -109 -356 344 628 118 -314 407 212 -453 81 735 99 -427 69 56 -610 -657 127
3446 127 8 -514 -265 423 -441 -947 -125 126 -664 -260 423 -112 -475 28 526 -26 87 468 527 -361
3466 -361 219 926 537 -211 544 626 23 -168 742 164 -256 -83 398 -26 -719 412 342 -876 -835 430
3486 430 -121 -1028 -488 136 -564 -1051 113 433 -508 -303 421 310 -400 -62 779 -39 -494 432 621 -233
3506 -233 47 772 442 -362 127 918 -396 -267 310 242 -655 -630 520 0 -942 -75 216 -799 -631 443
3526 443 158 -568 -278 659 -21 -586 671 936 -124 -111 531 492 -164 147 801 209 -273 503 715 -173
3546 -173 -379 388 -74 -747 -99 412 -244 -943 78 -52 -806 -610 175 137 -824 -630 465 -271 -585 340
3566 340 166 -653 61 763 313 -345 271 741 -187 -239 1012 945 -300 66 700 -102 -634 112 487 -484
3586 -484 -409 306 91 -625 -240 376 -248 -736 77 11 -622 -667 172 213 -741 75 766 185 -195 260 322 77
3608 77 89 646 -148 -239 349 533 -34 -186 653 332 -543 -498 399 124 -859 -438 274 -509 -795 197 -93
3629 -93 -757 -392 271 -376 -621 -27 292 -243 -194 684 292 -396 -117 871 -170 -496 658 476 -339 182
3649 182 917 175 -280 159 498 -265 -547 199 590 -347 -462 472 -101 -598 12 245 -432 -404 -35 -32 -513
3670 -513 -226 551 -304 -515 227 391 -96 -133 337 297 121 103 712 460 -507 397 471 -303 -101 560 -109
3691 -109 -237 104 231 -381 -330 -17 323 -729 -495 319 -159 -466 44 10 -345 -539 -71 253 -573 -38
3711 -38 52 112 -345 236 649 41 107 509 657 -287 184 403 -3 -282 177 466 -193 146 421 9 -542
3732 -542 -157 234 -64 -265 -188 114 -460 -385 58 -118 -252 -37 -95 -309 -364 28 349 55 -160 244 236 -28
3754 -28 89 258 91 228 192 -19 124 69 375 -64 -256 85 371 -118 -338 144 28 -229 -129 -156 -233 -382
3776 -382 86 71 -232 -418 96 127 -267 156 200 113 -54 522 608 195 212 212 513 170 218 187 195 49 298 349
3800 349 -162 -136 139 -66 -331 104 -241 -377 -142 -150 -446 -437 -325 17 -352 -272 -190 45 -113 41 242 167 228
3823 228 407 428 316 49 66 452 -1 206 -23 162 220 324 -25 116 -200 193 82 -306 -86 -182 -164 -429
3845 -429 -334 -7 -347 -507 -189 -93 26 -123 -324 -232 -187 -164 90 66 351 351 498 275 371 450 84 180 453 -61
3869 -61 388 126 -44 28 -284 110 219 30 -292 -52 -425 -307 -386 -247 -288 -143 -33 -330 -75 -154 -75 -146
3891 -146 56 183 -68 302 329 381 171 190 186 239 292 308 190 253 126 -111 406 18 -142 125 -144 -373 -261
3914 -261 -392 -203 37 -340 -17 -347 -246 -40 168 -289 -44 32 230 113 150 210 162 212 94 356 42 237
3936 237 255 323 113 -25 168 134 -58 -60 -163 88 40 49 -56 -311 -504 -63 -212 -336 -194 -330 -392 -76 -394
3959 -394 -230 -334 -222 170 99 -83 158 294 265 -39 -38 478 -2 103 425 -57 -156 242 158 94 119 -80 -221
3982 -221 -49 -3 97 172 -46 -229 -65 -244 -91 -288 -158 -111 -6 -1 -85 81 401 123 19 42 205 260 235
4005 235 110 429 109 111 479 187 -116 389 270 113 -132 -13 -301 46 -460 -276 -400 -466 -264 -132 -139 -378
4027 -378 -313 135 -47 -287 -146 204 -218 -404 219 281 -12 161 722 110 -140 104 210 329 185 523 440
4048 440 101 104 298 64 -293 172 26 -270 -53 -167 13 -179 -348 257 -418 -108 -118 -290 -711 -131 81
4069 81 189 59 330 434 23 118 383 271 -71 64 96 146 418 96 296 -18 72 520 -114 -296 -26 149
4091 149 155 -222 -126 -138 -324 -181 45 -491 -340 -190 30 -268 -93 -12 -172 -157 -16 460 12 38 126 514 195
4114 195 -68 237 150 72 325 644 247 92 77 237 -153 -293 83 -8 -700 150 -15 -587 -338 -249 -328 -299
4136 -299 -347 35 -398 -619 -180 187 212 -245 240 263 -115 -70 362 341 -133 52 150 122 141 370 519 -605
4158 -605 7 444 81 -367 -10 170 -610 -458 -18 -409 -677 68 324 -402 -371 -203 199 -266 -114 430
4178 430 63 -101 237 582 24 -192 683 845 -152 -54 510 422 -313 500 394 28 -249 56 114 -431 -205
4199 -205 307 -432 -724 -322 138 -488 -494 109 -247 -820 -344 57 -207 -531 358 340 -317 148 547 93 -253
4220 -253 -166 469 199 -347 484 284 -260 58 329 125 -515 90 417 -264 -322 60 273 -393 -302 113 -192
4241 -192 -750 50 271 -204 -550 319 -137 -281 73 645 -386 -494 199 427 -115 -42 474 539 -22 488
4261 488 801 -82 168 36 305 -68 -166 186 228 -448 59 304 -262 -655 67 -201 -512 -578 151 -155 -543
4282 -543 31 143 -199 -356 256 372 -38 35 603 269 -54 310 851 -316 -54 532 458 -140 111 267
4302 267 135 -196 475 166 -328 -387 196 -131 -357 -175 134 -145 -540 301 198 7 -128 464 312 -65
4322 -65 47 410 154 -236 140 122 -250 -268 365 351 -256 197 452 122 -245 350 316 -239 -256 256 -233 -145
4344 -145 -114 -13 -235 -445 53 169 -804 -442 135 -322 -99 -143 306 -284 -34 271 478 158 -87 400 113
4365 113 28 645 231 -75 363 358 129 21 34 319 84 141 43 115 29 -141 -35 -14 -400 -213 237 -512 -428
4388 -428 -95 -135 -296 -360 174 244 -235 85 155 -358 -253 551 138 -86 67 574 -178 -226 332 448 -23 -197
4410 -197 262 143 -339 -46 -17 -334 -461 28 -116 -660 -457 -197 -97 -404 -528 -22 -305 -197 61 -30 24
4431 24 159 239 -157 -23 61 437 114 408 325 310 203 151 407 119 -20 294 108 5 -139 278 74 -244
4453 -244 -119 -217 -257 -451 -322 -114 -264 -173 243 -327 -308 -287 361 -196 -425 379 373 30 25 287 -3 174 -55
4476 -55 13 99 247 463 204 29 -327 -29 21 -59 -117 -55 -88 -244 -300 -318 -257 206 -36 -152 -428 166 -9 -187
4500 -187 -40 -185 -5 -28 40 264 258 480 233 -65 275 90 294 322 96 64 260 2 -82 243 -67 -49 -60
4523 -60 -100 -254 -456 -474 -66 -274 -228 -417 -397 -186 -262 -95 -213 -248 -190 221 129 -95 -87 157 -57 47 171 138
4547 138 111 198 407 176 -73 264 127 31 -202 371 146 -473 78 -45 -161 -477 -24 -107 -179 110 -205 -358
4569 -358 -161 163 40 -99 173 98 256 168 98 548 55 16 333 286 360 212 277 147 233 106 -68 13 123
4592 123 94 -27 -212 -1 -66 -316 -100 -112 2 -382 -31 -96 -3 -169 72 152 239 -518 -148 13 154 169 299
4615 299 38 -151 205 321 -47 417 301 33 257 295 246 183 -137 125 101 -344 -141 -209 -50 100 -13 43
4637 43 -97 -178 -15 -108 -134 70 -204 -73 -89 108 40 -78 325 233 173 160 74 218 253 -188 221 368 50 66
4661 66 190 148 -279 118 208 -404 -78 -226 -38 -131 -62 -253 -292 -229 -400 -186 -231 -37 174 47 84 -36 -107
4684 -107 458 122 261 -19 145 94 380 284 293 -110 224 305 165 181 -29 152 55 5 -9 -68 -429 6 30 -115
4708 -115 -308 -194 -110 -141 -12 -126 -293 -178 129 -109 -37 -1 15 -40 -216 87 -14 73 233 228 19 267 219
4731 219 19 168 -65 66 182 152 -11 -4 -233 -67 -201 -119 -99 74 -424 19 -56 -111 -203 134 157 -155 154
4754 154 -110 -26 267 -194 -34 306 538 437 -212 483 234 -219 101 221 -65 55 53 116 187 92 27 -153
4776 -153 -447 -113 67 -127 -281 -360 -102 -177 -260 -208 57 -284 79 -231 -196 -8 -33 82 3 113 332 -167
4798 -167 116 294 492 3 -273 404 151 -25 66 432 377 -318 -148 -79 -285 -146 5 -168 -269 -347 -6
4819 -6 -210 -246 -165 13 -62 -226 234 69 22 -23 364 270 71 107 473 -67 -106 253 268 91 360 160 113 -77
4843 -77 -42 -37 -108 -187 -63 -15 -422 -471 39 -276 -488 -91 -33 -202 -246 198 -48 -418 -240 196 14 142 205 216
4867 216 33 -199 403 -20 86 91 379 63 -83 540 122 -55 -251 -28 -267 -167 -277 254 -105 -394 -94
4888 -94 -349 113 -29 268 31 -308 -12 133 -119 -146 154 14 60 3 309 265 -375 297 188 209 2 513
4910 513 311 -161 106 391 -16 -199 -157 146 -490 -329 -102 -370 -529 199 -42 -399 -505 -107 7 -483
4930 -483 -298 -74 -303 -429 -2 186 -333 -110 226 106 35 63 625 213 -81 202 412 292 -22 309 86
4951 86 -398 18 267 27 -168 264 -149 -474 -101 196 -351 -60 -12 246 0 -308 166 -380 -371 -4 413
4972 413 -273 -403 120 325 -339 274 601 325 6 -192 217 174 -335 160 362 -167 -170 216 66 -498 -186
4993 -186 186 -154 -539 27 58 -633 -274 82 176 -299 -35 200 48 -126 369 283 -62 72 134 -163 -350
5014 -350 262 316 0 179 418 235 -204 249 55 157 148 97 157 -3 -292 -13 28 -365 -110 247 -119 -361
5036 -361 114 -325 -474 -532 182 197 -287 -34 -61 -21 108 -115 124 -173 -3 410 186 -209 -228 196 -119 -422
5058 -422 286 26 -208 -15 119 -187 -238 -17 -26 -279 -440 -49 -163 -300 -59 -65 218 -232 24 334 79 93
5080 93 486 140 73 9 209 413 167 82 153 206 32 496 82 -138 90 176 123 -471 54 -118 -153 -501 177
5103 177 -76 -251 54 132 -110 -336 40 13 -85 -12 -2 -240 -102 -77 382 -46 -248 175 118 -65 129 211 208
5126 208 -246 171 235 198 -13 44 -79 -135 -146 29 106 -370 -183 -26 -60 -48 -73 -47 87 -162 170 -265 97
5149 97 -73 276 136 263 318 276 236 108 272 -156 101 421 398 -64 26 88 147 6 93 -25 -68 -204 -484
5172 -484 -84 -8 -252 -98 -371 -543 -75 -250 27 -131 59 282 -173 -164 -331 42 -56 79 133 -101 83 79
5194 79 71 272 205 285 -342 81 318 -25 188 -34 212 329 -349 -126 75 -210 204 27 208 -372 -169 -158
5216 -158 -220 -158 25 64 94 -58 26 -83 237 81 437 94 -23 145 201 -95 -10 167 198 -177 377 170 -109
5239 -109 -109 88 184 -14 -76 83 -111 -257 -278 -239 -75 -152 -200 -233 -282 -294 -237 -151 124 -12 210 223 -79 -24 -105
5264 -105 136 166 -25 357 98 342 265 427 69 34 383 173 247 141 -98 -257 -80 -176 -186 95 145 -176
5286 -176 -241 186 -263 -121 -229 -3 -63 81 -178 -5 274 39 49 390 41 -93 145 -74 182 -226 6
5307 6 75 215 69 -142 -9 71 -108 -191 -27 -80 -213 -56 -331 -261 -142 152 -466 -33 -205 -205 86 156 74 -130
5331 -130 248 81 39 65 321 155 -140 168 199 50 -76 281 -57 56 243 220 56 16 67 71 -87 -49 68
5354 68 -2 -65 -213 95 7 -234 -388 -234 -128 -152 -255 123 -217 4 35 4 106 104 1 91 -110 90 -165
5377 -165 98 132 140 135 256 -168 -119 243 -71 186 243 -1 51 93 -387 -114 -89 -255 -144 -96 -46 -118 112 -89
5401 -89 -71 -17 -6 262 90 -49 425 233 -58 -143 96 236 51 -33 221 -56 -54 -128 -36 244 9 -88 -121 3
5425 3 -96 -339 -357 -133 -106 -141 -170 -261 -151 9 -374 -126 46 -292 -81 -306 144 35 -4 163 242 92 137 98
5449 98 30 83 442 388 119 -20 288 229 -87 -11 -128 -93 -87 -125 -37 -53 -111 -18 -203 -121 -47 135 36 127 40 193
5475 193 -315 -203 -16 -77 136 328 197 -11 140 148 211 -117 19 195 46 -300 91 -285 -78 -328 289
5496 289 -185 37 -169 -163 -122 -182 -127 -327 73 -448 96 8 22 126 174 54 85 -84 122 -106 121 29 130
5519 130 138 84 -22 -59 -82 195 289 -68 17 76 -17 -200 -233 74 -98 -110 91 -38 109 -170 145 -269 -82 -102
5543 -102 -370 -68 -53 -133 68 -32 -166 105 131 -101 87 134 -103 -92 279 -1 -238 -208 65 341 -53 202
5565 202 118 -82 -62 164 18 -398 -102 -194 -27 -77 -204 -19 -310 -298 305 227 62 -150 -13 -75 -117 245 339
5588 339 -268 -1 198 35 -117 161 82 -50 -115 338 53 -269 71 321 -77 -350 108 92 -210 -425 75
5609 75 -261 -337 -58 -76 -171 -373 -167 349 28 -289 395 -150 -78 50 75 -69 -136 125 75 -66 67 352 201
5632 201 7 254 45 -13 -191 80 22 -141 -21 -289 51 -226 -3 26 -238 -95 16 127 -28 -245 541
5653 541 152 45 138 15 101 -149 122 88 -127 -92 210 65 -61 -91 74 -177 379 315 164 -104 -6 23 -227
5676 -227 -249 294 -71 4 -74 -173 24 -114 -41 151 -288 -284 290 145 -225 -44 181 230 232 73 464 90 43 236
5700 236 182 263 -117 76 -292 -185 221 319 -41 -145 278 93 -68 111 -188 3 -331 138 264 -43 29
5721 29 211 -236 -526 -89 46 50 -461 -116 -4 158 -206 366 68 -75 413 562 -196 216 383 177 88
5742 88 196 236 -195 -361 19 430 -20 170 16 7 -445 -127 63 -31 -195 -15 120 -321 -429 122 -108 -254
5764 -254 106 17 164 -137 -258 162 119 -19 495 26 62 32 210 193 -51 346 64 144 213 180 -59 -208 49
5787 49 -319 -229 -376 -213 -27 -182 124 55 -102 -390 -245 -342 -70 75 46 208 162 -81 81 162 -147 495
5809 495 97 -4 0 224 12 12 86 160 49 -222 -12 85 165 -40 31 -279 -282 -416 -120 -20 -220 -109 -142 -104
5833 -104 -46 -171 258 -209 94 -30 -193 326 234 202 114 11 328 35 240 113 103 -19 250 141 129 176
5855 176 -229 199 5 -175 -439 -80 -188 -199 -52 -74 -102 -115 36 39 -201 349 92 -37 -73 -17 -75 -90 37
5878 37 318 215 -237 17 42 -21 -14 98 189 -15 -119 165 -67 5 -14 -243 99 -341 -48 46 -388 -209 -20
5901 -20 14 -268 130 52 253 81 -69 -94 -178 348 86 61 210 64 103 4 377 169 13 191 113 115 -100 174
5925 174 19 -69 63 -210 -124 -203 -43 123 -97 -270 163 -163 -111 -291 -66 125 146 67 -188 -81 -271 119
5947 119 144 -252 186 380 117 -23 -15 -191 -118 -6 315 191 -357 -98 204 -103 -32 -276 -40 -28 -275 -269 62
5970 62 -163 -100 105 -297 -132 -273 -20 -2 7 153 37 -239 -237 204 271 98 119 -14 208 65 -101 345 149
5993 149 89 -74 160 111 221 14 58 -31 -185 87 -120 -238 -206 -136 298 51 -91 -118 38 51 52 6 -54 -33
6017 -33 136 84 17 59 91 -62 19 98 -1 -47 160 -17 195 -30 5 73 60 -19 -30 -378 -131 18 -158 -111 -216
6042 -216 11 -221 -266 -8 42 -29 -213 -146 -178 96 191 245 369 183 292 319 -131 398 -102 105 -70 13 119
6065 119 100 -32 79 287 -148 -53 16 -141 195 91 -21 -26 15 -100 -4 -408 -228 22 -386 -24 -40 -247 36
6088 36 180 15 97 57 210 410 238 -71 221 150 115 -146 -91 284 2 175 -219 -67 -331 4 150 -103
6110 -103 146 -264 -42 80 -435 -78 59 -153 57 168 -281 141 262 -133 214 141 231 244 -268 113 -77
6131 -77 128 109 -141 163 171 334 239 344 61 439 4 -98 187 317 -139 30 -27 -392 -43 -191 -19 191
6153 191 -245 122 66 45 -240 203 -22 -116 -147 22 26 -108 222 279 -34 81 232 -216 -111 -77 166 -264 127
6176 127 70 81 -88 -107 -209 -316 -230 -121 -29 37 127 124 270 -356 -103 10 6 -173 76 223 -8 -108 353 -160
6200 -160 -100 401 69 -14 119 97 90 -181 183 -40 136 -11 70 -22 124 -69 -93 130 95 -356 -175 -158 -191 -148
6224 -148 -85 -142 -307 249 -34 -296 243 -42 -25 -244 -87 -5 -39 -78 270 118 308 46 140 227 -29 -165 76
6247 76 -21 -57 299 61 41 -216 -152 -216 -158 -438 -3 -141 -124 -157 0 -12 201 -69 -164 9 144 201 -12 -173
6271 -173 35 -82 -24 190 -7 438 157 279 168 -16 -52 143 -196 284 -78 -49 73 -35 -30 281 -71 -156
6293 -156 141 -144 -45 -233 185 -145 -111 78 -140 -99 108 248 -66 -206 -288 133 -221 18 184 -232 -215 189
6315 189 1 292 -236 41 57 -79 106 295 3 -362 -222 37 106 -501 167 -193 -180 193 38 77 -342
6336 -342 4 233 -255 -52 282 -8 -112 -35 459 -39 28 -55 132 -45 185 73 -48 147 186 470 -45
6357 -45 -222 248 -98 177 -202 -97 229 -206 -164 58 154 -98 246 -207 -182 -98 91 254 2 -80 131 216
6379 216 209 167 236 27 18 232 68 -135 205 269 -130 -406 183 159 247 86 99 38 -56 -123 31 -122 30 -6 -461
6404 -461 -163 70 -82 -381 -20 118 417 230 -183 75 -164 -163 174 282 84 38 112 544 222 378 270
6425 270 168 -229 171 231 -58 -41 93 43 -266 -146 -108 -74 33 233 147 -58 163 136 -10 -191 -87 -50 -304
6448 -304 74 136 221 -135 175 231 9 -146 64 243 -90 127 163 -70 -224 -34 73 -69 104 -152 99
6469 99 19 -104 228 -160 -181 -209 50 74 -201 -7 144 -11 -119 -230 -120 -91 226 -27 156 24 239 73
6491 73 -189 154 -84 -15 -57 140 -56 -263 -208 54 -43 -188 -493 346 -121 -174 -75 27 -115 22 -21 12 192
6514 192 -299 8 -191 -152 -191 270 264 -110 -170 -121 -77 -32 83 162 65 58 283 -21 -35 122 247 52 343 165
6538 165 191 -36 -127 -117 245 34 89 -90 -74 83 -424 -101 82 -62 -120 -332 40 76 38 -180 -67 202 42
6561 42 254 24 78 161 185 23 62 111 -119 -81 161 -103 35 114 -190 -280 -192 -33 2 -245 -89 151 -76 -91
6585 -91 -143 -220 11 38 -263 -44 -12 92 -134 -41 129 246 150 163 3 23 -81 60 36 -55 243 119 182 -16
6609 -16 -43 229 -156 4 56 63 -26 -95 -155 -94 221 -23 -73 157 25 -169 126 108 49 166 -50 219 -167 3
6633 3 238 42 102 38 74 252 5 51 -269 -44 98 209 11 -10 5 -183 67 -232 -199 -153 -138 127 206 71
6657 71 -129 3 -73 -169 -180 104 27 268 54 49 -225 48 110 238 63 98 174 194 -148 99 -5 43 76 -62
6681 -62 38 161 -56 -77 -48 -78 -141 -149 -172 120 94 -182 -15 -100 300 27 -186 80 136 -74 150 -114 -147 117
6705 117 129 92 -22 14 -206 203 249 223 95 -164 15 -140 -255 153 217 -124 -200 266 -13 -60 -163 51 16
6728 16 7 -10 14 -13 -34 14 -50 26 -42 198 -98 201 141 389 295 -64 223 47 30 167 16 161 151 18 184
6753 184 25 -201 108 -63 -111 24 84 10 92 -151 -274 -152 -141 -443 -382 13 -134 506 92 64 180 86 -346
6776 -346 37 76 172 206 188 126 -141 -114 -176 59 -77 -62 135 95 -85 -224 60 -290 -1 50 -354 -147 -177 101
6800 101 -240 -237 15 -182 -99 -128 169 89 232 143 -118 130 -144 134 158 -64 -112 22 -155 9 -102 -370 -205
6823 -205 142 142 51 -300 -333 -85 20 -72 -185 -48 262 -32 -119 203 71 -36 49 77 -73 -45 146 345 -108
6846 -108 98 -72 28 185 278 -77 171 -8 142 240 55 225 203 -68 0 -51 -127 -102 -290 -105 -82 115 19
6869 19 6 -281 -373 -80 -324 29 280 -135 9 -179 -40 195 -179 157 281 68 10 141 142 208 -129 274
6891 274 -14 208 162 153 98 -46 -156 -56 30 37 41 42 -134 107 -150 -87 73 -34 131 -198 45 97 -180 60
6915 60 -153 -42 -26 193 -38 375 66 384 -33 -50 -25 257 148 4 16 209 -107 134 155 95 -165 -225 -27
6938 -27 242 146 -71 13 -78 -421 -230 -28 -357 13 -88 -49 37 -207 -234 252 -164 57 -29 -13 14 182 -175
6961 -175 80 72 -34 -231 152 269 23 -374 20 -50 -224 50 203 -45 -195 -126 106 -211 -312 -43 187
6982 187 -169 -294 -86 84 -367 -81 -50 -151 -1 -80 201 130 94 37 17 -163 -66 -103 299 -39 67 317 -82
7005 -82 254 80 -18 -265 -106 -26 -415 122 -15 133 -373 5 48 121 -213 -152 168 134 123 -31 214 41 125
7028 125 322 128 106 -201 231 114 105 -36 386 3 -183 -72 -208 255 -46 143 13 -224 196 76 -54
7049 -54 -24 228 -255 63 -121 -66 -127 -203 -79 256 265 -62 178 -61 2 -257 -56 64 200 65 76 -141 68
7072 68 122 -164 -14 145 17 63 -99 64 115 55 -445 256 25 177 50 75 -49 -526 300 -107 -239 -50
7094 -50 133 132 -11 229 29 -139 -353 -118 15 -5 246 86 -299 17 126 189 -51 5 62 181 -75 135
7116 135 -31 -113 -180 -178 -7 56 -20 79 168 -83 61 -247 -121 242 -346 -418 -40 -24 -113 182 72 75 -9 25 17 186
7142 186 44 -381 33 197 181 -28 146 -205 -217 150 194 118 -47 -97 -257 -117 -57 -280 -196 274 26 152
7164 152 -5 84 -58 113 -39 -37 218 199 -112 8 -25 153 -170 21 42 -126 364 46 -58 153 -26 110
7186 110 10 215 -2 -70 -285 -149 -138 89 53 -323 78 201 -263 -158 -250 -31 -97 -4 268 198 -218 -124 -61
7209 -61 -270 -410 182 -25 38 57 46 -7 -45 282 -162 262 165 -2 -17 83 -69 -1 -149 11 11 11 -149 -68 -3
7234 -3 61 -64 -75 -107 240 -250 -167 181 8 240 60 -139 -172 126 97 189 138 23 45 37 -127 -32 -132 -56 310
7259 310 83 -302 235 161 -61 -177 23 -150 -124 114 -321 -48 -241 -64 -230 -185 98 158 -95 109 -36
7280 -36 72 271 392 -81 120 146 -51 264 -61 -82 -81 9 -372 83 94 -124 -5 -234 233 -13 -180 -293
7302 -293 -341 -357 -163 231 8 104 -25 56 -191 176 -73 135 316 133 291 146 244 -103 120 45 -28 -83 10
7325 10 58 16 -215 120 -161 -74 -104 178 -2 54 136 -84 61 111 -64 81 -65 86 4 -225 145 45 16
7348 16 68 -133 35 -188 -22 305 -57 52 100 -277 -43 154 48 2 245 -25 -205 -406 -134 96 -132
7369 -132 -57 148 98 -326 -203 -157 -102 -310 35 -296 -230 -194 115 -57 -245 171 7 -28 -205 125 -89 34
7391 34 22 -139 291 -125 13 -110 8 -110 176 -86 -234 34 -184 156 -158 162 -113 -67 -123 1 16 -401
7413 -401 -95 -203 -61 133 -75 -121 41 95 -36 -18 -117 -131 214 36 -39 -218 331 160 133 203 111 -320 -173
7436 -173 -64 67 51 30 -94 -193 2 -91 109 101 -54 -133 234 -88 -141 -9 -152 -239 -102 32 17 164 67 178
7460 178 -2 336 -149 -95 120 -14 96 -153 289 342 66 138 -19 276 -100 -61 -123 80 201 -174 214 3
7482 3 1 -129 -37 -52 66 27 -301 180 -92 124 -40 32 -58 -11 -175 -132 108 26 357 150 74 356 -239 -195 -24
7507 -24 -50 30 -31 -60 -163 173 -13 0 -235 -150 -211 -42 -23 -132 -12 104 -49 -174 -13 -275 79 134 211 80
7531 80 -34 -104 77 111 92 233 68 -166 14 248 171 79 -82 -190 -90 104 233 39 10 51 158 143 -122
7554 -122 -121 -215 -49 24 227 37 -237 -66 41 -79 79 279 99 118 251 -15 -182 17 27 119 7 -37 62
7577 62 -258 -74 207 -19 -149 118 419 -105 -10 -136 -39 -304 37 -238 106 -49 71 -18 138 -384 109
7598 109 354 -171 242 -66 45 24 161 7 54 -63 248 86 34 2 23 39 -45 -171 46 -33 -285 -67 121
7621 121 -54 -78 -247 -10 -213 103 -207 -34 -264 32 -106 -22 204 -110 150 100 -171 -7 159 43 -252
7642 -252 63 183 306 61 -148 40 185 277 -109 -152 -44 123 -222 80 -314 2 -126 -144 177 -252 88
7663 88 -146 418 -48 -151 85 48 141 302 -170 157 291 -70 31 142 63 -10 4 156 103 165 -200 159 54
7686 54 -471 -161 146 -398 109 214 -12 -95 -100 -44 153 196 -277 -320 150 -113 -121 -89 -238 180 61 -37 -162 173
7710 173 104 36 147 39 89 -266 139 -103 42 32 246 94 -6 -18 -412 -57 -155 16 407 113 -132 210
7732 210 275 -126 -285 229 -45 -126 63 -121 -70 -182 -262 81 -45 -60 39 100 72 72 66 160 -69 -237 90 -356
7756 -356 -138 -141 16 -43 -117 81 -28 193 179 -226 -132 -62 188 36 -179 -228 -75 -136 150 27 10 52 174 229
7780 229 -344 -171 -84 -127 202 -85 -66 173 -46 173 39 -164 -23 61 40 5 30 84 -29 18 18 36 -43 -170
7804 -170 -29 202 -107 -254 -124 -100 11 -235 222 -82 -7 95 109 -143 173 125 -237 215 52 -176 244
7825 244 94 -61 319 -109 -97 139 -97 175 217 -27 -124 33 -90 151 -9 -415 -388 7 14 337 -39 190
7847 190 -197 -198 -153 -135 101 192 127 2 286 -26 46 58 54 20 -59 1 172 -64 -28 158 -5 -29 -79 -16 -243 -151
7873 -151 34 124 -151 -222 -143 -293 63 59 -250 63 -249 -23 -66 208 -365 84 -278 -123 66 22 -178 -22
7895 -22 44 116 -48 -185 -14 -117 -70 -5 34 63 -228 12 72 -34 -149 19 -140 -269 -163 -90 -62 -87 -25 -33 -25
7920 -25 -3 193 4 -211 93 186 16 -405 28 47 66 65 202 372 -212 -55 -44 94 155 285 -83 186 -269
7943 -269 -52 -167 -114 -5 -40 4 241 79 -36 -73 16 -85 -49 286 -132 31 86 -99 -126 -58 -130 28 -52 32
7967 32 -149 99 148 -185 -210 303 184 13 -228 41 59 79 -87 -108 218 86 128 -168 -74 157 -126 458 -24
7990 -24 -341 151 -62 -32 -7 -88 112 156 -248 17 12 -133 -38 165 -243 174 268 96 253 -238 163 48 -115
8013 -115 79 105 -15 -122 50 123 -206 -190 62 -101 194 -16 95 77 -241 207 45 -120 415 -6 410
8034 410 94 -52 176 66 -87 166 -52 -22 -184 102 42 69 -49 -191 95 103 -512 -16 141 174 69 45
8056 45 42 -61 -57 -108 77 -127 -102 10 65 -158 -115 263 181 -98 -331 57 -222 27 84 229 250 -104 287 116
8080 116 -153 -164 112 -169 161 7 -129 16 104 39 -375 -209 35 -75 -197 -64 -10 -307 -43 150 -267
8101 -267 -166 246 126 210 217 -144 132 230 160 -92 137 2 -30 -2 32 444 -125 -89 -61 -96 43 -188 -56 -240
8125 -240 -132 47 -41 313 26 142 -56 235 -16 -161 28 253 -254 -73 280 46 92 -70 189 163 -259
8146 -259 149 -137 -115 8 -73 -121 117 142 25 136 -125 -311 66 277 276 97 -81 -191 -68 -398 39 -215
8168 -215 190 75 -146 96 25 -142 -100 -143 -45 -31 94 205 145 151 -17 194 10 148 82 -162 9 -16 201
8191B01
##END NTUPLES=NMR FID
##END=
