##TITLE=1H_PHDEO504
 CDCl3, 8 sc, 
 2.4.2019
##JCAMPDX= 6.0         $$ Bruker NMR JCAMP-DX V2.0
##DATA TYPE= NMR FID
##DATA CLASS= NTUPLES
##ORIGIN= UXNMR, Bruker Analytische Messtechnik GmbH
##OWNER= root
$$ XWIN-NMR		Version 3.5
$$ Wed Apr  3 15:48:53 2019 Russian Standard Time (UT+4h)  she@DPX200
##.OBSERVE FREQUENCY= 200.1316
##.OBSERVE NUCLEUS= ^1H
##.DELAY= (6, 6)
##.ACQUISITION MODE= SIMULTANEOUS
##.ACQUISITION SCHEME= undefined
##.AVERAGES= 8
##.DIGITISER RES= 18
##SPECTROMETER/DATA SYSTEM= spect
##.PULSE SEQUENCE= zg30
##.SOLVENT NAME= D2O
##.SHIFT REFERENCE= (INTERNAL, D2O, 0, 15.7039)
##AUDIT TRAIL= $$ (NUMBER, WHEN, WHO, WHERE, WHAT)
$$ ##TITLE= Audit trail, XWIN-NMR		Version 3.5
$$ ##JCAMPDX= 5.01
$$ ##ORIGIN= Bruker BioSpin GmbH
$$ ##OWNER= she
$$ F:/spectra/data/she/nmr/H-F/1/audita.txt
$$ ##AUDIT TRAIL=  $$ (NUMBER, WHEN, WHO, WHERE, WHAT)
(   1,<2019-04-03 15:47:34.21 +0400>,<she>,<DPX200>,
      <created by zg, POWCHK disabled, PULCHK disabled
       configuration hash MD5:
       00 E9 B6 7A A2 85 ED C7 34 08 36 98 17 FE 4E 26
       data hash MD5: 16K
       45 E1 CB 7E F5 3F BF A5 08 FE C8 8A FD 40 01 58>)
$$ ##END=
$$ 
$$ hash MD5
$$ 03 BE B4 A7 64 D3 4A 21 D6 EB 0F 7F 33 C6 02 29
##$RELAX= 
##$RELAX= 
##$RELAX= 
##$RELAX= 
##$RELAX= 
##$RELAX= 
$$ Bruker specific parameters
$$ --------------------------
##$DU= <F:/spectra>
##$EXPNO= 1
##$NAME= <H-F>
##$PROCNO= 1
##$TYPE= <nmr>
##$USER= <she>
##$AMP= (0..31)
100 100 100 100 100 100 100 100 100 100 100 100 100 100 100 100 100 100 
100 100 100 100 100 100 100 100 100 100 100 100 100 100 
##$AQSEQ= 0
##$AQ_mod= 1
##$AUNM= <au_zg>
##$AUTOPOS= <>
##$BF1= 200.13
##$BF2= 200.13
##$BF3= 200.13
##$BF4= 200.13
##$BF5= 200.13
##$BF6= 200.13
##$BF7= 200.13
##$BF8= 200.13
##$BYTORDA= 1
##$CFDGTYP= 0
##$CFRGTYP= 5
##$CHEMSTR= <none>
##$CNST= (0..31)
1 1 145 1 1 1 1 1 1 1 1 1 1 1 1 1 1 1 1 1 1 1 1 1 1 1 1 1 1 1 1 1 
##$CPDPRG= <>
##$CPDPRG1= <>
##$CPDPRG2= <>
##$CPDPRG3= <>
##$CPDPRG4= <mlev>
##$CPDPRG5= <mlev>
##$CPDPRG6= <mlev>
##$CPDPRG7= <mlev>
##$CPDPRG8= <mlev>
##$CPDPRGB= <>
##$CPDPRGT= <>
##$D= (0..31)
0 1.2 0 0 0 0 0 0 0 0 0 0.03 0 0 0 0 0 0 0 0 0 0 0 0 0 0 0 0 0 0 0 0 
##$DATE= 1554292053
##$DBL= (0..7)
120 120 120 120 120 120 120 120 
##$DBP= (0..7)
150 150 150 150 150 150 150 150 
##$DBP07= 0
##$DBPNAM0= <>
##$DBPNAM1= <>
##$DBPNAM2= <>
##$DBPNAM3= <>
##$DBPNAM4= <>
##$DBPNAM5= <>
##$DBPNAM6= <>
##$DBPNAM7= <>
##$DBPOAL= (0..7)
0.5 0.5 0.5 0.5 0.5 0.5 0.5 0.5 
##$DBPOFFS= (0..7)
0 0 0 0 0 0 0 0 
##$DE= 6
##$DECBNUC= <off>
##$DECIM= 24
##$DECNUC= <off>
##$DECSTAT= 4
##$DIGMOD= 1
##$DIGTYP= 9
##$DL= (0..7)
0 120 120 120 120 120 120 120 
##$DP= (0..7)
150 150 150 150 150 150 150 150 
##$DP07= 0
##$DPNAME0= <>
##$DPNAME1= <>
##$DPNAME2= <>
##$DPNAME3= <>
##$DPNAME4= <>
##$DPNAME5= <>
##$DPNAME6= <>
##$DPNAME7= <>
##$DPOAL= (0..7)
0.5 0.5 0.5 0.5 0.5 0.5 0.5 0.5 
##$DPOFFS= (0..7)
0 0 0 0 0 0 0 0 
##$DQDMODE= 0
##$DR= 18
##$DS= 0
##$DSLIST= <SSSSSSSSSSSSSSS>
##$DSPFIRM= 0
$$ [...]
##$SUBNAM2= <"">
##$SUBNAM3= <"">
##$SUBNAM4= <"">
##$SUBNAM5= <"">
##$SUBNAM6= <"">
##$SUBNAM7= <"">
##$SUBNAM8= <"">
##$SUBNAM9= <"">
##$SW= 24.9336934301222
##$SWIBOX= (0..15)
0 0 2 0 0 0 0 0 0 0 0 0 0 0 0 0 
##$SW_h= 4990.01996007984
##$TD= 16384
##$TD0= 1
##$TE= 0
##$TE2= 300
##$TE3= 300
##$TEG= 300
##$TL= (0..7)
0 120 120 120 120 120 120 120 
##$TP= (0..7)
150 150 150 150 150 150 150 150 
##$TP07= 0
##$TPNAME0= <>
##$TPNAME1= <>
##$TPNAME2= <>
##$TPNAME3= <>
##$TPNAME4= <>
##$TPNAME5= <>
##$TPNAME6= <>
##$TPNAME7= <>
##$TPOAL= (0..7)
0.5 0.5 0.5 0.5 0.5 0.5 0.5 0.5 
##$TPOFFS= (0..7)
0 0 0 0 0 0 0 0 
##$TUNHIN= 0
##$TUNHOUT= 0
##$TUNXOUT= 0
##$USERA1= <user>
##$USERA2= <user>
##$USERA3= <user>
##$USERA4= <user>
##$USERA5= <user>
##$V9= 5
##$VALIST= <valist>
##$VCLIST= <CCCCCCCCCCCCCCC>
##$VD= 0
##$VDLIST= <DDDDDDDDDDDDDDD>
##$VPLIST= <PPPPPPPPPPPPPPP>
##$VTLIST= <TTTTTTTTTTTTTTT>
##$WBST= 1024
##$WBSW= 4
##$XGAIN= (0..3)
0 0 0 0 
##$XL= 0
##$YL= 0
##$YMAX_a= 232903
##$YMIN_a= -244935
##$ZGOPTNS= <>
##$ZL1= 120
##$ZL2= 120
##$ZL3= 120
##$ZL4= 120
##$ABSF1= 10
##$ABSF2= 0
##$ABSG= 5
##$ABSL= 3
##$ALPHA= 0
##$AQORDER= 0
##$ASSFAC= 0
##$ASSFACI= 0
##$ASSFACX= 0
##$ASSWID= 0
##$AUNMP= <proc_1d>
##$AZFE= 0.1
##$AZFW= 0.1
##$BCFW= 1
##$BC_mod= 2
##$BYTORDP= 1
##$COROFFS= 0
##$CY= 11.3945322036743
##$DATMOD= 1
##$DC= 2
##$DFILT= <>
##$DTYPP= 0
##$F1P= 18.9103706918063
##$F2P= -1.10871071338519
##$FCOR= 0.5
##$FTSIZE= 0
##$FT_mod= 4
##$GAMMA= 1
##$GB= 0.15
##$INTBC= 1
##$INTSCL= 1
##$ISEN= 128
##$LB= 0.24
##$LEV0= 0
##$LPBIN= 0
##$MAXI= 10000
##$MC2= 0
##$MEAN= 0
##$ME_mod= 0
##$MI= 1.114404
##$NCOEF= 0
##$NC_proc= 0
##$NLEV= 6
##$NOISF1= 3.799351
##$NOISF2= 2.8
##$NSP= 1
##$NTH_PI= 0
##$NZP= 0
##$OFFSET= 15.70392
##$PC= 1
##$PHC0= -8849.68
##$PHC1= 11.60025
##$PH_mod= 1
##$PKNL= yes
##$PPARMOD= 0
##$PSCAL= 0
##$PSIGN= 0
##$REVERSE= no
##$SF= 200.130013532006
##$SI= 16384
##$SIGF1= 3
##$SIGF2= 2
##$SINO= 400
##$SIOLD= 16384
##$SREGLST= <1H.CDCl3>
##$SSB= 0
##$STSI= 0
##$STSR= 0
##$SW_p= 3612.71676300578
##$SYMM= 0
##$S_DEV= 0
##$TDeff= 0
##$TDoff= 0
##$TI= <>
##$TILT= no
##$TM1= 0
##$TM2= 0
##$TOPLEV= 0
##$USERP1= <user>
##$USERP2= <user>
##$USERP3= <user>
##$USERP4= <user>
##$USERP5= <user>
##$WDW= 1
##$XDIM= 8192
##$YMAX_p= 0
##$YMIN_p= 0
$$ End of Bruker specific parameters
$$ ---------------------------------
##NTUPLES= NMR FID
##VAR_NAME=  TIME,          FID/REAL,        FID/IMAG
##SYMBOL=    X,             R,               I
##VAR_TYPE=  INDEPENDENT,   DEPENDENT,       DEPENDENT
##VAR_FORM=  AFFN,          ASDF,            ASDF
##VAR_DIM=   8192,          8192,            8192
##UNITS=     SECONDS,       ARBITRARY UNITS, ARBITRARY UNITS
##FACTOR=    0.0002004,     1,               1
##FIRST=     0,             0,               0
##LAST=      1.6414764,     0,               0
##MIN=       0,             -244935,         0
##MAX=       1.6414764,     232903,          0
$$ Real data points
##PAGE= N=1
##DATA TABLE= (X++(R..R)), XYDATA
0 0 0 0 0 0 0 -8 8 -8 9 -16 16 -24 32 -40 48 -56 65 -80 95 -111 129 -153 177 -205 234 -270 307 -350 397
29 397 -450 508 -569 639 -716 798 -890 992 -1101 1222 -1356 1501 -1662 1839 -2036 2254
45 2254 -2500 2775 -3087 3443 -3857 4342 -4916 5617 -6487 7602 -9095 11204 -14429 20039
59 20039 -32620 117729 -64192 -125968 46660 -119375 59288 -66826 21525 232903 -102710
70 -102710 -54248 79857 -163688 -7253 -3283 55203 199732 -117870 -48987 82700 -167190
81 -167190 -8660 38233 37735 154991 -100775 -34773 84878 -160565 -24330 44910 28247
92 28247 154312 -62083 -61948 42965 -136442 3274 72552 1234 96868 -37766 -29407 47190
104 47190 -141740 -35077 86687 37875 79733 -46468 -41983 40390 -111343 -30387 87252
115 87252 27034 46980 -23219 -23337 22043 -104789 -29761 90818 24888 26387 2226 -21271
127 -21271 -16594 -84216 -1486 90703 8100 -7158 19896 1934 -29748 -69740 -7722 68874
139 68874 25883 -947 15570 -13835 -44723 -31293 8692 42377 17582 -9482 22957 609
151 609 -51690 -24217 5628 31264 30474 -14829 16025 4424 -60023 -9750 19409 19432 22502 -26037
165 -26037 19959 21667 -64951 -8488 23631 6807 23317 -17888 17944 13313 -70616 9852
177 9852 38960 -12822 8758 -10737 21189 12767 -65681 17651 33208 -28080 15866 4338
189 4338 8317 -1417 -52875 34155 30902 -42437 12673 9622 2585 2258 -37463 27797 17929 -38493
203 -38493 21298 8405 -11917 2397 -18240 26504 8005 -35858 20191 5391 -14022 6091
215 6091 -7105 20562 -178 -30152 18835 4171 -13175 4226 -2218 20086 -183 -24606
227 -24606 8904 -2532 -5225 10377 1683 11340 -7743 -14127 10266 -8346 -6897 8931 10446
240 10446 14158 -15373 -13339 7602 -9272 -139 6804 9641 14687 -17363 -9416 3590 -13770
253 -13770 6862 7969 7017 13750 -17415 -4283 -139 -19969 12593 11687 6715 11139 -21157 -1214
267 -1214 2321 -21900 13017 9564 6524 16153 -21885 -4551 364 -20057 18098 8230 1260 16244
281 16244 -19131 -4471 -1240 -21655 19818 10812 -586 15060 -18431 -4808 -125 -21318 18725
294 18725 11652 -963 14997 -17626 -7548 933 -18014 16865 11097 -1943 14967 -14408 -10271
307 -10271 -170 -15200 16100 12297 -2961 12457 -11656 -10944 -54 -12886 13148 12525 -1955
320 -1955 10551 -10490 -12267 144 -9020 10791 11755 -1315 8675 -8202 -12663 -813 -6594 9628
334 9628 11886 -531 5418 -7071 -11380 -902 -4603 6627 11007 1750 3720 -6926 -10784 -1412
348 -1412 -1855 5875 9364 2221 2796 -5695 -10471 -2774 -318 6077 8614 2026 228 -4785 -8448 -3577
364 -3577 -45 5461 8542 3106 -1610 -5371 -6961 -2809 1024 4463 6571 3994 -1025 -5577 -7032
379 -7032 -3065 2015 5324 5380 2588 -1670 -4820 -5538 -2844 1837 5062 5374 2515 -2278 -5022 -4573
395 -4573 -2215 2129 4906 4649 2152 -2409 -5049 -4056 -1535 2102 4624 4002 1201 -2151 -4594 -4048
411 -4048 -1261 2042 3964 3965 1090 -2421 -4417 -3562 -434 2587 3634 2844 842 -1780 -3608 -3483 -1211
428 -1211 2796 4656 2434 -164 -2516 -2765 -1598 -1160 1548 3393 2978 1092 -3146 -3865 -1194 263
444 263 2167 1676 911 2408 -1724 -3445 -2301 -997 3815 2751 -1081 1054 -1040 -1259 -548 -3685
460 -3685 1812 4347 884 1088 -3253 -2328 2348 -2209 -146 1459 899 4363 -2092 -4555 719 -661
476 -661 2276 917 -2753 3942 1026 -2761 -974 -4135 2285 3902 -2141 1680 -342 -483 1794 -5275
492 -5275 -1988 2729 2003 4120 -2634 -2926 2916 -1931 -1989 -1195 921 6899 271 -3239 -1138 -3287
508 -3287 966 66 -698 3856 1287 2343 -1720 -8365 -445 2474 3495 2310 -2830 4288 371 -8082
524 -8082 -2133 -747 5577 6277 -2892 2367 -3286 -6414 2933 -3770 2135 8042 288 4706 -7954
539 -7954 -10229 6869 -2454 1926 6939 -2050 7799 -6494 -12983 5517 -3348 5735 10466 -6846
553 -6846 5828 -4710 -12014 6591 -7118 4671 14990 -5978 4233 -7385 -13383 11217 -6191
566 -6191 928 15517 -4639 5817 -8196 -17225 12705 -4192 945 16794 -7217 3675 -4759
579 -4759 -16537 10397 -5712 1658 21959 -8489 -2048 -2426 -13648 9217 -6420 1239 23565
592 23565 -8179 -4354 -1001 -14694 6975 -1757 2064 19877 -8757 -4120 2216 -16416 2767
605 2767 4126 3157 15639 -6824 -5321 1627 -14899 1047 7221 1167 12578 -1118 -8962 -1907
619 -1907 -9890 669 8347 360 10346 3775 -13099 -3951 -2381 -3241 7124 4380 7807 4481 -17137
634 -17137 -3255 5306 -10527 6626 11403 2319 3644 -16090 -2383 9035 -17632 9583 19059
647 19059 -8129 2321 -10181 -3883 10003 -21450 13096 24363 -19241 4765 -3384 -10033 11716
660 11716 -19774 13887 25005 -27824 10154 2198 -19841 15286 -14729 11691 24933 -33767
672 -33767 13478 7130 -27745 19309 -11491 6659 27977 -36235 12188 10065 -32006 24122
684 24122 -8883 -299 30479 -36551 11149 13638 -36597 26280 -2983 -5501 29549 -37119 10450
697 10450 18843 -41136 25106 4089 -9563 27445 -35354 8657 21636 -42296 25376 9077
709 9077 -16128 25088 -28501 4981 19120 -40608 28266 13249 -24509 22362 -19540 1168
721 1168 16263 -36149 27877 14944 -27714 20564 -14245 -4899 16373 -27726 23353 12952
733 12952 -26631 19756 -10856 -10220 16055 -18810 18166 11258 -23944 15742 -7949 -11439 14479
746 14479 -13092 13796 12348 -20354 8259 -4800 -8955 11493 -8840 10293 11739 -16504 1603
759 1603 -1661 -6730 6438 -2180 9449 7569 -13888 -1649 2061 -5744 -352 5348 9996 1488
773 1488 -10684 -3838 3939 -4283 -5278 12104 9090 -5305 -5200 -4647 1964 -2464 -7066 17014 7204
788 7204 -12443 1865 -4792 -2661 370 -7157 20127 5727 -17572 7481 -4889 -7210 4795
801 4795 -6407 19146 4922 -19840 12043 -6625 -11648 10343 -5668 16119 4862 -20685
813 -20685 14268 -7512 -14586 15167 -5182 12449 6454 -20619 13891 -7627 -15685 18023 -5370
826 -5370 8699 8264 -20027 11808 -6559 -15254 19197 -4606 5701 9417 -19198 9500 -4725
839 -4725 -14969 18244 -2703 3785 8982 -17490 6857 -3039 -14226 16398 57 1975 7219
852 7219 -14270 4851 -2327 -12542 14411 2577 -210 4914 -10212 2418 -3046 -9827 12470
865 12470 4587 -1526 2624 -5710 -193 -4263 -5552 10229 4660 -1972 960 -2124 -2606 -5136 -998
880 -998 7172 4341 -663 -1450 471 -4261 -5989 3579 4370 3109 1545 -3738 2119 -4799 -7891 7600
896 7600 2158 1635 3678 -5905 3152 -4309 -9150 10546 564 -146 6653 -7775 3088 -3143 -9975
911 -9975 12981 -1534 -2068 10068 -8977 1975 -1942 -10676 14613 -2306 -4297 12341 -9921
924 -9921 512 210 -11206 14031 -1827 -4601 13552 -11449 -906 3512 -11346 12305 -1148
937 -1148 -4832 14221 -11891 -2689 5785 -10777 10981 303 -5825 13327 -10482 -3232 6272
950 6272 -10905 9922 2638 -6402 10993 -8944 -3229 6733 -10648 7608 4319 -5855 9223
963 9223 -7941 -4446 7344 -8404 5784 4599 -5930 8047 -5681 -5670 6105 -6215 5054
976 5054 5121 -6109 5889 -3465 -5510 4617 -5124 3625 5976 -4813 3334 -2686 -4713 4209 -3494
991 -3494 1773 5028 -3073 2209 -2274 -5215 3373 -770 1180 3886 -2413 1347 -908 -4774 1526
1006 1526 493 1451 3369 -1856 -962 -634 -3059 716 947 831 2830 -230 -1818 -1538 -2102 529 1793
1023 1793 453 1814 564 -1989 -1158 -1408 -258 2446 1325 713 352 -2247 -790 -723 -942 2409 1631
1040 1631 546 433 -2730 -1446 319 -753 2247 1535 -136 709 -2521 -1626 412 -444 2486 1449
1056 1449 -716 362 -1955 -1692 462 -624 2327 1572 -778 37 -2094 -1305 627 -10 1713 1314
1072 1314 -592 -150 -1960 -1468 934 466 1370 1092 -716 -506 -1388 -1279 753 760 1260 1114 -607 -766
1090 -766 -1240 -1008 781 924 1094 727 -588 -838 -1034 -682 556 872 1186 556 -774 -1062 -980 -143 495
1109 495 732 932 529 -656 -1034 -1041 -127 842 657 575 -35 -531 -718 -881 -442 530 965 783 234 -805
1129 -805 -558 -431 -18 452 697 843 444 -489 -1020 -787 128 745 342 292 345 -88 -469 -706 -114 601 554
1150 554 527 -185 -271 -185 -439 -194 -45 427 919 -161 -411 -406 -356 323 -194 -115 905 199 328 -569 -1226 127
1172 127 124 -94 917 -312 711 209 -1584 -90 -351 345 1481 -740 154 373 -1697 239 -564 -249
1190 -249 2236 -341 270 346 -2470 659 -89 -964 2154 -265 641 452 -3466 614 186 -904 2701
1207 2701 -527 416 1413 -3519 588 223 -1199 3594 -113 -528 1182 -3682 487 399 -1962 4093
1223 4093 508 -777 1294 -4320 176 1338 -2021 3668 440 -1122 1566 -4398 -307 1702 -1857
1238 -1857 3663 835 -1764 1141 -3459 -655 1889 -1760 3603 1897 -2264 205 -2967 -681 2040
1253 2040 -1418 2967 2529 -2835 -390 -2028 -1328 1934 -150 2416 2709 -2814 -1327 -800 -1993 1618
1269 1618 1147 1532 2626 -2742 -2508 618 -2198 671 2843 706 2373 -2056 -3787 1940 -2212 -214
1285 -214 4770 -138 1600 -1144 -5102 2579 -1811 -1286 6742 -1423 361 -144 -6099 3548 -1315 -2393
1301 -2393 8287 -2059 -881 1773 -7323 3707 -289 -3799 9953 -2790 -2552 3552 -7928 3517
1315 3517 889 -4872 10982 -3200 -4392 5443 -8311 2803 2405 -5871 11571 -3194 -6459 7204
1329 7204 -8602 1778 3825 -6284 11329 -3126 -7475 8637 -8398 405 6067 -6323 10160
1342 10160 -2390 -8516 9450 -8138 -1019 7974 -6532 8509 -1418 -9022 9284 -7356 -2030
1355 -2030 9148 -6492 6903 -390 -9372 8804 -5921 -2516 9346 -5864 5375 258 -9713
1368 -9713 7826 -4146 -3574 8841 -3941 3618 184 -8726 7468 -2688 -4675 8443 -1744
1381 -1744 1333 -698 -6760 6741 -2202 -5152 8849 66 -2038 -1124 -2998 4442 -3063 -3607 8739
1396 8739 782 -5167 -595 743 886 -3648 -522 7684 15 -6535 744 2880 -3105 -2876 3552
1411 3552 4457 -1009 -5094 1614 3709 -6250 -1215 6895 251 -1443 -2554 589 3539 -7192 217
1426 217 8770 -3728 -356 90 -2218 3782 -6464 675 9198 -6522 357 2287 -4754 4327 -5183
1441 -5183 157 10085 -7909 776 3933 -6740 4871 -3929 -1193 10882 -8408 408 5343 -8212
1455 -8212 5166 -2444 -2506 10821 -9009 60 6885 -9720 4400 -509 -3255 10119 -8313 -379
1469 -379 7739 -10130 4048 1257 -4398 9238 -6585 -1128 7507 -9624 3693 2412 -5432 8501
1483 8501 -4507 -2286 6837 -8255 2420 2861 -5402 7410 -2819 -3479 6560 -5806 347 2694
1497 2694 -3540 5909 -2696 -3862 6465 -3918 -2232 3055 -1220 3342 -2327 -2567 5803 -3403 -3699
1512 -3699 4333 480 -340 -1437 -183 3580 -3500 -3875 4986 1468 -3392 442 2355 508 -2814
1527 -2814 -2526 4568 1602 -5410 2381 3720 -3557 -1577 -253 2687 1632 -5547 3784 4205 -7085
1542 -7085 533 1769 -398 2232 -4611 3736 4434 -9118 2263 3081 -3760 3429 -2980 2498 4554
1557 4554 -9832 3504 3863 -6429 4822 -1413 716 4683 -9751 3997 4013 -8280 6098 -166
1571 -166 -1610 5079 -8770 3508 4381 -9147 7129 917 -3998 5459 -7416 2221 4334 -9053
1585 -9053 7460 1438 -5509 6081 -5805 498 4649 -7758 6997 1614 -6291 6350 -4958
1598 -4958 -1285 5040 -6517 5661 1804 -6287 5861 -4150 -2144 5494 -5595 4267 2858 -5799
1612 -5799 4586 -3383 -2618 5442 -4518 2770 3333 -5262 3383 -2119 -2713 4787 -3358 2163 3409
1627 3409 -5069 1929 -785 -2810 3988 -1964 1262 3154 -4234 742 -43 -2304 2822 -358 432
1642 432 2343 -3277 -294 486 -2344 2017 619 63 1418 -2126 -619 643 -1478 1001 1616 -136
1658 -136 673 -1312 -1529 800 -602 14 1947 -196 -57 -141 -2095 530 329 -469 2406 -55 -1244
1675 -1244 351 -1534 246 520 -721 2614 48 -1883 863 -1405 -161 1346 -986 2334 56
1690 56 -2046 1198 -1671 -417 1820 -907 1708 312 -2471 1599 -1363 -1030 2276 -784 1415 397
1706 397 -2558 973 -870 -1011 2367 -975 793 628 -2345 1125 -657 -768 2304 -732 43 578
1722 578 -2160 427 -173 -918 2253 -324 -137 695 -1674 451 22 -765 1634 -67 -170 605 -1384
1739 -1384 59 307 -432 1288 -130 -441 462 -1115 157 309 -118 1068 203 -556 389 -864 -195
1756 -195 124 -122 691 -7 -572 184 -483 -139 79 87 560 90 -302 -40 -358 -64 40 -1 564 113 -69
1777 -69 -164 -257 -172 102 345 84 391 74 -157 2 -170 -35 170 258 158 310 -284 -70 -216 -185 228 187
1799 187 242 290 -166 -272 -136 -120 196 199 364 431 -80 -221 -265 -428 335 206 259 255 -253 -471 -508 -552 215 427
1823 427 294 544 -314 -492 -674 -366 169 385 706 311 -227 -600 -583 -416 327 666 685 238 -333 -757 -751
1844 -751 -723 278 853 721 548 -246 -915 -599 -471 555 996 703 689 -704 -885 -690 -637 677 1155 573
1864 573 480 -729 -1256 -845 -586 967 1233 646 419 -874 -1427 -650 -486 856 1513 586 346 -1110 -1874
1883 -1874 -456 -187 880 1559 511 107 -1019 -2087 -495 2 1019 1789 423 -80 -1132 -1765 -508
1900 -508 195 993 1832 873 -263 -1083 -1863 -424 812 904 1525 896 -665 -1225 -1652 -498 1226 1013
1918 1013 1632 941 -1039 -1494 -1497 -647 1171 861 1406 1114 -1520 -1403 -877 -933 1475 1169 971 1186 -1849
1937 -1849 -1400 -566 -1057 1789 1242 435 1274 -2121 -1676 -69 -1345 1927 1701 -213 1724 -1948 -2094
1954 -2094 771 -1357 1868 1493 -833 1684 -2313 -2333 1353 -1005 1674 1752 -1334 1806 -2189 -2757
1970 -2757 2039 -631 1208 2164 -1152 1379 -2360 -2892 2982 -1257 273 2735 -1543 1111 -2025
1985 -2025 -2519 3445 -1514 47 3470 -1771 23 -1372 -1731 3195 -1499 -174 3891 -2212 -756
2000 -756 -445 -1546 2968 -1248 -63 3718 -2602 -1301 395 -1333 2251 -588 -60 3160 -2688 -1554
2016 -1554 1167 -842 1664 -110 -68 2538 -2558 -1654 1632 -736 780 204 224 1441 -2261 -1721 1749
2033 1749 -42 -485 899 718 256 -2115 -1397 1873 398 -1073 1220 949 -1184 -1548 -872 1473 558
2050 558 -1170 1749 839 -2490 -449 119 13 861 -1053 1608 868 -3423 542 531 -1044 1944 -360
2067 -360 630 806 -3557 1085 754 -1838 3049 -375 -685 1792 -3379 708 1032 -2041 3812 -972
2083 -972 -1658 2730 -3591 85 2027 -2191 3565 -1123 -1969 3625 -4145 -571 3512 -2253 2782 -645
2099 -645 -2140 3659 -4572 -723 4551 -2907 1882 460 -2062 3210 -4350 -372 5273 -3553 1053
2114 1053 1852 -2376 2001 -3592 -234 5208 -4078 622 2844 -2859 852 -2232 93 4550 -4170
2129 -4170 414 3649 -3392 -197 -437 258 3128 -3470 624 3740 -3850 -725 1100 -152 1645
2144 1645 -2636 532 3429 -3929 -842 2330 -469 391 -957 692 2323 -3299 -949 3160 -973
2159 -973 -991 723 624 886 -2281 -740 3237 -1100 -1713 2159 31 -630 -678 -579 2645 -949 -2194 2866
2177 2866 -291 -1557 977 -704 1348 -248 -2580 3384 -445 -2648 2318 -1254 402 1114 -2676
2192 -2676 3179 -91 -3225 3299 -1351 -533 1746 -3163 2574 371 -3394 3952 -1001 -1368 2481
2207 2481 -3528 2050 1425 -4043 4248 -691 -2411 3049 -3411 1641 1814 -4249 4347 -71 -3205
2222 -3205 3244 -2892 1028 2427 -4044 3661 167 -3804 3539 -2633 249 2599 -4018 3645 796
2237 796 -4227 3459 -1652 -357 2815 -3574 2876 906 -4373 2997 -951 -1087 2991 -2588 2336
2252 2336 751 -4546 2688 -326 -1536 2881 -1716 1236 1050 -4093 2263 158 -2205 2745 -557
2267 -557 484 630 -3343 1900 603 -2419 2370 118 -430 531 -2469 1213 669 -1862 2269 510
2283 510 -999 276 -1442 573 541 -1237 1922 974 -1505 -333 -438 -226 653 -687 1205 1147 -1712
2300 -1712 -165 363 -780 444 263 760 1257 -1565 -472 797 -1196 470 807 16 1233 -1294
2316 -1294 -971 967 -1312 217 1433 -842 1053 -875 -1282 1260 -1392 43 1895 -776 791
2331 791 -268 -1825 1517 -977 -317 2136 -948 536 -77 -1823 1528 -778 -541 2219 -950 517
2347 517 395 -1734 1392 -683 -937 2363 -819 81 605 -1511 916 -513 -1008 2447 -815 -502 953
2364 953 -1625 445 -68 -727 2007 -690 -527 1348 -1359 7 -144 -812 1445 -569 -496 1436 -1310
2381 -1310 -215 374 -613 1069 -160 -200 1161 -1164 -327 327 -692 652 109 -333 871 -718 -576
2398 -576 324 -535 546 434 206 461 -583 -491 128 -358 202 505 374 416 -293 -747 20 -160 75 600
2418 600 364 195 -156 -536 -378 6 -10 791 569 124 -110 -796 -554 29 172 795 760 -175 -107 -604 -633
2439 -633 -113 -104 763 859 -228 -242 -653 -829 111 265 779 554 -486 -287 -494 -747 91 199 484 451 -159
2460 -159 -436 -550 -730 275 389 596 822 -512 -401 -445 -709 226 531 403 636 -261 -571 -316 -593 475
2480 475 425 552 602 -392 -471 -379 -498 315 692 290 469 -346 -337 -344 -488 273 823 350 210 -258 -551 -354 -303
2503 -303 186 395 310 182 -432 -407 -307 -120 425 425 180 51 -364 -491 -152 10 189 497 196 -74 -158 -267
2525 -267 83 195 -106 333 -140 -235 -293 -243 72 261 88 228 -217 -263 -69 -159 208 399 142 -155 -211 -348
2547 -348 53 27 297 245 -90 -49 -214 -383 -63 171 566 301 -75 -247 -349 -382 -127 142 459 212 -159
2568 -159 -420 -418 -125 110 347 590 207 -429 -748 -521 -392 340 768 270 190 -154 -955 -436 -358 203 1022
2589 1022 327 320 -398 -997 -379 -364 461 1057 285 18 -535 -1326 -496 -261 569 1053 430 -46 -519 -1297 -523
2610 -523 127 499 1282 95 -240 -621 -1226 -373 174 606 1223 204 -260 -403 -1384 -206 332 601 1436
2629 1436 42 -426 -471 -1439 -79 501 498 1246 365 -467 -527 -1477 -43 825 550 1139 293 -596 -709 -1132
2649 -1132 -132 928 486 1007 134 -912 -596 -1060 -92 805 869 1015 136 -786 -650 -649 63 806 416 665
2669 665 94 -890 -705 -502 -92 1007 495 346 81 -923 -699 -455 -76 840 534 86 8 -553 -759 24
2689 24 176 708 955 -98 108 -427 -995 177 409 391 866 -176 -74 -401 -1214 394 554 42 948
2708 948 -457 -24 156 -1375 441 655 -375 1081 -357 -491 216 -1239 850 740 -677 993 -250
2725 -250 -672 379 -1225 644 950 -1014 1058 -5 -835 801 -1016 504 775 -1437 859 75
2741 75 -1254 940 -323 213 773 -1528 802 348 -1552 988 -204 50 824 -1264 563 447 -1628
2758 -1628 1330 44 -430 872 -1251 348 346 -1355 1392 480 -819 1051 -978 -102 430 -1166 1059
2775 1059 505 -783 839 -828 -359 409 -744 1031 669 -877 629 -649 -738 643 -288 556 817
2792 817 -817 -21 -225 -796 604 -110 269 939 -695 -392 11 -806 322 218 93 806 -657 -568 552
2811 552 -902 152 816 -180 667 -536 -958 762 -772 -181 1405 -247 448 -182 -1285 903 -779
2828 -779 -419 2007 -216 -79 343 -1377 725 -426 -457 2312 -456 -540 734 -1401 175 -168 -876
2845 -876 2357 -678 -739 1256 -1546 -96 113 -891 2163 -720 -1059 1612 -1675 -207 937 -859
2861 -859 1976 -482 -1166 1906 -1724 -521 1495 -812 1480 -71 -1260 1903 -1794 -806 1828 -1013
2877 -1013 895 188 -1008 1606 -1555 -675 2066 -1078 479 720 -1155 1165 -1401 -467 2362 -1326
2893 -1326 91 1179 -964 420 -689 -210 1733 -1387 86 1598 -1297 -365 -156 -345 1127 -1059
2909 -1059 128 1573 -1245 -306 531 -648 368 -280 171 1194 -1517 -103 922 -898 118 315
2925 315 236 612 -813 -88 914 -1070 31 971 -309 406 -27 -197 313 -830 -75 984 -796 72
2943 72 501 -982 199 -258 -133 862 -353 204 760 -950 35 54 -789 859 161 215 706 -1002 -103
2962 -103 473 -1329 619 400 -340 791 -884 -133 511 -1231 777 674 -814 820 -624 -522 529
2979 529 -1151 804 991 -1016 946 -299 -910 542 -810 553 819 -1045 686 -527 -981 853
2995 853 -883 340 910 -814 563 -13 -1075 405 -818 300 1364 -891 260 193 -912 245
3011 245 -367 484 1189 -927 356 225 -1241 37 277 310 778 -630 339 545 -1512 318 771 -77
3029 -77 530 -260 246 -34 -1456 404 773 -330 382 62 -3 -275 -895 525 654 -433 481 498 -506
3048 -506 -278 -402 280 382 -387 425 200 -683 -125 174 52 446 -60 -35 127 -758 -140 -50 -300 247 179
3069 179 -123 -94 -467 -42 172 -185 253 -32 -582 22 -373 -69 326 -136 129 34 -429 179 -319 -509 560
3090 560 43 -57 201 -473 236 122 -390 622 -32 -243 99 -383 69 102 -86 582 -60 -327 183 -401
3110 -401 -171 143 -180 391 28 -437 259 -602 -112 246 5 460 74 -445 -129 -671 -23 408 -17 454
3130 454 132 -403 -36 -200 -126 623 125 294 73 -646 -90 -84 -169 355 319 70 -64 -597 -94 -262 -125 516
3152 516 290 25 -147 -459 -207 -195 -17 569 324 72 -128 -467 -87 2 180 384 232 -150 -381 -313 -128
3173 -128 -132 332 605 295 -3 -210 -412 -162 56 263 418 188 -117 -268 -268 -173 155 275 390 87 -28 -336
3195 -336 -342 -100 196 340 236 122 -380 -394 -33 -105 246 372 76 -41 -186 -239 -184 97 206 361 174 -132
3217 -132 -234 -376 135 62 264 131 47 -326 -187 -368 156 145 161 220 35 12 -152 -93 117 185 388 -32 -197
3240 -197 -204 -194 -59 226 188 45 120 -84 -87 -120 88 61 316 313 -166 -227 -167 -145 254 311 158 107 -205 -251 -290 -62
3266 -62 384 89 73 -106 -127 -379 -258 148 146 168 192 -5 -139 -433 -252 38 271 402 137 -185 -404 -275
3288 -275 -158 349 386 274 10 -289 -235 -384 14 271 488 277 -56 -491 -276 -285 -183 442 363 108 -87 -453
3310 -453 -620 -99 -29 542 261 32 -178 -430 -463 -49 105 344 615 24 -264 -304 -474 -70 399 497 465 -237
3332 -237 -199 -414 -590 -140 497 408 398 -172 -548 -278 -486 138 494 328 301 -263 -386 -355 -362 127 649 402
3354 402 238 -151 -613 -345 -393 235 859 249 180 -216 -675 -265 -277 310 908 447 33 -169 -668 -315 -69
3375 -69 279 985 36 -130 -210 -924 -442 121 197 935 36 -367 -105 -796 -263 219 562 630 121 -461 -219
3396 -219 -796 -162 407 368 880 117 -266 -87 -774 -120 689 327 514 115 -439 -245 -592 -170 719 341
3416 341 371 -4 -632 -58 -451 -106 658 368 442 -5 -802 -194 29 -37 485 375 96 -2 -753 -292 -106
3437 -106 -129 779 359 -134 -186 -601 -147 24 -151 635 523 -400 -14 -408 -323 64 -93 743 300 -461 -184
3458 -184 -203 -367 152 283 734 452 -647 -81 -46 -569 351 439 510 157 -920 -50 230 -873 163 729
3478 729 209 -76 -553 183 -10 -1004 493 727 -266 -28 -140 324 -231 -684 835 893 -848 49 -5 -245
3498 -245 -154 -519 827 304 -1012 419 152 -597 140 12 474 273 -948 683 139 -975 384 308
3516 308 410 -5 -864 399 1 -1004 634 305 -87 186 -410 205 -34 -850 580 245 -429 197 -368
3535 -368 -29 28 -709 519 277 -487 234 75 -243 -16 -376 249 424 -729 186 -38 -526 170 -257 691
3555 691 219 -711 396 76 -323 184 -230 413 310 -587 289 132 -524 301 323 40 96 -170 140 26
3575 26 -696 369 318 -167 187 70 -156 -56 -404 471 362 -611 305 221 -744 60 -81 185 248 -279 341
3596 341 58 -608 360 98 -202 433 171 279 -109 -579 679 4 -501 659 317 -380 -186 -300 618
3615 618 -210 -405 758 14 -405 361 1 190 -261 -351 893 -302 -796 599 -4 -192 -40 -123 613
3634 613 -296 -485 747 -275 -730 288 -203 228 -318 -222 605 -241 -416 457 -25 45 145 -231 498 -378
3654 -378 -362 555 10 -48 284 -41 251 -53 -559 418 -13 -234 263 -147 283 -182 -510 535 -27 -201
3674 -201 448 156 52 -261 -552 402 -97 -230 629 279 -87 -125 -421 202 -127 -343 561 103 -72 -117 -366
3695 -366 -23 -54 -220 668 231 -417 104 -108 -212 207 -131 339 386 -191 -77 -224 -100 34 86 381 229
3716 229 -464 -72 -258 -265 214 167 225 279 -514 -155 -228 -296 306 90 288 235 -409 -322 175 -527 175 498 118
3739 118 274 -477 -276 75 -382 418 667 78 167 -295 -492 12 -265 197 558 -29 84 -220 -343 -136
3759 -136 -136 317 612 -61 -147 -282 -220 86 -49 377 433 -68 -74 -245 -480 -92 47 474 228 1 -291 -187
3781 -187 -259 45 58 323 517 -56 -429 -129 -350 270 339 172 434 -165 -365 -252 -242 12 358 293 310 -227
3803 -227 -182 25 -208 159 426 178 215 7 -496 -142 -156 22 414 323 -14 -67 -223 -81 -37 357 386 154
3825 154 -10 -155 -288 -100 -182 183 407 94 -42 -183 -331 -101 274 310 473 -40 -247 11 -140 -168 12
3846 12 4 230 30 -295 -255 -51 41 170 270 398 -103 -175 -204 -38 -113 219 250 -71 -74 -326 -458 -39 -56 322
3870 322 290 154 -188 -303 -141 2 182 229 234 23 -8 -318 -280 60 186 298 149 183 -109 -88 -104 25 166
3893 166 377 203 -79 -95 -331 -116 20 73 241 167 -17 -215 -96 43 5 343 272 55 -84 -208 -162 81
3915 81 201 211 192 36 -159 -34 -134 35 67 126 -13 -127 -91 -252 -50 229 292 174 -16 -151 -255 -183 -89
3938 -89 256 345 89 130 -251 -172 -114 153 33 305 46 82 -48 -74 -234 1 284 61 -34 -71 -59 -121 233 84
3962 84 209 161 39 -54 -409 -241 141 218 240 108 -128 -236 -388 -62 -43 221 190 24 -90 -147 -178 -304 173
3985 173 192 218 -124 -173 -358 -162 -59 219 273 170 -110 -242 -233 -37 44 32 259 276 -89 -78 -175 -102 -49 257
4009 257 232 216 -46 -120 -288 -124 -6 314 273 53 -171 -147 -130 -58 250 79 -35 183 -108 -300 -165 -160 134
4032 134 346 148 89 -249 -348 -62 78 28 325 90 -46 -348 -98 -66 134 255 157 172 -90 -21 -68 54 224
4055 224 79 145 55 -106 -14 -234 173 -61 77 407 -44 -389 -103 -241 -34 197 160 441 -152 -134 -46 -158
4077 -158 -107 20 387 76 74 -127 81 -131 -31 58 108 185 40 -215 46 -211 101 215 244 3 -261 -24
4099 -24 73 -103 70 336 73 -172 -171 -75 -87 -242 -163 291 71 -123 -98 -36 -121 -115 203 105 -66 -21 34 -114 -65
4124 -65 154 -75 149 -50 -96 71 -159 -176 176 83 204 23 -50 207 -27 92 325 -23 -95 70 -40 173
4146 173 -19 -10 56 -41 -116 -155 -268 128 -8 0 43 -190 -42 -8 -253 -90 84 -195 -5 -59 -135 60 -355 163
4170 163 152 -170 -59 -196 89 85 -296 35 102 -248 -9 14 -261 71 -155 90 131 -156 -105 106 -153 13
4192 13 100 78 -5 -357 -47 100 -49 63 90 -180 90 64 -115 67 -270 205 220 -272 -174 -11 -50 -269 -41
4215 -41 41 359 -78 61 148 -41 26 40 281 65 -328 114 85 -213 5 46 -71 242 -81 -82 108 -334 -28
4238 -28 -9 99 -65 -89 -93 -126 -370 -4 189 -131 265 11 -51 -195 -34 151 195 -66 -29 119 -74 -15 -36 57
4262 57 108 -52 -16 17 -253 -58 103 33 316 -85 61 -94 -354 -148 75 217 45 -31 -197 -16 -314 121
4284 121 154 36 296 15 -141 71 -22 -49 -11 275 -22 202 -149 124 -68 15 66 -34 109 35 -351 -102
4306 -102 -94 130 366 148 127 -227 -255 68 147 165 70 145 -37 -25 -252 -153 206 -69 196 91 -19 106 -166
4329 -166 3 100 -13 349 -17 -86 3 -13 -133 65 151 282 -32 -210 58 -243 -5 94 276 60 38 -312
4351 -312 -89 -32 63 367 136 328 -266 -311 -93 -296 -156 295 252 -169 -145 -90 6 -84 -56 616 85 -37 -73
4374 -73 -232 -261 -152 -8 355 210 -82 73 -31 -187 69 262 389 54 -75 76 -145 -195 37 -82 255
4395 255 46 -42 -180 -110 -297 250 269 60 -23 -82 24 -150 -73 303 330 85 64 -99 -7 -49 -34 68 63 126 -91
4420 -91 -222 -114 -108 -127 211 234 49 -60 -287 -166 -142 25 188 244 -30 -75 -112 -23 -170 50 218 251 -148 -9
4444 -9 -190 -368 64 29 237 95 -173 -75 -27 -216 5 196 -22 380 -94 -346 -192 53 -18 259 84 132
4466 132 -100 -35 -178 -192 33 237 -44 -45 -298 -101 -172 -103 -87 271 167 85 -12 -76 -3 -192 270 43 203 -65
4490 -65 -81 -204 -14 -178 201 15 -124 -274 -161 -221 -171 -21 74 129 -115 -32 -218 -102 -35 -152 131 225 64
4513 64 -173 -68 -120 -20 5 103 164 -21 -53 43 113 -32 105 369 237 10 -144 -63 133 5 35 -26 190 -86
4537 -86 -164 -52 119 -11 8 247 -46 -32 79 -95 34 29 58 -125 -25 45 -162 19 65 -109 -59 -32 179 -104
4561 -104 -99 44 -12 -44 2 -133 29 -174 -275 -136 71 229 -22 15 -37 64 -21 70 -23 195 80 -116 101
4584 101 57 30 247 224 4 -162 -177 -20 -7 -19 -29 76 -78 -258 -3 -114 -66 58 194 74 208 62 -91
4607 -91 26 140 22 121 171 -183 -115 -40 40 30 15 62 61 -8 5 74 65 7 107 -29 28 65 -65 0 -155 89 204
4634 204 -137 26 -144 51 -196 118 -61 111 -33 51 -38 20 176 182 0 291 42 -270 -162 79 -96 33
4656 33 184 72 12 89 -44 -130 -31 233 172 -53 -184 -20 -120 228 24 77 -43 52 99 22 90 10 211 -124
4680 -124 86 1 -135 13 -49 -42 -47 212 145 149 -130 4 73 -21 85 208 -46 -73 -322 -163 -65 -80 270 144 118
4705 118 7 -50 -13 -39 18 63 136 133 -2 -73 -262 134 84 186 388 -106 -36 -106 34 57 227 196 21 -111 -279
4730 -279 87 -126 -11 193 -4 -68 78 -273 -63 -92 97 319 -5 -225 -291 -208 -152 24 79 184 12 245
4752 245 -62 -119 93 98 -49 292 81 11 -135 -3 -10 -134 121 -46 -197 -149 -122 33 -39 1 129 -217 -39
4775 -39 -155 -302 79 34 252 229 -63 -20 4 -138 39 -9 120 85 23 116 -7 -233 188 249 44 49 53 -322 28
4800 28 -92 -172 -90 -137 -83 101 3 -165 -145 204 267 -18 -141 -85 -42 -40 146 3 33 -162 96 326 -422 231
4824 231 -107 -70 40 -3 -14 -38 -169 -1 22 245 203 67 3 -106 -203 13 58 -208 -31 9 -114 -96 -154 3
4848 3 244 72 -36 11 -162 -126 -139 56 67 -12 -6 17 -147 -137 -32 97 94 169 -40 -337 -82 61 -27 90 139
4873 139 75 35 -99 -46 -24 196 183 86 -63 -142 -388 -57 29 196 121 20 -114 -20 -244 4 72 101 60 -149
4897 -149 343 -76 -262 45 204 5 41 120 -20 -205 -237 188 43 193 143 45 21 -357 -111 122 -70 183
4919 183 34 -84 -192 -74 72 4 38 -19 316 -230 -88 9 87 -93 1 335 133 -128 -185 150 69 62 136 178
4943 178 -5 -277 -102 -12 -106 -37 236 61 -79 -132 72 -18 170 53 131 -28 72 -85 -37 -226 -101 237
4965 237 50 -135 -73 94 -54 -216 338 292 150 -27 -62 100 -142 1 204 233 52 -162 -134 -44 -281 59
4987 59 233 337 0 129 52 -195 -305 16 361 189 -73 -124 -54 -85 -59 32 197 22 -112 -103 134 16 73
5010 73 18 112 143 -188 -2 -82 -159 121 222 46 2 22 95 -69 78 -25 210 -38 -65 -3 103 -108 -246 238
5034 238 -46 203 127 109 -101 -277 185 363 113 79 -13 -97 -145 57 160 240 146 126 66 -52 -65 -217 27 134
5058 134 105 -34 -72 -129 -34 -83 82 297 69 128 -48 -185 42 214 0 78 100 22 -298 24 143 -31 124
5081 124 211 92 -237 -123 -102 -27 -18 -23 145 15 -152 -69 -38 131 183 116 85 -71 -206 117 -25 186 -76 6
5105 6 -165 43 -271 -115 97 -67 102 97 174 67 -189 -20 106 94 180 14 67 -7 47 -35 -176 37 113 92
5129 92 12 15 3 -189 -87 -1 81 244 -250 -67 -97 33 -104 -34 -4 110 29 -61 85 -51 29 -17 47 -34 -186
5154 -186 -84 160 141 196 -83 -8 -11 156 38 137 -143 -40 118 -37 19 -70 -54 -74 92 191 -18 -168 -71 -145
5178 -145 123 218 286 127 42 -29 -155 -42 -48 209 232 -24 132 -158 -21 132 -99 86 -16 51 55 -6 -160 -39
5202 -39 7 154 100 -12 31 -133 -118 -12 37 104 -31 19 -11 -146 -205 143 297 143 46 53 -121 -218 48 -62 -22
5227 -22 175 168 -138 -36 -4 26 63 134 84 -80 -55 -52 -47 89 65 66 136 -26 -126 -20 -119 -96 -59 51 8 -74 -135 -115
5255 -115 -108 82 89 285 158 100 -205 -104 -127 31 128 -83 66 -108 18 -108 99 44 160 55 -102 -43 82
5278 82 -169 -14 139 85 -68 -128 -11 -99 -39 92 177 178 16 87 -168 -84 -43 -44 68 52 77 69 82 10 -19 -8 -38
5305 -38 56 40 51 -69 -46 3 93 78 182 -32 -133 -108 84 24 42 -79 -19 -60 67 -125 68 -62 133 67 48
5330 48 25 -289 -186 -130 98 31 200 -27 -33 -55 12 66 180 90 56 2 -83 102 165 27 111 152 -70 23 -168 -205
5356 -205 -95 81 25 -12 189 -53 130 -123 -8 -21 59 -160 -24 -25 -264 -83 -50 -48 -8 -93 146 46 32 34 71
5381 71 81 12 191 -131 73 -54 -93 -100 59 27 -109 -203 -277 -68 -89 72 53 -29 -48 -148 -42 18 38 204 -5
5406 -5 -86 -159 -119 45 102 145 -54 98 -65 -160 -181 -169 -37 89 92 55 88 73 -43 116 96 84 144 136 35 -17 -94
5433 -94 95 -119 145 96 -114 -134 -161 -174 57 42 166 166 16 -51 -166 -68 105 167 63 164 -7 -92 -5 53 -88
5458 -88 56 -55 140 -117 -96 -161 -63 57 31 -11 -73 103 -99 86 89 138 129 77 -79 -46 -131 -49 83 -100 -43 -60
5484 -60 28 -186 -217 -168 -13 13 55 1 -153 -218 76 107 107 104 85 -24 140 -225 46 61 -83 -155 -98 145 -35 -78
5510 -78 -29 75 10 -101 92 36 -163 -91 93 -52 100 33 63 -423 40 -85 65 64 107 144 -149 26 -66 -1
5534 -1 52 151 -32 216 -214 -344 -79 -139 126 164 69 -132 -276 -129 113 -104 260 27 -8 65 -101 -46 -90 -136
5558 -136 101 92 76 -5 -123 -62 12 -59 201 60 -162 -82 -43 -39 46 -96 6 140 -3 -84 110 -85 56 38 84
5583 84 141 25 0 -116 15 58 -38 173 -116 -220 -160 -128 -7 152 49 245 40 -206 -2 -95 24 129 255
5606 255 -102 -46 23 64 -147 8 91 106 61 -12 -281 31 33 19 258 176 -143 12 -214 21 192 21 53 242
5630 242 34 -24 134 -40 -140 38 96 62 -25 -296 2 -123 -18 -62 -33 -10 74 -96 -4 3 191 205 -75 -80 65
5655 65 -50 34 -155 84 161 -126 -43 -98 -73 10 76 13 43 -61 143 -85 -340 -119 -50 156 135 -60 -186 -41
5679 -41 -49 -79 207 -173 113 -129 -42 -128 57 77 -18 164 130 -34 -41 -41 32 94 208 186 94 116 34 12 -90 -45 -53 201
5707 201 -35 -150 -318 13 3 227 129 -30 177 11 -145 34 22 -150 116 55 -30 3 38 5 -50 -9 68 39
5731 39 14 -8 -231 164 -4 121 83 -116 -57 -192 -150 -53 -66 82 -49 95 -126 -195 35 224 26 54 79 171
5755 171 -65 47 55 20 79 -70 63 184 -188 -5 -221 -201 103 127 -200 -98 -243 -150 54 249 43 80 89
5778 89 -74 -201 -86 82 -46 9 81 130 24 39 163 75 197 52 39 -216 -128 -29 -6 183 52 107 -144 33
5802 33 56 16 -78 242 111 31 141 -96 -78 -102 -52 -21 21 141 28 -261 23 -155 111 61 -120 -56 -88 51
5826 51 54 2 130 84 26 -171 20 -54 -51 9 -22 62 -213 8 69 -62 -74 203 59 181 39 -78 -132 -108 -187 130
5852 130 107 216 -28 95 0 -121 -50 294 28 -28 84 -99 95 -16 45 221 108 86 4 -194 -127 -152 -101
5875 -101 39 -2 168 5 -107 55 302 120 -200 84 -42 -91 -3 157 139 193 44 -103 -19 -117 -147 -102 161
5898 161 255 -3 16 45 -62 -145 42 123 13 -28 -32 -68 -235 -115 -39 100 -41 -6 68 -53 79 -93 -110 91
5922 91 113 -165 -161 0 -144 -19 67 121 226 -61 -76 -24 40 105 -66 57 68 -262 -46 -165 25 79 2 203
5946 203 -33 -16 -98 -22 98 -73 124 82 61 -69 122 -89 228 94 -30 63 77 -170 33 210 -74 180
5968 180 23 -44 -284 22 56 -61 -45 190 181 80 -199 -30 15 -25 -189 47 86 -196 -88 24 17 -31 -56 92
5992 92 51 -91 -99 -111 -220 -85 233 285 19 -59 -116 -179 48 53 17 -58 18 -184 14 -109 -113 53 144 -122 -141 -116
6018 -116 -52 124 -51 95 123 71 72 -105 15 -155 81 220 -190 1 -53 -108 -249 31 -162 53 -117 -121 -254
6041 -254 -199 -21 -77 40 209 80 -94 -97 58 -83 -32 24 167 -60 -7 25 138 84 -23 74 140 -70 -16 -121
6065 -121 -65 -87 -160 93 104 45 -111 -182 -101 9 15 54 96 -129 -58 -57 -164 152 -1 -2 -57 -163 -144 106 -218 95
6091 95 -101 159 31 -151 79 -43 -8 24 234 15 -167 -154 -75 -164 -143 115 70 -246 -128 -100 -24 152 -31
6114 -31 129 118 65 -11 40 -32 -37 64 11 50 71 -69 9 -158 -244 192 25 37 -63 36 -1 -16 -39 102 232 68
6140 68 -223 -111 -255 -137 105 39 129 -35 -75 -81 -221 -46 -52 21 -64 -54 -18 -19 -244 20 206 -52 29 -96 2
6165 2 55 -138 -25 31 49 -20 -55 -79 -34 137 -64 -77 19 -13 -59 -54 -16 120 31 160 -68 -24 -94 -159 -104 -91 -5 -53
6193 -53 28 -160 -67 -113 -93 -51 35 52 -221 -123 -47 57 43 77 -34 6 -236 -172 16 191 74 122 28 82 -102 -152
6219 -152 251 -43 147 102 52 -58 -109 -23 29 142 20 -47 -23 -105 -7 -110 -123 121 252 31 -4 -49 -208 -3
6243 -3 -59 -13 59 -24 -12 -85 -186 -78 75 87 144 103 -180 99 -133 -80 62 124 -121 -75 -79 -72 -47 -7 -35 -64 -191
6270 -191 104 -49 -11 -126 97 -57 23 209 -79 -91 -203 -101 48 142 139 108 46 96 -95 241 123 32 -47 -58
6294 -58 44 -213 -2 -68 15 194 -110 -17 39 -53 6 -89 72 -148 -108 50 -163 -47 -48 83 43 164 -57 111
6318 111 58 -58 88 63 77 86 -83 -9 36 -51 -17 -133 -18 10 -78 65 -177 -1 12 -106 -150 221 -121 -55 -73
6343 -73 -25 191 69 69 173 -240 -133 -112 -58 150 -36 -160 -148 -87 16 -16 164 32 121 0 -169 -344 -21
6366 -21 -71 -49 82 257 -114 -162 81 -115 125 -222 162 27 -172 28 136 -71 216 -35 163 26 101 7
6388 7 -364 -11 34 119 -2 134 -224 -18 50 -155 100 -71 -49 25 1 -122 86 -80 17 189 -65 104 -114
6411 -114 -72 -169 20 95 -60 46 79 -19 -42 44 24 177 7 -99 74 -167 -113 -67 74 133 -89 24 -13 -92
6435 -92 14 6 185 -50 165 -97 -61 -79 61 194 181 63 72 158 -65 -238 -105 180 224 -200 50 7 -45 40
6459 40 -141 51 82 116 -38 -78 -290 126 -125 11 -65 16 -11 50 -101 -25 -34 -56 35 -231 -39 -159 104 11 75
6484 75 -125 47 -43 180 18 -176 34 -100 -2 -32 -11 -84 99 101 -33 193 36 92 -99 -213 64 -224 -64
6507 -64 -16 -165 117 -177 -16 -33 -157 81 248 -25 -80 89 -293 -113 -1 -75 96 80 -124 16 -31 19 68
6530 68 71 155 -188 52 -1 -110 203 -137 -60 145 -278 -33 -64 -90 -12 -1 121 -74 -89 -91 -59 -88 -13 -65 130 -26
6556 -26 76 -19 -202 19 91 96 -19 48 -131 30 62 -238 -24 23 144 43 -28 22 -94 63 -10 72 -7 1 216
6581 216 -216 57 -51 -16 106 -127 -138 -20 -187 0 -37 145 73 -17 -116 -71 101 -149 -68 94 8 -39 -182
6604 -182 -77 69 -221 241 49 61 17 -40 -110 -114 -117 -117 198 99 15 55 -127 -60 -129 86 105 -46 -201 -86 -172 -112
6630 -112 115 32 13 -165 -50 -180 -76 -30 43 127 8 56 -10 -74 106 14 18 3 134 97 -43 56 100 -64 65
6655 65 100 -208 -63 31 114 65 180 81 75 -51 -191 -123 -37 51 128 -55 -118 -70 112 -48 71 159 182 96 -41 28
6681 28 83 72 -184 -50 119 69 -36 156 -108 -213 -70 151 -62 0 20 -287 94 4 134 51 3 3 -26 -115
6705 -115 15 -76 105 -47 49 -184 -119 16 -49 103 -41 -85 205 66 -37 129 122 -165 48 23 -84 -42 -80
6728 -80 -4 -186 -209 130 -36 -246 96 -174 11 21 -3 65 -18 36 -51 150 -103 -59 142 -93 -35 -92 133 -159
6752 -159 -289 84 47 -36 2 58 -168 17 148 -77 28 -2 0 16 44 -118 -96 -114 111 -70 36 -32 148 -54
6776 -54 187 8 119 -105 -10 -53 -35 -20 -61 3 31 81 -82 -117 -167 114 78 -41 -66 46 44 -89 -78 30 -43 -107
6802 -107 -161 -11 -88 -171 92 -194 117 278 62 -117 79 -174 56 86 -77 -36 115 -8 142 -199 32 -18
6824 -18 -155 7 124 -34 14 35 3 35 115 -69 -89 117 -126 -89 106 -3 121 84 -3 37 -168 31 118 -78
6848 -78 -109 -25 -136 -70 -69 -106 -83 -96 -17 -29 -132 115 3 -85 89 46 -34 71 -28 -90 -24 -3 142 -15 137 -53
6874 -53 -70 122 52 145 14 29 -259 -85 -90 18 -3 125 -18 -14 -206 -144 -88 -80 54 52 93 -64 -37 -126 83 -47
6900 -47 210 7 84 -60 26 44 -127 -259 60 -106 67 116 -183 52 -30 -181 251 71 13 95 -26 -11 -5 61
6924 61 -101 -35 54 -3 -52 -117 189 34 93 -2 -239 -179 -189 32 28 67 72 132 -129 -34 90 9 71 -97 70 24 -24
6951 -24 -190 -78 -93 90 145 -18 23 -35 11 10 8 -90 198 243 -285 -28 3 -132 85 16 298 34 93 22 -36 22
6977 22 183 -142 -219 -64 67 -156 -17 40 -105 127 -250 -56 -34 -244 -94 74 10 16 -78 -71 -30 23 61 84 71
7002 71 -65 -230 -92 -17 50 25 235 130 55 -175 118 69 57 164 -83 -99 7 56 -201 -117 2 214 19
7025 19 8 -21 -170 -14 -71 137 -49 95 234 -101 16 40 17 -44 43 -172 71 29 -72 2 203 -190 329
7048 329 72 -13 25 -50 20 -102 170 -65 90 -64 23 -90 91 42 79 -13 48 23 -138 -74 -22 69 127 13 -246
7073 -246 35 -14 -85 62 19 250 10 -112 -2 -298 -46 64 57 39 3 -125 75 47 -74 213 106 -25 58
7096 58 -173 -120 -52 95 9 -210 52 41 -180 -27 -7 174 65 258 117 159 0 -94 -56 -122 5 97 -224 71
7120 71 -153 28 15 91 42 148 -143 131 -123 92 -86 -54 49 -84 -135 -220 -146 -9 112 -82 179 -75 207
7143 207 -207 -74 -90 79 -24 -9 -25 2 163 -132 5 103 18 72 84 -121 131 74 197 55 160 -168 -12
7166 -12 -4 -107 137 64 -42 6 -79 59 78 13 128 -154 106 2 -2 -63 -2 -177 -38 -102 -26 196 -46 -15 -73
7191 -73 -130 121 7 11 133 -54 -45 60 -179 -24 39 79 173 44 -70 175 -149 7 28 138 102 122 -68 169
7215 169 -85 129 -7 -186 59 72 -15 50 -87 4 10 -226 2 -162 -214 -161 -111 60 -87 175 42 4 -218
7238 -218 -15 -102 21 136 188 27 -8 100 -82 97 61 -12 -114 -208 112 41 2 -18 259 -83 -207 -168 118
7261 118 -98 4 87 -160 -2 47 25 114 -126 -155 77 -189 -54 -30 -143 -102 14 -112 118 294 93 -245
7283 -245 -48 -108 14 -35 204 -198 174 255 -167 -96 16 137 -145 6 30 42 -21 -30 61 71 -46 -124 -117 -162 -38
7308 -38 0 61 -28 -56 -49 -154 17 -93 -15 -92 -36 -6 75 165 56 -28 75 59 12 -25 -23 -67 -91 204 -131 176 31
7335 31 33 -90 -166 -57 101 58 -58 73 -89 -41 -52 111 43 -113 22 -142 -24 62 -66 76 265 39 33 12
7359 12 -136 62 -132 165 -15 -32 -18 -40 78 218 8 -43 -64 170 77 -11 9 -1 -32 66 -23 10 7 -119 -79 7
7385 7 -42 -74 56 5 -40 -173 56 -10 -49 132 -123 53 -92 -91 -148 194 50 -119 -107 114 -24 3 -8 30 159
7410 159 67 131 -111 79 -140 27 -142 64 -146 -73 -71 90 -85 34 106 67 -24 -108 23 -90 34 10 172
7433 172 177 89 -103 -140 92 197 -174 30 205 124 42 -91 -4 24 127 178 -122 -118 -200 -154 66 50 96 85 -191
7458 -191 33 51 -107 70 144 26 53 -281 -66 -116 255 127 12 98 55 95 -20 -180 -72 211 46 13 121
7481 121 -11 15 -83 110 65 10 26 -43 -97 -174 -140 -169 -9 22 -11 -5 -107 -29 -53 83 -21 -7 -80 -35 -180 -179 155
7508 155 89 18 225 80 24 -49 108 36 -23 158 3 -78 -176 -67 -109 155 21 87 11 -193 -142 -336 15 221
7532 221 26 18 29 32 99 -20 24 -29 60 234 65 87 -207 -11 -330 84 -89 135 -62 -109 97 -35 4 97
7556 97 157 -58 33 55 -213 -89 -8 -73 -26 -121 -125 -177 -73 -32 -13 56 -11 20 176 -50 -27 81 -172 -71 138 18
7582 18 -83 57 58 -38 204 40 204 148 132 -140 5 54 -8 -77 -122 136 -98 -88 49 53 85 79 204 -33 -206
7607 -206 39 -130 40 45 -136 113 44 -18 55 -37 -48 385 53 -43 155 -39 -25 252 125 124 54 -57 -175 -119
7631 -119 9 43 25 43 -57 -144 176 -13 -42 61 53 34 -125 -97 -194 -46 47 13 21 34 -53 5 -291 -15 -43 -12
7657 -12 7 50 121 73 151 -30 69 -18 46 233 -120 -7 -60 -123 71 158 -143 176 -59 -16 -18 120 316 60 5
7682 5 -68 48 63 174 -4 -116 -74 -121 -35 -55 -324 81 -24 14 202 -109 -17 7 149 -67 84 -150 -6 38
7706 38 33 -2 134 59 -82 -118 137 75 -45 -145 -326 -203 -23 -93 53 190 -51 -60 -136 -81 7 -168 -218 146 14
7731 14 -140 -36 -307 -19 197 70 -91 -209 -74 -192 52 -57 77 -266 89 -38 -26 -72 -55 46 329
7752 329 -302 -87 -141 -113 200 -7 99 34 -40 136 109 -68 162 -41 18 208 71 -70 25 -141 -74 61 -97
7775 -97 -154 97 -66 31 -205 6 -125 -39 -4 -82 83 -54 -22 90 102 -14 -74 -83 -190 97 -161 131 -83 -67
7799 -67 75 72 -16 -27 55 -167 48 22 36 -118 -92 40 -43 -91 -42 -97 39 23 69 112 -82 -65 -51 94 190 -81
7825 -81 -68 97 -55 -292 -87 -34 14 73 2 117 101 118 127 -73 -145 356 -23 -2 146 -140 154 161 -65 -135 -16
7850 -16 -71 -13 -63 18 -13 153 114 -19 77 -41 -180 23 22 159 89 10 -49 68 -96 -161 61 -9 174 8 120
7875 120 -107 -119 48 -19 -44 -29 -20 -164 -12 -134 195 31 -240 63 124 -297 224 31 72 -170 51 -160 -138
7898 -138 -254 -181 -165 -144 -3 -163 94 109 -58 125 -54 62 -233 114 -116 22 -42 -31 122 -49 -160 -106
7920 -106 -54 -28 -209 -4 -5 -83 29 -54 102 102 -202 -26 62 -112 103 33 -153 27 -76 41 43 -161 29 49
7944 49 84 -133 -50 126 86 31 2 66 -33 -47 77 213 21 56 -90 169 -208 83 -165 -191 1 83 -65 57
7968 57 -11 78 -12 -100 162 80 40 30 76 -81 55 4 -34 88 -105 -85 -45 -114 -40 -180 57 -26 -32 5 90 131 -172
7995 -172 -77 57 -61 31 -170 -3 -116 226 61 -102 94 42 37 -99 14 -95 -76 36 -103 -37 -32 35 79 -24
8019 -24 74 68 168 72 137 69 12 141 -28 -22 119 -103 -104 -52 58 -46 -35 76 -63 -114 -169 -10 109 -47 115
8044 115 -7 -30 -108 -160 -23 314 33 -149 -131 84 -57 32 -116 12 49 -38 -70 -41 297 -6 35 -13 73 34
8068 34 -167 -147 -158 17 86 -29 9 -59 -297 -20 -2 81 14 -7 114 -67 70 -121 -91 -18 -89 1 73 104 314
8093 314 -126 -145 -161 -18 13 217 168 36 -3 -60 -32 137 153 8 -124 57 84 110 5 66 -21 72 -216 74
8117 74 -11 78 80 45 150 43 -191 133 -46 139 149 -45 35 40 -4 -190 -75 134 -19 -99 29 -41 156 -114
8141 -114 77 70 -158 -124 -111 -98 -114 -29 -49 214 53 -56 48 12 -228 29 49 -117 48 -160 -87 -66 5 239
8165 239 -10 52 75 -135 -14 -164 -167 -203 316 159 49 77 -339 0 80 75 -36 22 -69 -51 23 -142 28 -9 -49
8190 -49 16
8191A6
$$ Imaginary data points
##PAGE= N=2
##DATA TABLE= (X++(I..I)), XYDATA
0 0 0 0 0 0 0 0 0 8 -8 8 -8 10 -16 16 -18 24 -26 32 -37 45 -52 59 -68 77 -89 100 -115 131 -147 165 -183
31 -183 203 -228 255 -282 315 -349 385 -426 471 -521 576 -637 709 -785 872 -972 1088 -1222
49 -1222 1383 -1576 1814 -2115 2507 -3039 3800 -4967 6945 -10867 21306 -97207 -244935 82605
63 82605 -41505 24318 63054 -33183 184364 -70711 -185039 108439 -91824 -33961 121041
74 121041 18364 133244 -94262 -166542 114674 -88889 -38261 143491 9828 84225 -74135
85 -74135 -134777 105491 -87613 -51348 142202 16822 76130 -47969 -147970 60738 -54463
96 -54463 -17227 141767 -8800 26706 -19861 -98079 47493 -69323 -41154 148083 33915
107 33915 6675 -43435 -93072 45313 -41922 -34638 128353 28126 -14349 -25538 -62055 21553
119 21553 -45592 -25427 122798 30500 -29196 -12761 -46412 -13595 -32365 9996 106676 9502
131 9502 -49060 3698 -11348 -31254 -36025 14316 83054 24624 -35644 -9905 -17779 -38015 -7120
144 -7120 32286 44812 12214 -26926 -3497 -751 -45791 -11226 35419 31806 21605 -24315 -15498
157 -15498 7554 -46672 -5506 48266 14384 9932 -23665 -10335 25501 -50970 -15014 53755
169 53755 5053 8143 -12174 -12628 18845 -51707 -1911 64882 -16049 -8368 1678 -3141 17187
182 17187 -50149 1146 59024 -28402 -2729 17447 -13054 2964 -35549 16216 50765 -44725
194 -44725 -5024 28270 -12964 2594 -23746 10532 35169 -39475 4789 25830 -23549 3112
206 3112 -5624 9641 19135 -37413 8119 22712 -21905 6432 1913 5039 7443 -30833 11120
219 11120 18733 -19464 5347 4298 6752 3354 -27587 5416 12189 -8041 11522 2081 -502
232 -502 -3951 -17735 10025 3305 -8333 13411 7347 2672 -13885 -18552 12987 1644 -2103 12935
246 12935 3118 4731 -15781 -16673 12308 -3202 4410 15419 -2259 4440 -15363 -14057 11222
259 11222 -9608 9986 20867 -5610 1871 -17973 -11053 14764 -12542 9238 20606 -6325
271 -6325 5619 -18603 -15433 14849 -9929 12974 19576 -12091 6415 -14082 -15569 12486 -10870
284 -10870 14748 21333 -13929 4296 -12798 -15352 12786 -10120 12929 21699 -13533 3396 -11819
297 -11819 -16631 12845 -6727 11483 19915 -12828 3071 -9335 -17698 10288 -3284 10972 18759
310 18759 -12482 515 -6936 -16321 8421 -1022 9155 17504 -10156 -1007 -6582 -15885 7731
323 7731 1945 7704 14641 -8342 -1916 -5466 -14748 5130 3948 7192 12841 -6559 -4396 -4994 -11886
338 -11886 4179 4543 5838 10912 -3703 -5160 -6075 -10116 3691 6250 5591 8122 -2880 -5001 -5861
353 -5861 -8759 2460 6585 6102 6710 -2453 -5908 -5069 -6064 1113 5919 6228 5865 -1663 -6571 -6079 -3726
370 -3726 1812 5469 5254 3926 -474 -5434 -6631 -3965 1599 6021 5769 2446 -1684 -5034 -5320 -2797
386 -2797 1400 5262 5629 2540 -1660 -5390 -5176 -1689 1877 4744 5072 1602 -1879 -4787 -4899 -1371
402 -1371 2140 4321 4582 1339 -2108 -4283 -4232 -1243 2514 4074 3790 1231 -2239 -4332 -3550 -1039
418 -1039 2758 4236 2843 93 -1894 -3160 -3273 -1126 1617 4121 3798 -17 -2873 -3679 -2160 605
434 605 1266 2369 3175 866 -1609 -4030 -3214 1265 2479 2351 1468 -881 -14 -2005 -3832 -42 1480
451 1480 3563 2842 -2704 -1270 -437 -2082 652 -990 1523 4904 -872 -1842 -2245 -2612 3135 128
467 128 -985 2670 232 1643 -1619 -5688 1712 1889 921 1983 -2807 1886 1946 -4412 -688 -855 1550
484 1550 5202 -2582 -1189 1183 -2108 1465 -2865 -2073 5347 1757 786 -2179 -4437 3133 127 -2677
500 -2677 1423 1362 4868 -282 -6330 -923 -716 1189 3042 -812 2619 683 -1896 -1809 -6425 952
516 952 6541 2238 1182 -3549 84 1256 -7871 -591 4833 4258 5429 -4891 -2985 -398 -6526
531 -6526 4349 2259 -317 8449 -2200 -2898 -4330 -10090 9072 4991 -2378 7557 -4104 -709
545 -709 -2193 -13742 8070 6357 -132 10278 -8315 -3449 1559 -12595 7768 4101 -1317 14791
559 14791 -7928 -7186 -189 -12801 11949 5416 -5821 14879 -5183 -7122 -826 -15845 13161
572 13161 8993 -6759 14643 -6589 -9177 2244 -14512 10085 8468 -5586 17934 -7560 -15183
585 -15183 4178 -9940 8167 6900 -5294 18789 -6651 -17565 4916 -8801 5745 10414
597 10414 -3541 14145 -6990 -16001 6527 -9071 1697 14274 -785 8202 -6194 -14621 4938
610 4938 -6516 856 15136 -193 3998 -2007 -14282 -632 -1090 1871 12612 439 978 1180
624 1180 -14631 -4858 5831 409 7774 5335 -718 -2 -14857 -6179 12892 -3472 2644 13891
638 13891 -4527 -4121 -10576 -6442 15531 -7280 922 22576 -12355 -8927 -869 -7874 14060 -8064
652 -8064 833 28508 -20670 -10711 9298 -13366 12168 -3281 -1147 28786 -26027 -9155 18224
665 18224 -22086 11560 4933 -5777 27085 -27837 -8446 25376 -28385 11470 11333 -12302 27799
678 27799 -26752 -11794 29902 -30302 11985 15846 -19479 27842 -22711 -14583 33062 -32023
690 -32023 10723 22283 -24509 24286 -19826 -15160 36878 -33690 6544 28775 -26357 19008
702 19008 -15833 -15844 38097 -32419 4617 32623 -30205 14455 -8033 -17023 33059 -28703 5963
715 5963 34051 -35670 9873 1674 -17508 26980 -23499 6205 32638 -36547 6853 6914 -19446
728 -19446 23456 -14754 3237 26674 -32700 6116 8540 -21233 20995 -5957 -42 20731
740 20731 -27903 3749 8998 -18911 17444 -1526 -1535 17045 -22702 -1608 9156 -12303 13149
753 13149 127 -1754 13522 -17763 -5587 8457 -6512 7611 3297 614 6343 -14512 -5809
766 -5809 8484 -2536 936 6721 5280 -2282 -12164 -4036 7056 750 -3180 9401 7931 -10380
780 -10380 -7930 -741 2392 3727 -4080 10636 8700 -18073 -3228 3298 -4155 6272 -2047 10362
794 10362 8984 -23105 799 6281 -10129 9640 212 6979 8964 -24532 3678 7213 -15264
807 -15264 13812 2886 2117 8936 -24031 4808 7847 -18537 16803 4936 -2948 9959 -22153
820 -22153 3569 8454 -18992 18493 5579 -6924 10893 -19754 1120 9128 -17736 17942
832 17942 6489 -9150 10936 -17443 -1031 9902 -16002 16384 7129 -9833 9279 -15232
844 -15232 -2347 10027 -13851 13767 8405 -9843 6338 -11857 -2583 8291 -10880 11675
856 11675 8977 -9446 2892 -8048 -2440 5596 -7629 10185 8364 -8866 150 -4496 -2580
869 -2580 2224 -3037 9226 6152 -7017 -1890 -1723 -2609 -929 1323 7946 3292 -4215 -3678 -968
884 -968 -1724 -3521 4883 6572 -297 -952 -4890 -965 -176 -5850 7746 6448 -3681 1991 -5686 -1547
900 -1547 1941 -8006 9381 6278 -6638 4980 -5925 -3310 4297 -8786 10185 6090 -9600
913 -9600 8137 -5614 -5918 5968 -8751 10352 5951 -12098 9775 -4789 -8044 8120 -8516
926 -8516 8774 6868 -12712 10484 -5017 -9514 10581 -7809 6058 7675 -11897 10037 -5083
939 -5083 -11184 12138 -6470 3896 8195 -11579 8636 -3516 -11187 11726 -5797 2440 9526
952 9526 -11252 5692 -1815 -9856 10971 -5155 855 10201 -9704 3660 -1242 -9672 10238
965 10238 -3143 -595 9197 -8154 2427 4 -9256 8125 -749 -622 8234 -7538 735 1787
979 1787 -7857 5889 15 -653 7387 -5925 -1367 1396 -5731 5076 1101 -1180 5760 -3925 -1886
994 -1886 628 -5166 3819 2862 -1340 3394 -2795 -1834 808 -3995 1874 3333 -23 1956 -2142 -2943
1010 -2943 647 -1697 1001 2569 111 1520 -803 -3219 -789 -143 1479 2665 229 -12 17 -2629
1026 -2629 -1384 335 586 2726 1157 -1298 -719 -2188 -946 1113 -46 1900 1809 -1216 -875 -2287
1042 -2287 -1291 2136 489 1497 1732 -1550 -320 -1695 -1687 1821 935 1550 1144 -2192 -537 -1137 -1259
1059 -1259 1679 890 1123 1478 -2039 -1242 -848 -1092 2028 991 741 1130 -1541 -1252 -772 -733 1567 1267
1077 1267 661 519 -1614 -967 -476 -385 1458 1017 566 377 -1369 -1248 -455 -241 1460 1301 365 -188 -1387
1096 -1387 -1323 -295 26 1228 1124 446 -144 -1335 -1057 -132 294 1188 846 193 -187 -952 -1081 -354 465
1115 465 1088 1063 -68 -373 -783 -869 -272 173 871 1000 273 -804 -944 -564 419 250 347 478 264 -158
1135 -158 -1007 -623 -130 487 1013 401 -63 -49 -424 -511 -280 209 1271 422 136 -609 -527 110 -199 -26 338
1156 338 481 472 -408 -1055 -231 -142 295 336 123 705 73 -553 -218 -1103 287 866 -99 518 -246 -432 440
1177 440 -1293 -310 841 -70 1303 -410 -976 579 -1663 -23 801 -450 1803 -33 -1168 254
1193 254 -1894 275 1497 -1055 1608 558 -970 593 -2613 70 2399 -1115 1793 434 -1792
1208 -1792 1158 -2621 -530 2437 -1216 2372 927 -2883 872 -2155 -678 2895 -1422 2468 1338
1223 1338 -3021 724 -2425 -659 3648 -1294 1671 1628 -3451 842 -2363 -1133 4166 -860 1547
1238 1547 1646 -3905 310 -1449 -1212 3888 -590 1092 2165 -4103 -834 -640 -915 3782 -261 834
1254 834 2199 -3847 -1505 -21 -930 2906 1368 154 1546 -3396 -2395 1230 -641 1679 2452 -194
1270 -194 761 -2747 -3452 1811 275 369 3693 -269 -728 -1567 -4134 2140 1410 -1000 4613 -383 -2287
1287 -2287 -222 -4453 2194 2336 -2417 5858 -236 -4088 1429 -4804 1897 3737 -3797 6426 165
1302 165 -6336 2952 -4675 844 5234 -4868 6554 783 -8507 4298 -4093 -246 6686 -5868
1316 -5868 6701 1291 -10495 5819 -3188 -1993 8081 -6196 5821 1993 -11790 7074 -2227
1329 -2227 -3824 9298 -5912 4353 2800 -12778 7737 -1124 -5383 10681 -5292 2274 3459
1342 3459 -12778 7589 -88 -6586 11386 -4547 192 4008 -12323 7063 1103 -7203 11496
1355 11496 -3887 -1448 4699 -11441 5920 2480 -7417 10619 -2781 -2733 4861 -10412 4750
1368 4750 3673 -7311 9214 -1202 -3573 3623 -8669 4403 4166 -7442 7628 870 -4638
1381 -4638 1603 -5953 4205 3305 -6904 7134 2275 -6279 112 -1938 2981 982 -4577 6924
1395 6924 2034 -8030 -405 2211 724 -1558 -750 6321 243 -7539 186 4505 -1974 -2539 3767
1410 3767 3672 -2345 -4982 774 4639 -3823 -2367 7660 231 -4518 -1071 -157 3761 -3563 -2180
1425 -2180 9508 -2662 -5008 2761 -2455 2564 -1531 -2595 9654 -4584 -5198 5596 -4575 1813
1439 1813 773 -3393 9525 -4846 -5689 7672 -5760 1284 2587 -5019 9901 -4391 -6660 9229
1453 9229 -6421 490 4536 -5985 8778 -3627 -7284 10043 -7029 -850 6602 -6107 7317
1466 7317 -2790 -7231 10400 -6965 -1655 7891 -6610 5493 -1171 -7242 9183 -5946 -2035
1479 -2035 8185 -6663 4301 828 -7474 7511 -3978 -2750 7517 -5662 3502 1776 -7315
1492 -7315 6345 -1916 -3731 6180 -3268 2104 1034 -6399 5811 -442 -5046 5023 -388 287
1506 287 -114 -4187 4492 -551 -5170 4649 2061 -2509 -586 -814 2557 -1371 -4153 4853 2800 -4604
1522 -4604 -265 2732 -680 -2390 -1268 3545 2495 -5123 247 4793 -3903 -2323 2148 1446 1690
1537 1690 -4282 546 5709 -6397 -1876 5178 -1490 1106 -2063 -204 5566 -7484 -1412 7427
1551 7427 -4418 1222 688 -1793 5485 -7519 -1161 8735 -6562 1371 3194 -3818 4934 -6305
1565 -6305 -1189 8970 -7769 1838 4908 -6166 4154 -4336 -1739 8790 -8082 2244 6406
1578 6406 -7918 3945 -2218 -2973 8291 -7227 2071 6644 -8747 3894 -517 -4289 7307
1591 7307 -5218 1466 6178 -9019 3727 657 -5246 7317 -3811 175 5785 -8305 2745
1604 2745 1339 -5495 7124 -2291 -807 5629 -7132 1432 1440 -4827 6218 -1282 -1631 5156 -5541
1619 -5541 296 2152 -4333 4842 -356 -1817 4177 -4939 -871 2591 -3429 3248 512 -1882 3496
1634 3496 -3790 -1477 2818 -2392 2188 1389 -1812 1990 -2386 -1425 2291 -1283 1455 1944 -1364 682
1650 682 -1625 -1591 1816 -321 475 1912 -997 -479 -859 -1670 1404 786 -187 1696 -227 -1325 -207
1667 -207 -1169 342 1536 -368 1486 192 -2252 226 -423 -184 1802 -793 878 625 -2810 563
1683 563 17 -547 2290 -448 556 801 -3073 559 244 -1360 2748 -309 -353 715 -2822 912 541
1700 541 -1468 2441 -86 -853 1100 -2429 509 760 -1302 2446 -122 -1118 1109 -1961 217 1111
1716 1111 -1316 1923 -85 -1249 1124 -1821 -13 1216 -1093 1593 261 -1511 794 -1190 -61
1731 -61 1417 -692 996 530 -1181 337 -897 -143 1064 -585 666 256 -1191 228 -546 -387 961
1748 961 -161 367 299 -914 125 -360 -307 732 -20 286 12 -942 60 -197 -84 600 -39 121 126 -431
1768 -431 -210 -120 -49 412 153 119 -25 -339 138 -94 -56 297 348 287 -93 -189 -135 -98 201 119 200 204 -309 -164
1792 -164 -243 -127 -66 89 379 304 61 39 -281 -456 -32 96 430 404 56 145 -481 -290 -170 22 456 472
1814 472 45 -16 -460 -464 -108 -308 528 669 307 -200 -441 -790 9 -3 421 484 299 -124 -453 -740 -356 191
1836 191 792 779 295 -73 -794 -956 -402 181 876 1139 278 -256 -756 -1140 -338 362 775 952 47 -418
1856 -418 -593 -1159 -89 554 1061 1032 -5 -524 -820 -1300 -118 519 1003 1195 -227 -650 -1089 -1335 193
1875 193 1010 1366 1374 -204 -771 -1168 -1426 83 985 1220 1155 -175 -1051 -1331 -1332 314 1303 1417 988 -289
1895 -289 -1248 -1276 -1268 568 1639 1188 956 -165 -1459 -1274 -1071 384 1900 1180 754 -9 -1721 -1171 -813
1914 -813 353 1806 1072 370 7 -1841 -1432 -374 347 1951 1098 59 79 -1870 -1720 377 149 1838
1932 1838 1265 -592 -39 -1896 -1860 756 153 1505 1646 -1020 -143 -1654 -2040 1321 156 1189 2046
1949 2046 -1511 -119 -1377 -2380 1875 631 817 2079 -1953 112 -966 -2774 2442 796 365
1964 365 2162 -2063 -37 -621 -3058 2899 1119 -685 2335 -1990 -545 -316 -3097 3580 1064 -1319
1980 -1319 2666 -1571 -1158 -150 -2544 3567 896 -2165 3102 -1515 -2319 548 -1536 2988 732
1995 732 -2320 3048 -1718 -2621 1389 -1096 2198 612 -1875 2994 -1968 -2908 1990 -484 1402 787
2011 787 -1646 2372 -1644 -2870 2469 -64 505 906 -1298 1680 -1403 -2524 2496 581 -53 748
2027 748 -690 738 -1464 -1992 2427 1021 -898 718 76 -405 -1381 -1046 2237 969 -1449 631
2043 631 884 -1659 -1234 296 1574 755 -1324 463 1020 -2791 -682 1680 84 887 -302 180 1160
2060 1160 -2957 -243 2676 -1100 1117 295 -1141 1011 -2626 -131 2764 -1865 1890 1023 -2710
2075 -2710 1535 -1845 -793 3117 -2186 1873 1111 -3640 2354 -1426 -1643 3945 -1812 1218 1226 -3985
2091 -3985 2931 -1324 -2688 4893 -1562 -225 1629 -3653 2893 -1485 -2938 5834 -1706 -1554 2344
2106 2344 -3217 1846 -1168 -2420 6046 -1936 -2561 3365 -2997 508 -446 -1787 5660 -2287 -2628 4488
2122 4488 -2772 -736 749 -1218 4571 -2263 -2484 4727 -2958 -1766 2051 -499 2790 -1856 -1747
2137 -1747 4416 -2757 -2279 3078 -277 830 -1090 -1217 3331 -2645 -2354 3693 -89 -671 40 -161
2153 -161 1781 -2210 -1873 3844 -182 -2148 1246 268 221 -1497 -790 2981 -387 -2495 2078 680
2169 680 -1628 -236 -52 1770 -20 -2639 2307 835 -2725 1345 348 4 783 -2387 2192 1309
2185 1309 -3735 1942 721 -1433 1588 -2075 1033 2003 -3979 2214 1189 -2883 2258 -1959 383
2200 383 2812 -3899 2252 1546 -3522 2686 -1584 -594 3362 -4166 1837 1891 -4360 2748 -726 -1368
2216 -1368 3713 -3846 1246 2643 -4795 2628 -177 -1838 3952 -3443 633 2931 -4909 2416 719
2231 719 -2406 4010 -2836 126 3061 -4958 1906 1662 -2642 3510 -2162 -332 2931 -4894 1580
2246 1580 2091 -2927 2828 -1156 -887 2662 -4310 1250 2654 -2891 2407 -280 -1301 1930 -3623
2261 -3623 846 2671 -2915 1861 560 -1580 1400 -2409 597 2612 -2520 1394 1132 -1999 470
2276 470 -1479 397 2201 -1849 1080 1250 -1992 -128 -310 12 1623 -1035 538 1274 -1959 -503
2292 -503 536 -86 938 -35 317 979 -1711 -1079 1141 -287 302 693 -42 621 -1398 -1069 1326 -315
2310 -315 -127 1768 -580 -22 -592 -1314 1353 -289 -564 1910 -748 -231 -124 -1755 1211 -160 -763
2327 -763 2099 -664 -626 447 -1899 1171 433 -949 2168 -492 -974 1083 -1878 948 797 -1291
2343 -1291 2219 -178 -1107 953 -1473 544 772 -1564 2141 -54 -1463 896 -1145 284 964 -1233
2359 -1233 1993 -100 -1766 1441 -741 -451 993 -939 1332 36 -1753 1425 -771 -783 1127 -405
2375 -405 974 121 -1260 1230 -663 -1044 1087 -499 730 484 -908 809 -595 -960 1122 -141
2391 -141 308 593 -647 379 -456 -847 516 -24 355 756 -502 29 -230 -874 393 142 293 602
2409 602 -28 -134 -329 -633 91 463 224 527 27 -445 -289 -687 101 526 128 527 456 -678 -384 -624
2429 -624 -151 681 308 535 221 -648 -561 -120 -273 610 511 415 330 -831 -641 -183 -184 718 639 231 72 -657
2451 -657 -712 -305 -471 701 701 167 246 -521 -561 -216 -296 557 833 247 275 -580 -795 -134 -194 592 942 -12
2473 -12 91 -599 -900 -242 -154 519 819 66 24 -602 -899 -145 16 513 883 153 -168 -438 -699 0 164
2494 164 351 628 64 -324 -495 -694 -41 87 327 552 -71 -203 -492 -463 136 377 358 445 -95 -267 -379
2515 -379 -433 19 569 303 193 -49 -250 -368 -150 124 188 266 -42 -284 -192 -204 -150 347 255 141 -120 -148 -373
2538 -373 10 59 185 174 13 -157 -441 -258 206 497 435 139 -291 -362 -135 -96 -47 480 215 -63 -316 -418
2560 -418 -169 85 329 480 222 -123 -504 -576 -62 13 288 702 117 -214 -504 -854 -215 191 477 725 4
2581 4 -506 -445 -807 -229 293 628 787 6 -603 -640 -791 -91 500 673 924 -148 -605 -602 -949 32 589 645
2603 645 882 -160 -915 -671 -829 53 817 551 850 -297 -925 -602 -779 157 1018 619 623 -382 -803 -473
2623 -473 -935 352 1380 603 702 -302 -1143 -296 -831 110 1238 529 482 -378 -1128 -504 -565 481 1666
2642 1666 451 253 -57 -1079 -388 -227 343 1642 500 117 -164 -1315 -594 -115 598 1342 479 71
2660 71 -176 -1320 -543 161 333 1192 564 -258 -441 -1129 -541 223 238 1095 717 -368 -399 -837 -568 339
2680 339 465 715 634 -445 -537 -540 -512 522 683 530 472 -384 -392 -234 -1042 469 1098 -13 268 -522 -683
2701 -683 118 -891 392 983 -90 415 -291 -710 467 -752 351 1229 -742 234 -54 -1061 480
2718 480 -526 380 1422 -1013 215 160 -1125 604 -535 151 1389 -1238 265 523 -1145 516
2734 516 208 -142 1307 -1188 -50 822 -1380 583 300 -408 1273 -1052 -159 998 -1462 757 768
2751 768 -995 832 -829 -75 1167 -1441 561 1095 -1209 569 -422 -391 978 -1194 588 1153 -1346
2768 -1346 634 -329 -721 1186 -783 432 1006 -1409 359 151 -965 1140 -240 84 780 -1138
2784 -1138 -58 232 -939 969 203 72 920 -1024 -441 442 -728 651 394 -233 575 -776 -699 555
2802 555 -425 173 775 -469 333 -470 -1138 687 -25 -52 1261 -155 12 -130 -1277 474 329 -597
2820 -597 1403 -33 -570 189 -1230 552 538 -711 1815 -106 -1097 600 -1038 187 649 -1055 1672
2837 1672 -30 -1753 999 -820 -218 1129 -842 1510 190 -2079 1267 -620 -724 1362 -547
2852 -547 1108 194 -1969 1366 -576 -1247 1789 -533 688 428 -2029 1515 -496 -1454 2128 -435
2868 -435 59 555 -2048 1310 -232 -1642 2443 -405 -472 1017 -1603 984 -228 -1495 2495 -270
2884 -270 -937 1281 -1197 409 12 -1140 2289 -368 -1215 1708 -972 -467 478 -803 1794 -630
2900 -630 -1111 1757 -933 -982 948 -429 1004 -157 -695 1631 -1217 -1232 1039 -379 182 402 -340
2917 -340 996 -1027 -854 1360 -488 -407 911 -117 190 -465 -570 965 -489 -570 999 -274 -338 64
2935 64 -616 224 -280 -152 1193 -210 -354 748 -754 -242 476 -390 711 66 -309 602 -895 -453
2953 -453 846 -507 298 518 -369 296 -816 -557 936 -645 278 1089 -840 112 -168 -512 912 -718
2971 -718 229 1515 -1015 65 288 -919 881 -402 133 1293 -1073 141 190 -1388 816 -219
2987 -219 -340 1168 -879 -139 610 -1261 677 91 -24 1424 -937 -460 550 -1087 507 173 -269
3004 -269 1535 -737 -580 780 -898 139 508 -190 813 -980 -600 835 -1081 -106 1013 -61
3020 -61 248 -496 -423 570 -1175 38 1425 -324 -75 -260 -436 337 -805 172 1153 -561 -56 269 -335
3039 -335 -163 -483 166 1196 -574 -78 397 -636 -138 184 58 738 -215 -218 229 -714 -366 270 -59 247
3059 247 53 -164 118 -468 -177 482 99 209 227 -637 -177 -164 -120 435 -140 110 259 -630 25 -62 -360
3080 -360 385 180 -328 212 -354 -124 98 -388 523 350 -294 30 -463 71 185 -351 456 320 -540 -83
3100 -83 -246 -321 293 -20 304 14 -512 111 -83 -269 382 -78 310 90 -600 50 25 -74 617 -2 137
3121 137 149 -513 233 -26 -218 569 -194 -128 -65 -541 -22 30 -36 522 28 -87 51 -512 -92 199 112 377
3143 377 154 -150 -242 -439 -90 228 110 428 256 -128 -226 -401 -68 480 196 518 154 -300 -432 -477 -63
3164 -63 368 432 427 -2 -499 -137 -321 -192 395 395 258 10 -181 -399 -361 54 196 304 89 30 -282 -393 -254
3187 -254 -82 350 239 265 -174 -368 -179 -269 82 365 470 -93 -186 -383 -337 60 224 458 140 24 -259
3208 -259 -415 -340 48 417 274 55 -45 -250 -279 -205 191 203 164 89 22 -336 -117 -117 196 170 76 90 -112 -304
3232 -304 -63 -31 227 262 259 -11 -125 -51 14 53 114 111 40 -53 -396 -141 -11 172 356 194 -85 -55 -138 -151 106
3257 106 50 63 137 -41 -165 -216 108 254 420 7 -48 -362 -207 -165 -56 391 257 85 7 -192 -325 14
3279 14 115 443 180 88 -179 -420 -388 -86 234 524 477 50 -165 -500 -218 11 306 558 405 -65 -237
3300 -237 -462 -189 80 325 605 511 -21 -482 -248 -254 170 434 380 230 -210 -473 -505 -159 206 506 403 172
3322 172 -418 -394 -307 -156 208 620 451 -115 -463 -552 -355 86 302 595 232 -47 -571 -467 -105 -2 167
3343 167 877 167 -310 -290 -679 -120 -52 462 873 216 -391 -371 -539 36 235 344 546 -92 -433 -451 -578
3364 -578 -89 432 464 550 -124 -550 -306 -398 33 270 545 782 -128 -759 -135 -764 0 507 412 251 -199
3385 -199 -744 -261 -396 31 720 237 331 -334 -693 14 -214 59 918 231 310 -71 -742 -220 -331 32 1005
3406 1005 330 69 -165 -827 -209 -22 190 728 45 -153 -194 -669 -191 320 -68 765 52 -398 -90 -884
3426 -884 -51 429 185 611 330 -471 -126 -692 -334 440 146 526 169 -512 -422 -573 -271 458 -35 367
3446 367 276 -564 -442 -35 -75 285 213 241 506 -732 -445 171 -324 214 466 201 93 -707 -308 341 -460
3467 -460 14 648 -122 61 -700 -97 749 -447 199 901 -274 -346 -205 -146 663 -556 201 1073 -668
3486 -668 -205 162 -342 162 -392 446 1112 -881 -338 443 -377 -29 79 644 494 -1041 -160 650 -765
3505 -765 -66 373 218 308 -1116 61 743 -978 387 651 -119 72 -395 30 229 -830 333 641
3523 641 -461 -48 -250 18 364 -733 323 735 -614 -24 37 -267 194 -416 233 562 -709 -32 53
3542 53 -282 137 -89 298 538 -638 -102 498 -255 23 125 322 530 -591 -125 280 -437 -96 375 -82
3562 -82 330 -436 -28 462 -605 49 608 -88 -67 -130 -201 -153 -486 414 438 -390 -239 43 -213 212 -128 38
3584 38 545 -469 9 165 -472 57 366 -77 62 -188 36 261 -598 220 367 -485 142 57 -88 -25 -608
3605 -608 634 417 -607 354 193 -474 28 -62 238 -22 -384 593 406 -632 158 131 42 66 -256 611
3625 611 215 -914 532 155 -454 184 -140 509 -120 -482 390 175 -527 269 96 22 44 -342 335 -30
3645 -30 -725 506 235 -186 325 -209 167 -18 -612 403 362 -409 196 -162 118 41 -537 554 297 -357
3665 -357 165 -109 64 67 -539 148 202 -407 273 322 -178 -280 -283 264 126 -353 260 264 -375 -17 -243 42 338
3688 338 -370 328 296 -318 -146 -16 43 220 -158 315 230 -522 15 -80 -209 250 55 372 190 -462 -267
3709 -267 314 -104 10 163 103 126 -509 -293 119 -43 170 330 -99 -22 -517 -479 211 -57 224 216 -29 81
3731 81 -379 -428 90 65 317 489 -202 -82 -320 -417 328 -50 214 545 -162 -244 -317 -295 213 -13 94 539
3753 539 -254 -353 -255 -436 230 195 245 446 -201 -439 -103 -241 246 221 303 408 -214 -368 -72 -213 120 293
3775 293 212 330 -202 -456 83 -117 255 468 314 48 -183 -693 -155 -42 116 578 113 -7 -215 -470
3795 -470 35 206 225 371 178 -42 -373 -574 38 155 224 330 233 -13 -262 -239 -123 192 209 351 128 -189
3817 -189 -248 -279 147 308 346 518 -176 -282 -303 -71 -58 333 209 190 -99 -206 -263 -392 83 65 371 132 98
3840 98 -477 -320 41 208 305 274 222 -356 -457 -383 152 72 328 319 149 -143 -239 -257 104 189 254 177 65 -136
3864 -136 -455 -14 -3 320 380 159 -137 -282 -437 -114 121 125 377 56 -215 -183 -345 -107 158 142 85 119 -268
3887 -268 -299 -401 -93 321 244 36 -55 -226 -306 -160 -235 219 367 117 -148 -310 -284 -2 219 237 -27 -31 -118
3910 -118 -123 -140 74 71 141 250 -26 67 -207 -275 42 255 -2 -39 -69 -159 -178 -168 107 385 220 210 -52 -220 -174
3935 -174 67 77 193 169 90 26 -82 -345 -120 162 350 68 -78 -49 -250 -65 -11 180 355 117 6 -228
3957 -228 -267 86 216 113 235 -44 -8 48 -276 -35 170 265 78 -11 -216 -332 -98 140 308 308 148 -96
3979 -96 -283 -471 97 41 77 203 17 -186 -62 -337 -190 22 219 380 11 -12 -403 -314 -64 207 316 -161
4001 -161 151 -271 -262 -196 72 212 183 169 -49 -258 -212 -65 -37 94 279 117 -156 -361 -307 13 111 228 297
4024 297 18 31 -274 -275 -60 33 253 345 -204 -198 -229 -208 -13 -20 67 163 59 -165 -251 -57 311 354 159 293 -76
4049 -76 32 -329 -33 85 277 48 155 47 -268 -188 86 47 192 75 132 -95 -494 -372 -76 159 333
4070 333 109 129 -152 -250 134 97 -12 87 30 3 3 -397 38 80 91 218 237 -26 -184 -96 6 -87 -112 422 189
4095 189 -14 -117 -19 -103 127 85 372 89 -135 83 -264 -79 102 88 130 17 -334 103 204 -115 -114 126
4117 126 200 -37 -108 152 26 112 165 79 94 -55 -372 10 -31 -176 156 74 -30 -66 -23 66 200 -76 194 -62
4141 -62 -145 63 -20 147 32 -155 83 69 -176 226 106 33 -132 -36 71 44 -10 106 77 40 171 -225 -115
4164 -115 129 -98 65 -45 -75 131 -33 -124 23 -109 71 38 -62 150 -113 -215 7 -84 -242 5 14 233
4186 233 -208 -93 243 11 -8 122 115 -126 -181 -123 94 -134 -86 177 84 -82 -107 -209 113 -67 -193 161 -245
4209 -245 -219 -41 -202 58 38 130 165 -66 -137 170 -41 148 115 168 10 -94 -108 98 -108 27 243 -111 -97
4232 -97 -86 -223 118 9 94 239 -304 -343 18 -291 -61 -197 101 219 -82 -79 1 -107 -338 27 123 175 189
4255 189 20 -27 -60 64 92 73 159 -176 135 -15 -189 -88 80 16 191 -201 -285 -229 -122 -60 35 27 5 -45 -260
4280 -260 96 99 -115 97 -96 293 -230 -110 -98 -206 113 383 82 -59 -51 -362 -66 -1 82 244 60 -205
4302 -205 -52 -97 -8 172 75 105 11 -39 -121 -368 6 102 164 138 2 -154 -3 -222 6 164 151 28 35 -280
4326 -280 70 74 61 135 61 131 56 -421 -83 -212 -19 217 37 100 -170 -198 -32 153 -167 125 101 205 -82
4349 -82 -422 -48 129 291 265 331 157 -200 -114 32 -71 -51 407 168 -348 -338 -137 -267 -124 2 169 241
4371 241 -322 -134 -250 -50 -55 196 376 21 -435 -151 -61 -195 -19 210 267 -216 -271 -138 103 -78 250 226
4393 226 31 -266 -86 -222 -183 -178 123 162 179 -378 -229 53 -45 156 157 203 118 -98 -85 -136 -36 286 294 161 97
4418 97 92 -166 -156 63 76 183 135 -58 -37 -188 -107 51 250 53 217 -108 -361 -174 -90 195 135 297 31
4441 31 -155 -224 21 -247 -8 262 115 173 -44 -258 10 -19 123 261 30 -47 -213 -98 -124 22 213 230
4463 230 201 44 -297 -71 7 48 150 385 159 229 -245 -97 -25 123 195 94 -43 79 -178 -300 104 -8
4485 -8 266 129 -95 -146 -205 -127 105 79 302 259 93 -29 -166 -126 -32 359 117 98 -77 -36 -84 90 18 -13 151
4510 151 87 -125 -187 -247 180 151 153 318 69 -287 -177 -124 197 171 193 65 170 -117 -46 206 62 4 234 -209
4534 -209 -71 -10 46 -45 -61 203 87 147 -69 -171 105 169 37 206 92 -90 -156 -52 77 10 173 -114 -146
4557 -146 -8 -68 5 112 -4 102 70 -38 -61 -24 -53 244 160 129 57 -117 18 -64 -19 47 -24 239 81 -148
4581 -148 95 -59 76 -51 137 -54 118 -101 45 -53 -132 -44 -79 -23 -74 -87 -149 25 -5 143 109 -70 -78 -250
4605 -250 82 79 60 57 32 -88 -145 22 195 125 -60 22 79 -26 -29 -49 191 7 87 26 107 149 -260 -69 -24 24
4631 24 191 273 66 -182 -128 -62 -78 224 21 14 28 -254 -73 53 9 -6 297 -5 -102 -123 -271 33 90 177 49
4656 49 -104 -33 -217 -170 160 -76 144 -81 -57 -33 58 -224 -38 59 17 -7 -115 85 -61 -72 172 29 188
4679 188 -125 -77 104 58 90 119 33 265 105 -358 -21 38 58 3 -27 -119 -47 76 -43 130 29 153 -142 50
4703 50 -12 -161 -131 17 -102 39 111 -46 -232 -164 -46 161 101 180 -35 -75 -252 -55 -118 152 118 73 -16 -143
4727 -143 12 47 53 91 22 -1 -62 -33 -29 53 -17 224 264 -191 -110 -42 -136 -47 76 233 27 98 -38 -208 -194 -51
4753 -51 -6 -24 300 -125 -21 51 44 -136 142 5 29 32 -98 20 2 146 206 223 145 -76 -53 -52 20 132 137 189 243
4780 243 -3 -252 -121 54 -202 127 211 56 27 -276 44 -9 -42 -144 241 65 -15 15 -161 -4 130 122 -105
4803 -105 -33 -131 -113 -66 37 121 72 -115 -40 -23 1 166 -28 33 146 -61 -8 -226 -158 -10 126 134 -64 -187 -177
4828 -177 20 21 87 142 34 -84 -204 1 -116 -129 243 34 50 89 -31 -216 -256 -93 71 167 -40 106 94
4851 94 -72 22 237 352 -61 -121 53 -37 -126 123 255 -140 -150 -112 -127 -151 -183 221 -48 95 75 -93 110 -207
4875 -207 -168 170 -15 6 202 51 -30 -160 -15 152 107 1 30 59 -22 -138 65 168 316 52 -96 -78 -112
4898 -112 -67 202 139 -148 -72 -139 41 -126 -159 39 222 -2 123 10 -139 -42 -60 139 218 53 164 -134 -338
4921 -338 -14 181 18 134 -26 160 -77 -71 -52 181 -63 55 -52 50 -194 -275 188 -153 45 128 296 79
4943 79 -60 19 164 203 332 85 40 -212 -147 104 208 -133 202 293 -12 -286 32 19 106 223 282 36 -28
4966 -28 -134 30 210 -186 118 413 -78 -118 -36 -108 98 -9 146 62 32 -227 -6 -74 -107 306 29 28 -142
4989 -142 -50 -30 -208 3 152 205 122 -158 58 -199 114 48 164 300 -57 -225 -105 133 56 77 119 74 -2
5012 -2 -195 158 21 -50 41 323 176 84 -146 -97 35 -92 39 103 -78 -142 -285 -174 -74 -9 160 113 -102
5035 -102 -172 -203 202 -144 11 319 -97 -143 -39 -129 -63 -108 196 237 -51 -265 -141 -69 -19 141 57 143 29 -28
5059 -28 106 -151 -5 -108 -30 13 -251 31 6 -137 -14 154 240 123 56 12 39 -270 9 63 113 16 110 18
5083 18 77 -39 28 164 57 148 -141 -156 -61 47 173 45 -100 -75 137 -105 -128 58 88 203 129 -145 -115 -205
5107 -205 -71 -52 -21 71 -2 93 -205 -28 -84 37 18 228 54 -29 -200 -92 -78 48 144 167 -41 -262 -54 44
5131 44 33 116 60 64 -175 -104 -63 -274 35 -56 244 171 -28 -138 84 -18 14 11 70 -208 69 -16 -88 58 -74
5156 -74 93 -54 25 56 271 176 276 98 29 111 -138 37 -182 -100 18 153 169 301 -9 -177 81 152 305
5179 305 23 -166 -79 -155 -3 -75 70 152 292 3 40 -24 -183 -136 -20 109 10 56 -139 -66 174 114 65 287
5203 287 58 -38 22 -267 79 42 40 -30 -66 35 63 -154 301 -3 21 273 -207 -65 -16 -61 -85 301 64 169
5227 169 -41 -305 -314 78 18 189 -36 -24 36 -338 -266 182 39 -88 -137 -70 -50 -63 -51 -163 116 29 -144 251
5251 251 -45 -172 52 53 166 27 4 -81 -137 -102 1 116 185 12 157 -22 -67 93 -53 112 111 106 -123 153
5275 153 67 87 144 160 208 -14 -156 -90 -118 -12 13 70 -65 8 -63 -214 49 112 -15 -7 120 126 -63 -64 -96 7
5301 7 117 -10 117 -167 -46 -87 -28 53 -40 -77 159 -12 -127 -62 -95 -104 -91 -1 37 3 36 -101 -135 19 -7 225
5327 225 160 -118 40 -52 -44 112 -38 130 -115 -152 -276 -138 94 -243 -148 350 15 -202 -196 -153 -10 53 -199
5350 -199 22 33 -151 -13 -9 76 79 -114 -17 40 28 40 85 125 29 1 93 -33 68 131 120 -125 -22 139 -127 89
5376 89 -4 -121 39 138 134 -81 84 -203 -161 265 -48 -54 -119 -15 -81 -21 27 103 66 97 -161 -170 17 1 -195 -27
5402 -27 176 -25 69 -46 97 -96 -14 104 286 -3 -35 -89 -50 19 -81 236 88 -124 -24 -94 205 -53 181
5425 181 41 158 -8 -45 -169 -4 -85 329 16 -55 75 -119 -31 -83 2 -60 62 -14 86 67 -11 -122 -81 253
5449 253 80 -12 -106 70 -120 120 59 80 -63 -93 -75 -170 -252 -170 9 15 -18 104 -186 -35 160 -14 58 51 135
5474 135 133 -61 -28 -156 126 -62 64 210 -86 -87 -9 55 155 101 236 160 -103 -167 -163 -30 173 145 -108 -167 -160
5499 -160 -191 -107 130 98 49 72 -30 -141 -26 -43 108 153 -28 106 -88 -98 -62 95 93 0 73 -46 -248 -155 -148
5524 -148 -187 226 62 145 43 -184 34 -63 226 -24 192 9 90 -210 169 164 -23 164 143 39 -113 -84 -118
5547 -118 -32 -79 -148 176 -18 63 -177 -92 62 -298 144 114 34 -8 -156 0 63 46 -8 -64 -92 57 25 41 37 165
5573 165 115 30 16 -21 5 135 244 85 48 -4 -311 -27 -104 310 -50 124 -67 203 -182 -34 -115 70 109
5596 109 158 32 -122 -94 -113 -219 65 240 85 -65 -170 -190 29 45 -69 186 102 -49 -234 118 -59 -75
5618 -75 144 27 -186 -87 27 96 -264 -119 136 62 -116 -31 -113 4 59 68 57 35 164 -55 0 29 29 35 12 6 158
5645 158 -61 21 22 -16 9 157 140 -85 43 -163 88 143 -63 151 33 -50 26 -24 34 131 73 147 -73 19 -77
5670 -77 -21 249 -62 2 72 -54 -209 -30 55 75 -12 -72 17 -167 51 68 -55 44 165 87 -25 25 -272 -82
5694 -82 -19 -135 102 162 10 161 171 -157 25 31 140 27 105 -238 -51 111 128 -114 174 -78 13 58 -80
5717 -80 -60 5 21 98 -104 41 -60 -74 222 -9 -47 205 -92 -20 -129 -149 -16 50 42 62 -56 139 -186 71
5741 71 27 189 118 26 -155 -215 87 97 43 111 -77 91 40 -147 44 181 223 231 -6 174 -81 113 146 45
5765 45 -25 -73 -82 -139 152 -207 204 34 -89 15 24 -52 42 115 61 157 108 21 40 -134 -209 -4 118 134 -5 -105
5791 -105 -52 -262 124 37 149 182 16 18 -255 -212 139 -95 -181 33 -125 -7 29 -249 39 139 43 172 -40
5814 -40 86 39 -115 108 165 222 -69 -205 -30 -64 63 50 159 133 -32 -27 -188 2 -71 -131 228 -75 99 122
5838 122 -77 -190 -111 311 26 -33 47 35 -137 -58 109 197 138 -168 158 82 -108 -79 171 56 120 -9 -112
5861 -112 -100 -343 56 8 135 -4 38 -70 54 46 -64 10 -31 264 -10 -218 -107 55 49 -3 117 -66 128
5884 128 -105 -164 41 -61 273 231 -137 112 -82 -24 126 -8 296 198 -208 25 38 -68 78 63 169 -9
5906 -9 -14 -124 -105 75 69 5 -55 234 -216 172 65 -58 48 -5 99 143 8 -40 -118 -40 37 82 -18 -109 -34 130
5932 130 98 -34 122 326 -38 -45 104 -80 39 84 127 88 -102 -20 -6 -136 -60 101 138 -28 11 157 -7 -146
5956 -146 -116 178 130 -25 -38 -46 -89 -30 -88 78 215 145 -24 -11 81 -144 -8 31 63 64 -55 -122 22 66 -80 0
5982 0 28 -38 -126 -50 -49 -41 258 132 -46 -46 -69 -55 93 167 12 -35 150 12 46 4 -31 219 175 129 -8 -96 -75 170
6010 170 6 -49 154 74 3 -248 -149 28 139 149 -131 58 -85 -155 -185 10 25 108 -12 -282 -7 17 48 -222
6034 -222 117 127 33 36 34 -150 26 29 77 94 208 30 -192 -29 -254 -5 -9 -20 -264 -104 -291 -51 105 7 188
6059 188 84 221 15 110 -90 -138 4 -37 -33 -282 -155 -103 113 -53 -18 162 -96 108 -101 56 -142 -65 20
6082 20 16 40 -207 -116 -176 61 87 -151 128 130 -202 -169 34 73 58 -24 -61 -99 -163 -251 -8 93 42 -114 -26 -148
6108 -148 -17 -59 -134 182 84 265 -87 -73 -129 57 18 114 11 132 162 85 -21 -184 -182 159 108 55 -198 -287 -115
6133 -115 -91 178 -4 -141 113 -36 -191 161 -182 -6 -94 -9 128 68 -116 135 138 -31 93 35 -181 -58
6155 -58 -61 -125 -145 52 -8 19 -17 6 -101 -23 30 110 236 152 -161 -122 -20 -22 -13 20 -105 -60 -144 -138 72 24 93 -84
6183 -84 -17 72 -152 8 57 76 130 23 -77 -113 -55 50 171 -66 232 8 -141 104 -219 -112 2 84 100
6206 100 122 -74 93 -143 -129 78 136 254 15 6 185 -193 232 187 -5 104 11 33 -186 -158 -87 43 -9 26
6230 26 81 -235 10 23 122 123 -28 151 118 -169 -17 -111 1 99 9 45 -129 -59 -169 -85 119 13 -74 -63 -94
6255 -94 -92 -120 -85 139 177 88 46 62 -135 57 60 -46 56 -81 -95 -74 90 -214 -137 4 66 90 -32 -127 -67 -122
6281 -122 245 89 39 -72 -242 -330 -50 14 258 146 7 59 -14 -18 -321 -40 57 84 -48 35 13 -4 155 43
6305 43 181 205 -117 64 -65 -135 111 166 155 115 -49 19 -22 -174 261 -52 131 12 -156 78 -58 -17 -64
6328 -64 -11 -172 22 -121 -2 32 112 28 -121 10 146 -146 -191 -130 -49 209 63 68 36 -114 -103 -33 71 229
6352 229 145 149 106 -177 -252 199 -115 -10 144 -55 -67 109 -115 156 30 28 164 -125 -135 137 -46 28 -156
6375 -156 -52 -179 -116 60 111 -67 148 159 149 -11 -221 -67 60 -23 189 -169 -15 -60 -236 -104 21 -5
6397 -5 136 -132 -188 90 -156 133 -105 -10 -4 276 -60 -38 0 -108 52 -19 9 86 -55 -42 72 -89 118 -33
6421 -33 -34 14 -217 -81 -14 129 88 285 87 139 -1 -98 63 0 152 172 -93 41 54 -57 -96 -92 -122 142 -127
6446 -127 65 -21 -49 28 -3 273 -1 -134 113 -77 -84 107 19 46 17 -190 -58 55 102 262 68 2 128 -189
6470 -189 -14 -129 -129 193 15 243 69 -119 -57 29 -198 -51 331 112 -152 -186 -74 87 -153 50 -4 70
6492 70 -19 -54 -238 -174 -57 172 310 17 -237 -255 -144 64 -15 55 12 -120 -130 19 -58 -137 48 145 32 -271
6516 -271 -122 49 53 -92 -69 175 268 -61 -2 25 -238 118 140 -113 53 11 -59 27 -229 20 77 101 26 -83
6540 -83 -160 -81 -3 -2 295 131 -163 29 -241 -72 43 5 172 -54 -131 119 -97 45 -12 35 312 -7 178
6563 178 81 -155 -97 113 -201 35 31 -58 35 21 49 -25 66 52 -67 50 -42 -76 150 -26 89 -29 90 -192
6587 -192 -218 -81 -88 150 -179 9 -219 -66 73 6 -140 147 85 1 -92 -149 -121 -1 219 53 89 91 21 -169
6611 -169 -30 -89 21 105 55 -173 -12 -49 -41 96 -367 40 55 -160 -42 106 -26 11 102 13 38 -15 122 -130
6635 -130 -107 28 -87 126 -4 51 -181 -114 -63 -66 59 -131 -55 65 -5 -108 -160 -59 -40 -26 -16 -74 110 79 -36
6660 -36 -7 184 32 -1 18 -218 -118 -77 -69 -21 -71 -88 -184 -72 125 135 23 34 27 115 49 -85 -24 84 66 40 3
6687 3 9 157 -44 209 -2 -99 189 122 26 165 140 132 6 82 108 -81 -66 -30 -38 -132 19 -188 -8 -72 -119 75
6713 75 187 104 146 -51 -78 111 69 105 -22 173 75 93 -180 15 -79 14 30 -88 43 20 -66 -30 -122 5 57
6738 57 7 60 -49 -183 -181 196 170 261 -86 -31 -58 -70 -8 165 -3 143 -128 23 -6 206 167 -28 79 -80
6762 -80 -88 76 -19 -101 74 48 28 42 192 109 -183 54 7 -103 42 66 -126 -208 -138 42 35 -76 -57 272 -27
6787 -27 -135 253 54 14 17 70 28 -33 -142 77 0 26 198 -72 74 -21 -223 -19 172 -57 31 -121 -81 140
6811 140 -46 46 138 169 133 85 17 -240 -154 189 -121 -130 -58 -92 -78 -139 -14 40 20 -65 56 179 -212 -112 -181 25
6837 25 -58 144 36 74 -85 -37 23 -150 -82 42 58 13 59 70 16 110 111 36 -92 16 -15 -66 5 66 218 103
6863 103 -125 86 3 -185 45 -57 -2 -110 -161 111 -70 109 64 95 25 -131 -98 31 25 187 4 129 -51
6886 -51 71 64 95 -55 -53 128 -14 -275 -127 32 -105 74 77 -28 -186 -100 133 -146 126 4 106 3 -173
6909 -173 -169 51 -12 -77 38 16 93 94 -285 -164 -197 25 78 90 -28 76 -63 50 211 -160 6 -191 85 -189
6933 -189 20 -25 -84 -114 -204 62 22 -2 -131 1 -176 -26 148 -15 42 11 59 69 40 78 44 0 43 -84 -110
6958 -110 40 -23 33 -133 91 -113 -161 -132 -10 138 4 147 -76 166 -22 31 122 119 -57 -114 16 71 -68
6981 -68 -3 107 -109 92 -162 -53 -25 12 31 -94 -2 -35 182 137 44 69 -121 18 11 -27 -120 35 -132 47 -61
7006 -61 54 -61 -17 -90 -104 -89 65 37 41 -5 92 -121 -58 -43 -101 7 58 85 24 -141 186 -15 -111 29 105 102 -154
7033 -154 -158 95 69 157 -35 27 228 -292 -109 49 -16 179 160 18 -57 -220 86 6 84 25 124 10 -75 -78 -17
7058 -17 39 42 -136 66 12 -52 -309 67 -2 41 -26 151 51 -128 96 -152 -127 104 -150 131 5 39 129 -115
7082 -115 47 2 14 -52 15 -152 146 -107 54 141 57 35 53 -120 135 132 168 -84 -35 60 10 -245 37 126 -71
7107 -71 284 12 -147 56 -83 118 0 96 152 47 7 -1 -64 -9 117 -189 191 100 29 -112 17 198 170 -9
7131 -9 -74 19 47 46 -51 -51 105 53 63 -173 -46 -136 -12 -20 4 -25 -138 78 52 -97 19 -161 13 137 -288 -5
7157 -5 19 -109 107 66 1 57 7 89 -209 -187 -182 -8 237 110 165 -221 -59 -153 -3 100 130 57 53 -40 -10 -81 181
7184 181 75 43 86 -5 -157 -224 -64 -11 -78 -2 11 -290 -129 -126 -3 8 119 -132 43 -5 -138 40 144 50
7208 50 199 147 -61 -109 -142 8 -57 52 -69 -340 -97 131 23 79 61 117 41 -100 -39 94 -14 189 119 -76
7232 -76 -4 -139 -28 96 -52 305 36 238 122 -115 -170 -66 63 86 117 -110 29 26 -197 127 -98 -19 5
7255 5 58 161 -23 -20 81 -24 -115 210 43 27 -119 -30 132 -4 -22 20 9 1 96 -93 -29 -4 142 67 92 62
7281 62 71 6 -76 -14 206 28 193 -39 43 -148 -46 -170 312 -54 -67 -43 -108 -82 54 100 53 -68 141 -5
7305 -5 37 49 37 -95 -21 61 8 18 114 105 -12 -53 180 146 -173 -103 58 -47 122 169 -44 192 -53 98 -113
7330 -113 142 -89 -105 -51 -17 -69 -138 -8 -275 134 -85 -109 40 208 62 65 0 -37 -73 20 20 -53 -89 -23 -109 -93
7356 -93 -112 -103 -56 39 79 -65 -27 -16 78 15 -106 18 179 14 -19 -18 -23 -1 -144 51 -67 -61 55 -10 118 2 -69
7383 -69 73 11 157 -76 195 7 13 -181 58 174 -67 164 107 10 114 -180 -67 -37 -61 -45 205 44 25
7406 25 -37 14 45 26 -82 -211 -43 -15 315 -116 73 -124 68 -56 -35 -9 -130 20 -2 37 18 41 128 42 -74
7431 -74 133 -48 -45 -96 -26 -54 -97 215 63 -31 35 137 -23 38 89 -87 62 -70 -125 185 77 -26 30 -8 -46
7456 -46 168 -139 99 -200 -144 -88 138 29 -90 -274 41 87 -29 186 89 -61 5 21 37 -205 175 103 -12
7479 -12 -39 -147 132 9 -24 -62 5 98 14 -97 -147 -129 49 135 -141 67 -40 -70 -9 73 94 -37 55 232 0
7504 0 -49 -259 216 99 -91 196 -51 -159 -98 -120 78 -76 116 223 -263 -54 -123 -27 62 165 -33 77 -24
7527 -24 2 134 -85 68 -88 125 -70 96 93 200 15 8 -11 22 48 -225 -3 90 71 46 -53 49 -73 -194
7551 -194 -81 -68 41 109 -74 -9 -106 137 59 17 -65 -18 17 188 -174 -285 -3 126 1 42 83 38 42 141 -123
7576 -123 97 35 -65 -63 65 -121 64 -89 -153 34 -79 80 -90 18 20 -151 84 -97 -7 180 -80 -83 -35
7599 -35 174 89 -191 -20 25 -41 14 -58 239 133 176 -69 76 97 8 -23 -106 159 -39 125 -141 19 38 243
7623 243 -94 69 -75 -49 -88 -14 53 -143 131 66 -20 -159 -111 -94 -260 62 -100 87 -54 -105 -76 -117 17 -147
7647 -147 -70 54 27 50 5 117 190 -40 19 -51 152 -82 -36 -88 -23 11 65 -24 45 -87 -51 -96 69 -102 90
7672 90 -86 -8 168 -30 144 79 79 8 144 -182 -103 -81 -36 147 21 -59 -25 -256 -107 -134 -75 233 79 -99
7696 -99 226 -348 -13 -22 80 -12 64 -5 -88 -140 -37 176 80 -71 -216 123 -122 -258 130 79 -99 227 80
7719 80 28 -63 95 -103 -12 -147 -43 120 -108 43 -69 15 -17 110 278 72 -187 -81 44 147 50 -62
7741 -62 131 24 -2 -38 160 64 -34 -153 -10 -113 60 -62 59 4 39 -27 73 -67 -45 -27 -11 178 32 10
7765 10 4 -57 66 103 57 278 181 -81 -175 -79 -267 22 20 -75 -32 15 111 -77 -15 119 50 1 -93 43 52 -62 35
7792 35 155 100 29 91 106 -52 -5 -59 62 108 -31 -82 7 -145 99 -282 -76 239 -124 35 156 5 1 -24
7816 -24 -43 -61 154 -160 -48 -100 11 79 -129 -157 -6 250 52 -207 31 -59 -48 -12 -140 -141 107 101 -153 133
7840 133 -161 117 58 -32 46 70 68 180 -112 -204 -55 -50 6 43 -99 -16 7 -75 -56 -54 -168 43 -70 113 40 -70
7866 -70 122 -24 18 -146 8 29 14 -139 -136 -205 -115 -99 -14 -48 81 -123 -123 98 -29 -132 35 35 -123 147 -5
7891 -5 -28 -30 311 66 -15 -11 59 -12 -19 -58 -33 224 -180 -93 -159 233 -235 13 63 -62 -56 174 -66 -301 18 65 -33
7918 -33 -2 36 -53 -155 -54 95 -27 57 23 -17 23 111 -244 -78 -57 -111 -21 14 -222 25 35 74 -16 143 -79
7943 -79 112 9 -11 71 103 209 -60 115 116 -37 -112 82 36 74 -17 115 104 -15 94 -21 62 -42 -206 -97
7967 -97 -31 53 27 96 -24 238 -14 -189 50 105 133 -76 -109 -39 161 50 24 -58 -38 -38 113 95 108 -141 26
7992 26 0 120 -32 -35 -116 -3 77 -42 -30 98 -227 -14 -149 -45 115 119 -28 -124 31 -24 142 -75 107 -1
8016 -1 -84 -19 24 70 -114 -23 -56 -41 89 7 -76 74 -91 -300 -36 -35 -33 -43 -59 87 37 -26 -94 39 -52 -122 -11
8043 -11 11 -67 74 41 -216 104 -39 62 -185 -18 -51 -161 185 -19 45 -61 3 -51 -45 123 -55 -1 -68 -93
8067 -93 -52 60 36 -168 174 53 -55 -161 -33 141 53 10 49 19 -114 -70 -142 99 -27 40 -87 94 -49
8090 -49 -299 -87 -153 136 -38 -57 -109 76 21 86 116 37 -20 -10 6 -170 135 44 61 -195 370 -1 -173 -79 -129
8115 -129 107 85 75 142 -50 60 125 -194 5 -146 102 -109 -9 -104 -14 116 -12 157 -119 -108 -149 -36 85
8138 85 -226 -99 18 38 -8 240 -4 -28 -194 -52 148 77 14 -28 -282 -49 61 -246 109 104 -56 7 -123
8161 -123 -97 88 223 32 -118 -25 -157 60 -61 132 -133 101 152 -47 -110 -34 -93 83 93 207 -33 138
8183 138 -22 -137 -28 131 155 -55 125 -177
8191a77
##END NTUPLES=NMR FID
##END=
