##TITLE=1H_PHDE3005
 CDCl3, 8 sc, 
 30.4.2019
##JCAMPDX= 6.0         $$ Bruker NMR JCAMP-DX V2.0
##DATA TYPE= NMR FID
##DATA CLASS= NTUPLES
##ORIGIN= UXNMR, Bruker Analytische Messtechnik GmbH
##OWNER= root
$$ XWIN-NMR		Version 3.5
$$ Tue Apr 30 14:44:06 2019 Russian Standard Time (UT+4h)  she@DPX200
##.OBSERVE FREQUENCY= 200.1315
##.OBSERVE NUCLEUS= ^1H
##.DELAY= (6, 6)
##.ACQUISITION MODE= SIMULTANEOUS
##.ACQUISITION SCHEME= undefined
##.AVERAGES= 8
##.DIGITISER RES= 18
##SPECTROMETER/DATA SYSTEM= spect
##.PULSE SEQUENCE= zg30
##.SOLVENT NAME= D2O
##.SHIFT REFERENCE= (INTERNAL, D2O, 0, 15.7039)
##AUDIT TRAIL= $$ (NUMBER, WHEN, WHO, WHERE, WHAT)
$$ ##TITLE= Audit trail, XWIN-NMR		Version 3.5
$$ ##JCAMPDX= 5.01
$$ ##ORIGIN= Bruker BioSpin GmbH
$$ ##OWNER= she
$$ F:/spectra/data/she/nmr/H-F/1/audita.txt
$$ ##AUDIT TRAIL=  $$ (NUMBER, WHEN, WHO, WHERE, WHAT)
(   1,<2019-04-30 14:43:07.03 +0400>,<she>,<DPX200>,
      <created by zg, POWCHK disabled, PULCHK disabled
       configuration hash MD5:
       00 E9 B6 7A A2 85 ED C7 34 08 36 98 17 FE 4E 26
       data hash MD5: 16K
       C2 9D 2A 81 8E 15 EC 8E 3F D1 DC A9 A3 FB 9E 29>)
$$ ##END=
$$ 
$$ hash MD5
$$ 4C 1E B6 BF ED 05 0F 89 71 76 1C D6 5F 38 AB D0
##$RELAX= 
##$RELAX= 
##$RELAX= 
##$RELAX= 
##$RELAX= 
##$RELAX= 
$$ Bruker specific parameters
$$ --------------------------
##$DU= <F:/spectra>
##$EXPNO= 1
##$NAME= <H-F>
##$PROCNO= 1
##$TYPE= <nmr>
##$USER= <she>
##$AMP= (0..31)
100 100 100 100 100 100 100 100 100 100 100 100 100 100 100 100 100 100 
100 100 100 100 100 100 100 100 100 100 100 100 100 100 
##$AQSEQ= 0
##$AQ_mod= 1
##$AUNM= <au_zg>
##$AUTOPOS= <>
##$BF1= 200.13
##$BF2= 200.13
##$BF3= 200.13
##$BF4= 200.13
##$BF5= 200.13
##$BF6= 200.13
##$BF7= 200.13
##$BF8= 200.13
##$BYTORDA= 1
##$CFDGTYP= 0
##$CFRGTYP= 5
##$CHEMSTR= <none>
##$CNST= (0..31)
1 1 145 1 1 1 1 1 1 1 1 1 1 1 1 1 1 1 1 1 1 1 1 1 1 1 1 1 1 1 1 1 
##$CPDPRG= <>
##$CPDPRG1= <>
##$CPDPRG2= <>
##$CPDPRG3= <>
##$CPDPRG4= <mlev>
##$CPDPRG5= <mlev>
##$CPDPRG6= <mlev>
##$CPDPRG7= <mlev>
##$CPDPRG8= <mlev>
##$CPDPRGB= <>
##$CPDPRGT= <>
##$D= (0..31)
0 1.2 0 0 0 0 0 0 0 0 0 0.03 0 0 0 0 0 0 0 0 0 0 0 0 0 0 0 0 0 0 0 0 
##$DATE= 1556620986
##$DBL= (0..7)
120 120 120 120 120 120 120 120 
##$DBP= (0..7)
150 150 150 150 150 150 150 150 
##$DBP07= 0
##$DBPNAM0= <>
##$DBPNAM1= <>
##$DBPNAM2= <>
##$DBPNAM3= <>
##$DBPNAM4= <>
##$DBPNAM5= <>
##$DBPNAM6= <>
##$DBPNAM7= <>
##$DBPOAL= (0..7)
0.5 0.5 0.5 0.5 0.5 0.5 0.5 0.5 
##$DBPOFFS= (0..7)
0 0 0 0 0 0 0 0 
##$DE= 6
##$DECBNUC= <off>
##$DECIM= 24
##$DECNUC= <off>
##$DECSTAT= 4
##$DIGMOD= 1
##$DIGTYP= 9
##$DL= (0..7)
0 120 120 120 120 120 120 120 
##$DP= (0..7)
150 150 150 150 150 150 150 150 
##$DP07= 0
##$DPNAME0= <>
##$DPNAME1= <>
##$DPNAME2= <>
##$DPNAME3= <>
##$DPNAME4= <>
##$DPNAME5= <>
##$DPNAME6= <>
##$DPNAME7= <>
##$DPOAL= (0..7)
0.5 0.5 0.5 0.5 0.5 0.5 0.5 0.5 
##$DPOFFS= (0..7)
0 0 0 0 0 0 0 0 
##$DQDMODE= 0
##$DR= 18
##$DS= 0
##$DSLIST= <SSSSSSSSSSSSSSS>
##$DSPFIRM= 0
$$ [...]
##$SUBNAM2= <"">
##$SUBNAM3= <"">
##$SUBNAM4= <"">
##$SUBNAM5= <"">
##$SUBNAM6= <"">
##$SUBNAM7= <"">
##$SUBNAM8= <"">
##$SUBNAM9= <"">
##$SW= 24.9337058887773
##$SWIBOX= (0..15)
0 0 2 0 0 0 0 0 0 0 0 0 0 0 0 0 
##$SW_h= 4990.01996007984
##$TD= 16384
##$TD0= 1
##$TE= 0
##$TE2= 300
##$TE3= 300
##$TEG= 300
##$TL= (0..7)
0 120 120 120 120 120 120 120 
##$TP= (0..7)
150 150 150 150 150 150 150 150 
##$TP07= 0
##$TPNAME0= <>
##$TPNAME1= <>
##$TPNAME2= <>
##$TPNAME3= <>
##$TPNAME4= <>
##$TPNAME5= <>
##$TPNAME6= <>
##$TPNAME7= <>
##$TPOAL= (0..7)
0.5 0.5 0.5 0.5 0.5 0.5 0.5 0.5 
##$TPOFFS= (0..7)
0 0 0 0 0 0 0 0 
##$TUNHIN= 0
##$TUNHOUT= 0
##$TUNXOUT= 0
##$USERA1= <user>
##$USERA2= <user>
##$USERA3= <user>
##$USERA4= <user>
##$USERA5= <user>
##$V9= 5
##$VALIST= <valist>
##$VCLIST= <CCCCCCCCCCCCCCC>
##$VD= 0
##$VDLIST= <DDDDDDDDDDDDDDD>
##$VPLIST= <PPPPPPPPPPPPPPP>
##$VTLIST= <TTTTTTTTTTTTTTT>
##$WBST= 1024
##$WBSW= 4
##$XGAIN= (0..3)
0 0 0 0 
##$XL= 0
##$YL= 0
##$YMAX_a= 788668
##$YMIN_a= -988725
##$ZGOPTNS= <>
##$ZL1= 120
##$ZL2= 120
##$ZL3= 120
##$ZL4= 120
##$ABSF1= 10
##$ABSF2= 0
##$ABSG= 5
##$ABSL= 3
##$ALPHA= 0
##$AQORDER= 0
##$ASSFAC= 0
##$ASSFACI= 0
##$ASSFACX= 0
##$ASSWID= 0
##$AUNMP= <proc_1d>
##$AZFE= 0.1
##$AZFW= 0.1
##$BCFW= 1
##$BC_mod= 2
##$BYTORDP= 1
##$COROFFS= 0
##$CY= 11.3945322036743
##$DATMOD= 1
##$DC= 2
##$DFILT= <>
##$DTYPP= 0
##$F1P= 18.9103706918063
##$F2P= -1.10871071338519
##$FCOR= 0.5
##$FTSIZE= 0
##$FT_mod= 4
##$GAMMA= 1
##$GB= 0.15
##$INTBC= 1
##$INTSCL= 1
##$ISEN= 128
##$LB= 0.24
##$LEV0= 0
##$LPBIN= 0
##$MAXI= 10000
##$MC2= 0
##$MEAN= 0
##$ME_mod= 0
##$MI= 1.114404
##$NCOEF= 0
##$NC_proc= 0
##$NLEV= 6
##$NOISF1= 3.799351
##$NOISF2= 2.8
##$NSP= 1
##$NTH_PI= 0
##$NZP= 0
##$OFFSET= 15.70392
##$PC= 1
##$PHC0= -8850.037
##$PHC1= 12.00026
##$PH_mod= 1
##$PKNL= yes
##$PPARMOD= 0
##$PSCAL= 0
##$PSIGN= 0
##$REVERSE= no
##$SF= 200.130013532006
##$SI= 16384
##$SIGF1= 3
##$SIGF2= 2
##$SINO= 400
##$SIOLD= 16384
##$SREGLST= <1H.CDCl3>
##$SSB= 0
##$STSI= 0
##$STSR= 0
##$SW_p= 3612.71676300578
##$SYMM= 0
##$S_DEV= 0
##$TDeff= 0
##$TDoff= 0
##$TI= <>
##$TILT= no
##$TM1= 0
##$TM2= 0
##$TOPLEV= 0
##$USERP1= <user>
##$USERP2= <user>
##$USERP3= <user>
##$USERP4= <user>
##$USERP5= <user>
##$WDW= 1
##$XDIM= 8192
##$YMAX_p= 0
##$YMIN_p= 0
$$ End of Bruker specific parameters
$$ ---------------------------------
##NTUPLES= NMR FID
##VAR_NAME=  TIME,          FID/REAL,        FID/IMAG
##SYMBOL=    X,             R,               I
##VAR_TYPE=  INDEPENDENT,   DEPENDENT,       DEPENDENT
##VAR_FORM=  AFFN,          ASDF,            ASDF
##VAR_DIM=   8192,          8192,            8192
##UNITS=     SECONDS,       ARBITRARY UNITS, ARBITRARY UNITS
##FACTOR=    0.0002004,     1,               1
##FIRST=     0,             0,               0
##LAST=      1.6414764,     0,               0
##MIN=       0,             -988725,         0
##MAX=       1.6414764,     788668,          0
$$ Real data points
##PAGE= N=1
##DATA TABLE= (X++(R..R)), XYDATA
0 0 0 0 0 -8 16 -16 16 -24 32 -40 48 -64 88 -104 120 -146 178 -212 250 -291 350 -404 467 -539 625 -712
26 -712 812 -921 1048 -1184 1330 -1496 1681 -1880 2097 -2335 2602 -2890 3204 -3553 3939 -4357
42 -4357 4822 -5340 5917 -6565 7290 -8120 9072 -10176 11475 -13036 14946 -17351 20479
55 20479 -24746 30944 -40799 58988 -103836 440451 425781 -411355 100139 369702 20504
66 20504 -95214 652107 788668 -29902 -489960 161616 570831 191079 43184 573063
76 573063 555326 -214740 -433375 317827 677753 201340 -26322 362943 293148 -367397
86 -367397 -456303 242136 507774 53575 -94377 299503 278864 -229022 -236109 326885 425615
97 425615 -58877 -196768 130199 95328 -304177 -234552 269571 320080 -125459 -265109 -17859
108 -17859 -34812 -283620 -134364 295525 297155 -99197 -234367 -64171 -79816 -237402 -104834
119 -104834 163806 66520 -277208 -340092 -125685 -37595 -86829 -6526 105043 -30003 -275896
130 -275896 -285427 -89920 23950 10048 3481 -17638 -139335 -263588 -239076 -107681 -18479
141 -18479 -18259 -57938 -98153 -123879 -129146 -103362 -32608 53130 57702 -49494 -144323 -125536 -77528
154 -77528 -89754 -71061 37626 74485 -62575 -181558 -115741 -12665 -20129 -4882 116693
165 116693 134292 -50890 -168870 -48374 78826 36007 10347 103490 79297 -129817 -201535
176 -201535 1425 162733 93176 26905 92180 66173 -96691 -95972 130578 239088 97959
187 97959 -10299 34515 16624 -92623 -36502 175783 216492 35738 -58144 23012 49024
198 49024 -13718 44326 193879 175168 2603 -51769 43441 74136 23908 57494 131303 68766
210 68766 -64677 -61532 45135 73740 39789 69416 108703 41778 -50024 -30444 43018 49496
222 49496 24540 40240 41343 -15955 -50897 -14123 19145 4109 -2078 10656 -16028 -60630
234 -60630 -43928 11318 19726 -2947 1022 -6693 -66218 -100626 -52706 -10706 -37853 -53462 -15617
247 -15617 -22680 -96747 -107635 -27521 -3430 -72574 -91803 -33159 -38331 -113519 -101650 -7593
259 -7593 -8499 -103996 -115122 -45964 -65540 -146020 -108154 124 -19834 -123395 -108157 -19582
271 -19582 -51046 -143295 -102614 -328 -40388 -144765 -110128 -13202 -49058 -133919 -82885 5080
283 5080 -53660 -150287 -97234 -2436 -48438 -124989 -61811 19540 -47397 -135474 -76260 8253
295 8253 -44895 -116093 -55724 13725 -47436 -112938 -47646 21566 -34605 -93253 -35543 17056
307 17056 -44143 -93415 -26930 29642 -26180 -75385 -21237 23562 -28991 -67846 -11655 30572
319 30572 -17856 -54978 -8918 24405 -17558 -42004 5054 31532 -12677 -37705 3238 27282
331 27282 -9936 -27899 11846 31708 -3004 -20951 11609 29438 1528 -13218 11339 21877
343 21877 -2727 -11411 12815 23629 4023 -1936 17149 21228 951 -4398 12829 18053 2966
356 2966 -1753 11952 16231 4764 -555 7225 9042 554 -2407 3677 5951 2058 3034 8020 7081
371 7081 1112 -1232 315 -504 -4731 -6093 -3203 -1760 -2779 -4924 -4659 -3894 -4524 -6374 -7589 -6885
387 -6885 -5629 -5091 -5872 -6349 -6642 -7276 -8525 -10128 -11357 -11677 -10404 -9701 -9858 -9719 -9192 -7964 -7200 -7405
405 -7405 -7736 -7228 -6174 -6252 -7181 -8792 -8827 -8048 -7540 -8271 -7747 -5134 -2383 -1734 -2524 -2656 -1589 -1293 -1479
424 -1479 -1386 230 2436 4740 4964 4186 4058 3249 2117 1631 2548 4341 6978 11365 15080 15745 13918
441 13918 13821 14407 10381 6299 8170 14479 16421 15219 18370 23076 21494 15166 14116 16804 14643 11919
457 11919 17029 25857 25951 23371 27078 29805 21129 10855 11909 17458 15414 13748 22620 31888 27794
472 27794 20904 22852 23006 13950 8113 14366 19191 15478 16327 26237 28910 19028 12889 14930 10010
487 10010 -1107 -405 12027 16746 15196 20084 25050 14337 461 1285 5962 -1554 -6811 5218
501 5218 13979 3923 -1606 12478 18058 -1669 -14274 -5016 -4315 -20719 -15704 15206 22217 -2156
515 -2156 -9743 5271 -3770 -33630 -27069 8943 6422 -27493 -22145 13931 8387 -25552 -15102
528 -15102 19145 -3165 -52480 -38297 10735 3588 -30563 -5953 35082 431 -57604 -34587
540 -34587 17849 -5070 -50404 -15056 36934 -349 -54857 -14909 41683 1511 -55879 -17930
552 -17930 31950 -16228 -67384 -7888 57581 10843 -47694 -3005 40816 -23670 -75756 -5234
564 -5234 62610 6719 -50421 4435 50600 -16265 -62322 13717 69121 -5409 -66479 -3250
576 -3250 49075 -10034 -43053 36692 77870 -11560 -73107 -3010 51132 -6196 -37374 36816
588 36816 69032 -16667 -63782 12814 62127 -535 -38710 23364 51047 -21694 -52974 22854
600 22854 64979 1894 -37310 17123 45073 -17830 -49836 12145 52116 2860 -30595 14913
612 14913 40122 -14472 -51176 -2436 42870 12268 -24361 -623 20668 -19162 -50926 -6740
624 -6740 48778 26937 -30205 -33750 -4696 -15283 -39237 -3847 51332 26429 -54656 -71819
636 -71819 -14009 10997 -17181 -8685 35257 7705 -83383 -92807 818 46529 -8902 -35747
648 -35747 6607 -6628 -93222 -90733 26809 66631 -29163 -80448 -16586 -2800 -82702 -76584
660 -76584 46801 69541 -60094 -115201 -20736 13356 -75070 -74166 52437 63542 -83814 -127825
672 -127825 -4998 31312 -75204 -79333 51871 53904 -102535 -129132 15717 49273 -69896
683 -69896 -73532 55450 38686 -123596 -128399 34470 63637 -62149 -62493 58565 24530 -132187
695 -132187 -111000 60106 72120 -63617 -63640 48727 12042 -118911 -70477 89948 70982
706 70982 -74584 -71133 36887 5690 -93272 -27442 105825 57432 -81214 -61431 42207
717 42207 11731 -67353 -3455 95298 32554 -76388 -34334 56644 19884 -44903 11989 77415
729 77415 11848 -62662 -8725 58614 17670 -23100 32287 68541 2626 -44418 5848 43897
741 43897 8184 -628 51458 56860 -6423 -26464 18813 32305 7770 24985 59274 28002
753 28002 -26044 -10397 34884 29459 16636 47581 51827 -11590 -43101 11573 51142 23622
765 23622 17659 56511 34824 -44356 -42223 43925 63784 4978 2884 50374 13615 -64293 -26022
778 -26022 76946 65022 -23323 -16827 41997 -932 -72435 -7742 95759 49573 -56663 -30673
790 -30673 43393 -4502 -72451 4605 96435 21438 -86368 -35171 51145 -3994 -71282 9328
802 9328 86353 -6328 -104150 -30280 58978 -6273 -73598 7835 72961 -25847 -108008 -19832
814 -19832 62470 -12792 -77605 4898 59941 -37629 -103681 -9241 61131 -19280 -76691 4309
826 4309 49580 -42901 -94964 -2569 56693 -20618 -69561 4117 39059 -44212 -82089 4168
838 4168 53068 -17277 -59795 59 27820 -38626 -64254 11210 50550 -10977 -52240 -6860
850 -6860 20205 -24365 -41565 15739 45608 -5610 -44979 -12492 19718 -3113 -19906 14110
862 14110 37043 400 -36450 -13738 25419 19142 -4955 6134 28485 9956 -24529 -11368
874 -11368 32807 36659 1927 -5027 23278 22513 -12401 -9387 38868 50055 4262 -15329 22913
887 22913 36485 -3215 -10875 41518 57765 1735 -23950 25551 50249 2913 -13037 41930
899 41930 59289 -4552 -30878 30781 61204 5923 -17326 41246 58136 -10613 -34260 36080
911 36080 65268 661 -25301 37587 56415 -13132 -32556 40880 63050 -10047 -34412 33213
923 33213 52496 -15053 -29795 42063 55868 -18897 -37745 31768 46843 -20736 -31774 36538
935 36538 44806 -25469 -34592 33212 40647 -26760 -34750 27942 31834 -30173 -31291 30867 31854 -29799
949 -29799 -32344 23121 22001 -32885 -30103 23002 18883 -32814 -27809 21291 16049 -31031 -26567
962 -26567 15053 6526 -35135 -25714 16027 8385 -28345 -20770 11787 674 -32028 -22013 8623
975 8623 -470 -27876 -18218 7386 -1865 -24035 -14377 4855 -6033 -25572 -16820 778 -6119
988 -6119 -18250 -8405 3317 -5916 -18615 -11526 -2544 -8709 -14933 -7940 -1415 -6643 -10495 -4847
1002 -4847 -1448 -5972 -9265 -6538 -6046 -7928 -5970 -2047 -2536 -3144 -1590 -1240 -4450 -5300 -2197 -2003
1018 -2003 -4680 -3152 2812 2214 -2302 -759 3608 314 -4685 -1577 4403 2056 -2713 1222 7612
1033 7612 3988 -1822 2278 7330 1997 -3447 1571 7973 4582 -193 5064 9524 3960 -1605 3446
1048 3446 7919 3708 -623 4791 9029 4584 1037 5973 9081 3934 -19 4799 7471 3418 1034
1063 1034 6214 8380 3777 1712 5281 6775 2782 1318 4813 6345 3098 1974 4625 5695 2875
1078 2875 1822 3959 4395 2297 1464 3344 3944 2251 1546 2759 3523 1644 1759 2409 2446 1525 975 1454
1096 1454 1746 1190 442 1005 1658 1337 973 781 720 409 -390 -501 -167 118 -127 -63 380 378 -386 -830 -905
1117 -905 -1246 -1670 -1813 -833 -637 -522 -627 -399 -739 -1588 -2373 -2242 -2372 -2349 -2389 -1409 -418 -1603 -1714 -1460
1137 -1460 -1737 -3047 -4031 -2800 -1813 -2564 -2658 -1150 -516 -2086 -3335 -2748 -2486 -4750 -4964 -2435 -1174
1154 -1174 -2576 -3492 -857 -513 -4196 -5843 -3120 -1699 -5107 -5993 -1097 718 -3719 -5128 -1422 -387
1170 -387 -6071 -7396 -1898 -248 -5838 -6648 597 1950 -5419 -7191 -339 -164 -8239 -8861 203 2222
1186 2222 -6531 -7743 1700 2687 -7821 -8784 1008 1488 -9254 -9261 2696 3059 -7826 -7267 4196 2840
1202 2840 -10319 -9494 3407 2601 -9569 -7433 5772 3579 -9596 -7353 5701 3171 -10752 -8451
1216 -8451 5756 3493 -9401 -6005 7671 3957 -9775 -6340 6577 2948 -9791 -5513 8004
1229 8004 4383 -8169 -3436 8471 3709 -8672 -4345 7666 3885 -6838 -2066 8629 4122
1242 4122 -5922 -1535 7712 3764 -5013 -1464 6814 3507 -2809 341 7218 4483 -1748 119 4817
1257 4817 3746 -21 1214 4931 4684 1954 1409 3250 4893 3675 1522 2012 5222 5310 1004 767
1273 767 6189 7383 1144 -817 6707 8554 379 -2218 7823 11060 -68 -3690 7971 11686
1287 11686 -767 -5163 9140 13320 -2323 -6743 9507 14127 -2844 -7701 10537 14978 -5243
1300 -5243 -9749 11702 15721 -5807 -10099 12322 15487 -7904 -11141 13026 16129 -8710 -12104
1313 -12104 12374 14566 -10817 -11625 14051 14752 -11999 -12989 12409 13049 -12029 -11630 13273 11750
1327 11750 -14584 -13691 11335 11244 -12503 -11316 11032 7566 -15937 -12587 10936 9443 -12632 -12005
1341 -12005 6701 3477 -14428 -9815 9493 5802 -13062 -12736 2293 1302 -10185 -7148 4124
1354 4124 648 -12252 -11853 -539 1317 -5585 -6900 -2743 -3954 -8319 -8907 -3319 327 -1969 -8366
1369 -8366 -10734 -4622 -186 -5073 -8958 -2788 935 -9661 -15085 -1058 9018 -5091 -18261 -5058
1383 -5058 7312 -6862 -17264 1978 14390 -10172 -27304 -2198 19319 -2941 -21626 1544
1395 1544 15891 -14730 -31090 7057 31348 -4250 -30852 80 20628 -13122 -28172 16971
1407 16971 36741 -12414 -41043 2963 30724 -7699 -24769 21701 35367 -22363 -45271 12566
1419 12566 41979 -5751 -27201 20654 31704 -26574 -40773 25438 49744 -9994 -33277 18575
1431 18575 30878 -25749 -32262 35970 50521 -16789 -37876 19636 32911 -23260 -25637 40454
1443 40454 46166 -23869 -38301 23498 35169 -19923 -20245 40767 38410 -30116 -36156 27976 37279
1456 37279 -15965 -16498 37064 28468 -34415 -32050 32063 38292 -13911 -15635 29522 19372 -32628
1469 -32628 -22470 35400 35063 -16033 -19260 20078 13679 -25425 -12169 34874 27533 -20186 -21995
1482 -21995 13730 12519 -15974 -6786 26354 17111 -20877 -20090 11727 14155 -10045 -7751 13933
1495 13933 8941 -15693 -14912 8991 12429 -6941 -11187 3892 6449 -8047 -12430 1726 7285
1508 7285 -5203 -11917 -399 8096 -2271 -14595 -7922 4762 1265 -9867 -3923 8271 -233
1521 -233 -19057 -14074 8003 9275 -8948 -10066 5040 -492 -21185 -14356 14854 15618 -12258 -17689
1535 -17689 2714 1864 -19304 -10945 20451 16373 -18429 -24106 3525 7814 -13951 -7195 21986
1548 21986 13634 -24831 -26061 9452 14671 -9752 -6460 19657 8631 -27889 -22230 17007 20904
1561 20904 -7993 -8633 14314 4023 -25999 -14442 23932 23280 -9783 -11770 10323 3094 -20115
1574 -20115 -5117 27880 20234 -13428 -13991 9736 6039 -11497 1479 25674 13011 -17005 -12726
1587 -12726 11457 10322 -4128 4591 19935 5806 -16416 -7833 13920 11597 -1302 3751 13350
1600 13350 1883 -11551 -1847 13790 10051 -798 1598 6819 275 -5597 2506 11207 7366 588
1614 588 702 1897 -477 -1216 3771 6624 4855 2806 -58 -2086 -503 2804 3085 1564 2584 3457
1630 3457 -1373 -5669 498 6651 2453 -3182 605 3770 -3667 -8482 1911 9039 606 -7071 26
1645 26 5152 -5142 -10242 2012 9606 -2504 -10608 40 7023 -5127 -11080 2274 8972 -5273
1659 -5273 -13082 -76 6968 -6283 -11360 3453 8950 -6803 -14116 490 6246 -7570 -11856
1672 -11856 3499 8356 -7713 -13628 1178 6463 -7674 -11503 4053 6853 -9461 -13104 2324
1685 2324 6516 -6752 -9977 3227 5104 -9716 -12017 3425 6677 -6524 -8873 3275 4124 -9556
1699 -9556 -9509 4061 5674 -6976 -8233 2791 2922 -6843 -6162 4373 4218 -6411 -7054 2174 2764
1714 2764 -5205 -4344 4023 3096 -5061 -4829 2382 2346 -3547 -3146 2746 2072 -3564 -3479 2298 2457 -2398
1731 -2398 -2199 1705 1662 -1807 -1951 1699 2106 -828 -931 1163 1807 -1005 -1357 1149 2361 420 -469
1748 -469 696 1815 160 -763 1174 2139 804 -790 515 1682 724 76 1096 2215 1060 175
1764 175 392 1957 1358 266 889 2204 1619 238 464 1975 1670 817 926 1836 1673 551 762 1821
1782 1821 2179 1060 893 1954 2009 1117 1233 2268 2124 1221 912 2111 2281 996 921 2208 2034 1149
1800 1149 1196 1822 2085 833 1133 2435 2105 1449 1276 2143 2287 1319 1028 1873 2031 1148 1148 2226 2186 842
1820 842 1504 2016 1495 892 1476 1678 1299 727 1244 1414 987 535 1180 1337 840 345 886 1016 174 108
1840 108 541 485 -134 -355 546 187 -148 -681 -184 -82 -801 -869 -568 -707 -1164 -1395 -1168 -1202 -1787 -1544 -1025
1861 -1025 -1158 -2111 -2464 -1689 -1880 -2217 -2385 -2141 -2146 -3004 -3020 -2707 -2757 -2940 -2951 -2824 -3493 -3631 -3379 -3144 -3504
1882 -3504 -3567 -3429 -3729 -4309 -4021 -3331 -3515 -4092 -3840 -3472 -4119 -4971 -4081 -2883 -3611 -4762 -3429 -2842 -4251
1901 -4251 -5298 -3515 -1765 -3505 -4858 -3163 -1892 -4343 -4827 -2110 -438 -3543 -5371 -2043 -980
1916 -980 -4094 -4623 -193 1082 -3348 -5122 -793 990 -2675 -3533 1610 2170 -4011 -4862 1376 3126
1932 3126 -2537 -2745 3025 2857 -3685 -3793 3767 4851 -1563 -2394 4051 4289 -2954 -2397 5753 6043 -1972
1949 -1972 -2243 5362 5764 -1796 -1019 6771 6709 -932 -1295 6845 6695 -1408 -856 7282 7602 -621 -688 6919
1967 6919 6584 -1513 -874 7901 8243 -223 -871 5911 5967 -1031 365 8050 7917 -424 -2175 4723 5971
1984 5971 634 661 7040 6152 -1773 -3617 3462 6717 2196 304 4340 4544 -2320 -4190 3092 7685
2000 7685 2559 -2126 528 2795 -1721 -4457 2384 7860 2380 -5201 -2674 2666 -253 -4478 1003
2015 1003 7472 1390 -8813 -5714 3143 1772 -4852 -1131 6939 119 -12111 -8187 5307 4015
2029 4015 -5652 -3482 5421 -1068 -14549 -8127 8744 6699 -7946 -6790 4121 -1556 -14901 -6109
2043 -6109 12874 7483 -11688 -10636 3632 -217 -12479 -3266 14749 5514 -16301 -12269 6599
2056 6599 4242 -9824 -1725 13827 2065 -19151 -10333 12135 8249 -8963 -3000 11594 -148
2069 -148 -18100 -5689 16573 8924 -10712 -4876 10772 868 -14440 -1411 17887 6635 -12764
2082 -12764 -4783 11871 3184 -11074 1580 16794 4592 -12675 -2260 13325 4125 -8893
2094 -8893 1864 14821 3718 -9952 264 13507 3926 -8035 1901 12944 3623 -6903 1316
2107 1316 11493 2474 -5767 3119 11596 3866 -5105 983 8147 2463 -2422 4397 9806 3281 -4038
2122 -4038 -303 5229 3528 1413 4491 6365 1738 -2753 -1001 3473 5270 4929 3060 1178 -56
2137 -56 -1107 -1300 2581 7755 6769 -1056 -4602 -873 1532 -432 1858 8436 5954 -6285 -9081 1324
2153 1324 5947 558 -276 7153 3144 -10650 -10342 5306 10626 -729 -4131 4635 1286 -12564
2167 -12564 -9070 10186 12498 -4495 -8939 2708 1582 -11160 -5813 13518 11402 -9222 -12106
2180 -12106 2920 4052 -8356 -3574 13552 8541 -13300 -13440 5578 7065 -6771 -3378 11910
2193 11910 5562 -14575 -11492 8444 9359 -6229 -4468 9579 3420 -13888 -8907 10708 9999 -5958
2207 -5958 -5271 6924 2332 -11423 -5697 11308 9269 -6468 -6435 5399 2656 -8525 -3035 10968
2221 10968 7552 -6725 -6533 4760 3829 -5019 -1779 9068 6318 -6190 -6216 3718 4775 -2321 -1461
2236 -1461 6586 4579 -4827 -5493 2719 5172 -269 -1826 3524 4161 -3023 -5872 1446 6215 1084
2251 1084 -2826 860 3657 -1760 -6143 193 7304 3241 -4601 -2322 3553 -262 -6343 -1448 7960
2266 7960 3610 -6806 -5113 3755 1375 -6504 -1926 8189 2889 -9605 -6789 4432 3231 -6555
2280 -6555 -2633 7513 1990 -11482 -7734 6164 4695 -7365 -4497 6788 773 -12691 -6933
2293 -6933 8198 5451 -8303 -5842 5706 501 -11865 -5272 9474 4578 -9801 -6804 5487
2306 5487 761 -10362 -4163 9707 3336 -11298 -6778 5964 1936 -8995 -2690 9083 2019
2319 2019 -11348 -5431 7012 2611 -8035 -1948 7937 1124 -10146 -3480 7798 2475 -7046 -1915
2333 -1915 7202 1488 -8373 -1736 7510 2245 -5969 -1007 6757 1202 -6094 -281 7264 2750 -4217
2348 -4217 269 5663 1316 -4380 481 6588 2872 -2835 255 4747 1492 -2603 951 5786 2798
2363 2798 -1661 -142 3413 1524 -890 1795 4499 2152 -1324 -250 2393 2667 762 1345 2696
2378 2696 1642 -590 -281 1903 2724 997 -20 1255 1084 26 -244 1224 2243 698 -954 -356
2394 -356 1050 569 -886 309 1735 448 -1696 -1116 1106 402 -1628 -769 1166 -47 -2393 -1790
2410 -1790 742 224 -2267 -1436 423 -333 -3020 -2175 454 -172 -2652 -2136 25 -539 -3120 -2417 609
2427 609 18 -2942 -2310 191 -656 -3376 -2166 430 -495 -2786 -2631 -11 -365 -2772 -1801 684 -290
2444 -290 -2607 -1841 546 -517 -1978 -1278 552 -283 -1617 -920 821 311 -1170 -213 893 361 -1086
2461 -1086 35 1490 806 -61 653 1642 843 602 1204 1822 1804 837 1610 1933 2282 1716 1673 2405 2440 2088
2481 2088 2269 2568 2671 2348 2793 2593 2669 2647 2574 3311 3326 2773 3138 3345 3420 3000 2770 3257 3589 3345 3228
2502 3228 3418 3519 3252 3281 3246 3242 3129 3170 3129 3082 2994 2890 2832 3051 2998 2964 2623 3177 2680 2653 2051 2940 2454 2439
2526 2439 2111 2113 2120 1898 1723 2250 2024 1510 1308 1766 1781 1155 855 1294 1268 551 840 973 588 160 274 573
2548 573 498 -57 23 678 103 -478 -478 128 -290 -1055 -673 -235 -317 -901 -790 -686 -314 -1344 -1081 -683 -963
2569 -963 -1419 -1272 -492 -895 -1702 -1214 -604 -1220 -1851 -1330 -417 -907 -1904 -1532 -271 -644 -2037 -1104 -375
2588 -375 -603 -1654 -1148 -211 -582 -1710 -895 -43 -682 -1700 -1256 425 -452 -1535 -477 1086 -172
2605 -172 -1247 -271 1073 -201 -1068 2 1248 196 -1056 381 1307 680 -623 -179 1276 398 -354
2622 -354 492 1496 962 -424 -19 1273 1330 118 697 1595 1148 140 104 1460 1363 712 549 1062 1312
2641 1312 260 48 1542 1864 416 243 957 1508 432 123 1142 2204 882 -647 170 1681 672
2658 672 -818 1083 1876 -190 -1429 -115 1720 261 -1402 143 1307 -398 -1909 -262 2029
2673 2029 -61 -2310 -461 1350 -683 -2817 -818 1842 -852 -3539 -1100 1257 -1041 -3542 -1226
2688 -1226 1134 -933 -4180 -1811 1091 -1282 -4283 -1816 907 -1722 -4372 -1990 971 -1936 -4587
2703 -4587 -2275 738 -1668 -4541 -2148 542 -1855 -4799 -2009 663 -1742 -4467 -2011 514 -2231
2718 -2231 -4368 -1841 827 -1675 -4368 -2595 105 -1620 -3918 -1518 775 -1600 -4254 -1985 194
2733 194 -1152 -2665 -1352 259 -1092 -3226 -1991 425 -520 -1562 -1821 -385 -447 -1975 -1582 356
2749 356 585 -1109 -2102 -922 640 -236 -1014 369 1584 -208 -2080 -474 2354 1199 -1301 -317
2765 -317 2314 584 -2331 -225 3687 1935 -2030 -810 3210 1467 -2304 -141 4696 2339 -3252
2780 -3252 -740 4445 2317 -2387 -341 5279 2336 -4006 -945 5606 3222 -3428 -699 5541 2152
2795 2152 -4000 -701 6426 3078 -4535 -1466 5869 2849 -4615 -1009 6513 2110 -5780 -1175 6795
2810 6795 2367 -5449 -1507 5822 1740 -6201 -1088 6815 1786 -6551 -1719 5633 835 -6255 -1389
2825 -1389 6374 735 -7070 -2291 5568 866 -6609 -1600 5569 332 -7432 -1782 5718 747 -6317
2840 -6317 -2222 4902 -219 -7024 -1709 5100 464 -6401 -2309 3734 -427 -5947 -1485 4588 -122
2855 -122 -5903 -2512 3205 261 -5112 -1429 3359 -71 -5434 -2481 3115 996 -3940 -2432 2242
2870 2242 218 -4051 -1365 3244 1795 -3533 -2664 1303 1555 -1979 -907 2925 1753 -3350 -3418 1912
2886 1912 3130 -347 -1382 1796 1550 -2701 -2380 3203 5007 -86 -2945 75 2269 -387 -804 3732
2902 3732 4894 -754 -4493 -202 4358 1949 -727 2642 4353 -1253 -4321 1109 6630 2625 -1796
2917 -1796 765 3183 -1056 -3600 2894 7379 1584 -4450 -231 3907 607 -2031 2916 6458 272
2932 272 -5193 -241 5152 1458 -2208 2173 5205 -834 -5023 1125 6018 1058 -3333 952 4279
2947 4279 -999 -4379 1071 5314 472 -3648 486 3959 -843 -3937 1100 4378 -150 -3938 223
2962 223 3071 -1173 -3530 1316 3563 -431 -3745 -328 2290 -967 -2575 986 2953 -1010 -3842
2977 -3842 -757 1880 -66 -2043 199 1470 -1254 -3007 -728 1961 462 -2258 -1210 468 -1006
2992 -1006 -1873 -135 1254 -175 -2195 -1533 350 267 -660 -693 302 -52 -1289 -953 981 1182 -1032 -1578
3010 -1578 -314 792 -214 -558 517 1164 -739 -2003 -328 1774 967 -932 -749 767 -470 -1686
3026 -1686 334 2701 1047 -2090 -1104 1379 913 -1117 730 2630 500 -2428 -687 2413 1610 -1114
3042 -1114 435 2029 145 -2489 -102 3440 1771 -1485 -458 2044 390 -1827 248 3211 1039
3057 1039 -2026 -523 2561 673 -1481 -41 2539 808 -2062 -308 2525 646 -1665 -116 2535
3072 2535 520 -2122 -115 1971 466 -1714 -81 1980 306 -2027 -552 1358 312 -1780 -426
3087 -426 1511 -10 -1721 -720 1171 470 -1756 -571 902 -472 -1833 -700 1056 -197 -1578
3102 -1578 -789 450 -713 -1275 -1020 515 -375 -1943 -1265 -59 -567 -1615 -958 -72 -691 -1722 -1318
3119 -1318 -26 -368 -1365 -1333 -433 -677 -1415 -1295 -618 -548 -1497 -1498 -738 -662 -1125 -1507 -442 -447 -1098 -1371 -262
3140 -262 -439 -1146 -1175 -563 -338 -1024 -1056 -821 -580 -535 -884 -645 -117 -746 -1009 -483 -49 -430 -821 -343 68
3161 68 -442 -914 -298 113 -455 -902 -138 180 -344 -711 -220 -17 -102 -665 -238 525 166 -328 41 266 -64
3182 -64 -121 -113 400 -96 -286 284 366 -123 -388 87 375 -110 -317 34 479 127 34 342 65 92 -156 -366
3204 -366 190 -195 -264 -201 -77 -208 -82 -267 102 73 -176 -240 21 -354 -594 -116 -194 -216 -392 -166 -108 -454
3226 -454 -524 -437 -162 -272 -367 -493 -305 -657 -83 -160 -181 -418 -687 -251 -136 -128 -439 -15 -159 -267 -626 -549 -77
3249 -77 -318 -261 -427 -323 -212 -8 -186 -65 -38 136 -434 -196 18 -84 -177 41 -91 102 -216 133 120 189
3271 189 -92 185 466 377 208 242 574 485 503 527 805 447 433 612 1055 743 497 818 681 966 782 467
3293 467 909 944 832 986 1099 817 548 1088 1621 1070 818 911 1510 957 956 1020 1328 1198 602 792 1538 1072
3315 1072 617 1039 1672 775 425 671 1130 457 493 986 978 591 86 622 1533 719 38 650 966 116 -86
3336 -86 415 680 121 -466 47 491 172 -773 51 683 -114 -598 -100 67 -530 -922 -425 305 -218 -1283
3356 -1283 -867 -486 -745 -1069 -640 -103 -564 -1619 -1555 -554 -627 -1471 -768 -151 -830 -2117 -1968 -963 -367
3375 -367 -1016 -1210 -806 -848 -2025 -1777 -139 -393 -1274 -1697 -849 -1056 -1697 -1594 -145 382 -985 -2231 -1398
3394 -1398 -481 -1574 -1142 311 426 -1379 -2006 -708 132 -747 -704 350 534 -1465 -2213 160 1293
3411 1293 -386 -845 473 593 -1133 -1888 706 2132 12 -1050 453 743 -784 -859 1413 2632
3427 2632 83 -1521 456 1416 -290 -831 2010 2511 -50 -1774 643 2471 545 -474 1736 2197
3443 2197 -521 -1613 1618 3040 817 -695 1332 2498 -229 -838 2206 2780 301 -808 1130
3458 1130 2201 -74 -789 1704 2773 -315 -887 1441 2813 19 -763 1263 1928 -74 -569 1752
3474 1752 2499 -18 -1550 874 1756 197 -524 1160 1704 -1064 -1743 608 1829 489 -656 15
3490 15 631 -1132 -1188 766 2212 547 -1714 -1262 -154 -544 -550 914 1324 -480 -2314 -1442 -116 218
3508 218 -482 666 521 -1269 -2717 -1555 544 1064 -252 -714 -518 -1226 -2295 -1101 940 1397 -707
3525 -707 -1996 -1461 -950 -1576 -586 1286 1280 -1670 -2732 -1287 -192 -653 -263 825 859 -2006 -3284 -904
3543 -904 1322 603 -410 628 240 -2332 -2634 243 2492 1072 -1172 -425 -73 -2043 -1646 1400 3067
3560 3067 303 -2105 -1248 140 -675 -558 2285 2383 -632 -2924 -885 1590 429 -65 1458 1880 -1084
3577 -1084 -2439 566 2792 1181 -637 387 1125 -329 -1075 1530 3329 372 -1395 70 1383
3592 1383 185 -747 1206 1977 15 -1431 341 2272 729 -538 292 1492 321 -353 749 2016
3608 2016 357 -1622 -161 1956 789 -541 531 1098 -180 -1217 77 1802 1310 -607 -675 466
3624 466 354 -1040 369 1553 838 -1300 -1714 542 705 -310 -248 1195 338 -1671 -1695 234 973 -186
3642 -186 -686 319 435 -1651 -1862 609 1349 -504 -1148 246 315 -1483 -1650 843 1509 -790 -1835
3659 -1835 -414 374 -1390 -1723 992 1303 -1107 -2411 -791 655 -837 -1473 520 1217 -1523 -2767
3675 -2767 -158 1175 -576 -1104 710 669 -1801 -2693 -39 1674 -321 -1592 41 370 -1668 -2229
3691 -2229 735 1864 -751 -1788 -27 859 -1353 -1350 1160 1825 -674 -1907 122 901 -628 -820 910
3708 910 1310 -555 -1391 486 1620 -232 -858 956 1435 -347 -925 527 1750 174 -451 746 1275
3725 1275 310 -760 1063 1186 458 -322 738 1138 100 -214 504 1369 522 -90 818 1279 528 -193
3743 -193 641 1845 729 115 555 1260 253 -93 705 1560 1047 -199 308 697 643 374 627 1443 849
3762 849 -42 318 1258 904 365 484 829 765 -216 67 1044 977 229 115 698 815 129 -5 588 884 -72
3783 -72 -131 502 513 -90 21 187 398 -379 -545 343 226 -323 -191 286 102 -374 -936 -166 192 -462 -708
3804 -708 -350 -327 -783 -987 -311 -59 -818 -951 -450 -190 -985 -841 -678 -308 -759 -683 -357 -434 -814 -1217 -546
3825 -546 -627 -899 -1312 -885 -448 -891 -1124 -733 -325 -889 -1180 -572 -603 -658 -701 -495 -213 -701 -998 -554 -447
3846 -447 -863 -868 -675 -551 -372 -1288 -626 -521 -642 -534 -220 -202 -395 -215 -512 -193 -464 -294 -335 -61 -34 -283
3868 -283 -84 12 -195 -1 -92 -24 105 -2 -63 344 156 96 407 217 361 531 236 564 405 506 238 351
3890 351 802 372 488 576 441 716 433 653 648 804 641 380 886 869 615 593 850 501 505 717 524 538 452
3913 452 384 523 661 353 672 725 282 554 172 300 416 120 571 317 191 253 377 391 435 245 244 142
3935 142 -151 -183 -16 183 99 -154 -134 152 -127 -235 -134 -158 -184 -519 100 -428 2 -298 -391 -199 -83 -382
3957 -382 -307 -472 -501 -649 -580 -198 -707 -486 -500 -21 -505 -614 -277 -530 -778 -703 -408 -432 -627 -577 -422 -242
3979 -242 -648 -581 -470 -499 -162 -451 -266 -420 -269 -499 -173 -237 -194 -480 64 -365 -422 -291 32 88 232 79
4001 79 -271 184 94 160 130 299 129 -245 38 187 243 70 339 524 79 239 571 337 666 326 473 447
4023 447 624 280 664 715 334 306 274 753 606 480 651 636 548 -16 328 854 660 712 247 849 495 27
4045 27 218 608 461 86 332 294 600 218 167 218 189 -87 -66 38 285 6 25 30 158 -76 -240 352 -157
4068 -157 -57 -177 9 26 -673 -158 -34 -85 -142 -836 -195 -37 -286 -724 -361 -476 -703 -751 -223 -310 -685 -675
4090 -675 -182 -471 -920 -581 -598 -173 -799 -403 -499 -338 -432 -756 -294 -99 -213 -1041 -602 -569 -383 -212 131
4111 131 -226 -674 -805 -363 -72 -363 -309 -249 -229 -753 -410 21 19 -250 -237 -314 -272 -467 -451 293 636 104 -304
4134 -304 -481 37 326 297 771 1036 208 -524 -259 230 1088 781 636 502 208 -313 -36 827 1271 529
4154 529 605 574 409 14 275 1289 1249 450 8 331 790 330 267 1333 1033 113 -211 834 1121 300
4174 300 47 902 719 -356 -591 601 905 198 32 732 709 -312 -314 388 826 -25 -642 176 378 -507
4194 -507 -707 319 562 -193 -520 78 268 -607 -893 -308 514 -377 -849 61 220 -898 -1208 -36 225
4213 225 -757 -958 -209 -264 -1027 -1463 -286 18 -800 -1146 -694 45 -1360 -1025 25 77 -1081 -1822 -789
4232 -789 -377 -1162 -1218 -441 121 -973 -1502 -567 -70 -102 -832 -521 112 -1075 -1079 -221 447 73 -756 -316 106
4253 106 -946 -966 -37 793 188 -1064 -215 331 43 -639 379 968 177 -511 -174 678 442 -254 373
4272 373 1090 484 -697 450 1163 844 129 460 1101 710 -103 340 1332 831 452 558 1620 585 66
4291 66 768 1469 964 -45 350 1428 688 34 566 1396 1012 -5 209 1297 1077 -95 352 1140 641
4310 641 399 563 1381 600 -204 129 985 748 122 420 958 381 -304 -47 1039 758 -33 -167 297 335
4330 335 -498 -232 753 405 -608 -664 -93 -8 -296 -328 414 90 -928 -1150 -150 -12 -359 -472 -235 -119
4350 -119 -1188 -808 -242 -31 -510 -1000 -521 -592 -910 -607 -142 -157 -964 -1327 -630 -567 -780 -694 -196 -249 -1005
4371 -1005 -916 -407 -63 -684 -741 -292 -211 -857 -908 -289 -354 -563 -532 -363 -101 -358 -723 -167 -130 -565 -981 -414
4393 -414 -20 -252 -483 29 -1 -111 -481 77 591 -50 -365 -118 501 -91 -276 -28 481 217 -152 177
4413 177 504 368 48 90 282 74 150 298 803 724 276 179 278 329 110 343 833 330 462 103 581 594
4435 594 167 181 475 657 132 186 621 660 356 189 724 714 316 96 369 619 190 343 514 325 -109
4456 -109 -7 221 899 313 46 290 151 267 90 289 491 -43 -102 -100 21 -176 -6 73 245 -83 -388
4477 -388 -134 -127 87 -68 -177 -199 -135 -540 -318 217 -99 -304 -93 -152 -303 -227 -267 -126 -106 -557 -530 -132 -19
4500 -19 -475 -270 203 -367 -407 -97 175 -318 -238 -203 127 -162 -218 128 -194 137 -138 -2 87 50 -634 -141
4522 -141 184 314 -54 285 -53 148 -229 -186 197 237 107 182 347 63 -159 112 246 49 -77 -53 418
4543 418 -101 168 94 -51 134 121 149 448 16 96 104 572 109 190 311 102 137 386 269 214 246 13 232
4566 232 368 119 27 165 88 -220 134 287 -126 108 -52 -236 -20 311 255 -5 25 156 76 -67 -64 -15 -130
4589 -130 1 -29 -200 -82 122 -27 16 -189 -191 -205 -63 -378 -780 -270 -118 -12 -145 -312 -224 -424 -307 -477
4611 -477 -206 -56 -591 33 -100 -320 104 -556 -196 -311 -437 -389 -196 -277 -563 -408 -349 -258 -132 65 -223
4632 -223 -230 -94 -189 -686 -390 -162 -153 -297 -338 -206 -286 -491 -444 -11 -66 -276 -96 113 -38 374 136 200 219 207
4656 207 381 55 318 130 300 139 -63 200 161 206 -52 -70 331 518 444 -89 97 349 464 408 428 194
4678 194 204 455 302 438 551 732 391 357 237 108 68 248 399 332 268 363 462 108 97 50 262 390 249
4701 249 493 373 -248 52 322 134 283 538 286 360 10 42 603 151 108 -212 65 258 -53 -22 229
4722 229 -146 -175 -35 35 10 -83 -62 -22 -340 -82 17 -198 -248 -76 91 -429 -133 -205 -323 -485 -282 -83 -196
4745 -196 -55 -478 -111 -220 -306 -619 -446 -91 -338 -260 -178 -232 -430 -345 -297 -298 -66 -635 -619 -36 -374 -456 -536 -209
4769 -209 -376 -606 -357 -291 -296 -348 -381 -356 -224 -481 -262 -69 -611 9 -447 -548 13 -297 -129 40 -162 -187
4791 -187 -99 249 -130 -115 211 -16 -79 -19 328 410 120 2 375 277 3 329 365 526 514 333 145 153 512
4814 512 203 527 227 258 240 426 396 552 379 116 404 412 108 472 457 193 419 521 586 611 92 397 336
4837 336 500 304 603 290 503 391 89 263 565 147 123 487 71 89 54 116 538 5 70 79 88 -85 -87 3
4861 3 29 109 297 296 148 -139 -88 -108 410 -137 -115 -210 -298 -464 115 277 119 -395 -375 -451 -101 -221 -316 171 -340
4886 -340 -536 -722 -696 -36 -161 -116 -41 -396 -818 -595 -189 260 -296 -196 -457 -987 -492 -474 179 207 -138 -635
4908 -635 -975 -825 -606 27 386 310 -601 -997 -695 -404 -190 23 231 -321 -511 -689 -352 -3 -111 46
4928 46 185 -664 -793 -397 121 663 347 64 -289 -456 -48 246 412 463 97 -121 -49 -78 259 220 201 204 -69
4951 -69 2 -44 313 296 765 325 53 85 99 261 135 412 298 374 -49 113 126 167 154 598 559 127 -84 565
4975 565 579 304 206 65 530 449 256 398 272 230 -14 439 173 315 292 190 355 -445 250 530 139 139
4997 139 137 419 252 -139 391 556 300 -21 -55 103 2 -10 287 525 93 -220 -532 116 12 290 214 235
5019 235 111 -567 -383 90 85 208 -67 -240 -639 -402 -197 140 186 7 -30 -280 -346 -266 -32 403 -254 -464
5041 -464 -339 -414 -284 -34 161 68 -238 -692 -325 -250 74 197 371 -186 -497 -204 -142 -57 96 284 117 -508
5063 -508 -446 -381 43 128 144 -71 -146 -188 -167 88 261 -179 338 -258 -333 -189 -63 43 210 347 -167 22 -98
5086 -98 -217 -5 225 238 74 76 31 515 317 345 154 -244 -130 32 -174 -433 368 68 -14 -119 -17 163
5108 163 243 -85 -8 428 -35 106 -275 194 87 -192 -80 336 22 -23 -109 51 -357 -66 116 -255 -130
5129 -130 -193 -274 61 -158 -186 29 52 -217 -243 -255 -31 -90 -139 140 -43 -305 -462 -227 -265 -58 -212 144 -297
5152 -297 -348 -254 58 -76 -211 -181 -137 -170 -476 -299 -47 105 -186 -230 27 -232 43 250 -72 316 42 -158
5174 -158 -121 25 -37 -304 66 45 -109 -185 39 -270 -16 155 -6 39 249 151 82 557 367 486 662 350
5196 350 -6 -46 318 129 193 85 49 12 437 31 -62 291 373 232 171 -33 287 246 449 170 122 257 112
5219 112 107 201 408 391 -69 -11 134 -104 296 109 41 81 212 29 62 119 -12 159 214 51 -89 234 -16
5242 -16 -52 -24 197 141 -141 -254 -64 21 214 37 144 268 -245 -312 -157 150 -63 159 115 15 -125 15
5264 15 180 -116 -371 -357 -200 88 -124 -49 -186 125 -211 -105 2 -137 -147 -224 -279 -63 -462 -123 -211 -407
5286 -407 -206 -529 -128 -143 -189 -119 -135 -313 -255 -279 -181 -111 -159 -322 -80 16 252 -295 28 -139 -62 -52 -65 58
5310 58 -52 4 4 98 -145 -110 -117 -133 415 -60 51 -19 -70 70 308 91 -130 263 302 307 286 4 298 169 232
5335 232 404 5 175 10 351 151 393 218 333 11 98 317 512 189 272 550 528 173 116 -71 229
5356 229 43 221 432 -185 127 90 181 1 -1 152 86 185 167 26 -109 -75 128 -86 185 -79 -3 -58 95
5379 95 -165 168 102 -160 -227 16 -125 -405 38 145 -224 -176 -22 -69 -89 -377 -153 -39 141 52 -463 -84
5401 -84 -297 -262 -247 -504 -16 -277 -194 -277 -174 -184 -156 -96 -220 -193 -291 -107 -74 -200 -219 -216 -1 -332 -487 -375 -322
5426 -322 -31 -273 -206 -23 -118 20 46 120 -210 -264 -422 150 123 6 229 -101 -166 -120 163 -35 19 -4 260
5449 260 56 156 362 193 167 235 98 -84 214 118 152 -28 -20 91 219 210 96 110 196 247 58 363 195 248
5473 248 25 279 50 212 92 -4 499 -261 -302 -91 144 -27 -52 -12 178 153 -109 214 146 390 -75 6
5495 6 -85 -11 108 102 237 -60 -159 24 83 117 293 187 -203 -176 -10 -51 243 159 -351 42 -224 -387 -194 -197 18
5520 18 -250 175 -75 -374 -594 -211 -403 193 -37 -266 -256 -224 -491 -92 12 -259 -61 -209 -155 -15 -177
5541 -177 86 -209 78 -32 -192 -379 -286 80 69 -235 183 -19 -386 -86 -251 22 86 -115 -355 110 125
5562 125 149 163 165 67 -17 191 406 77 89 100 341 95 -108 335 331 104 58 210 361 259 37 244 517 329
5586 329 -19 -51 155 565 169 424 255 52 -74 310 692 -236 230 346 348 196 258 533 379 240 251 378
5608 378 527 102 229 640 310 -50 8 296 251 369 178 272 -68 -306 -390 -398 666 -20 337 234 25 51
5630 51 -394 161 130 194 -312 -128 -199 -132 217 -52 93 -190 -447 -267 -67 -56 22 -183 -111 -428 -553 -495 -420
5653 -420 -51 -31 -480 -659 -493 -220 -59 -241 -104 -325 -581 -568 -538 -401 -328 -201 36 -299 -622 -612 -257 -34
5675 -34 -258 -196 1 -98 -239 -331 -212 -33 -263 -250 -23 -351 -342 -547 483 -134 -397 -373 -336 -156 -546 -10 255
5698 255 89 -196 252 56 -79 78 -19 315 -318 -197 114 343 -13 137 323 362 267 158 -120 463 179
5719 179 -59 323 384 209 -83 369 113 133 119 185 16 336 140 267 518 512 331 262 634 154 80 482 264
5742 264 460 356 344 244 181 209 526 168 278 -99 241 -32 195 -15 347 106 75 145 82 426 163 274
5764 274 79 37 177 235 73 -99 269 59 -81 115 316 85 102 135 148 217 -20 -179 52 110 -66 -16 80
5787 80 207 -465 -171 28 -78 27 -40 -138 -10 -507 -256 60 -172 -342 -151 -24 125 -525 -171 -6 -189
5808 -189 -438 -217 -86 45 -508 -189 221 -253 -209 -393 -63 -316 -734 -253 -152 -203 66 -242 151 45 -92
5829 -92 -224 -13 -37 -308 -185 61 -122 -474 -316 -7 -72 -295 78 49 -14 -278 -64 249 -220 -12 155 134
5851 134 302 -134 261 99 -196 116 322 389 21 -8 316 151 148 81 36 157 440 -24 143 198 282 160 299
5874 299 101 150 61 500 215 74 310 397 431 360 -36 296 290 113 89 254 137 256 -42 165 155 196 146 -10
5898 -10 475 128 206 -8 312 108 -79 -273 161 308 466 212 -46 171 12 -203 -51 138 -88 -124 -88
5919 -88 -25 78 -364 183 -43 -82 -189 -69 -174 -173 263 -579 -219 -345 -193 -327 71 -173 -151 96 -165 -404
5941 -404 -78 -90 -228 56 -27 -198 -28 -497 -601 105 -257 -41 -287 -344 -128 -124 -210 -59 -184 5 300 -28
5963 -28 202 164 -139 235 -311 -115 -279 -248 -173 191 56 -31 73 -33 -206 -132 -190 -308 -91 -261 293 -45
5985 -45 -310 128 157 240 -71 1 7 -53 240 -93 -138 272 324 134 80 140 135 -65 97 419 -269 162 254 263 100
6010 100 103 187 14 227 15 -71 318 526 187 304 262 19 92 40 -12 295 379 423 -146 441 130 137 316 -250
6034 -250 16 -67 195 255 126 281 369 252 -152 240 91 -160 -222 -123 205 -12 282 73 94 254 255 -330 36
6057 36 175 313 178 -75 -70 254 1 38 -36 -9 78 -73 101 1 -193 -115 -181 -111 -125 42 88 76 191 53
6081 53 -127 -97 -263 -253 -285 -148 -44 -236 219 -90 112 -103 -434 -87 -440 -299 -200 -212 -36 -137 -45 -391
6103 -391 -83 76 -68 -297 174 -361 -148 -202 -31 34 -138 -220 195 -161 -137 -86 -304 -125 -127 -317 -129 -129 16
6126 16 155 81 -157 -74 -136 -152 42 -127 -178 -57 107 -400 97 75 93 -274 142 91 89 20 80 -216 -84 -2 -329
6151 -329 -58 49 29 173 173 215 37 63 -262 -156 218 50 98 26 116 -90 -190 235 187 -19 39 -29 -29 -88 308
6176 308 177 521 46 -11 -127 130 136 -50 101 183 20 -352 6 39 9 86 11 203 247 120 121 53 -260 58
6200 58 43 111 -133 202 -46 -21 57 107 59 138 44 21 -227 202 129 174 15 204 -75 -118 -101 -252 33 -132 61
6225 61 -147 34 -260 134 55 -60 -150 98 138 -96 198 350 -46 -7 -171 239 -244 32 -3 166 140 -329
6247 -329 1 -111 -186 63 -49 -183 -54 24 -235 -83 41 -72 50 -296 176 13 84 -201 -111 46 -380
6268 -380 -183 -115 199 12 83 64 -14 53 -359 -125 56 142 187 246 -132 -15 -111 124 208 -431 -99 16 121
6291 121 86 -198 104 80 -265 -357 89 -94 -1 -164 201 35 212 -285 -164 375 -27 -161 180 136 174 -279
6313 -279 8 165 16 81 432 -70 136 131 118 332 9 -73 85 199 14 -380 -32 112 -71 -300 69 120
6335 120 -45 -210 21 23 -327 8 -348 369 67 -157 151 81 -164 -149 -282 108 282 -207 19 -65 -40 -65
6357 -65 152 516 -149 -322 -273 15 -199 -276 183 218 -342 -352 176 291 208 -206 6 -89 -167 -137 -76 217 -29
6380 -29 -365 -83 -5 -182 -349 -177 -163 65 -162 -361 -255 -153 65 -203 27 -55 -4 109 246 306 52 -39
6402 -39 60 -505 -13 -266 -260 -1 -365 -134 112 225 -284 -345 -42 67 67 118 -101 327 -59 -218 -21 166 -162
6425 -162 -450 210 316 156 -297 232 210 101 -29 232 -22 -232 -355 107 348 129 -162 99 -15 -239
6445 -239 -65 306 294 141 92 115 263 239 -115 120 335 189 198 -75 171 119 -69 167 496 -29 -160 178
6467 178 336 319 336 136 299 80 -309 419 464 285 141 -2 331 56 -161 -126 56 45 -262 295 249 19
6489 19 -137 445 341 189 -393 -23 362 26 -364 49 -16 -167 -108 -242 -97 10 -81 -19 129 -234 -40 -217
6511 -217 -261 -154 -385 -70 -132 259 -123 75 146 44 -296 -148 -239 -161 25 -19 -245 -60 -410 -211 -276 81
6533 81 -511 -665 -196 -263 -400 -385 139 -61 -176 -403 43 -25 -120 -25 -172 -379 -48 -286 -135 141 -229 -519
6555 -519 296 70 28 251 -138 19 -260 -273 260 1 17 -383 -126 164 167 -375 -133 279 -20 136 34 49
6577 49 25 44 27 279 -104 -48 -104 437 105 -57 -11 507 81 -58 120 316 362 139 346 505 18 62 320
6600 320 366 253 188 54 186 344 69 279 275 209 37 -29 408 136 300 41 -176 -26 290 -79 189 188 -108
6623 -108 -120 254 -35 228 129 80 214 202 20 -5 245 -309 -20 315 96 -144 143 -28 73 -88 71 281
6645 281 -61 11 -65 37 39 141 -47 272 83 111 -54 -39 -158 -128 -6 258 -236 54 54 80 -323 -241 -74 74
6669 74 -251 -139 -144 -199 -61 12 -165 81 -145 -418 -100 -73 -288 -181 -224 -219 -260 -219 -194 -529 -101 -164 -15 35 -153
6694 -153 -399 -281 -85 183 -602 -247 -257 21 -106 45 -29 -131 -298 -43 62 -38 -188 -101 -76 305 -35
6715 -35 264 198 50 317 49 24 360 176 -35 308 -32 334 254 204 158 295 48 103 322 -26 82 63 417
6738 417 -7 224 192 374 162 169 225 546 348 52 129 -215 409 336 434 456 -38 95 85 122 -142 236 51
6761 51 202 92 369 263 133 299 147 -52 390 353 -139 162 97 69 11 -67 66 80 188 -336 162 108 -162
6784 -162 -18 -33 437 13 105 -92 -337 14 -16 -141 -92 -260 47 -113 -153 -234 -231 -204 -2 -94 32 -69 -365
6807 -365 -236 -283 -421 -79 -240 -203 -160 -84 -218 -353 -359 -11 -181 -231 -205 -315 -231 -236 -73 -189 -369 -463 329 44
6831 44 -132 -151 41 98 -290 -400 -187 -9 145 44 -116 -322 -116 -193 -62 242 -68 -161 -162 -98 27 128 -4
6854 -4 30 247 -16 232 107 -15 -16 150 34 -171 26 18 15 -89 -31 117 281 92 135 71 259 494 -44 255
6878 255 -86 199 284 -123 283 125 48 121 166 308 314 145 98 24 271 388 348 593 214 206 276 239 76 -19 75
6903 75 -28 44 -22 15 106 4 -92 376 -113 97 -152 63 298 -92 -60 -106 40 -71 -10 -31 -13 181 352 -108
6927 -108 -356 -140 -492 -100 21 49 -16 -329 186 -395 -202 75 268 -23 -581 -96 129 -70 84 58 107
6948 107 -212 -292 -139 89 17 -29 -78 -19 -161 -189 -110 140 -89 157 -91 291 65 -144 149 -144 -167 -307 -92
6971 -92 -2 213 -173 106 15 103 -210 -3 -35 -40 45 -55 308 -186 -233 393 169 326 47 143 -167 334 -178
6994 -178 -85 283 -95 29 153 472 259 288 453 72 -42 -28 121 477 548 -122 401 213 156 76 -72 318
7016 318 314 241 149 256 -160 321 257 198 194 125 -28 25 436 146 339 217 412 27 140 377 377 309 62 -26 376
7041 376 17 275 26 101 27 -305 -51 105 220 -297 -132 129 -178 -340 100 298 253 -355 297 -163 -350
7062 -350 -213 32 153 -435 -23 -72 -116 46 -210 -370 216 -263 -464 -12 -286 -275 -190 216 235 -238 -174 -326
7084 -326 195 -172 -564 -299 48 -561 -282 23 -301 -90 -393 -334 -39 -244 -736 -180 204 -193 -89 33
7104 33 123 -192 -54 -127 373 -277 -206 31 -198 -6 -396 35 -136 -101 -80 -9 58 35 -43 -142 373 -36 -138 5
7128 5 -75 24 153 3 -194 370 92 -40 56 160 -295 -46 165 184 121 288 55 448 -42 42 293 123 8
7151 8 283 296 218 413 335 236 433 -1 -142 113 78 218 181 426 -2 49 -315 -21 253 -134 -7 -157 166
7174 166 -140 122 330 334 153 -242 201 49 117 -6 176 109 -67 -190 159 64 -259 -110 197 65 -317 -38
7196 -38 -11 76 -53 -422 -163 59 -326 -104 47 104 -292 -116 -89 -259 123 -445 -73 112 -252 -385 -205 94
7218 94 -200 -327 -206 -51 -275 -331 14 -205 -198 -260 234 25 -242 -357 -126 97 -193 38 -101 -68 -100 -274
7240 -274 47 57 -119 23 109 8 -86 1 144 197 -44 -125 185 188 -158 -25 -74 200 298 -175 -116 -91 -99 42 -202
7265 -202 372 289 147 -113 213 126 74 251 50 202 95 239 -7 177 20 146 113 -266 -68 52 106 274
7287 274 -125 -120 95 95 -121 -94 356 32 43 17 -88 89 -410 -109 80 -37 173 -149 172 301 -191 -130 185
7310 185 289 -51 -3 397 -9 68 37 184 319 -24 87 222 357 46 54 -264 -101 202 -241 -191 -35 -118
7332 -118 -32 143 179 170 -257 -67 34 165 -337 -186 81 -244 -151 -129 67 -289 -90 -1 -5 -80 -311 -206 34
7355 34 -289 89 -85 95 -73 6 155 -253 297 -432 233 -166 -149 -142 -47 -46 -323 185 -30 233 50 -97 24
7378 24 143 36 83 -137 -179 -192 -174 -211 2 132 64 -179 73 -246 32 37 -4 23 47 49 5 434 -240 82 116
7403 116 191 70 -41 196 189 70 -199 46 -125 -73 34 81 -75 28 53 69 -69 61 23 -350 -144 -42 297
7426 297 105 63 178 200 405 291 -111 -24 175 105 -180 -118 -50 290 19 -133 100 -47 -26 19 -116 2 89
7449 89 74 -157 127 79 43 127 189 176 -42 141 -89 -103 110 -104 86 99 -145 32 35 -93 -85 216 263 -71 67
7474 67 -92 27 -110 154 -123 18 -38 79 55 -121 -288 -142 22 -239 -7 -273 34 -34 -231 237 -209
7495 -209 -169 -159 -510 396 352 -162 -52 -174 -150 -320 -218 -32 -99 17 227 249 205 79 225 149 -100 -115 -103
7518 -103 94 200 34 -86 -176 119 -392 238 161 -116 -152 -27 -150 21 155 94 -149 112 142 -66 -150 168
7540 168 51 106 -51 311 99 -23 194 -22 49 174 -28 114 -185 127 147 96 67 -53 83 6 203 -69
7562 -69 -131 -23 35 439 -98 -171 -32 -60 150 -44 126 -3 32 -222 224 60 -211 62 81 -128 80 185
7584 185 -162 288 50 153 -87 -1 -394 157 -219 25 4 -194 57 -462 -247 -92 -259 -165 -20 -176 306
7605 306 -75 149 79 -104 4 -60 -142 156 -138 -35 27 -129 30 -140 -181 35 38 165 -280 -9 -232 -432
7627 -432 36 408 -351 31 -100 125 65 -8 170 -151 -202 66 -112 -426 217 127 -282 134 -38 -115 178 12
7649 12 23 -176 108 7 4 -265 399 33 145 -228 168 299 -141 -176 140 -229 83 -205 -173 96 -153 -165
7671 -165 -240 -14 72 -51 -209 248 426 -224 -108 -34 194 150 121 213 60 60 102 172 94 208 -36 -62 -109 -224
7695 -224 -238 195 219 -105 -118 -166 181 114 64 197 -170 -269 -83 -120 66 -4 33 295 99 339 -153 137 -28
7718 -28 114 -166 93 333 -80 -351 -12 131 62 -98 -71 22 113 -98 21 -64 295 60 358 -48 -119 -115 41
7741 41 -174 132 -301 225 109 -124 111 -79 -170 325 215 -215 310 -130 -84 -60 35 112 418 99 221 -78
7763 -78 -115 -189 378 -78 -20 111 -17 37 101 -95 143 -34 160 134 127 310 63 244 -73 124 -380 -59 128
7786 128 20 113 122 -47 146 -181 -66 -195 205 99 -246 151 -94 -234 -176 159 28 72 26 -110 201 -317
7808 -317 -102 45 -23 80 168 -386 151 -7 -108 -27 -24 -205 -146 46 178 -241 -282 245 -51 -381 139 85 -23
7831 -23 -189 -152 131 327 -318 -116 190 -72 -377 74 -51 130 -138 176 229 179 84 -7 70 0 -23 111 -171
7854 -171 -169 -127 47 5 -101 -32 37 200 -80 1 -229 -174 -127 -290 71 -143 -192 -68 -62 -108 214 -250 -181 174 175
7879 175 -86 83 79 -47 203 -40 -85 52 76 -1 322 199 52 61 -104 -15 40 -143 208 -381 236 114 -14
7902 -14 -54 86 -103 -15 435 240 -28 27 -70 137 98 68 482 116 -131 -216 182 30 141 -110 322 76 151
7925 151 -57 268 -199 -95 68 53 184 140 -151 -116 235 -145 236 130 152 294 150 -219 142 -161 -109 -41
7947 -41 -75 -88 -209 -160 -151 173 -122 157 -35 235 136 49 189 -8 -140 -64 -101 -34 -201 333 95 95 185 4 -13
7972 -13 -134 -112 -358 -55 -237 -106 321 11 -131 16 93 -105 29 5 103 -181 -281 67 -224 -10 -110 58
7994 58 377 14 -31 30 90 -28 -150 -74 -62 56 347 -88 -181 0 75 -86 161 -80 168 -321 98 -59 208
8017 208 187 -38 348 -292 173 144 42 -287 -271 -42 47 327 71 58 429 98 -126 -215 50 373 3 -122
8039 -122 24 176 -201 -41 131 137 -7 153 245 183 70 233 10 -170 77 -332 2 -40 58 161 -79 -224
8061 -224 -315 200 -255 -136 193 142 115 1 173 30 -42 166 -80 -108 90 -72 -343 -281 -43 -429 -63 -139
8083 -139 52 50 -90 -194 -12 -104 1 104 91 -242 17 89 -192 -225 -184 -31 -174 -165 306 -84 -97 -48 -141 -136 -108
8108 -108 -123 -110 -168 26 -203 -115 -226 -28 -40 -165 -80 313 -145 132 -224 131 -9 -237 -37 24 63 143 297
8131 297 37 -105 -173 23 83 134 173 -218 -319 40 434 -133 -15 281 161 46 97 125 215 56 34 156 77
8154 77 213 100 -23 75 37 -191 120 181 219 261 187 473 224 281 -145 368 9 -89 46 20 12 207 220 13
8178 13 -121 -45 -88 -337 222 285 -8 -58 229 -97 -179 174 23
8191B3
$$ Imaginary data points
##PAGE= N=2
##DATA TABLE= (X++(I..I)), XYDATA
0 0 0 0 0 8 -8 0 -8 8 -16 16 -16 30 -32 35 -48 59 -70 80 -94 114 -134 149 -175 205 -234 263 -301 342 -390
29 -390 434 -489 551 -617 685 -765 853 -950 1048 -1164 1292 -1431 1580 -1749 1938 -2153
45 -2153 2383 -2655 2966 -3323 3737 -4239 4845 -5604 6575 -7876 9715 -12505 17214 -26681
59 -26681 53047 -275447 -988725 -344562 178296 -141976 -322918 239805 301619 -513126 -835270
70 -835270 -59058 413239 -67837 -370874 38860 44223 -622817 -708659 95894 407103 -216872
81 -216872 -562604 -183606 -136432 -644926 -606102 134417 345970 -230309 -468810 -79653
91 -79653 -37142 -484298 -461443 87922 135079 -410283 -555148 -161629 -100117 -434507 -350491
102 -350491 118681 101451 -396930 -512176 -163848 -74145 -279153 -162686 181524 81098
112 81098 -374030 -473884 -194749 -111632 -240541 -143564 69759 -60346 -379143 -353542 -43354
123 -43354 70129 -38491 -44628 12041 -122174 -308743 -228451 24155 112454 11620 -68542
134 -68542 -100937 -174958 -218791 -115980 46818 102636 42664 -31215 -61890 -55837 -25693 17518
146 17518 67205 94706 46055 -69507 -131085 -63948 25116 31025 30176 90782 90120 -44988 -126051
159 -126051 -12110 120754 104114 64466 116574 95068 -77865 -150750 12788 152053 78907
170 78907 -3986 46022 29147 -125342 -134419 96533 232025 96174 -34873 8857 14610
181 14610 -96072 -68352 138661 190270 -11877 -146384 -70079 -22942 -82599 -25653 143577
192 143577 127207 -89293 -173591 -45915 24551 -32556 -9053 90798 33933 -146913 -175360
203 -175360 -40008 11419 -54526 -55321 -4118 -64786 -172920 -134331 -2469 21213 -47201 -55351
215 -55351 -33412 -95056 -166564 -119445 -29478 -30801 -81258 -84398 -80185 -121966 -139219 -86232 -46094
228 -46094 -69712 -91436 -81601 -93946 -121229 -94340 -38770 -41698 -85831 -97013 -97141 -131651 -140676
241 -140676 -77924 -30956 -63653 -93148 -64281 -62797 -118215 -115417 -32503 -11066 -85186 -108484
253 -108484 -45371 -36493 -99379 -86323 1519 -5390 -102828 -109919 -25549 -24012 -90001 -53207 45593
266 45593 17390 -90734 -75091 21617 964 -85426 -45148 54433 15398 -87094 -47877 56333
278 56333 25236 -62276 -17892 68830 14023 -76990 -17222 83336 38373 -44677 9324 87311
290 87311 21416 -63680 1297 91105 37797 -37931 19554 90910 30723 -35285 29199 98487
302 98487 38214 -26437 30396 85360 27290 -22400 43048 97140 35939 -18295 36059 82756
314 82756 29653 -10974 43520 84171 30749 -9358 37048 72050 28169 -476 43384 67372
326 67372 20719 -6449 35653 60169 20819 148 37557 55370 17313 -3303 29374 46428
338 46428 14626 -2750 22473 34308 9346 -465 24000 32939 10290 791 18589 21686 824
351 824 -4466 13579 18878 2007 -3716 9734 13669 -234 -5759 3540 5880 -2242 -4490 3436
365 3436 5974 1065 237 3663 1520 -5318 -7056 -3497 -3258 -5562 -5198 -1261 846 -1086 -2806 -2432
381 -2432 -920 -520 -2198 -2334 -625 1146 1607 124 -204 -458 -200 -674 -607 236 1674 3648 5260 6042
399 6042 5714 6710 8028 8386 7680 7540 8182 8641 8479 7589 6896 8064 10067 11308 11433 12639 14953 16653
417 16653 15700 13904 13570 13986 14693 14397 14601 16335 17480 17428 15698 13916 13345 12991 12863 13155 15291 17353
435 17353 19220 20754 21027 17579 13194 11218 11325 8856 6575 9834 15812 16570 13053 12164 13954 9896
451 9896 2804 2286 6135 6403 4070 8458 14124 10969 3530 2688 2806 -5739 -13883 -8671 421 -162
467 -162 -2369 3188 7635 -873 -11003 -10749 -9115 -15554 -18295 -10101 -3957 -8082 -10355 -4332 -5061 -18117
483 -18117 -25297 -20564 -20767 -26413 -21139 -7543 -3603 -10921 -13456 -12340 -23257 -34961 -30091 -19681
497 -19681 -22044 -25428 -13932 -6216 -17567 -25458 -14701 -10943 -29680 -39879 -25513 -16270 -25940
510 -25940 -20603 4619 4730 -25440 -36184 -18500 -19548 -40507 -29462 5879 2964 -31106 -26638
523 -26638 8598 2762 -32705 -26190 6677 -10843 -51018 -30019 22996 16239 -24334 -10279 24330
536 24330 -8419 -59100 -28967 29246 9230 -36856 -6354 41860 4819 -48391 -10513 45100
548 45100 4437 -53175 -14307 39757 -699 -48053 8100 67383 12937 -52948 -9892 39582
560 39582 -13864 -58560 12562 75233 11622 -53209 -521 49898 -10919 -55463 16849 66917
572 66917 -10074 -69343 -140 58828 758 -40982 26659 58977 -30048 -82733 -1532 60613
584 60613 279 -41637 21787 49264 -33616 -74101 8353 58760 -10500 -56264 4440 35703
596 35703 -31541 -59740 15679 52961 -18175 -62282 -5615 26239 -32216 -60010 4361 41166
608 41166 -15226 -54506 -9800 17712 -33403 -62721 -9047 33413 -6554 -50392 -26275 753
620 753 -29799 -53338 -7574 36378 -440 -61639 -55287 -11580 -10467 -31685 -6381 30322 -5846
633 -5846 -78689 -75115 -518 27728 -11825 -22580 6962 -16794 -85325 -71077 29689 63065
645 63065 -12753 -55771 -14296 -9822 -70227 -53688 54525 73886 -37511 -90113 -12907 23296
657 23296 -40975 -38167 65168 69122 -64498 -107456 7383 58726 -24801 -36834 68997 68306
669 68306 -74628 -103097 36159 83347 -25184 -43832 72324 70283 -75928 -88330 67302
680 67302 103596 -25670 -46394 72526 62179 -83245 -72108 98079 120637 -23678 -43424
691 -43424 73356 53222 -83489 -48508 122710 121237 -34783 -47145 72366 54213 -62486
702 -62486 -13427 134991 99104 -59089 -52757 73759 61473 -35004 17859 132723 69029
713 69029 -73224 -42277 81372 62163 -23516 25394 111075 41898 -65839 -13760 89566
724 89566 53587 -22885 22363 83599 18844 -52183 9846 83748 38035 -16443 28864 62606
736 62606 -1812 -44482 15832 61757 21145 -2072 38793 40627 -21526 -35043 21532 41821
748 41821 8955 9381 33838 5200 -41940 -16690 36886 29479 -460 12466 14522 -36347 -53382
761 -53382 11211 51601 11323 -15174 10862 -2747 -63282 -47123 41490 53396 -21994 -38702
773 -38702 8268 -10699 -70329 -27819 66457 40469 -60765 -57768 13282 -9162 -68793 -9868
785 -9868 77869 18496 -92275 -60171 30605 -1847 -68059 -2730 74960 -5542 -109268 -47196
797 -47196 53156 5349 -68364 -1023 67897 -22977 -111548 -26324 71736 6219 -71084 458
809 458 63573 -29176 -101661 -4941 81059 1456 -71873 5238 62825 -27897 -86512 12753
821 12753 84218 -2053 -66643 11742 62060 -24186 -70417 25352 83353 -1260 -56340 17293
833 17293 58331 -18563 -52318 35323 80532 1823 -46493 17257 52821 -8137 -31296 41597
845 41597 74392 3869 -38810 14115 49140 7462 -11474 40186 62114 5098 -31393 11174
857 11174 49173 24566 1470 28935 46035 8135 -22025 9293 49869 37275 5139 11304
869 11304 32133 15718 -11782 6046 47087 42865 1240 -7006 23014 25771 -4577 -1177 41069
882 41069 44535 -6090 -24131 17588 35143 -2533 -12467 33182 42856 -13706 -36531 16486 42149
895 42149 -5217 -25791 23433 38222 -22929 -45256 18342 47385 -10949 -39476 15037 33603
907 33603 -30765 -50865 19612 46829 -21576 -50811 11453 32568 -33520 -52155 19125 39551
919 39551 -34647 -59549 10725 32917 -34328 -51278 17897 30977 -43834 -60972 11749 29601
931 29601 -38363 -51623 15960 24868 -44572 -53994 15158 23375 -44473 -52026 13095 19477 -42290
944 -42290 -44066 18048 18538 -44039 -46134 12443 13548 -40818 -37806 16298 13339 -38745 -34183 15992
958 15992 11341 -36752 -32138 12601 6814 -33869 -23921 18650 10927 -28798 -22224 12615 3915
971 3915 -28253 -16856 15368 7027 -21635 -11717 14808 6130 -17718 -8471 12299 1894 -17540
984 -17540 -6377 13522 6559 -7485 708 12791 2564 -9625 -1280 10078 4236 -2768 4506
997 4506 11644 5018 371 5242 9047 3486 559 4108 6503 5082 6279 9675 8638 5475 6465
1012 6465 6611 3733 3454 7082 8046 5374 6409 10936 9565 3913 4639 8039 6317 1019 4608 10604
1028 10604 7785 3019 5999 11205 6635 384 4037 8575 4196 -1427 4242 10297 6321 381 4368
1043 4368 8698 2661 -2616 2482 7776 2789 -1667 3508 7336 1948 -2436 2361 5175 -377 -3500
1058 -3500 1050 4352 93 -2304 1646 3983 -712 -3783 69 1793 -1735 -3751 -14 1317 -2014
1073 -2014 -3659 -743 113 -2734 -3894 -1750 -806 -3169 -3963 -1930 -1326 -3297 -3852 -2419 -2267 -3139 -3961
1090 -3961 -2625 -2896 -3891 -4201 -3575 -3181 -3428 -3762 -3371 -2691 -3087 -3666 -3863 -3889 -4012 -4133 -4120 -3535 -3102 -3137
1110 -3137 -3271 -2950 -3436 -3545 -3996 -4074 -3867 -3689 -3385 -2368 -1886 -2429 -2644 -2642 -3061 -4103 -4211 -3184 -2803 -3034
1130 -3034 -2553 -1446 -1349 -2253 -3395 -2985 -2850 -3511 -3487 -2012 -984 -1798 -1891 -719 -913 -2761 -3703 -2422
1148 -2422 -2000 -3081 -2981 -209 1057 -1115 -2398 -301 297 -3275 -4405 -1092 811 -2058 -2871 1689
1164 1689 3030 -2069 -3885 424 1880 -3399 -4499 1400 3718 -1721 -2881 3744 4662 -2753 -5150
1179 -5150 1940 3218 -3791 -4120 5282 6933 -2144 -4019 5392 5695 -4181 -4696 5413 6275 -3931
1194 -3931 -3577 7994 8257 -3368 -3537 7330 6238 -5946 -4263 9277 8839 -3549 -2244 10186
1208 10186 8224 -5140 -3188 9964 7560 -5874 -2764 11265 9343 -4007 -1151 11886 7924
1221 7924 -5593 -2407 10927 8239 -5033 -380 12756 8432 -3988 -471 11873 6951 -5508
1234 -5508 -614 11823 7634 -3218 978 11645 6670 -3858 436 9963 6208 -3026 504 8964
1248 8964 5866 -1436 1585 8280 5160 -1615 295 5837 4492 355 1242 5158 4597 1185 494 3244
1264 3244 3748 2004 -240 527 3497 3333 -533 -745 3730 4343 -1489 -3327 3210 4975 -2571 -5470
1280 -5470 3984 6785 -3630 -7491 3555 7210 -5298 -9384 3885 8240 -6808 -11423 4336
1293 4336 9058 -7870 -12813 4934 9017 -10587 -14619 6035 10065 -11225 -15516 6150 9571
1306 9571 -13090 -16267 7475 10175 -14944 -18037 6823 9543 -15112 -16721 8609 9271 -17202
1319 -17202 -18110 8031 9255 -16331 -16604 8773 7075 -18545 -17038 9141 8800 -15899 -15528 7366
1333 7366 4933 -17488 -13955 9819 7531 -15898 -14734 5535 4288 -13921 -9938 8829 4863
1346 4863 -14534 -12813 4367 4330 -8354 -6420 5030 1232 -11175 -8748 4427 5310 -3524 -5130
1360 -5130 -196 -227 -4074 -3010 2598 4653 296 -5110 -4735 1995 5683 486 -3357 1950 5268 -2522
1376 -2522 -6290 6036 14168 -180 -11748 1564 14662 2336 -8927 7506 18171 -3563
1388 -3563 -18013 7913 27915 4162 -16580 5344 21812 -4975 -18775 16556 36835 -883
1400 -883 -27626 5671 29629 -1707 -18049 21173 37763 -11386 -35950 11688 41815 1694
1412 1694 -21148 19489 33721 -18989 -36580 23064 50761 -2172 -29109 16433 32013 -20568
1424 -20568 -31714 32127 51201 -12759 -38388 15859 34179 -18237 -26785 36337 46299 -23986
1436 -23986 -43182 18853 37236 -17438 -24225 35879 38073 -31806 -42564 24042 38433 -18363
1448 -18363 -24999 31756 28738 -36705 -38183 29451 38800 -20137 -26096 24995 19378 -38938 -31908
1461 -31908 33710 36255 -22600 -28853 17864 13124 -34785 -22736 34003 28542 -28381 -31522 13132
1474 13132 12129 -25141 -14361 28984 16605 -32176 -30376 11785 14152 -17048 -11379 18589 7567
1487 7567 -29213 -23753 12268 14065 -13145 -13806 7837 3815 -19806 -15768 9409 10978 -10852
1500 -10852 -15190 1692 5129 -9764 -12449 2299 7488 -5477 -11954 -156 7561 -3700 -13903
1513 -13903 -4944 8449 3662 -8367 -3591 7263 -569 -15391 -7420 13579 12255 -8366 -10304
1526 -10304 5550 3597 -12858 -5437 20013 16614 -13139 -17184 7064 10496 -8490 -2770 22932
1539 22932 15352 -19293 -19987 12340 18594 -4949 -3180 21291 11532 -23032 -18663 20380 25146
1552 25146 -4633 -6233 17315 8577 -22520 -12573 27210 27035 -7784 -11525 12358 7344 -18091
1565 -18091 -5072 30897 23875 -13435 -15961 10814 8963 -11566 793 28743 16189 -19092
1577 -19092 -16876 12274 12385 -6576 1960 21723 7222 -21481 -12666 15550 14661 -4368 -359
1590 -359 12563 -80 -18979 -7015 16451 12045 -5817 -3309 6440 -2323 -13392 -1841 13252
1603 13252 6795 -7109 -5033 1944 -2756 -7338 529 8194 1734 -7295 -6081 -1952 -2827 -3235 1036
1618 1036 2540 -1173 -4801 -5950 -5498 -3050 400 195 -3272 -2805 -2150 -5724 -8010 -1523 3668 -1482
1634 -1482 -8118 -4293 183 -5536 -8860 577 6382 -3214 -11460 -4078 2934 -5601 -10356 844 7639
1649 7639 -4599 -12966 -1689 5611 -5032 -11085 2136 8130 -6026 -13436 621 7638 -4500
1662 -4500 -10487 3178 8640 -6842 -13290 1949 8849 -5004 -9611 5162 9383 -7100 -12091
1675 -12091 3496 9511 -4503 -8868 5543 8772 -6770 -9781 5949 10650 -3895 -8010 5151
1688 5151 7492 -6454 -7607 7878 10340 -3658 -6717 5518 6927 -5114 -5203 8224 9255 -4256
1702 -4256 -5624 5988 7079 -3267 -2654 7680 7033 -3917 -4187 5811 6625 -1395 -1100 6720 5482
1717 5482 -2669 -2079 5518 5566 -952 -889 5085 4650 -1519 -581 4850 4849 -243 -292 3783 3773 -289 100 3838
1736 3838 4096 796 175 2662 3211 603 402 2798 3765 1034 19 2055 2699 1161 448 2010 2987
1753 2987 1358 17 964 2633 1595 537 1457 2547 1259 151 825 2489 1890 236 792 1795
1769 1795 1557 346 706 1744 1754 179 429 1742 1328 108 507 1349 1156 199 257 1052 922 23 -132
1788 -132 973 889 111 -131 350 790 -217 -363 667 725 -422 -683 171 148 -153 -867 -174 512 -576
1807 -576 -781 -71 -162 -1318 -1190 -358 -728 -1728 -1259 -275 -988 -1842 -1506 -1077 -1167 -2186 -1348 -946 -1687 -2050
1827 -2050 -1818 -1280 -1731 -2516 -1910 -1689 -2509 -2293 -2146 -2009 -2447 -2836 -2246 -2418 -2876 -2907 -2251 -2086 -2707 -2869
1847 -2869 -2437 -2289 -2693 -2928 -2484 -2603 -2992 -2969 -2694 -2343 -2800 -2517 -2471 -2359 -2840 -2703 -2254 -2432 -1940 -2378
1867 -2378 -2051 -2017 -2587 -2273 -1698 -1184 -1724 -1721 -1460 -1437 -1556 -1451 -875 -1153 -990 -682 -771 -1040 -420 417 217
1888 217 -543 -477 386 -65 -273 662 1936 899 62 1065 1979 1138 62 2192 3707 1869 226 2177
1906 2177 3731 1924 922 3849 5101 1628 496 3403 5447 2232 1505 5267 6148 1713 148
1921 148 4937 6706 2611 1532 6470 6991 1171 467 6480 8068 2607 771 6339 6585 692 516
1937 516 7636 8574 1239 47 6471 7119 342 365 7930 8046 122 -674 6922 7213 -278 -576 7551
1954 7551 6790 -1152 -1346 6734 6247 -1748 -1278 6627 6367 -2002 -2200 5520 4458 -3013 -2055 6038 5480
1971 5480 -3007 -3589 3718 3721 -3370 -2428 4886 3849 -4620 -6080 1632 3510 -2494 -2877 2002 1550 -5968
1988 -5968 -6640 1205 4230 -1466 -4643 -546 -125 -5209 -5986 1240 4592 -1617 -7144 -3953 -14 -3255
2004 -3255 -5010 643 4216 -2056 -9078 -5516 1448 -360 -4701 -683 4042 -1826 -10212 -6146 4133
2019 4133 3013 -5023 -2523 4024 -1317 -11300 -5548 7914 5891 -5783 -4539 4285 -342 -11053
2033 -11053 -3645 12085 8416 -8271 -7338 5108 2025 -8669 -714 15462 7769 -12084 -9452
2046 -9452 7806 6344 -6039 1245 15453 5152 -15246 -8607 13107 10890 -5223 -324 13431
2059 13431 3029 -15342 -4415 18555 12908 -7548 -3246 11796 2951 -12383 520 20889
2071 20889 10627 -11157 -5026 12568 4855 -9643 2505 19590 6649 -13130 -3716 14525
2083 14525 6554 -8379 1965 16800 3503 -12942 -1743 15396 5881 -8823 1085 13825
2095 13825 2636 -10894 -18 13289 3447 -8834 698 12202 1978 -9013 -81 9994
2107 9994 1189 -7196 1006 9354 715 -8545 -1297 6345 851 -4767 758 5811 -1605 -7787 -2412
2122 -2412 4304 1543 -2097 292 1053 -2990 -6384 -2806 2241 2787 99 -2836 -4055 -3610 -2954 -1456
2138 -1456 1149 3635 418 -6812 -8174 -2214 1401 -720 -685 3233 -468 -10092 -10109 2405 6617 -1262
2154 -1262 -4164 1434 -1102 -11860 -9117 7496 10269 -4060 -9136 -19 -135 -10620 -5773 11055
2168 11055 10685 -8242 -13067 1107 3359 -7551 -3603 12625 8159 -12716 -13927 4560 7858
2181 7858 -5495 -2973 11127 5233 -15029 -12431 8885 10703 -5081 -4491 9288 3496 -14346
2194 -14346 -9416 11938 11892 -6144 -6403 7146 3128 -11907 -5818 13466 10717 -7790 -8047 6157
2208 6157 3376 -9140 -3148 12792 8249 -9138 -8399 5747 4397 -6334 -1835 10561 5428 -9264
2222 -9264 -7805 5509 5225 -4621 -2383 7394 3410 -8542 -6813 4908 5582 -2568 -3065 4298 2394
2237 2394 -6397 -6302 3293 5647 -1625 -3961 882 1786 -4825 -6066 1584 5782 -309 -5521 -1823 1754
2253 1754 -2400 -5592 166 5945 681 -7175 -4547 2348 -500 -6120 -992 6178 1138 -8805 -6292
2268 -6292 3545 2128 -5626 -2003 6898 1075 -10495 -6683 6084 4752 -5889 -3275 6374 909
2282 909 -10868 -5902 8484 6302 -6885 -4818 6036 1475 -9951 -3707 10646 6827 -8198
2295 -8198 -6025 6180 2931 -8638 -2129 11412 5548 -9682 -6027 7744 4638 -7165 -1152
2308 -1152 11410 4051 -9893 -4460 9393 5451 -6128 -1096 9994 3482 -9283 -2781 10672
2321 10672 5729 -6161 -851 9167 3160 -7616 -575 10649 4795 -5549 -473 8664 2890
2334 2890 -5736 399 9859 4102 -5149 -88 7868 2292 -4939 615 8519 2992 -4377 -26 6062
2349 6062 1568 -4268 739 7008 2469 -3606 -151 4479 1383 -2480 997 5102 1106 -3126 -1019
2364 -1019 2928 1443 -1756 486 2683 115 -3347 -1479 2133 1573 -902 -766 745 -470 -1973
2379 -1973 -1273 1047 933 -1026 -2025 -688 -95 -1495 -1478 -30 578 -1085 -2488 -1336 -135 -764 -1917
2396 -1917 -1033 95 -1041 -2607 -1643 253 -356 -2215 -1711 625 -439 -2727 -1752 568 390 -1995
2412 -1995 -1488 940 465 -2162 -1642 1275 613 -1623 -1253 1514 456 -1889 -972 1932 1490 -1412 -619
2429 -619 1723 1178 -908 174 2820 1963 -638 -45 2319 1963 -106 1094 2910 2403 -27 1027
2445 1027 3230 2767 836 1477 3039 2449 567 1774 3533 2905 1197 1985 3042 2538 1828 2192 3461
2462 3461 3157 1761 2320 3372 2541 1987 2341 2982 2747 1746 2659 2645 2437 2072 2247 2617 2523 1846 2033
2481 2033 1993 2010 1680 1652 2000 1620 1365 1134 1648 1425 919 801 995 826 747 678 472 565 155 -206 181 271
2503 271 -31 -411 -592 -80 -510 -560 -716 -645 -778 -1118 -1075 -1091 -1369 -1324 -1593 -1336 -1480 -1685 -1885 -1569 -1963 -2142
2525 -2142 -2302 -1910 -1970 -2527 -2633 -2132 -2385 -2768 -2725 -2659 -2340 -2926 -2758 -2396 -2333 -2944 -2983 -2031 -2752 -2556 -2811
2546 -2811 -2292 -2560 -2909 -2424 -2070 -2342 -2869 -2706 -2362 -2256 -2915 -2478 -1967 -2282 -2858 -2457 -1568 -1807 -2532 -2278
2566 -2278 -1239 -1397 -1967 -1601 -809 -1314 -1689 -1360 -724 -861 -1646 -900 -540 -655 -1150 -1072 206 -402 -1291
2585 -1291 -767 102 25 -984 -309 507 361 -1151 -230 767 223 -1081 -680 1178 399 -897 225 1588
2603 1588 280 -952 -132 1316 563 -732 257 1260 456 -873 53 1394 851 -725 -71 729 531
2620 531 -475 24 1364 530 -1197 -341 556 362 -598 -409 543 38 -1451 -846 206 360 -696 -1069
2638 -1069 -426 -568 -1055 -1236 4 90 -1361 -1720 -1370 -308 -1251 -1989 -635 -230 -1499 -2963 -1642 -208
2656 -208 -1177 -2154 -1286 -177 -1887 -2975 -1382 -259 -1366 -3412 -1858 -448 -1808 -3905 -1868 348
2672 348 -1567 -3785 -2379 -430 -1796 -4078 -1727 436 -1677 -4596 -2364 543 -1432 -4033 -1742
2687 -1742 957 -1450 -4101 -1838 978 -1139 -3861 -1445 1181 -1174 -3823 -1278 1923 -1000 -3874
2702 -3874 -1351 1887 -623 -3517 -623 2005 -400 -3205 -483 2556 -325 -2850 -484 2565 154
2717 154 -2108 494 2941 515 -2442 366 2948 688 -1023 784 2646 656 -1593 700 2871
2732 2871 1537 -522 838 2379 958 -631 1072 2847 2140 522 762 2041 1861 819 945 2806
2748 2806 2534 620 -212 1382 2730 1807 945 1880 2787 794 -487 1123 3442 2079 -411 837
2764 837 2887 1600 -828 872 4519 2437 -1766 -339 3831 2001 -1879 130 4026 1690 -3117
2779 -3117 -946 3993 2498 -2951 -803 4248 1592 -4009 -1356 4841 2072 -4684 -2187 4775 1447
2794 1447 -5044 -1490 4967 1430 -6002 -2303 4953 1838 -5584 -2438 5070 666 -6487 -2297 5496
2809 5496 1452 -6495 -2549 4790 703 -6688 -2177 5398 854 -7562 -2823 5291 697 -6881 -1929
2824 -1929 5655 391 -7730 -2197 5883 1042 -6649 -1795 5214 194 -6862 -1589 5805 1237 -6527
2839 -6527 -1968 5044 524 -5430 -617 5845 732 -5801 -1782 4863 901 -4520 -241 5127 950
2854 950 -5146 -1070 5062 1789 -3480 -768 4131 1403 -4142 -484 4889 2935 -2731 -1072 3524
2869 3524 1935 -2033 294 4771 2474 -2699 -1702 3339 3290 -321 234 3501 2019 -2464 -1417 3705
2885 3705 4839 238 -1308 1787 2203 -1226 -936 4061 5002 -392 -3596 732 3333 638 -426 3494
2901 3494 4061 -1674 -4328 1000 5366 2336 -1540 1132 2525 -2098 -3959 2106 6529 1145 -4024
2916 -4024 -887 2461 -687 -3258 2383 5694 -670 -6086 -1891 3560 752 -2925 1532 3989 -2156
2931 -2156 -6842 -768 4927 770 -4079 -266 2919 -2515 -5821 353 5061 -188 -5105 -1113 2615
2946 2615 -2032 -5273 197 4433 -1210 -5538 -1038 2993 -1619 -4521 44 3417 -1353 -5131 -866
2961 -866 2424 -1304 -3934 301 2752 -1790 -4687 -827 2224 -511 -3124 147 2247 -1833 -4069
2976 -4069 -657 2699 -202 -2151 -341 1271 -1272 -2767 114 2096 -191 -2168 -893 568 144
2991 144 -1462 28 1124 -21 -1894 -982 826 1323 -348 -515 498 272 -841 61 1489 1227 -674
3008 -674 -1606 307 1341 532 -317 402 900 -613 -1554 857 2438 1147 -959 -606 842 353 -793
3025 -793 864 2750 489 -2147 -1241 1558 1345 -823 88 1751 -158 -2469 -672 2743 1502 -1627
3041 -1627 -509 1793 -239 -2404 -67 2849 728 -2700 -812 1851 434 -1905 -615 2319 62
3056 62 -3349 -1027 2022 407 -2417 -792 1718 -455 -2968 -1048 1583 -50 -2589 -1021 1652
3071 1652 -171 -2712 -785 1568 -531 -2795 -830 1195 -546 -2474 -910 937 -322 -2199 -769
3086 -769 782 -612 -2460 -927 936 -540 -1922 -850 9 -857 -2069 -775 794 -444 -1941 -1060
3102 -1060 366 -751 -1551 -528 451 -389 -1405 -928 224 -449 -1121 -669 481 -327 -1026 -624 190 11
3120 11 -724 -619 264 110 -825 -486 423 132 -468 -380 354 531 -270 -183 188 739 96 -426 379 514 189
3141 189 -38 502 948 116 -54 464 462 498 -59 381 882 114 -7 693 1128 644 158 460 1081 394 55
3162 55 422 735 679 64 700 833 369 79 593 1224 548 326 631 923 485 -57 599 472 329 -224 235
3183 235 878 294 -76 339 526 296 372 284 601 402 -137 382 739 382 -59 231 253 421 227 -45 203
3204 203 485 294 205 399 -81 -45 6 370 -189 208 53 -163 1 -176 93 682 35 153 173 405 253
3225 253 22 123 394 84 -104 156 311 248 -19 -77 194 -100 349 441 355 529 251 538 639 703 361 454
3247 454 485 298 559 494 382 334 757 640 711 408 904 787 532 841 847 533 887 1188 1253 873 997 727
3269 727 1024 1000 834 1138 775 657 461 1126 818 748 774 1069 806 356 725 902 643 507 477 782 351
3290 351 730 241 877 928 205 209 581 509 103 280 776 138 -37 411 384 -7 -88 -46 110 -138 -320 -231 1
3313 1 -304 -750 -411 -241 -385 -1231 -528 7 -795 -1005 -767 -489 -895 -1532 -1126 -334 -574 -1568 -931 -717 -1049
3334 -1049 -1703 -804 -465 -940 -1827 -1533 -685 -825 -1803 -1141 -532 -1176 -1631 -1272 -1142 -1274 -1565 -1318 -499 -1123
3354 -1123 -1811 -1395 -614 -758 -1239 -556 -254 -1030 -1564 -1180 -101 -20 -1036 -472 -60 -450 -1245 -915 364
3373 364 275 -601 -501 212 -327 -790 -506 1068 837 -711 -473 285 635 68 171 1410 1043 -178 -699
3392 -699 730 1175 657 348 1655 1616 -175 -814 1336 2198 822 418 1446 1624 -165 -190 1828 2686
3410 2686 693 -5 1151 1639 226 -67 2201 2800 777 -637 809 1774 268 166 2195 2968 397
3427 397 -1072 717 2375 664 33 1986 2226 -356 -1797 1035 2729 412 -409 1108 1678 -847
3443 -847 -1714 1431 2706 182 -1205 629 1461 -722 -1443 1316 2303 -642 -2165 239 1639 -581
3459 -581 -1515 1117 1224 -1190 -2372 476 1499 -787 -2030 -227 638 -1555 -2322 404 995 -1822
3475 -1822 -2442 -203 977 -834 -1773 -119 198 -1934 -2406 177 1401 -557 -2035 -1165 -350 -1236 -1409
3492 -1409 333 1474 -877 -2705 -1613 88 -323 -849 302 351 -1720 -2761 -1272 860 755 -338
3508 -338 -410 -446 -1510 -1776 -365 1520 1160 -737 -1237 -666 -965 -960 195 1747 1261 -1113 -1764 -154 326
3527 326 275 266 1711 1264 -1547 -2095 -7 1356 993 66 980 805 -1613 -1865 756 2939 1372 -492
3545 -492 349 590 -1658 -1550 2085 3233 638 -1350 -454 1039 -399 67 2700 3330 -56 -2498 -610
3562 -610 1916 1084 646 2246 2173 -1081 -2680 285 2771 1371 -227 925 1345 -1250 -1770 1258 3456
3579 3456 818 -1075 -28 942 -425 -1071 1439 2600 54 -1889 -42 1387 200 -774 531 1233
3595 1233 -651 -1944 -18 1839 17 -1462 -261 1176 -150 -1049 -35 1195 -547 -1820 -472
3610 -472 1453 190 -1301 -944 90 -456 -1462 -269 1376 556 -1598 -1582 -36 -194 -1069 -420 921
3627 921 113 -2085 -1744 382 702 -696 -1006 103 26 -1908 -1525 598 1115 -872 -1419 6 -28 -1799
3645 -1799 -1198 768 1365 -861 -1930 10 105 -788 -1490 892 1271 -933 -2091 -202 989 -812 -1357
3662 -1357 959 1651 -1305 -2070 296 1448 -112 -818 1217 1326 -1059 -2045 652 2147 250 -1054
3678 -1054 797 923 -965 -1332 1106 2676 194 -1126 679 1420 -277 -862 1385 2812 -152 -1430
3694 -1430 765 1659 -202 -360 1800 2298 -321 -1500 811 2138 474 -144 1368 1651 -365 -1107
3710 -1107 1403 2229 302 -530 1048 1524 -228 -267 1324 1981 401 -677 820 1321 254 -252 1105
3727 1105 1434 275 -519 706 922 -205 -185 356 1355 -99 -624 255 901 -51 -823 393 1196 102
3745 102 -879 -141 480 -227 -761 84 758 -330 -918 -463 400 -167 -563 -240 119 -580 -1336 -507 294 -37
3765 -37 -844 -624 119 -158 -1234 -698 -72 -285 -608 -1136 -178 -400 -907 -796 -161 -439 -1145 -883 -1013 -737
3785 -737 -1095 -1331 -498 -47 -1305 -1311 -555 -560 -1461 -1320 -497 -604 -1021 -978 -517 -207 -735 -1134 -354 -438 -1140 -765
3807 -765 -509 -92 -820 -1333 -208 270 -726 -851 -338 114 -426 -930 -171 -242 -410 -733 81 -127 -750 -746 176
3828 176 304 -361 -100 201 327 -218 -109 247 447 326 -32 470 346 315 22 345 246 253 65 648 552 50
3850 50 654 811 958 364 114 846 723 610 613 952 889 975 647 607 872 578 722 621 780 652 785 677
3872 677 914 799 800 571 529 450 538 525 542 811 483 912 664 739 362 99 536 482 438 298 510 384 65
3895 65 191 236 366 145 274 242 187 5 106 -67 -104 -36 -143 -373 -18 6 108 -177 -252 -1 -81 -72 -241 -531
3919 -531 -465 -373 -98 -217 -334 -845 -324 -466 -647 -575 -384 -641 -447 -796 -851 -848 -480 -435 -825 -557 -605 -551 -692
3942 -692 -802 -331 -564 -425 -516 -435 -632 -676 -476 -651 -314 -353 -125 -455 -398 -310 -278 -517 -298 36 -364 -511
3964 -511 -210 -46 57 -385 -64 0 -186 -273 2 -34 -119 -43 219 -168 303 31 266 406 443 221 669 250
3986 250 232 468 315 589 334 371 621 712 373 575 731 401 325 537 559 451 333 801 346 682 505 82
4008 82 306 555 561 252 249 771 246 208 570 403 490 390 178 503 454 -30 109 236 116 -3 -142 335 438
4031 438 -170 3 -248 323 -122 -130 109 -66 -289 -251 -202 -215 -747 -56 -189 -288 -484 -722 -158 -359 -516 -301
4053 -301 -64 -293 -727 -528 -206 -545 -382 -618 -50 -471 -1072 -480 -109 -274 -883 -586 -324 -453 -647 -697
4073 -697 -562 -377 -756 -660 -302 -336 -608 -349 -198 -160 -593 -529 -106 -92 -524 -463 -345 -29 -416 -197 202 -104
4095 -104 -224 -119 -73 224 -64 195 -23 333 -84 -231 606 582 348 246 516 229 300 88 436 676 661
4116 661 506 533 577 21 361 866 1364 904 457 -44 415 369 124 1106 983 723 -57 208 778 528 669
4137 669 675 641 196 -375 52 865 1139 649 -27 116 15 -263 219 1108 820 63 -205 -24 251 -22 187
4158 187 781 523 -474 -766 -43 -5 -178 -158 144 30 -751 -862 112 519 -246 -514 -35 -112 -943 -1168 -125
4179 -125 85 -686 -880 103 -52 -1014 -1129 -187 453 -718 -982 -404 -356 -986 -1217 -465 39 -677 -1200 -280
4199 -280 -309 -1003 -1060 64 -24 -551 -1074 -500 -355 -793 -728 -110 435 -540 -831 -242 226 -535 -753 330 340
4220 340 -659 -677 -7 604 -149 -619 480 641 -126 -745 525 1043 262 -250 699 678 -46 -453 550 1358
4240 1358 329 57 919 1138 -76 -202 737 1647 806 189 502 1177 558 139 1016 1742 584 -198 639
4259 639 1099 588 115 913 1540 962 76 453 1075 1011 264 1095 1280 610 -461 205 1272 783 -514
4278 -514 533 1357 625 -321 388 1377 270 -311 85 497 358 -321 -149 832 312 -879 -183 420 82
4297 82 -566 -93 525 -57 -649 -122 414 -114 -992 -554 252 193 -1026 -1007 56 -469 -1189 -673 -202 -246 -869
4318 -869 -848 -461 -644 -1067 -936 -227 -167 -1012 -1023 -632 -659 -869 -768 54 -216 -1511 -1709 -551 -382 -629 -650
4339 -650 -172 -718 -1400 -1313 -556 220 -422 -373 -389 -617 -1090 -733 312 281 -619 -977 -232 27 -409 -469 229
4360 229 212 -478 -494 -10 153 212 -332 238 319 -284 -300 433 681 -4 -82 25 590 393 270 722 802 371
4382 371 -49 -14 733 240 92 628 1121 477 406 443 865 726 156 652 792 485 326 603 969 223 -32
4403 -32 607 483 806 494 479 689 745 -137 343 507 357 448 435 374 404 208 638 523 696 195 -5 711
4425 711 448 74 -171 544 191 208 -139 170 187 -75 121 245 200 84 -319 25 167 -406 -340 148 -46
4446 -46 -333 -675 1 133 -56 -474 -275 -39 -359 -479 -209 150 -426 -456 -379 -313 -416 -527 -7 119 -287
4467 -287 -302 -628 -31 -230 -273 -128 38 -799 -598 -196 125 -302 -225 -239 26 -257 -673 -114 95 -115 -363
4488 -363 -593 339 -75 -169 -39 122 111 -245 -57 109 292 -149 111 258 154 -355 -17 308 94 -173 127
4509 127 381 -144 103 302 265 77 52 240 606 403 -53 216 395 244 157 39 408 193 43 292 108
4530 108 195 38 108 183 -39 -30 -136 237 165 -297 271 266 205 -94 -93 -27 -267 191 -133 -195 -80 -84 69 116 36 -46
4556 -46 -152 -150 17 -77 -253 -126 -146 -243 -208 -121 -16 89 -177 -199 -134 -444 -55 -183 -294 -67 -174 -191 -300 -30
4580 -30 -167 -105 -139 -344 -109 8 -339 -53 -153 -464 -389 -105 -209 -287 -379 -262 -60 -122 -64 -285 -112 -18 -217
4603 -217 -233 146 75 -258 -283 -19 59 -88 -223 -77 -68 -41 13 -122 41 -184 93 179 154 462 -234 75 61 198
4627 198 10 -52 378 345 133 299 303 245 -123 120 48 208 320 125 421 461 224 359 447 104 219 280 158
4650 158 476 584 407 450 246 390 243 379 292 356 270 330 61 479 185 454 202 488 407 133 544 187
4672 187 387 -47 134 -144 237 -51 119 59 398 235 130 -204 -37 275 101 -49 -119 119 215 -64 -230
4693 -230 -277 -245 171 -67 12 -198 -98 -108 66 -337 -226 -292 -412 -611 -35 -49 -387 -110 -43 91 -365 -333 -266
4716 -266 -446 -478 -216 -201 -377 -403 -429 -501 -74 -323 -338 -563 -132 -307 -437 -360 -167 -561 -280 -50 -310 -477
4738 -477 -296 0 108 -325 -267 63 -225 -374 -34 221 -456 -476 -345 -127 -3 -238 29 325 87 -72 -38
4759 -38 -44 -51 103 51 281 -23 -291 230 290 317 91 259 281 262 -204 659 371 369 202 246 128 18 52 184 524
4784 524 755 272 324 -24 300 178 242 701 358 561 207 403 478 247 368 685 267 519 332 767 475
4805 475 -39 394 343 -8 306 194 381 110 609 261 303 -115 -52 196 281 321 0 62 135 168 -185 192 -73
4828 -73 169 24 -217 -206 308 -286 -125 -66 -208 -149 -425 -113 223 8 -311 24 -236 -71 -227 -120 -364
4849 -364 -454 -447 -223 -182 -405 -447 -323 -188 -558 -270 -261 -30 -601 -504 -328 -620 -574 -452 -442 -87 -709 -345 -591
4872 -591 -510 -547 -414 -316 -305 -353 -866 -589 -346 -149 -299 78 -421 -908 -926 44 -40 -123 -414 -17 -297 -596 -355
4895 -355 166 151 119 -151 -136 -380 -403 163 340 240 -268 -177 -321 287 322 238 401 112 -411 -452 335 435 483
4918 483 604 167 0 -98 -240 488 665 619 374 263 123 -57 239 947 663 202 220 -40 77 328 862
4939 862 881 385 -204 -69 245 606 487 693 314 -55 -173 425 283 698 452 393 -53 123 587 284 388
4960 388 455 438 628 -24 101 129 188 139 231 322 -28 89 40 444 155 43 -421 125 -72 -12 -81 65 51 -388
4984 -388 -72 198 -132 -43 -232 -140 -205 -415 -86 -82 -80 -294 -322 -137 -83 -684 -471 98 -301 -295 -126 -280 -160 -260
5008 -260 -206 -89 -212 -600 -342 -181 -81 -246 15 -256 -590 -619 -315 162 -223 -238 -70 -369 -468 -289 365
5029 365 62 33 -44 -338 -514 8 -36 527 376 143 -372 -46 -82 113 303 338 -50 -171 -607 -99 333 284
5051 284 436 235 191 -278 19 189 386 477 385 -348 46 -5 167 567 472 21 -79 -159 -246 175 370 16
5073 16 74 114 -60 -94 161 434 40 106 96 295 172 7 -1 366 474 -31 -190 183 -305 -328 84 340 89
5096 89 -433 -292 -57 -46 -118 -87 18 -126 -195 28 -120 -421 37 109 -36 -7 -472 -253 125 218 -139 -237 -211
5119 -211 -248 -238 -213 6 -244 -129 160 -44 -59 -391 -219 93 187 -413 -248 -154 -597 -255 2 231 -70 -221
5141 -221 9 -343 75 -119 182 198 -5 126 254 -8 -53 -52 45 156 -399 -95 -62 -102 164 161 485 41 -61
5164 -61 -76 247 61 148 298 514 217 97 -5 143 -162 233 458 378 -2 245 214 278 -24 196 193 204 452
5187 452 40 275 290 135 255 148 241 -24 -107 291 200 131 -95 330 231 236 -92 -39 85 126 6 59 90 -137
5211 -137 23 91 284 -91 -151 113 -258 -68 -12 -146 -57 -217 -235 -161 -378 -408 -262 -188 -247 -90 176 -289 -163
5234 -163 -179 91 27 -348 -182 -325 94 -237 -151 -123 -335 -142 -276 -268 -172 -395 -57 -198 -114 -109 -34 -214 -227 -447
5258 -447 -335 -245 -323 -254 -425 -448 -112 -176 -188 -393 -233 -224 -43 26 201 -253 71 -106 -283 213 -202 -283 51
5281 51 -77 -95 -11 -33 79 233 239 138 184 210 192 21 45 -18 354 -7 108 225 3 199 2 354 130 67
5305 67 65 229 173 75 174 164 91 261 232 235 -56 -42 111 123 313 321 281 1 398 115 288 361 184 109 227 236 155
5332 155 49 53 34 -161 167 261 117 -80 -119 -312 -39 -262 -82 -149 -98 175 -239 7 3 -69 -222 55 -57
5355 -57 -143 63 -230 -14 -170 -299 -31 -14 -145 -371 -5 -230 -195 -316 -608 -36 17 -321 -500 -362 -449 -237
5377 -237 -7 -88 -223 31 -61 -390 -93 -177 -118 -96 -326 -163 -171 -121 -77 -162 -77 -200 -26 180 -107 0 66 33
5401 33 -192 127 -243 143 70 23 -66 34 -251 128 107 -337 234 195 -124 -130 189 308 225 -2 50 289 46
5424 46 319 -230 162 -91 247 20 186 532 202 32 208 277 428 19 468 468 353 206 31 97 221 167
5446 167 82 121 279 500 365 135 131 122 -12 106 199 258 22 50 65 137 434 5 114 263 -17 477 -107 27
5470 27 100 17 -138 -118 227 -1 113 228 -193 -243 -256 -320 -36 -144 -129 -361 -219 -301 -122 -287 113 -287 -103
5493 -103 116 -219 -65 -92 101 -316 -516 38 -247 -145 -280 114 -53 -258 -378 -169 -139 -38 -341 -79 107
5514 107 -44 -72 -135 -49 28 -225 24 -293 -339 -300 -256 219 122 261 31 -475 -149 116 132 38 -47 -275 47 123
5538 123 52 -91 317 47 89 442 -198 86 -129 541 565 10 -140 20 328 63 275 519 663 -15 331
5559 331 360 233 241 204 251 262 109 53 439 134 254 -25 166 178 96 353 424 63 202 87 315 75 167 219
5583 219 373 -78 -360 88 484 20 -345 215 307 89 -128 -264 49 -95 -39 -179 -395 -166 -185 145 -200
5604 -200 -213 -47 -83 73 -261 -175 -90 -235 -441 -613 -216 -157 -302 -316 -366 -670 -630 -132 28 -156 -266 -357 -391
5627 -391 -561 -534 -326 -1 -238 -725 -453 -357 -430 -266 -168 -115 -467 -423 -434 -377 -515 42 -72 -91 -235 -710 -127
5650 -127 -156 -200 -285 -127 -220 -577 -181 -83 -144 -32 182 -27 -148 -278 -122 54 165 56 104 121 -239 -145 21
5673 21 349 98 -34 292 142 -466 217 359 669 -22 237 580 349 -160 143 332 390 53 -210 288 299
5694 299 -26 307 460 332 21 152 360 304 102 321 710 377 -31 341 554 496 58 136 747 367 225
5715 225 -47 643 488 -135 214 424 29 -58 155 207 381 203 3 136 304 59 331 294 159 92 26 348
5737 348 -57 -92 205 204 -234 -452 -49 -52 108 -182 -360 -130 -116 -454 -46 16 -126 149 -276 -305 -186 -253 -278
5760 -278 -444 -201 -227 -125 -261 -384 -326 -482 -354 -105 -176 -94 -440 -70 -240 -390 64 -170 -426 -536 -387
5781 -387 -156 -200 -323 -254 8 -231 -324 -497 -114 -107 -362 -280 -408 -411 -418 -143 137 -53 -403 -81 -416 -14 -453
5804 -453 -41 129 -5 -312 -353 163 -235 69 -67 170 255 -146 144 314 205 -454 244 522 209 -444 56
5825 56 172 31 -340 270 630 84 119 15 270 -227 -310 369 458 219 -79 364 337 108 38 36 204 468 150
5848 150 -54 99 19 347 202 247 412 -174 57 353 288 -64 6 43 209 1 -85 413 82 55 170 68
5870 68 -33 -88 120 -105 66 -395 -62 120 -20 27 -21 -86 -174 416 -133 -286 -213 -154 -370 -92 -66 -140 -276
5893 -276 -354 -175 60 -488 -126 -73 -145 -13 -228 69 -284 -169 -348 218 -153 -251 -505 13 221 -147 10
5914 10 -14 -226 -332 -166 -427 -370 -164 -89 169 -146 5 -382 113 -163 -145 -19 -84 13 -75 -115 39 -154 -121
5937 -121 -380 86 -73 -131 -186 207 83 71 -35 155 -71 -192 -26 -90 68 -191 191 400 151 252 -56
5958 -56 -73 87 -52 397 -124 126 141 350 227 -10 -84 121 176 173 70 54 61 222 7 240 23 188 140 264
5982 264 44 13 171 197 66 -122 209 68 92 -110 -182 -41 131 261 311 316 268 331 -101 3 101 182 -29 288
6006 288 107 83 -326 -7 177 66 -68 -148 123 31 224 80 48 -161 -20 -82 183 43 248 226 -95 -283
6028 -283 -61 -215 19 -18 -102 -53 111 -3 -26 17 -189 24 123 23 91 -46 -234 -318 131 39 16 -22 -115 -147
6052 -147 -218 -120 5 40 128 53 -167 -153 20 -198 -226 -437 -156 -118 213 233 -380 -66 -86 -145 -249 -146 102 -284
6076 -284 -260 -173 23 -123 -202 -139 -308 -149 -82 -266 -126 -220 -200 -38 -69 182 -37 -71 -218 -141 -201 40 -151 68
6100 68 144 -92 65 151 -20 -30 -62 58 -77 -136 290 -31 -63 41 -54 -154 -9 -101 50 118 225 -89 102
6123 102 223 289 -219 263 315 -29 292 -128 -247 89 -217 222 -42 45 23 148 157 6 97 93 36 -127 46
6146 46 313 209 190 197 -129 169 203 -73 188 89 376 85 -141 210 -48 220 98 -60 20 -14 149 191 208
6169 208 79 32 -22 144 -159 -3 -110 -46 30 -142 250 218 -6 59 -77 113 -41 -40 -336 122 -30 -123 -182
6192 -182 119 229 67 -49 439 -38 -113 -112 -38 287 -157 5 -90 -43 -29 234 -42 49 -58 -116 -90 -430 -141
6215 -141 -105 259 105 -43 -35 53 -202 -209 57 45 220 -63 -434 243 -189 178 -16 -253 -139 -162 65 104 -346
6238 -346 -228 75 -245 -148 160 188 14 14 -288 172 -13 19 -114 -52 15 -36 4 -5 144 212 -68 -299 -50 113
6262 113 -93 20 53 -159 -146 -130 228 146 -176 -65 105 57 58 -225 43 217 -110 -35 -9 104 -327 -311 349
6285 349 -118 -7 68 57 -48 198 224 -33 192 -53 -167 -99 48 138 400 148 175 125 -301 -210 -133 177 -72
6308 -72 -74 358 -77 -95 12 231 -8 45 -222 188 -18 -504 -41 218 -198 -196 2 279 -258 -187 -128 293 -7
6331 -7 -446 254 88 -9 -64 76 1 -357 -285 100 188 141 -301 -235 99 24 -469 -121 149 -102 -189 127 157 110
6355 110 -298 125 -9 -201 -610 -203 103 87 -230 -67 -135 -203 -215 98 197 49 -155 -157 -143 -190 -189 412 -157 -72
6379 -72 -495 -41 72 -261 -30 2 -195 -177 21 -296 189 -260 231 112 47 -16 224 196 -130 186 -322 158
6401 158 45 -89 254 45 138 88 -110 -171 177 354 21 54 -18 51 -9 -82 95 322 185 -11 236 252 269
6424 269 -293 -101 323 -296 -220 260 407 88 -329 380 464 309 -302 234 447 -189 170 218 194 -27 -31 223
6446 223 441 165 -174 99 315 191 -265 429 201 -21 -194 -23 297 122 -111 302 178 -144 -146 102 337
6467 337 -47 -257 104 205 65 -304 146 175 -243 82 27 218 -263 -234 115 128 -105 -430 -8 22 -295 -38
6489 -38 46 -46 -380 -326 -201 -218 -276 -119 -247 -77 -175 -427 8 -62 -361 -286 -113 -26 -160 -608 -275 -181 -200 -225
6513 -225 -56 -77 57 -135 -155 -94 -13 -418 -358 -129 -45 -269 -269 51 -45 -169 42 -375 -210 63 98 264 -130
6536 -130 83 -151 170 -49 -70 -190 -233 13 158 200 -113 185 -38 -54 40 214 -39 -177 157 166 380 68
6558 68 374 517 93 156 238 211 193 109 -48 368 305 55 20 147 178 132 99 167 389 24 178 510 90 -310
6582 -310 -143 574 126 235 -13 140 -123 -262 151 65 80 213 79 -101 31 101 242 198 40 -63 124
6603 124 185 148 -166 -113 -427 -2 30 -2 109 56 -166 -214 88 -359 -365 88 -220 -365 -47 -282 79 -214 298
6626 298 -173 -212 -117 -89 -469 37 -217 -105 28 26 -26 -142 -95 -120 -186 -132 -274 -223 -31 -188 -306 -79 -176 -194
6650 -194 -435 117 -437 -489 -266 117 -283 -280 -77 -57 -199 -1 -305 -158 -331 -195 -328 66 -72 -234 -73
6671 -73 160 -205 -5 -294 78 -3 1 -16 242 428 193 238 -108 -29 16 157 64 -49 229 -72 -201 227 -153
6694 -153 44 317 218 296 271 302 89 311 82 400 195 240 246 227 412 579 148 140 333 291 381 110 440 422
6718 422 412 192 -241 233 298 192 99 284 89 180 209 210 121 -31 361 143 235 271 -4 188 549 415 -155
6741 -155 269 424 -68 40 77 -138 -137 130 121 -173 -369 -62 -38 -40 127 -159 -211 -172 -183 -175 -203 -251 -322 -185 -2
6766 -2 -304 156 -63 -225 -362 -276 -246 -376 45 55 58 -190 -259 -308 -271 -594 -150 -156 -135 -117 -34 -229 -366 32 -406
6791 -406 22 118 -196 -292 -43 -256 -154 223 -175 -23 -11 -71 -100 -338 34 -115 93 -19 -16 -242 -45 17 9
6814 9 -71 -238 -142 224 -18 -124 47 209 -9 -166 -160 -195 220 89 199 -161 -74 119 215 243 115 453 -11
6837 -11 226 286 182 287 61 376 285 184 114 -195 -55 501 72 191 -10 -21 514 287 177 63 419 209
6859 209 28 256 157 -73 61 252 79 221 -59 -156 110 -23 -82 224 112 44 268 90 215 249 -74 -17
6881 -17 -121 153 -66 -125 104 -68 -242 -141 476 -86 83 -119 52 157 210 -282 -192 -124 268 -218 -1 256
6903 256 -162 -57 -300 -82 -121 -119 -40 -162 -340 -140 -28 72 -206 -220 -32 -135 18 -115 -15 -164 -252 -325
6925 -325 -6 152 -100 -277 -94 -140 -261 -232 -79 -260 -9 -238 -125 120 -155 -137 161 175 -273 -200 112 202
6947 202 -231 -67 -206 -25 -171 -227 226 190 -86 -161 101 183 8 -355 -156 72 -380 30 93 206 249 -216
6969 -216 359 167 35 51 -141 322 373 328 137 307 198 -228 392 418 303 -113 260 47 324 180 10
6990 10 383 279 119 -63 0 293 -286 74 259 33 -214 54 -289 213 272 234 223 -202 55 13 255 -27
7012 -27 -39 15 -176 -52 79 61 -229 133 -32 -280 -431 -138 -156 205 167 126 -319 -302 -112 -174 -318 -359 136
7035 136 -278 -529 161 -192 -252 -229 -284 271 -136 -345 -150 182 -19 -280 -143 -49 -92 -446 -297 -71 53 -275
7057 -275 -387 48 -102 -245 -181 -22 -130 -129 -166 -10 -98 1 -61 192 28 -70 -97 -385 -53 -203 -39 -73 -83 -116
7081 -116 -485 135 129 -250 -87 -234 300 58 -130 103 369 25 -238 98 33 -231 15 257 77 -54 -92
7102 -92 124 -185 -45 263 -52 60 411 95 217 183 49 209 468 304 151 -52 212 178 28 18 294
7123 294 200 333 139 177 -27 116 127 -161 258 337 13 56 241 273 6 123 244 -9 98 -95 264 246
7145 246 -276 -83 28 24 -159 -126 -67 221 -281 -167 157 18 -46 554 -134 83 -445 -57 196 78 -44 -348
7167 -348 -214 38 136 132 -125 73 71 -231 -162 -308 -319 -348 -45 -87 -103 -163 -32 311 -508 -256 145 -1 -301 -201
7191 -201 52 -111 -320 -212 169 -21 -207 -450 59 90 -8 -356 -195 -57 -244 -148 150 134 -207 -213 104 153
7213 153 -31 61 52 409 10 92 205 -122 -184 -367 120 -156 -275 -73 -143 138 96 -99 132 163 -164 279 174
7236 174 156 42 115 169 182 -49 12 15 48 327 -508 32 309 332 92 -41 -121 102 292 81 420 221 23
7259 23 -212 -79 66 157 161 85 -11 -101 223 -24 66 275 145 132 -134 234 162 153 -124 -15 158 -115 -54 -197
7283 -197 158 526 -129 160 52 -181 147 95 49 -140 34 -162 -365 98 -93 -231 6 220 20 -170 -81
7304 -81 127 180 22 -268 -160 24 -237 -110 159 -181 -8 -458 -103 85 35 -462 201 87 -35 -158 98
7325 98 -226 69 -416 -202 82 -430 -169 73 22 -96 -283 212 247 -44 -255 -286 77 -65 75 137 107 -540
7347 -540 -46 -71 159 -119 -335 -74 -93 150 -50 -58 102 -113 -259 -65 342 -173 77 457 7 -236 42
7368 42 44 35 76 -106 211 -28 32 -139 -342 -179 -91 -54 64 -36 140 -218 -67 -91 4 -67 -105 400 293 -94
7392 -94 125 297 142 29 -30 -217 184 -31 94 186 136 295 119 -84 62 181 19 -128 24 437 140
7413 140 68 67 273 -57 114 86 208 -127 -130 -65 -60 -156 -5 153 175 236 -255 19 42 -247 267 33 -254 -270 145
7438 145 222 -395 149 -13 -45 -165 -41 -51 45 -8 -233 -212 -155 -156 -80 197 33 -13 -35 156 -11 101 20 -234
7462 -234 101 -111 26 -174 149 -21 45 53 2 -51 -332 13 319 -118 -85 38 -158 -392 228 259 -55 -5 -109
7485 -109 32 -104 -166 55 -132 133 -52 221 187 -390 104 298 191 -67 -210 61 -75 72 20 41 280
7506 280 -73 -31 -122 -17 56 -64 -282 -138 -156 113 -109 208 -208 176 50 -91 198 -180 33 170 -94
7527 -94 -88 54 -128 11 234 184 -45 -94 238 3 -67 -315 32 101 -11 -140 96 80 244 -93 102 80 -143
7550 -143 -181 205 -24 -3 -184 -76 -403 24 -213 48 -312 63 -91 -111 -395 -329 -162 87 -208 -384 51
7571 51 35 -363 -8 112 -308 -120 -318 60 344 -27 -173 -103 11 -25 -10 232 47 -319 -161 -16 -283 57
7593 57 -43 161 -126 -44 -144 0 -163 -354 -98 141 24 -269 230 -184 72 -144 -186 227 -35 -132 -16
7614 -16 34 -67 -111 -112 88 -124 215 233 70 -164 -128 38 -168 19 138 -125 -321 23 219 -5 97 395
7636 395 -20 94 214 195 -98 -121 -28 179 -162 -92 -25 122 -440 -212 305 -90 -7 -16 36 318 6 92 -96
7659 -96 27 -40 -159 167 -242 120 164 -102 23 -230 -309 12 72 268 127 -41 72 95 -361 -118 -30 -112 148
7682 148 42 153 66 -82 24 -172 12 -120 -137 116 195 -353 -155 69 8 188 -28 309 85 21 -53 56
7704 56 164 -3 -17 65 206 -188 -355 85 -98 -29 -48 6 111 67 -358 181 105 -40 -207 1 -51 -187 -7
7727 -7 -210 129 61 -113 116 73 -139 -43 133 36 -53 -172 126 41 -154 -146 125 203 43 -5 135 53 -182 -75
7751 -75 -90 83 -303 198 172 -76 117 -76 163 175 224 -298 158 281 -283 -28 59 199 223 20 -107 -107 -128
7774 -128 136 -169 -152 -93 -163 141 213 336 235 -122 -27 -86 46 -62 305 5 -378 -25 114 254 -140 114
7796 114 354 309 -76 -13 -21 178 -225 -101 202 -14 284 -113 242 72 -122 -283 242 80 -140 91 88 126
7818 126 -254 -71 344 37 -344 29 18 305 -9 -168 -91 -223 -282 -347 195 247 -308 28 89 269 -63 209
7840 209 320 177 8 396 -169 263 -305 -205 234 157 -137 54 95 71 -57 36 146 12 48 -50 339 -245
7862 -245 -137 78 319 158 134 -71 244 123 -17 -36 178 122 -78 -164 88 304 82 -263 224 -16 13 278
7884 278 343 -171 18 133 -58 378 -10 -153 56 400 -23 -225 -281 -55 -224 -51 -119 -34 -40 -21 -52 -72 -19
7907 -19 -137 160 2 -119 -349 -54 -37 -304 338 -85 -398 -126 102 105 -51 71 -132 -369 198 -71 -628
7928 -628 -110 192 247 -504 -396 6 69 13 6 149 -147 -315 144 94 138 -159 -48 -37 -160 -53 23 298 7
7951 7 58 -160 -7 249 -383 -273 -59 6 106 17 130 -59 -110 -170 38 139 -84 97 -128 223 -37 176
7973 176 -16 136 -72 -131 228 134 -27 53 -1 -27 -61 181 68 86 -235 122 210 -76 204 -6 84 185 113
7996 113 -104 117 -138 416 78 139 332 85 -32 53 14 343 109 118 18 -147 -3 -28 208 173 -62 26 -136
8019 -136 69 285 -68 42 -21 104 -42 196 -147 343 -208 174 54 -32 195 -28 159 0 -328 -48 -205
8040 -205 -163 94 -143 183 -167 24 33 146 235 135 -214 150 -159 43 10 -30 -152 -53 -99 -294 -333 -185 -234
8063 -234 -151 171 45 21 -449 43 -43 -10 210 -77 -217 -137 99 -146 -45 242 -68 92 -181 -13 -135 -30
8085 -30 -279 24 118 -111 -23 -8 99 144 314 -17 -77 -43 138 -26 83 121 -15 -227 -34 94 -177 69 -113
8108 -113 -240 -277 -66 301 89 -150 144 150 -215 -116 -80 186 -133 -47 23 360 -53 -15 258 255 217 121 -55 -48 122
8133 122 -213 277 -61 210 -69 143 -6 129 163 97 -84 -10 87 81 -12 15 348 31 94 -325 140 -106 -124
8156 -124 -206 -142 60 -44 87 -178 -149 20 -65 -44 61 206 446 -72 6 -46 -98 -384 163 -266 -116 -197 -26
8179 -26 89 -173 -132 -315 74 98 21 266 -31 301 -50 190
8191A90
##END NTUPLES=NMR FID
##END=
