##TITLE=1H_PHBP2507
 CDCl3, 8 sc, 
 25.7.2019
##JCAMPDX= 6.0         $$ Bruker NMR JCAMP-DX V2.0
##DATA TYPE= NMR FID
##DATA CLASS= NTUPLES
##ORIGIN= UXNMR, Bruker Analytische Messtechnik GmbH
##OWNER= root
$$ XWIN-NMR		Version 3.5
$$ Thu Jul 25 15:11:28 2019 Russian Standard Time (UT+4h)  she@DPX200
##.OBSERVE FREQUENCY= 200.13155
##.OBSERVE NUCLEUS= ^1H
##.DELAY= (6, 6)
##.ACQUISITION MODE= SIMULTANEOUS
##.ACQUISITION SCHEME= undefined
##.AVERAGES= 8
##.DIGITISER RES= 18
##SPECTROMETER/DATA SYSTEM= spect
##.PULSE SEQUENCE= zg30
##.SOLVENT NAME= D2O
##.SHIFT REFERENCE= (INTERNAL, D2O, 0, 15.7039)
##AUDIT TRAIL= $$ (NUMBER, WHEN, WHO, WHERE, WHAT)
$$ ##TITLE= Audit trail, XWIN-NMR		Version 3.5
$$ ##JCAMPDX= 5.01
$$ ##ORIGIN= Bruker BioSpin GmbH
$$ ##OWNER= she
$$ F:/spectra/data/she/nmr/H-F/1/audita.txt
$$ ##AUDIT TRAIL=  $$ (NUMBER, WHEN, WHO, WHERE, WHAT)
(   1,<2019-07-25 15:10:28.90 +0400>,<she>,<DPX200>,
      <created by zg, POWCHK disabled, PULCHK disabled
       configuration hash MD5:
       00 E9 B6 7A A2 85 ED C7 34 08 36 98 17 FE 4E 26
       data hash MD5: 16K
       5A 5B BA 9F 38 B7 DB CE B4 0F F8 ED E2 DE 90 00>)
$$ ##END=
$$ 
$$ hash MD5
$$ 48 80 02 B2 1A C7 96 3F 20 0F 68 2C F3 F6 0E 8B
##$RELAX= 
##$RELAX= 
##$RELAX= 
##$RELAX= 
##$RELAX= 
##$RELAX= 
$$ Bruker specific parameters
$$ --------------------------
##$DU= <F:/spectra>
##$EXPNO= 1
##$NAME= <H-F>
##$PROCNO= 1
##$TYPE= <nmr>
##$USER= <she>
##$AMP= (0..31)
100 100 100 100 100 100 100 100 100 100 100 100 100 100 100 100 100 100 
100 100 100 100 100 100 100 100 100 100 100 100 100 100 
##$AQSEQ= 0
##$AQ_mod= 1
##$AUNM= <au_zg>
##$AUTOPOS= <>
##$BF1= 200.13
##$BF2= 200.13
##$BF3= 200.13
##$BF4= 200.13
##$BF5= 200.13
##$BF6= 200.13
##$BF7= 200.13
##$BF8= 200.13
##$BYTORDA= 1
##$CFDGTYP= 0
##$CFRGTYP= 5
##$CHEMSTR= <none>
##$CNST= (0..31)
1 1 145 1 1 1 1 1 1 1 1 1 1 1 1 1 1 1 1 1 1 1 1 1 1 1 1 1 1 1 1 1 
##$CPDPRG= <>
##$CPDPRG1= <>
##$CPDPRG2= <>
##$CPDPRG3= <>
##$CPDPRG4= <mlev>
##$CPDPRG5= <mlev>
##$CPDPRG6= <mlev>
##$CPDPRG7= <mlev>
##$CPDPRG8= <mlev>
##$CPDPRGB= <>
##$CPDPRGT= <>
##$D= (0..31)
0 1.2 0 0 0 0 0 0 0 0 0 0.03 0 0 0 0 0 0 0 0 0 0 0 0 0 0 0 0 0 0 0 0 
##$DATE= 1564053028
##$DBL= (0..7)
120 120 120 120 120 120 120 120 
##$DBP= (0..7)
150 150 150 150 150 150 150 150 
##$DBP07= 0
##$DBPNAM0= <>
##$DBPNAM1= <>
##$DBPNAM2= <>
##$DBPNAM3= <>
##$DBPNAM4= <>
##$DBPNAM5= <>
##$DBPNAM6= <>
##$DBPNAM7= <>
##$DBPOAL= (0..7)
0.5 0.5 0.5 0.5 0.5 0.5 0.5 0.5 
##$DBPOFFS= (0..7)
0 0 0 0 0 0 0 0 
##$DE= 6
##$DECBNUC= <off>
##$DECIM= 24
##$DECNUC= <off>
##$DECSTAT= 4
##$DIGMOD= 1
##$DIGTYP= 9
##$DL= (0..7)
0 120 120 120 120 120 120 120 
##$DP= (0..7)
150 150 150 150 150 150 150 150 
##$DP07= 0
##$DPNAME0= <>
##$DPNAME1= <>
##$DPNAME2= <>
##$DPNAME3= <>
##$DPNAME4= <>
##$DPNAME5= <>
##$DPNAME6= <>
##$DPNAME7= <>
##$DPOAL= (0..7)
0.5 0.5 0.5 0.5 0.5 0.5 0.5 0.5 
##$DPOFFS= (0..7)
0 0 0 0 0 0 0 0 
##$DQDMODE= 0
##$DR= 18
##$DS= 0
##$DSLIST= <SSSSSSSSSSSSSSS>
##$DSPFIRM= 0
$$ [...]
##$SUBNAM2= <"">
##$SUBNAM3= <"">
##$SUBNAM4= <"">
##$SUBNAM5= <"">
##$SUBNAM6= <"">
##$SUBNAM7= <"">
##$SUBNAM8= <"">
##$SUBNAM9= <"">
##$SW= 24.9336996594482
##$SWIBOX= (0..15)
0 0 2 0 0 0 0 0 0 0 0 0 0 0 0 0 
##$SW_h= 4990.01996007984
##$TD= 16384
##$TD0= 1
##$TE= 0
##$TE2= 300
##$TE3= 300
##$TEG= 300
##$TL= (0..7)
0 120 120 120 120 120 120 120 
##$TP= (0..7)
150 150 150 150 150 150 150 150 
##$TP07= 0
##$TPNAME0= <>
##$TPNAME1= <>
##$TPNAME2= <>
##$TPNAME3= <>
##$TPNAME4= <>
##$TPNAME5= <>
##$TPNAME6= <>
##$TPNAME7= <>
##$TPOAL= (0..7)
0.5 0.5 0.5 0.5 0.5 0.5 0.5 0.5 
##$TPOFFS= (0..7)
0 0 0 0 0 0 0 0 
##$TUNHIN= 0
##$TUNHOUT= 0
##$TUNXOUT= 0
##$USERA1= <user>
##$USERA2= <user>
##$USERA3= <user>
##$USERA4= <user>
##$USERA5= <user>
##$V9= 5
##$VALIST= <valist>
##$VCLIST= <CCCCCCCCCCCCCCC>
##$VD= 0
##$VDLIST= <DDDDDDDDDDDDDDD>
##$VPLIST= <PPPPPPPPPPPPPPP>
##$VTLIST= <TTTTTTTTTTTTTTT>
##$WBST= 1024
##$WBSW= 4
##$XGAIN= (0..3)
0 0 0 0 
##$XL= 0
##$YL= 0
##$YMAX_a= 66036
##$YMIN_a= -88409
##$ZGOPTNS= <>
##$ZL1= 120
##$ZL2= 120
##$ZL3= 120
##$ZL4= 120
##$ABSF1= 10
##$ABSF2= 0
##$ABSG= 5
##$ABSL= 3
##$ALPHA= 0
##$AQORDER= 0
##$ASSFAC= 0
##$ASSFACI= 0
##$ASSFACX= 0
##$ASSWID= 0
##$AUNMP= <proc_1d>
##$AZFE= 0.1
##$AZFW= 0.1
##$BCFW= 1
##$BC_mod= 2
##$BYTORDP= 1
##$COROFFS= 0
##$CY= 11.3945322036743
##$DATMOD= 1
##$DC= 2
##$DFILT= <>
##$DTYPP= 0
##$F1P= 18.9103706918063
##$F2P= -1.10871071338519
##$FCOR= 0.5
##$FTSIZE= 0
##$FT_mod= 4
##$GAMMA= 1
##$GB= 0.15
##$INTBC= 1
##$INTSCL= 1
##$ISEN= 128
##$LB= 0.24
##$LEV0= 0
##$LPBIN= 0
##$MAXI= 10000
##$MC2= 0
##$MEAN= 0
##$ME_mod= 0
##$MI= 1.114404
##$NCOEF= 0
##$NC_proc= 0
##$NLEV= 6
##$NOISF1= 3.799351
##$NOISF2= 2.8
##$NSP= 1
##$NTH_PI= 0
##$NZP= 0
##$OFFSET= 15.70392
##$PC= 1
##$PHC0= -8865.103
##$PHC1= 17.20097
##$PH_mod= 1
##$PKNL= yes
##$PPARMOD= 0
##$PSCAL= 0
##$PSIGN= 0
##$REVERSE= no
##$SF= 200.130013532006
##$SI= 16384
##$SIGF1= 3
##$SIGF2= 2
##$SINO= 400
##$SIOLD= 16384
##$SREGLST= <1H.CDCl3>
##$SSB= 0
##$STSI= 0
##$STSR= 0
##$SW_p= 3612.71676300578
##$SYMM= 0
##$S_DEV= 0
##$TDeff= 0
##$TDoff= 0
##$TI= <>
##$TILT= no
##$TM1= 0
##$TM2= 0
##$TOPLEV= 0
##$USERP1= <user>
##$USERP2= <user>
##$USERP3= <user>
##$USERP4= <user>
##$USERP5= <user>
##$WDW= 1
##$XDIM= 8192
##$YMAX_p= 0
##$YMIN_p= 0
$$ End of Bruker specific parameters
$$ ---------------------------------
##NTUPLES= NMR FID
##VAR_NAME=  TIME,          FID/REAL,        FID/IMAG
##SYMBOL=    X,             R,               I
##VAR_TYPE=  INDEPENDENT,   DEPENDENT,       DEPENDENT
##VAR_FORM=  AFFN,          ASDF,            ASDF
##VAR_DIM=   8192,          8192,            8192
##UNITS=     SECONDS,       ARBITRARY UNITS, ARBITRARY UNITS
##FACTOR=    0.0002004,     1,               1
##FIRST=     0,             0,               0
##LAST=      1.6414764,     0,               0
##MIN=       0,             -88409,          0
##MAX=       1.6414764,     66036,           0
$$ Real data points
##PAGE= N=1
##DATA TABLE= (X++(R..R)), XYDATA
0 0 0 0 0 0 0 0 0 0 0 0 8 -8 8 -8 8 -16 16 -21 24 -25 32 -40 44 -48 56 -66 77 -88 97 -112 125 -141 157
33 157 -176 197 -221 245 -272 302 -334 371 -411 453 -502 557 -616 687 -764 854 -959 1080
51 1080 -1228 1404 -1631 1922 -2322 2901 -3822 5522 -9758 46235 47118 5448 66036 64677 7923
66 7923 -8149 48013 44509 -9336 -10963 41297 28216 -26627 -23087 19468 -3792 -51388 -34959
79 -34959 3548 -25252 -61560 -31456 2056 -32834 -61693 -24223 1181 -39387 -57343 -11031
91 -11031 7262 -37233 -45553 6199 15992 -33091 -35590 16598 17294 -31441 -23498 30263 24173 -23022
105 -23022 -7337 43179 26806 -21926 -4409 37069 10538 -33381 -7854 29413 -1253 -36022
117 -36022 -2402 28647 -8161 -37892 -3868 14938 -28808 -50088 -11013 632 -42265 -50295
129 -50295 -5237 220 -42157 -40853 2690 -2601 -45332 -34975 8369 -4495 -43049 -21658 21114
142 21114 2245 -32221 -4393 32131 4635 -25873 8127 39046 5844 -18127 21327 45957
154 45957 8199 -10442 29239 43636 1236 -11734 29340 36202 -6885 -11115 30652 30638 -12109
167 -12109 -10182 28065 17732 -23674 -15030 20426 3866 -32351 -14474 18758 -2006 -31880
179 -31880 -7676 19165 -8407 -33069 -3555 17545 -14124 -30964 4846 21341 -12087 -20515
191 -20515 18368 26382 -10679 -12939 26360 26764 -11635 -6898 33073 27263 -10029 1564 39316
204 39316 25298 -11316 4724 38079 17572 -16064 5123 34644 9190 -18967 6754 30058
216 30058 -178 -23042 5799 22571 -10805 -26309 5598 16130 -17385 -24801 9019 12060
228 12060 -22351 -22008 11850 7695 -25589 -17415 16198 6515 -24232 -8649 22985 6239 -21997
241 -21997 -1079 26657 3926 -21059 4750 28199 1472 -18597 10463 28642 -1958 -17651
253 -17651 13233 24915 -8410 -19172 12481 18132 -15794 -19787 12293 11214 -22042 -19737 10899
266 10899 3928 -27638 -19270 9351 -3264 -31012 -16017 10269 -7570 -31146 -9928 12704
278 12704 -9529 -28269 -2312 15866 -10046 -23179 6597 19564 -9074 -16838 15382 22268
290 22268 -8177 -10566 21990 22861 -8261 -5625 26377 20987 -10280 -2180 27394 15664 -13900
303 -13900 -999 25102 7992 -18515 -1573 20604 -890 -23120 -2202 15163 -9549 -26498
315 -26498 -2268 10027 -16508 -27611 -673 6581 -21036 -25379 2819 5013 -22330 -20341 8754
328 8754 5727 -20718 -12847 15569 7291 -17203 -3698 22761 9429 -12810 5282 28367 10208
341 10208 -9023 12391 30999 9184 -7157 16703 30822 5413 -6719 18792 27145 -207
353 -207 -8133 17885 20492 -8244 -10915 14606 12030 -16161 -13592 11619 3656 -22705 -14278 8945
367 8945 -3437 -26898 -13306 7572 -8817 -28142 -9502 8607 -10927 -25791 -3254 11217
379 11217 -10703 -20906 4699 14709 -8933 -14276 12708 17939 -7100 -7592 19655 19815 -5528
392 -5528 -1658 24528 19255 -5504 2465 26253 15999 -7479 4122 24852 10218 -11087 3583
405 3583 20939 2276 -15266 2446 15398 -5574 -18955 1234 9991 -13095 -21662 409 5270
418 5270 -18633 -21653 1750 2227 -21332 -19214 4901 898 -21467 -13940 9469 1373 -19269 -7300
432 -7300 14626 2451 -16149 -126 18932 3241 -12563 6566 22167 3436 -9291 11542
444 11542 22828 1273 -8242 13795 20525 -2765 -8016 14481 16305 -7632 -8533 13466 10299
457 10299 -13260 -9739 11111 3210 -18586 -10361 8806 -2482 -21799 -9375 7709 -6682 -23000
470 -23000 -6885 7622 -9382 -21940 -2533 9123 -9971 -18043 3706 11550 -8663 -13301 9467
483 9467 13342 -7620 -7910 15161 14866 -6148 -2479 19634 14730 -5748 1039 20786 12029 -7470
497 -7470 2794 20397 7880 -9154 4001 18323 2214 -12204 3077 13905 -4861 -15895
509 -15895 1809 9397 -10446 -17004 2293 5843 -14679 -17497 2715 2415 -18481 -16178 4416
522 4416 754 -18414 -11725 8384 1254 -16897 -6462 12226 1304 -15084 -1104 15297 1867
535 1867 -11219 5193 18708 2822 -7664 10218 19860 1388 -6368 12815 18466 -768 -4674
548 -4674 14841 16656 -3043 -3514 15095 12282 -7568 -4581 13071 7021 -11117 -3882 12652 2958
562 2958 -13295 -3052 11382 -1612 -15671 -2391 9507 -5151 -15626 691 10145 -6379
574 -6379 -13666 4086 10329 -7873 -12130 6320 9197 -8976 -9388 9847 9559 -8616 -5776 12461
588 12461 8184 -9930 -4314 12405 4543 -11950 -2663 12650 1818 -12651 -915 11564 -2159
601 -2159 -14459 -910 8553 -6873 -15761 91 7061 -9598 -14954 2277 6036 -11731 -14016
614 -14016 3561 3742 -13659 -11694 6639 3933 -12461 -6597 10578 4392 -11234 -3041 12646
627 12646 3544 -10211 967 14664 3401 -8051 5576 16626 2678 -6945 7475 15095 -726
640 -726 -7303 8538 13411 -3479 -7085 9280 10829 -6462 -7429 8385 6049 -10898 -8363 7321
654 7321 2495 -13390 -7364 7521 -30 -14222 -5505 7268 -3095 -14901 -3078 8048 -3959
667 -3959 -13246 1319 10634 -3275 -9715 5858 11823 -3561 -6982 9764 12626 -3137 -3655 13586
681 13586 13472 -2678 -339 15525 11737 -4340 268 15493 8753 -6420 1028 14679 5237 -8204
695 -8204 1159 12415 -188 -11532 287 8835 -5098 -13642 208 6064 -8532 -14018 664
708 664 3662 -11984 -13753 1684 1998 -13451 -11825 4102 2137 -12457 -7560 7411 2174 -11287
722 -11287 -3560 10336 2450 -9296 689 13015 3137 -7040 4946 14627 2377 -5989 7466
735 7466 14387 437 -5593 8474 12914 -2154 -5189 8932 9871 -5658 -6620 7758 5705 -9875
749 -9875 -7403 6265 1389 -13030 -7249 5300 -2114 -15004 -6737 4706 -5155 -15857 -5026
762 -5026 4695 -6286 -14227 -1548 6249 -6481 -11919 2566 7795 -5933 -8671 6664 9048 -4950
776 -4950 -4713 10412 10019 -3931 -1213 13303 10175 -3726 903 14268 8092 -4621 2550 14079
790 14079 5185 -6262 2946 12437 1422 -8113 2252 9469 -2997 -9781 1825 6401 -7121
803 -7121 -11405 1491 3663 -9941 -11365 1753 1285 -11983 -10196 3129 333 -12543 -7999 4946
817 4946 288 -11413 -4336 7465 236 -9643 -212 9906 619 -7810 3272 11736 1295 -5331
831 -5331 6778 12398 358 -3853 8916 12196 -1105 -3222 9973 10596 -2663 -2402 10258 7789
845 7789 -5310 -2762 9410 4416 -8131 -2856 7842 1285 -9488 -2276 7013 -1846 -11090 -1702
859 -1702 6019 -4378 -11332 -471 5439 -5728 -9972 1971 5530 -6537 -8646 4227 5764 -6702
873 -6702 -6591 6232 5536 -6240 -3640 8506 5405 -6207 -1685 9356 3918 -6804 -247 9598
887 9598 2316 -6788 1388 9519 295 -7170 2162 8239 -2369 -7942 2585 6581 -4464 -7831
901 -7831 3453 5454 -6117 -7083 4572 4101 -7682 -6400 5083 2819 -8440 -4443 6724 2126
915 2126 -8165 -1975 8144 1533 -7772 -31 8702 567 -6981 2231 9539 -149 -6222 4196
929 4196 9394 -1473 -5685 5022 7871 -3256 -5252 5949 6473 -4940 -4857 6327 4487 -7014
943 -7014 -4640 5654 1874 -8635 -4110 5655 14 -9286 -2876 5855 -1556 -9620 -1681 5553 -3236
958 -3236 -8884 377 6079 -3556 -7645 2918 6757 -3791 -6125 4872 6411 -4358 -4344 6627
972 6627 6239 -4352 -2704 8328 5440 -4959 -1419 8385 3576 -6072 -541 8131 1606 -6731 495
987 495 7603 -559 -7510 952 6301 -3208 -8068 1082 5129 -4904 -7972 2383 4348 -6210 -7106
1002 -7106 3555 3370 -7252 -5711 4874 2875 -6930 -3325 6724 2963 -6311 -1060 8303 2487
1016 2487 -5772 1176 9084 1988 -4913 3005 9603 1181 -4383 4713 9103 -552 -4415 5101 7567
1031 7567 -2517 -4492 5241 5728 -4676 -4363 4888 3269 -6790 -4859 4196 770 -8422 -4683 4108
1046 4108 -948 -9392 -3567 4135 -2367 -9437 -2091 4484 -3385 -8671 138 5403 -3397 -6710 2830
1061 2830 6310 -3185 -4799 5418 6680 -2935 -2637 7529 7069 -2729 -523 9008 6343 -2948 280
1076 280 9352 4854 -3854 964 8674 2729 -5072 1204 7484 -128 -6325 957 5790 -2729 -7446
1091 -7446 853 3969 -5291 -8096 895 2442 -7096 -7808 1400 1054 -8144 -6702 2420 498 -8120
1106 -8120 -4853 4125 696 -7443 -2346 5612 866 -6230 151 7233 1154 -4601 2521 8372 924
1121 924 -3472 4805 8523 304 -2489 5999 7958 -926 -2474 6364 6355 -2644 -2510 6137 4431 -4486
1137 -4486 -2573 5566 1954 -6362 -2843 4384 -382 -7936 -2864 3761 -2136 -8616 -2018 3567 -3534
1152 -3534 -8394 -722 3279 -4500 -7592 1066 3753 -4581 -5906 2985 4163 -4237 -4232 4954 4382 -4029
1168 -4029 -2106 6688 4490 -3471 -224 7528 3731 -3741 1076 7941 2587 -3844 1911 7391 840
1183 840 -4279 2529 6295 -1103 -4824 2551 4971 -2986 -5254 2606 3404 -4776 -5385 2841 2394 -6058
1199 -6058 -5020 3153 1184 -6992 -4044 3579 401 -6626 -2484 4815 -112 -6276 -724 5405 -280
1214 -280 -5696 1074 5805 -739 -4720 2534 6100 -970 -4004 3935 5748 -2171 -3070 5001 4908 -3004
1230 -3004 -2521 5240 4015 -4047 -2108 5219 2177 -5012 -1388 5188 682 -5604 -822 4934 -638
1245 -638 -6178 -296 4710 -1751 -5810 909 4467 -2880 -5509 1969 4283 -3109 -4250 3386 4043
1260 4043 -3635 -3252 4611 3626 -3883 -2094 5309 3105 -3983 -956 5853 2243 -4297 -179 5660
1275 5660 970 -4513 307 5566 -483 -4929 1153 4535 -1912 -4802 1757 3808 -3197 -4852 2329
1290 2329 3272 -4299 -4403 3043 2328 -5076 -3698 3504 2010 -4926 -2478 4264 1110 -5022 -1238 5066
1306 5066 691 -4847 383 5500 70 -4402 1543 5440 -740 -4059 2318 5214 -1660 -3835 3023
1321 3023 4498 -2649 -3390 3458 3411 -3670 -3290 3658 1969 -4816 -2587 3733 913 -5260 -2128 3769
1337 3769 -163 -5917 -1392 3866 -968 -5716 -19 3965 -1465 -5000 1008 4307 -1973 -4247 2592
1352 2592 4559 -2142 -3206 3877 4542 -2202 -1986 5006 4145 -2760 -1047 5479 3390 -2986 -496 5820
1368 5820 2309 -3512 304 5434 919 -4090 380 4769 -844 -4968 648 3828 -2505 -5213 1036
1383 1036 2852 -3795 -5384 1468 2135 -4867 -4913 2042 1482 -5126 -3597 3158 1297 -4885 -2439 4059
1399 4059 1264 -4646 -942 5028 1094 -3752 1115 5922 980 -3215 2330 6017 277 -2692 3314
1414 3314 5969 -250 -2326 4156 5169 -1592 -2294 4151 3789 -2692 -2329 3861 2369 -4237 -2153 3619
1430 3619 695 -5255 -2206 3192 -743 -6006 -1924 2658 -1927 -6205 -881 2909 -2668 -5530 324
1445 324 3228 -2975 -4964 1504 2890 -3072 -3634 3143 3520 -2958 -2116 4188 3291 -2811 -1041 5167
1461 5167 2833 -2896 1 5684 2236 -3195 832 5520 1186 -3533 1212 4820 -580 -4024 1635
1476 1635 4194 -1858 -4176 1684 3192 -3107 -4439 1688 1887 -4568 -4195 2196 1317 -5008 -3451 2383
1492 2383 716 -5294 -2436 3033 113 -4970 -905 4073 -5 -4254 299 4605 -82 -3352 1794
1507 1794 4898 -575 -2841 3008 5144 -951 -1984 3910 4576 -1249 -1732 4348 3611 -2389 -1570 4229
1523 4229 2631 -3178 -1128 4235 1375 -3912 -1086 3488 -155 -4716 -671 3298 -1150 -4981 -98
1538 -98 2789 -2014 -4706 726 2545 -3042 -4295 1262 2619 -3192 -3314 2413 2729 -3001 -2387 3344
1554 3344 2251 -3319 -1319 4073 2069 -2812 -182 4593 1631 -2888 725 4790 509 -3172 1192
1569 1192 4437 -239 -3027 1774 3975 -1332 -3039 2108 3274 -2403 -3098 2027 2204 -3305 -3129 2491
1585 2491 1501 -3793 -2498 2647 840 -4194 -1993 2796 90 -4301 -1179 2914 -277 -4125 -164
1600 -164 3339 -657 -3775 833 3312 -1202 -3214 1599 3195 -1709 -2601 2569 2986 -2226 -2178 2720
1616 2720 2597 -2561 -1697 3357 1795 -3131 -1151 3560 999 -3708 -730 3505 171 -3657 -171
1631 -171 3448 -482 -3524 773 3323 -1262 -3456 1224 3160 -1814 -2980 2039 2942 -1988 -2267 2641
1647 2641 2484 -2415 -1843 3219 2018 -2762 -1250 3581 1362 -2870 -623 3682 770 -3097 -146
1662 -146 3424 -218 -3002 403 3289 -974 -3521 967 2862 -1676 -3329 1392 2533 -2445 -2961
1677 -2961 1862 2139 -2704 -2319 2471 1699 -2980 -1659 3075 1196 -3045 -929 3552 1138 -2968 165
1693 165 3904 602 -2925 777 3909 -68 -2518 1797 3713 -742 -2440 2078 3348 -1476 -2392
1708 -2392 2456 2647 -2266 -2336 2377 1878 -3194 -2102 2398 995 -3444 -1739 2476 104 -4050 -1246
1724 -1246 2388 -678 -4196 -813 2469 -940 -3898 323 2723 -1255 -3234 1216 2907 -1537 -2678
1739 -2678 2126 2811 -1568 -1758 2976 2870 -1611 -977 3513 2524 -1770 -176 4032 1900 -2223 211
1755 211 3814 1047 -2500 596 3497 117 -2874 874 2963 -1052 -3289 743 2248 -2184 -3486
1770 -3486 734 1494 -2908 -3560 1081 1163 -3464 -3146 1340 614 -3678 -2320 1852 350 -3536 -1283
1786 -1283 2742 325 -3108 -353 3222 431 -2687 801 3558 188 -2168 1979 3738 -312 -1592
1801 -1592 2642 3706 -695 -1342 2885 3193 -1141 -1256 3129 2498 -2070 -1176 2998 1174 -2668 -943
1817 -943 2553 184 -3449 -1056 2297 -677 -4005 -645 1949 -1584 -3976 -362 1718 -1909 -3784
1832 -3784 397 1608 -2356 -3105 840 1815 -2285 -2150 1858 1777 -2083 -1194 2755 1640 -2073 -382
1848 -382 3338 1727 -1828 313 3808 1249 -1978 887 3737 515 -2010 1323 3395 -297 -2036
1863 -2036 1344 2875 -1078 -2406 1726 2109 -1867 -2449 1647 1376 -2745 -2327 1722 534 -3266 -1860
1879 -1860 1814 308 -3279 -1201 2079 -152 -3361 -645 2301 -517 -2919 109 2499 -686 -2538
1894 -2538 1027 2687 -957 -2102 2010 2742 -1076 -1553 2397 2558 -1302 -1123 2941 2286 -1799 -613
1910 -613 2995 1493 -2059 -262 3239 765 -2351 -109 2619 -90 -2749 155 2496 -721 -2932
1925 -2932 242 2056 -1441 -2813 766 1992 -1950 -2665 1141 1714 -2345 -2243 1512 1260 -2599 -1546
1941 -1546 1933 994 -2408 -998 2172 478 -2672 -534 2583 174 -2472 21 2725 -227 -2442
1956 -2442 802 2683 -748 -2224 1188 2316 -1196 -2096 1556 2046 -1621 -1728 1888 1742 -1999 -1344
1972 -1344 2168 1254 -2374 -1026 2281 1046 -2405 -597 2517 485 -2476 72 2598 -138 -2449
1987 -2449 372 2555 -567 -2232 1037 2369 -1024 -2017 1425 1965 -1253 -1869 1616 1603 -1956 -1535
2003 -1535 1841 1360 -2206 -1348 1858 788 -2525 -890 2007 295 -2525 -759 2206 -200 -2530
2018 -2530 228 2088 -365 -2359 827 2287 -711 -1835 1423 2394 -1029 -1591 1634 2514 -1278 -1204
2034 -1204 2278 1905 -1527 -656 2609 1405 -1575 -440 2546 1016 -2028 -210 2518 109 -2210
2049 -2210 41 2244 -357 -2446 280 2074 -1188 -2768 415 1720 -1574 -2609 931 1106 -1985
2064 -1985 -2396 1050 880 -2225 -1882 1515 690 -2462 -1156 1930 574 -2344 -472 2281 568 -1882
2080 -1882 209 2429 250 -1732 784 2907 190 -1730 1501 2758 -311 -1157 1595 2342 -899
2095 -899 -1256 1842 1847 -1369 -1141 1814 1216 -2090 -1292 1721 408 -2576 -1381 1707 -181 -2904 -925
2112 -925 1213 -904 -3074 -556 1321 -1201 -2844 -168 1572 -1391 -2508 582 1528 -1388 -1898 1216
2128 1216 1598 -1513 -1328 1799 1715 -1447 -583 2740 1371 -1430 13 2862 1341 -1304 480 2926
2144 2926 921 -1404 780 2759 205 -1510 961 2263 -444 -1974 1055 1867 -1239 -2018 1089
2159 1089 1335 -2059 -1779 1087 850 -2304 -1743 1116 389 -2546 -1461 1442 199 -2654 -784 1733
2175 1733 -85 -2526 -170 1860 -211 -1856 561 2257 -211 -1686 1264 2519 -537 -1214 1833
2190 1833 2396 -671 -936 2261 2014 -1097 -553 2148 1540 -1413 -353 2409 1140 -1748 -162 2006
2206 2006 242 -2175 -233 1695 -175 -2413 44 1528 -952 -2511 68 1373 -1483 -2409 467
2221 467 1027 -1692 -2013 999 1065 -1937 -1526 1274 832 -1866 -1065 1740 641 -1856 -435 2174 508
2238 508 -1776 156 2116 339 -1465 611 2346 -78 -1522 858 2244 -489 -1166 1459 2005 -672
2254 -672 -1274 1613 1661 -1015 -1239 1415 1073 -1637 -857 1318 629 -1926 -994 1490 226 -2207 -412
2271 -412 1405 -184 -2335 -170 1601 -476 -1953 140 1625 -821 -1979 549 1457 -1080 -1585 976
2287 976 1510 -1336 -1250 1369 1311 -1367 -912 1635 796 -1739 -697 1807 604 -1663 -352 1736 274
2304 274 -1729 71 1887 -204 -1656 409 1776 -557 -1711 816 1681 -718 -1398 847 1356 -1059
2320 -1059 -1401 1130 1070 -1156 -950 1380 1016 -1426 -839 1603 648 -1679 -547 1756 399 -1748 -257
2337 -257 1706 -109 -1772 117 1647 -419 -1856 216 1567 -794 -1846 641 1315 -952 -1561 1046
2353 1046 1175 -1149 -1160 1213 927 -1301 -964 1510 853 -1658 -373 1545 625 -1440 23 1952 312
2370 312 -1454 280 1893 204 -1394 632 1880 -218 -1116 947 1759 -444 -1186 1144 1492 -795
2386 -795 -1280 1190 995 -1477 -1033 1257 634 -1850 -1052 1061 260 -1886 -735 1318 -128 -2145 -215
2403 -215 1364 -473 -2011 -46 1452 -682 -1770 198 1258 -901 -1215 792 1565 -758 -1122 1298
2419 1298 1658 -1006 -831 1661 1379 -927 -314 1818 941 -1054 -143 1897 762 -1301 143 1883
2435 1883 343 -1420 333 1578 -515 -1386 431 1461 -847 -1687 277 1138 -1209 -1868 483 700
2451 700 -1714 -1710 687 456 -1998 -1341 825 274 -1944 -1071 1291 263 -1699 -470 1318 73 -1584
2468 -1584 61 1486 222 -1301 644 1910 -101 -883 1247 1899 -354 -822 1203 1652 -581 -659
2484 -659 1556 1218 -843 -718 1566 820 -1275 -626 1414 586 -1583 -643 1347 -155 -1858 -401 1096
2501 1096 -453 -2098 -104 990 -1018 -1724 183 935 -972 -1668 413 1154 -1094 -1434 957 959 -1098
2518 -1098 -808 1182 987 -1101 -496 1634 980 -897 56 1972 706 -1019 538 2007 512 -873
2534 -873 766 1851 227 -982 779 1612 -418 -1194 694 1276 -732 -1107 913 892 -1330 -1336 940
2551 940 641 -1496 -1150 927 197 -1759 -881 969 -63 -1765 -594 1017 -379 -1608 -46 1049
2567 1049 -267 -1403 138 1232 -374 -1167 450 1323 -592 -890 1016 1422 -502 -689 1495 1148
2583 1148 -987 -417 1426 846 -1063 -278 1403 493 -1063 -87 1309 201 -1381 152 1406 -262
2599 -262 -1419 251 1372 -501 -1235 348 887 -937 -1245 590 838 -952 -1076 615 827 -1192 -1137
2616 -1137 930 683 -1433 -614 1236 305 -1339 -327 1314 21 -1382 125 1375 -51 -1342 262
2632 262 1486 -310 -1193 665 1548 -489 -1139 869 1246 -632 -1076 881 1058 -818 -749 1267 719
2649 719 -943 -666 1182 862 -1141 -332 1284 309 -1261 -76 1277 30 -1389 74 1164 -101
2665 -101 -1326 169 1315 -576 -1407 515 996 -834 -1202 656 925 -923 -778 835 795 -1208 -796
2682 -796 1107 537 -1224 -600 1107 281 -1091 -392 1125 19 -1254 21 1282 -177 -1041 452
2698 452 1233 -406 -975 840 1493 -490 -782 804 1274 -345 -798 977 1038 -587 -329 1309 606 -723
2716 -723 -338 1227 674 -939 -220 1056 300 -1136 -182 1075 23 -1257 -51 1129 -539 -1252 127
2733 127 827 -927 -1299 455 736 -959 -1256 509 717 -960 -796 488 338 -1069 -656 848 319
2750 319 -1042 -260 1058 362 -780 147 1303 335 -853 506 1384 44 -476 489 1425 -288 -808
2767 -808 838 1136 -73 -862 910 1079 -767 -817 965 653 -1088 -507 640 406 -1297 -711 712
2784 712 -153 -1311 -487 938 -422 -1644 -405 551 -557 -1443 -17 840 -545 -1413 322 756 -705
2801 -705 -814 669 1018 -602 -648 1047 897 -461 -521 1106 752 -796 53 1412 859 -630 143 1575
2819 1575 564 -855 308 1305 365 -861 374 1248 -374 -948 211 917 -792 -1125 120 532 -936
2836 -936 -1303 468 473 -1169 -1188 532 -48 -1311 -763 705 145 -1397 -662 766 14 -1152 -224 902
2854 902 -99 -1196 197 1202 -364 -946 417 1260 -308 -705 759 1189 -96 -469 1113 1176 -524
2871 -524 -184 1275 974 -783 -420 1094 653 -705 -132 1079 109 -1047 -140 892 152 -1406 -198
2888 -198 790 -371 -1133 -75 439 -612 -1248 97 335 -905 -1195 220 388 -810 -824 478 481 -1061
2906 -1061 -597 609 433 -862 -359 915 365 -873 -67 1256 184 -711 172 1259 -3 -666 563
2923 563 1136 -196 -644 858 945 -313 -618 738 877 -491 -596 786 556 -708 -715 569 589 -1012
2941 -1012 -462 839 -9 -1159 -371 616 -45 -1150 28 636 -249 -975 246 633 -229 -905 130 589
2959 589 -641 -903 257 664 -557 -515 475 404 -631 -570 723 459 -778 -233 843 290 -892 -164
2977 -164 914 175 -660 132 1017 190 -801 100 863 -52 -725 363 880 -182 -576 437 726 -496
2995 -496 -729 590 797 -636 -636 915 423 -764 -298 777 397 -727 -535 725 19 -959 -108 817
3013 817 -6 -732 -108 643 -210 -654 140 762 -482 -823 217 782 -424 -586 243 631 -456 -530 580
3032 580 569 -581 -468 707 479 -740 -339 917 368 -659 38 1059 402 -473 69 1002 234 -495
3050 -495 293 932 -40 -564 399 839 -244 -638 525 714 -576 -530 389 308 -734 -706 616 290 -726
3069 -726 -390 619 117 -985 -322 687 -68 -1000 -476 569 -125 -896 -167 686 -204 -893 235 607
3087 607 -224 -701 426 676 -344 -698 602 783 -499 -285 774 675 -292 -94 1066 497 -713 36
3105 36 877 234 -605 59 969 258 -586 105 1000 -72 -881 61 753 -439 -730 127 664 -526 -712
3124 -712 288 264 -989 -736 281 261 -877 -611 486 34 -919 -425 620 171 -801 -249 684 -49 -740
3143 -740 48 819 207 -562 159 917 -56 -305 450 887 -139 -329 605 839 -84 -136 673 761 -373 -377 736
3164 736 467 -642 -391 565 280 -832 -398 672 -66 -886 -291 277 -248 -924 6 485 -410 -860 7
3183 7 462 -495 -876 62 343 -629 -706 287 456 -547 -596 504 591 -674 -428 758 387 -604 -213 963
3203 963 382 -233 165 1032 291 -402 333 809 110 -594 432 776 -39 -452 454 650 -197 -429 397 597
3223 597 -384 -585 309 457 -649 -400 383 224 -915 -325 461 -10 -793 -437 507 -368 -805 -261 560
3242 560 -172 -909 46 612 -137 -693 224 667 -179 -605 290 529 -356 -384 610 593 -537 -332 573 396
3262 396 -479 -16 709 387 -592 -21 734 201 -610 16 673 88 -654 5 817 -116 -738 191 599 -429
3282 -429 -632 114 389 -448 -647 293 502 -414 -582 469 264 -608 -448 587 172 -640 -251 718 123
3301 123 -578 -22 723 67 -655 -19 684 175 -605 221 586 -216 -582 514 477 -198 -447 261 496 -182
3321 -182 -291 639 607 -379 -106 819 310 -584 -271 738 117 -648 -122 662 177 -470 232 469 -268 -741
3341 -741 104 455 -261 -649 324 381 -544 -667 84 373 -703 -624 304 307 -483 -302 419 150 -644 -210 342
3362 342 242 -637 -346 586 96 -780 78 530 5 -463 93 606 -44 -451 321 698 -284 -288 248 639 -138
3383 -138 -268 542 615 -351 47 650 368 -450 -88 688 19 -543 37 755 -36 -719 7 508 -206 -770
3403 -770 -63 572 -312 -616 -3 450 -367 -553 155 178 -558 -501 360 128 -534 -358 560 255 -479 -336 464
3424 464 365 -584 -204 788 318 -390 131 612 176 -371 -95 755 -1 -267 369 563 69 -89 393 736
3444 736 -209 -190 551 323 -156 -361 407 261 -438 -341 229 113 -672 -337 185 50 -619 -251 161 -218 -760
3465 -760 -168 259 -378 -652 -217 373 -83 -620 141 378 -317 -495 307 548 -283 -528 364 558 -257 -318
3485 -318 788 337 -172 -2 552 504 -37 37 652 193 -231 156 638 257 -379 133 602 -253 -656 152
3505 152 591 -160 -434 199 266 -394 -736 216 39 -691 -422 295 104 -738 -408 182 -71 -851 -254 257
3525 257 71 -811 -132 618 -155 -562 47 529 58 -483 236 626 -59 -387 356 611 -207 -147 442 644
3545 644 -108 -126 479 475 -440 -214 701 397 -428 2 618 215 -344 -126 483 40 -468 -43 342 -150 -726
3566 -726 -85 611 -266 -625 -84 327 -563 -563 39 285 -415 -506 199 274 -622 -204 400 83 -581 -219 483
3587 483 170 -417 -1 735 63 -326 -46 714 201 -245 338 598 21 -208 364 675 -93 -361 501 509 -57
3608 -57 -214 370 348 -289 -221 333 235 -539 -271 421 245 -633 -208 453 42 -555 -274 270 -108 -572 145
3629 145 370 -159 -657 -169 200 -26 -403 166 347 -279 -354 274 357 -235 -251 535 106 -266 -207 361 112
3650 112 -382 -41 367 252 -434 108 315 82 -378 249 593 51 -361 325 665 -59 -385 283 506 -364
3670 -364 -139 339 298 -77 -316 204 176 -366 -430 267 79 -578 -188 227 67 -490 -248 317 -52 -453 3
3691 3 181 -293 -523 -98 269 -225 -340 64 304 -338 -251 344 312 -171 -177 254 268 -230 31 457 357 -347
3713 -347 -9 520 98 -159 -1 368 72 -289 199 541 80 -205 134 629 23 -266 100 402 -128 -320
3733 -320 96 515 -344 -231 332 148 -330 -453 232 -40 -419 -449 33 80 -430 -125 182 -128 -387 -261 324
3754 324 -141 -652 -26 222 -53 -475 147 538 -8 -340 328 498 -112 -325 294 213 -297 -229 226 176 -308
3775 -308 -139 516 509 -97 -19 494 155 -190 143 503 73 -203 107 264 101 -262 76 131 -149 -429 105
3796 105 414 -185 -327 -8 76 -465 -347 89 268 -445 -299 209 66 -405 -321 289 131 -534 -109 350 100
3817 100 -322 -133 407 -1 -278 60 185 -44 -191 260 469 118 -206 239 515 36 -157 333 402 -264
3837 -264 -208 298 306 -311 -155 437 279 -294 -268 521 57 -320 -222 233 -110 -631 95 -42 -298 -432 -65 266
3859 266 -309 -665 11 185 -268 -483 80 254 -254 -123 240 181 -301 -175 267 277 -108 -154 184 179 -281 38
3881 38 322 111 -378 -68 273 58 -248 387 516 -205 -16 153 484 -84 -180 319 331 -305 -199 263 174
3902 174 -234 -146 290 -3 -312 -220 217 107 -575 -230 147 -54 -530 -119 164 -37 -493 -133 281 -161 -175
3923 -175 17 202 -204 -201 215 430 -170 -72 295 417 -273 -43 79 343 -149 96 272 274 -377 -59 297 -5
3945 -5 -5 84 452 121 -199 205 178 35 -181 235 190 -224 -258 327 160 -231 -386 23 171 -220 -463 109 -20
3968 -20 -469 -546 238 -71 -346 -278 380 65 -261 -91 232 35 -394 130 323 -214 -304 284 240 76 -368 301
3990 301 171 -238 -220 383 261 -143 -320 168 259 -132 -148 373 -56 -236 -212 383 203 -263 62 326 -15
4011 -15 -163 -17 122 18 -380 84 136 -224 -473 41 360 -247 -226 276 326 -135 -266 -20 207 -306 -192
4032 -192 261 -30 -358 -243 331 -18 -109 -192 404 46 -375 -88 303 154 -88 204 355 -136 -327 131 198
4053 198 -77 -95 206 334 -74 -131 96 234 -134 45 326 432 -72 -143 183 157 -184 -103 333 -101 -424 -116
4075 -116 281 55 -412 -8 58 -106 -215 145 216 -244 -211 15 278 -279 -214 312 81 -205 -56 147 63 -28
4097 -28 39 176 -49 -265 -110 300 191 -73 193 280 50 -294 10 178 138 -65 259 442 60 -294 181
4118 181 373 -52 -317 171 112 -174 -74 133 280 -246 -249 296 15 -389 -241 244 73 -429 -128 170 -41
4139 -41 -355 73 33 -149 -383 -122 265 -117 -222 -27 145 -110 -205 101 -45 -86 -316 314 263 -147 0 430
4161 430 339 -104 -19 253 78 -224 -71 407 226 -217 140 375 55 -87 58 241 -78 -317 145 68 -202
4182 -202 -239 75 77 -178 -302 220 273 -58 -267 108 313 -411 -341 207 16 -464 -250 179 -80 -324 -20 185
4204 185 -62 -228 36 227 -185 -304 126 351 -241 -66 103 89 -232 -86 406 420 11 -216 361 361 -114
4225 -114 -25 232 160 16 82 245 81 -126 42 154 22 -254 -69 289 76 -434 123 163 -183 -337 38
4246 38 95 -302 -282 -93 -42 -172 -215 186 -57 -9 -264 187 140 -219 -120 244 37 -190 -190 445 -67 -232 229
4269 229 375 115 -102 171 526 34 -188 185 212 -128 -186 216 190 -62 -215 303 205 -37 -150 136 96 -131
4291 -131 -105 230 160 -259 -58 267 -142 -449 10 150 -209 -296 -328 88 -164 -217 21 -57 -98 -302 44 -103
4313 -103 -354 -422 202 -43 -223 -142 285 72 -182 -119 169 52 -202 -70 22 -86 -193 171 283 -20 -193
4334 -193 218 357 -105 -266 130 178 -125 -151 20 185 -58 -147 234 -66 -68 -79 139 12 -151 -48 104 -113
4356 -113 -353 -124 -27 123 -260 -184 17 25 -288 -75 41 -281 -118 -87 1 -26 -201 213 -44 17 -234 105 286
4379 286 -31 -104 78 202 -91 113 315 229 -270 14 231 116 -253 171 187 266 -23 63 280 17 -154 86
4401 86 57 -127 -310 174 108 -179 -107 65 125 -249 -220 169 120 -132 -246 172 82 -259 -239 192 5 -207 -222
4424 -222 92 197 -198 -209 156 -67 -256 11 -12 -70 -221 33 324 -155 -233 219 185 52 -34 345 176 -62
4446 -62 -144 193 52 124 129 190 8 0 22 415 -48 -364 -72 178 -79 -217 2 27 -124 -144 -7 195 -93 -357
4470 -357 -46 165 -162 -160 104 -86 -260 -193 14 90 -157 -110 200 -56 -186 -261 137 -152 -93 -79 39 -6 -77
4493 -77 -39 276 154 -259 110 225 -90 -357 245 83 -106 -216 158 217 -151 -100 12 268 66 -170 308
4514 308 251 -203 84 245 127 -300 -193 136 175 -432 -56 173 -66 -5 -98 82 -109 -25 -4 -29 -170 -305
4536 -305 -1 94 -203 -119 139 249 -126 -27 -29 151 -204 -3 -5 -82 -33 -243 25 -27 -72 48 264 -96 13 68
4560 68 159 -7 -93 143 206 -32 -129 296 331 -100 -155 163 -72 -209 -190 120 324 -141 -69 60 191 -171 55
4583 55 177 -67 -228 -65 -67 -41 -100 55 103 45 -241 -52 224 -99 -225 78 195 -111 -304 120 220 10
4605 10 -137 202 199 -70 68 117 140 -146 -61 144 143 -214 104 193 -129 -309 168 29 64 -67 -32 150 43 -53
4629 -53 131 120 34 -280 -142 71 -18 -168 301 -27 -161 -150 155 71 -162 -125 133 -54 -219 -262 147 -221 -175
4652 -175 -47 55 -112 -259 -56 41 -105 -259 -201 194 -139 -200 316 324 -44 -163 90 369 1 10 399 78
4674 78 -33 134 198 135 -124 50 200 33 -22 1 299 102 -168 -81 -57 -16 -191 148 84 -145 -86 17 0 -249
4698 -249 -248 -154 -17 -89 -165 283 16 114 -103 47 -54 -57 -80 269 51 -171 -14 169 -183 -104 19 13 91 -117
4722 -117 96 -20 -15 21 198 177 34 6 152 139 -239 30 228 -50 -72 -98 40 101 -143 -35 153 246 -126
4745 -126 -145 119 123 -115 -74 268 -154 -67 21 9 -223 -98 65 30 -151 -186 34 213 -138 -57 149 24 -171
4768 -171 -27 43 35 18 -50 114 -9 -124 -88 189 81 -254 149 190 31 66 -65 86 87 -74 102 304 -193
4791 -193 -129 126 20 -83 -230 176 205 -54 195 21 94 -70 84 185 -27 -209 45 56 98 67 -141 116
4813 116 -4 -268 -44 132 -121 -202 -20 20 -39 -64 68 195 -100 -161 -163 180 -35 -40 234 97 -193 -167 145
4836 145 56 -12 71 -5 1 -173 3 35 17 -87 143 15 -6 -43 -54 281 -178 -209 -5 271 -63 -253 14 226
4860 226 -100 -83 -76 167 -36 -214 197 84 -209 -105 30 -2 -114 -74 -41 3 -99 -321 81 104 -146 52 21
4883 21 80 -230 123 63 -27 -50 106 -25 -160 108 194 -113 -187 -172 205 97 14 -150 271 -17 -139 -104 237
4906 237 127 58 256 264 -71 -24 100 -69 -223 -185 55 24 -57 -209 96 61 -95 -214 9 130 -50 -131 -47
4929 -47 2 -151 107 65 23 -93 -112 256 89 -141 -19 175 65 -141 -32 183 81 -140 -104 59 -50 -133
4951 -133 47 -23 11 135 105 265 -48 65 191 240 26 -129 55 26 -139 -52 149 29 -63 82 30 66 -97
4974 -97 -100 10 -96 -299 34 107 -104 -153 -51 47 -183 -209 -7 132 -334 -77 109 282 -94 3 -28 197 -37
4997 -37 85 14 108 -139 91 135 -95 -28 -78 66 -32 -54 58 86 111 -155 -41 117 16 -78 58 171 -29 -165
5021 -165 167 -69 -82 18 127 -51 108 74 -3 -6 -171 -209 42 -44 -148 -90 69 -108 31 113 120 -99 -162 -138
5045 -138 -41 130 18 69 -88 -45 -206 67 110 -25 -126 288 281 14 155 95 167 -72 96 210 47 240 146
5068 146 172 -13 -116 83 68 -118 23 -8 -113 9 -185 71 86 -124 -26 105 69 158 -53 -84 99 -68 -45
5091 -45 -63 47 -127 -193 -40 -28 -152 -130 85 -2 -95 21 57 -78 -103 -16 225 12 -43 194 120 73 -86 -65 116
5116 116 3 -140 234 131 47 61 56 -25 2 47 163 225 62 -28 20 -130 23 18 343 101 -199 -55 3 -18 -40
5141 -40 182 57 13 -180 55 64 -288 -124 -10 -23 42 -46 43 125 -48 -174 80 -92 -253 -78 167 -171 -81
5164 -81 -83 -91 62 -99 13 163 47 -149 190 301 -107 -105 329 138 -26 22 88 176 83 -57 210 26 16 -45
5188 -45 125 206 -57 133 55 62 -88 6 97 77 -107 -79 -109 -49 -120 -14 14 -75 -180 -31 40 -155 89 36 86 9
5214 9 -87 -110 77 -106 -124 53 179 -192 71 20 92 -101 104 50 4 -58 9 161 60 -141 32 143 173 -69
5238 -69 6 63 -66 7 145 163 -86 -22 100 -134 127 136 -74 -20 -186 -33 7 -56 -336 -149 2 54 -203 -54
5262 -54 124 20 -54 -31 -46 5 -135 -112 218 -163 -81 -53 54 2 -35 -107 52 235 -125 123 -73 -34 -86 -14 10
5287 10 -177 93 117 -45 -1 -43 133 52 -7 57 240 163 101 180 -89 -116 -153 155 45 91 -47 102 101 -307 -60
5312 -60 -5 -7 -48 -38 28 106 -43 28 40 36 -241 -194 110 41 -84 105 -49 -111 -298 -50 -99 139 -12 -165 242
5337 242 -91 -17 126 42 -144 -52 57 -22 -69 -229 14 -3 2 4 32 305 -31 82 197 40 170 137 199 81
5361 81 60 126 23 -25 77 -22 86 -26 -149 219 21 -178 -256 -97 132 -86 -179 -20 98 95 -280 -120 42
5384 42 26 97 45 5 -116 -1 -3 66 -116 43 82 -78 -23 36 208 27 70 -4 138 -9 11 -72 118 -87 -3
5409 -3 302 -24 -140 0 265 10 -159 207 68 -112 26 16 -8 -5 -42 -68 72 -81 -181 -7 79 46 -220
5432 -220 -125 -46 16 -176 37 129 -119 -38 105 41 -57 -86 146 30 -124 -144 186 -184 -10 -80 225 310 -21 245
5456 245 -6 67 -31 -32 141 96 2 206 112 -70 76 -104 27 -61 -142 -99 -123 -22 -81 111 -58 24 -123 66
5480 66 80 -47 -172 91 66 -270 83 121 73 -153 -88 149 -247 -97 -103 86 -19 32 38 62 -16 -15 124 29 -43 100
5506 100 -19 -87 -116 -3 64 -147 136 65 -58 -248 -96 131 189 18 -127 79 18 -95 70 133 -8 73 110
5529 110 -39 -204 -39 -121 36 108 -46 -28 8 95 -20 -109 -233 32 17 -82 54 92 -51 -111 -61 -112 -73 38
5553 38 -9 -99 -223 25 -88 11 -5 127 -21 -67 -180 -43 68 -11 145 95 145 20 2 -49 -4 134 86 -115
5577 -115 -46 80 68 86 5 -59 -124 18 57 78 53 107 -120 29 -77 -35 -21 -63 -9 -28 -47 -114 26 -18 82 -137
5603 -137 -16 -160 -99 -82 122 0 -47 -13 184 43 -26 -128 6 82 225 65 121 125 13 13 136 -143 -37 -47
5627 -47 -17 -10 -113 155 -24 188 -89 96 166 10 84 34 -73 52 -144 94 -128 -57 149 102 81 -29 6 -140
5651 -140 -142 -83 -4 100 -120 -7 -90 -116 35 -148 -105 -84 5 -84 149 115 -114 -78 173 -33 120 -256 268 -77
5675 -77 -25 105 156 -20 -101 -209 -98 185 -236 -16 115 -29 26 -101 30 48 22 76 -76 33 25 167 -168
5698 -168 -34 153 27 -150 -2 -12 -137 143 -278 56 28 91 -165 57 175 -78 181 130 -83 -122 -143 -33
5720 -33 85 71 -73 -77 53 -99 -94 -20 -84 17 -26 179 45 -8 -37 182 101 -88 52 100 -20 -100 169 85 151
5745 151 -89 129 40 -75 -194 58 -106 -137 160 31 -10 -237 -67 -145 31 24 -17 -143 57 139 -44 0 -114
5768 -114 -113 -163 -175 80 159 21 -97 57 -138 114 165 105 -66 128 39 92 -87 -58 -70 -27 -213 101 94 24 -41
5793 -41 106 186 7 -50 46 134 -21 -59 19 73 -64 24 -28 -69 12 73 107 -78 -95 -159 -47 59 -98 129 28
5818 28 3 -79 12 -184 9 -77 -13 -98 -253 -139 -37 99 83 -40 110 -1 -46 95 -3 10 -80 47 49 151 -102
5843 -102 6 44 -57 5 -23 -9 15 -175 -78 39 154 50 210 34 208 -45 -8 72 36 92 138 22 -152 -68
5867 -68 33 97 -84 87 -1 -95 32 -165 99 54 -145 14 -58 -166 -55 49 66 -71 -93 -159 -55 -42 -158
5890 -158 89 27 -10 -56 159 -109 35 94 -37 162 -112 -106 71 -15 89 -30 -79 109 -85 20 31 51 111 261
5914 261 -34 -64 -27 44 72 -92 -4 56 62 -36 40 -35 145 -34 -140 -193 63 -93 -81 135 13 -72 50 -91 108
5939 108 -112 -33 -76 -45 -40 69 163 -165 -206 72 195 -37 -7 59 -11 -91 -52 -13 -76 152 25 -20 73 -114 194
5964 194 40 90 -4 4 207 126 98 138 123 -99 -78 75 56 -96 -72 0 -22 5 39 -211 95 31 -150 -180 150 -52
5990 -52 -95 -75 -67 -41 -38 2 -44 -35 124 -49 53 68 145 0 -66 -111 -89 56 -60 -126 -10 50 36 74 -139 104 -207
6017 -207 -134 204 107 -38 -8 199 82 21 186 53 -265 -17 118 -65 82 45 -91 116 -77 54 143 152 160
6040 160 75 27 91 54 -75 -63 -65 -37 -207 -16 166 -45 2 15 88 63 -154 26 -13 222 -18 107 38 -143 81
6065 81 179 -52 76 -57 70 56 10 73 16 34 261 25 8 -113 -62 -41 98 29 116 214 180 30 -57 -20 -53 101
6091 101 -35 -57 -68 48 -83 79 130 71 112 -42 150 12 -44 -9 11 13 61 222 -187 -116 151 -197 -51 -140
6115 -140 119 -35 -116 27 35 -73 35 184 141 -45 -238 -40 -90 -111 -63 43 22 5 -28 -62 51 -62 20 -12
6139 -12 161 64 140 68 164 136 39 -10 -62 73 -182 27 23 -65 -26 -25 140 -3 -52 65 13 100 -55 3 88 4 -62
6166 -62 97 -123 -84 -26 -12 -1 -18 45 -19 -285 -16 -19 52 -197 -65 178 7 -92 -47 -79 -18 52 -87 55 75 -14
6192 -14 53 103 34 15 169 -79 -57 -109 46 200 -37 -94 -139 -179 -9 -145 52 -43 -153 -26 175 101 38 -41 -133
6217 -133 133 109 -289 -39 70 -36 -62 -7 -1 -171 77 -180 -158 -129 -46 -97 -38 -196 7 44 40 102 162 50 6
6242 6 45 124 0 -30 6 -65 -48 -44 64 154 13 -85 89 -40 -8 -93 64 121 9 106 -106 20 20 -129 -61 19 -156
6269 -156 -54 89 74 -60 9 -108 8 134 -42 145 94 -44 91 47 35 -127 111 -176 -80 128 86 10 140
6292 140 -143 -73 31 34 -160 46 -76 -197 -46 94 -18 -44 20 42 200 189 -163 14 -52 -15 51 57 160 71
6316 71 -79 -93 -232 89 -21 -258 38 -198 -82 112 -57 -127 -24 153 119 32 97 -230 168 26 3 -22 -131
6339 -131 -44 72 237 168 161 -2 130 105 9 -32 -96 -125 -219 161 99 -19 -84 11 -59 -64 -163 103 21 -107 81 90 -57
6366 -57 -29 -29 -35 -10 3 143 -254 -13 -105 -26 -12 5 -115 29 91 -99 17 -12 -141 94 -107 -4 163 -84 -38
6391 -38 8 263 -107 -26 -88 -144 53 37 108 -121 -342 224 -48 109 210 36 37 106 77 279 147 -223 -99 84
6415 84 164 24 87 43 -88 8 -12 -119 -163 -50 44 141 1 -119 121 80 -78 127 -133 250 167 -309 21 -13
6439 -13 -82 48 79 -101 -100 74 40 26 -157 -193 23 -90 -102 58 175 -7 -280 149 75 -151 33 184 73
6462 73 137 -141 -103 178 -148 -18 150 41 69 -43 65 49 -96 33 5 151 251 -154 37 142 168 -11
6484 -11 -91 113 -361 32 153 88 121 -79 -70 24 -69 -46 -37 6 -14 131 -95 -43 30 108 8 14 106 136 -9 -186 271
6511 271 -55 172 -92 -280 0 73 34 -2 -15 -89 0 -30 -3 162 156 73 -24 11 47 31 124 100 12 -108 64 -22
6537 -22 -33 188 -20 101 -6 -103 -112 84 -105 -91 -104 -267 -100 -103 -153 7 -68 -160 96 -362 -116 167 97 105 55
6562 55 -21 68 121 -28 116 -51 -102 -49 -84 -249 14 -7 75 -146 20 37 79 54 -12 -29 261 80 32 7 168
6587 168 118 115 -25 -6 54 126 34 171 -60 -57 140 95 98 -63 48 42 -20 -54 99 -169 150 11 -48 -114 178 -81
6613 -81 31 179 -96 -19 -42 -167 -60 150 -10 -161 79 -48 -85 85 68 -14 -173 -166 12 194 8 45 135
6636 135 49 22 118 80 209 23 -51 67 -133 -141 159 -5 34 -12 -42 -84 64 100 -174 13 -2 -55 98 -41 88
6661 88 -71 44 296 -36 16 -80 -22 -143 -35 -71 -16 -127 142 -35 158 -50 -81 -41 42 -79 17 -37 -51 68
6685 68 -18 246 8 -59 142 40 82 -94 2 -110 61 -17 188 145 39 -77 -158 -48 124 188 145 64 185 -38
6709 -38 -47 -27 117 18 -30 -62 82 -2 221 -20 33 48 122 -14 -137 8 26 -42 38 23 -193 -102 50 91 6 65
6735 65 9 56 136 -211 -51 40 18 -39 84 24 82 -35 228 -133 -12 -120 12 -11 72 132 -44 44 11 96 282
6760 282 128 -39 139 135 101 62 143 110 111 -114 101 89 -48 -166 246 154 109 -98 219 72 44 189 -188 37
6784 37 -64 -1 -84 1 3 -25 -62 21 -117 28 90 -39 132 61 76 2 59 -61 207 -100 -18 42 -82 -23 -22 -54 -35
6811 -35 20 65 114 -82 -36 -34 -85 191 24 -131 82 -35 -78 -115 223 56 181 97 157 25 91 8 49 -1 -23 239
6837 239 -121 2 -69 -56 141 121 12 97 -54 35 -176 -101 72 -139 1 -24 -75 13 54 37 54 -33 -260 44
6861 44 -123 203 4 -92 103 -200 104 -20 2 136 96 -106 45 0 -68 66 -66 -43 -74 64 -6 68 70 -10
6885 -10 36 47 91 -4 -82 42 -85 114 -113 34 221 -43 -96 -223 84 63 95 -19 -221 -13 -8 68 -70 7
6909 7 -174 114 44 24 -2 -104 143 51 -84 -95 -137 -109 -135 -179 -13 252 -189 -112 48 20 31 100 -52 42 57 -41
6935 -41 213 -40 -189 -18 -153 40 -67 4 190 12 35 110 15 87 -102 61 -67 97 54 122 30 141 -32
6958 -32 -27 -146 -140 9 -8 118 -120 94 182 -46 91 -57 14 51 207 -40 -9 130 61 25 -64 -73 36 86 -27
6983 -27 45 -105 11 0 99 -193 105 57 97 54 -110 -75 199 -17 67 -133 81 50 -22 -27 -126 76 -47 79 2
7008 2 -106 83 -149 -57 -92 -46 -37 -112 -71 -2 221 54 30 1 109 387 -78 -65 -233 -97 15 -132 226 -132
7032 -132 -180 54 -32 -36 71 31 -79 27 22 -15 158 68 102 -211 17 70 72 20 47 -86 97 -135 -118 -104 91 -76
7058 -76 -82 82 55 -45 42 92 -21 -80 -48 96 -143 22 9 131 -40 -136 104 -35 -72 -17 214 23 114 207 163
7083 163 -206 62 129 70 -11 -150 -186 -46 -236 34 -132 39 -13 -105 78 45 230 40 92 33 -212 -180 40
7106 40 -3 -91 96 77 -42 -74 -50 -67 -60 -23 -22 143 52 29 70 -78 52 -83 -12 285 -260 52 34 117 110 60 88
7133 88 32 -54 9 115 -33 42 216 147 38 18 152 70 37 -97 44 54 -26 -56 91 44 -24 -3 183 2 46
7158 46 -100 -71 -97 -139 31 153 -10 -116 41 37 -88 -189 -131 -89 -65 -36 -98 -44 15 8 -3 -116 -150 -2 -95 -194
7184 -194 -44 84 -19 123 37 -12 104 131 -81 -153 53 71 -57 -200 45 244 -159 35 -33 15 19 -120 86
7207 86 -103 117 -32 192 -104 -185 -18 58 34 73 162 108 -8 -155 167 -64 54 13 28 8 67 -17 -17 -50 -4
7232 -4 7 16 6 -54 4 150 -177 -69 -27 -58 113 78 -41 94 197 -125 59 140 32 87 -5 -75 39 95 66 193
7258 193 -20 -85 60 77 95 33 -112 48 -39 -73 7 -14 -18 -54 -8 55 -33 -82 -61 -97 -162 -164 -110 -55 -161 -75 27 100
7286 100 -156 7 28 -32 -123 89 -60 -78 140 -46 47 -20 33 77 -209 -174 -17 34 -74 -94 -93 -30 -172 35 -77
7311 -77 85 171 3 -6 -29 161 72 36 -64 64 -14 21 -56 184 -33 52 29 -55 69 117 -34 -57 -215 114 16
7336 16 -236 -123 -65 -49 -54 90 73 -130 -146 -86 36 4 -87 -130 158 -108 196 -127 -133 12 -169 -17 -36 -37 -92 -150
7362 -150 -78 70 195 36 -250 -40 142 -23 -72 -36 42 232 -19 -67 -70 144 -101 -102 -161 159 -124 82 120 -99
7386 -99 71 -29 88 33 -89 -110 37 -75 80 30 -37 53 -195 -9 20 53 -169 93 -61 -165 -100 -26 -185
7409 -185 -16 -23 75 -7 89 -74 -83 63 51 75 -16 -76 -87 130 83 -93 42 144 146 82 39 -10 -20 -54 144 -32 191
7436 191 31 -40 -95 161 90 77 -87 -191 41 -41 299 126 160 116 -70 199 107 50 -220 72 -49 -44 -44 -12 33
7461 33 62 -179 -52 -66 146 16 -35 97 -169 -72 92 -88 -6 121 -114 28 40 -12 15 114 7 83 90 -100
7485 -100 131 13 -95 119 63 116 -9 -100 83 -16 159 -167 -88 64 243 -26 171 -19 -74 130 -71 -18
7507 -18 -93 5 51 -59 174 118 7 43 -97 14 -3 33 -38 -138 -162 -25 10 150 83 -16 -39 -62 -75 -110 -41 -57
7533 -57 -21 -58 33 3 -4 147 -29 21 -86 -12 149 89 150 -107 -2 -30 -16 -73 -35 -15 -46 120 33 -78 -23 -89 -47
7560 -47 14 89 -136 134 15 82 92 -258 -4 49 -11 143 5 -119 -184 -7 0 141 18 -26 71 87 222 137 -95
7585 -95 150 -71 -190 -31 -20 94 23 -76 -31 6 -139 -22 -181 25 90 51 104 73 81 -192 -84 -15 -3 29 -15
7610 -15 32 -20 -145 120 184 -30 -28 -163 7 226 59 -49 14 3 -47 -82 -69 -95 27 -13 -214 -30 10 52 48 -136
7636 -136 -95 -82 -182 17 61 24 237 0 99 107 27 29 -302 -50 -101 -61 202 -38 33 18 56 91 92 26 70 102 -140
7663 -140 119 102 -46 -192 -32 113 -73 118 53 221 -92 -64 15 262 46 -128 -24 -62 -140 -215 -63 -141 -66
7686 -66 220 -131 89 -49 -76 22 -137 -37 60 -103 -13 51 -16 126 44 -15 34 -84 -19 -31 68 -70 -162 9 14
7711 14 74 3 75 -47 -69 38 33 -102 76 23 -67 -47 203 74 -110 167 -182 37 129 -36 -34 28 -68 -95 -56 27
7737 27 -118 151 84 28 -120 -55 54 -52 -22 64 47 -54 -101 77 164 -147 -120 135 -31 59 26 96 23 -39 -126
7762 -126 107 -66 -132 84 38 22 -76 -50 10 120 73 203 137 9 104 -100 50 114 -20 -31 -107 -68 -6 95 -19
7787 -19 31 -77 -42 27 -183 -203 116 339 244 82 117 212 203 103 117 35 -102 -16 135 -117 68 40 12 91 -35
7812 -35 125 90 -44 -36 105 -139 -200 19 -239 -107 -94 139 -18 44 10 69 86 6 -163 -58 20 -91 72 249
7836 249 -29 -28 48 70 -5 -29 79 -122 -218 -84 16 -64 -64 -103 -169 -81 -30 -11 205 117 90 -26 -162 25 -4 0 28
7863 28 -20 78 223 -120 94 190 -135 -16 117 -50 31 -61 -9 -207 69 46 151 197 -128 -81 -170 211 -89 175
7887 175 -202 -48 -127 162 -7 22 22 -109 41 67 36 -119 -24 -19 -56 -124 -111 37 44 -134 -96 82 86 -163 -1 -44
7913 -44 150 92 96 20 62 -184 -64 107 -173 -142 -56 -127 -22 -130 -41 34 53 -5 -51 -2 161 -175 -42 143 -111
7938 -111 40 -171 76 177 -131 23 114 -169 13 -148 183 -29 88 -9 3 103 46 56 -128 102 159 43
7960 43 182 -63 147 124 -157 -80 -165 11 23 110 49 123 -73 29 -231 -13 130 23 88 49 15 45 -36 -107 -111
7985 -111 94 77 -62 -19 -125 28 83 62 28 15 -24 65 99 9 -47 -185 -34 96 -22 -57 -50 58 -126 -30 17
8010 17 -43 -6 133 -65 73 -28 -53 90 114 197 40 105 -124 -6 201 -47 -26 -75 5 138 51 -56 110 114
8034 114 -90 26 20 -143 73 99 230 3 -15 98 270 91 -69 -66 2 -10 27 119 189 53 48 -94 234 -197
8058 -197 4 -24 45 -106 32 83 -1 41 45 -163 -238 -102 -16 -9 -46 117 34 -65 90 -197 49 183 171 -60 10
8083 10 -96 -117 -9 64 54 199 -26 -169 -22 52 -72 -16 -130 -35 106 -12 165 -195 73 -123 199 11
8105 11 50 106 -3 56 -16 -99 -128 45 147 94 118 111 -103 66 150 55 -21 -60 185 -90 -64 -106 -20 28 104 -164 19
8132 19 -5 35 -214 -92 -33 60 56 -90 29 21 100 -89 -130 101 13 161 26 -37 -24 -36 -64 113 26 30 122 43 22
8159 22 94 -134 5 32 103 47 77 -19 -101 70 178 79 -25 -29 130 53 -144 -281 -22 -61 16 21 142 -41 -5 -103
8185 -103 14 -77 52 -227 105 81
8191H1
$$ Imaginary data points
##PAGE= N=2
##DATA TABLE= (X++(I..I)), XYDATA
0 0 0 0 0 0 0 0 0 0 0 0 0 1 -8 8 -8 8 -8 11 -16 16 -21 24 -25 32 -34 40 -47 53 -58 66 -74 85 -95 106 -118
35 -118 130 -145 161 -178 200 -221 245 -271 299 -331 369 -410 457 -512 574 -649 740 -852 995
54 995 -1183 1446 -1834 2475 -3718 7023 -34144 -88409 -25111 -17688 -71400 -83038 -22524 -18082
68 -18082 -70488 -70955 -15924 -23293 -75821 -67862 -16945 -29019 -70119 -47411 439 -17909 -50264
81 -50264 -16975 22299 -6843 -34376 5019 35828 -326 -18418 27949 48575 5157 -6311
93 -6311 42710 52521 2078 -3896 46652 48252 -2268 1202 51943 43892 -8703 17 45963 26406
107 26406 -26975 -13176 28961 4715 -39863 -14781 24765 -3831 -40478 -9523 22123 -14746
119 -14746 -46864 -12668 10357 -28722 -48073 -5676 12666 -25882 -33698 12347 21199 -21154
131 -21154 -22259 21579 19649 -22270 -12972 31794 21718 -17395 1344 43361 23942 -14435 8873
144 8873 44243 15920 -17629 12556 42623 8638 -19213 16118 39322 -716 -24394 12422
156 12422 27290 -15293 -30207 10878 20101 -22585 -28619 13718 15161 -27801 -27472 12352 5988
169 5988 -33862 -23588 15967 4608 -29745 -11079 25648 7751 -22453 1054 30571 5508
181 5508 -19196 10548 34831 5592 -11864 23279 41045 7183 -4843 31036 39186 534
193 534 -5439 31989 32692 -6784 -5481 33152 26853 -12924 -5776 30034 15728 -23408 -10010 23494
207 23494 3896 -31452 -11172 19530 -4693 -34509 -9635 15351 -13042 -36762 -7525 12377
219 12377 -18586 -34228 -1100 12482 -19541 -27777 6425 12496 -21403 -21915 13015 11615 -21354
232 -21354 -14319 20116 11878 -19625 -6614 24496 8520 -21687 -3286 24654 2658 -24064
244 -24064 -525 23531 -3054 -25216 1888 20539 -9937 -28110 1984 15042 -17798 -29394
256 -29394 2697 10775 -21938 -26851 6123 7954 -24395 -22706 9877 6006 -24473 -16258 14818
269 14818 5332 -21706 -6772 21476 5944 -17915 2557 26396 5606 -14168 10307 29401
281 29401 4190 -11069 17052 30251 975 -9753 20662 27610 -4304 -9755 21062 21426 -11419
294 -11419 -11202 19413 14020 -18751 -12658 16564 5668 -24699 -13173 13753 -1858 -28619 -11920
307 -11920 11944 -7333 -29477 -7974 12150 -10394 -26744 -1579 13845 -10591 -21228 6576
319 6576 16910 -9284 -13864 15513 19959 -7025 -5918 23253 21537 -5517 769 28867 20873
332 20873 -5141 5811 31150 17568 -6983 8014 29972 11226 -11100 7559 25475 2535
344 2535 -16016 5860 19569 -6091 -20321 3593 12833 -14851 -23868 1949 6062 -21855 -24734
357 -24734 2134 1685 -25074 -22098 4915 -247 -25456 -16469 9031 -593 -23043 -8849 14402
370 14402 482 -18633 -57 20178 2159 -13585 8452 24078 2395 -9389 14951 25387
382 25387 933 -6729 18723 23902 -2443 -5630 19763 19441 -7837 -6744 17915 12767 -13957
395 -13957 -8539 14944 4642 -20155 -10316 10766 -3403 -25025 -10648 7842 -9581 -26804
407 -26804 -9153 6324 -13197 -26210 -5191 6238 -14781 -22754 562 7881 -14151 -17099 7737
420 7737 10425 -12093 -10315 14727 12390 -9983 -3420 20293 12908 -8537 1811 23332 11554
433 11554 -8698 5147 24057 7992 -9634 6825 22097 2543 -12609 6548 17742 -4403
445 -4403 -15465 5388 12444 -10918 -17178 4846 7750 -15821 -17618 4815 3646 -19518 -16220
458 -16220 6071 928 -20063 -11643 9571 318 -18054 -5788 13355 711 -15394 1013 17253
471 17253 1379 -11276 7857 20768 2268 -7200 13559 21898 1076 -4977 16883 20822 -1283
484 -1283 -3436 18519 17995 -4448 -3426 17673 12389 -9842 -4828 14595 5949 -14563 -5776 11928
498 11928 -65 -18098 -6026 8946 -5961 -21077 -5986 6551 -10386 -21331 -2840 6420
510 6420 -11627 -18324 1706 6983 -12405 -14898 6045 7584 -11816 -9900 11452 9724 -9688
523 -9688 -3664 16631 10001 -8586 411 19044 8649 -8511 3874 20309 6664 -8173 6622
536 6622 19749 2977 -9630 6525 15890 -2690 -11855 6248 12494 -7224 -12235 6274 8659
549 8659 -11732 -13198 5311 4000 -15433 -12785 5979 1344 -16613 -9504 8050 -243 -16614
562 -16614 -6216 9036 -2127 -15922 -2536 11234 -2034 -12922 3036 13499 -2465 -10908
574 -10908 6571 13588 -4483 -9528 9003 12874 -5608 -7133 11711 11632 -7562 -5968 11785 7714
588 7714 -10810 -6525 10750 3904 -12885 -4697 10935 913 -14042 -3321 9818 -2990 -15535
601 -15535 -1995 9208 -5364 -14249 1831 10035 -5790 -11683 5440 10347 -7054 -9606 8377
614 8377 10217 -6889 -5526 12582 10351 -6506 -2065 14964 9144 -7656 -538 15063 6318 -8372
628 -8372 1701 15266 3778 -9401 2721 13703 -637 -11701 1829 10090 -5367 -12995 2709
641 2709 8220 -8414 -12766 3550 5772 -11484 -12779 3787 3137 -13287 -10324 6492 3124 -12206
655 -12206 -6291 9417 2865 -10841 -2518 11453 2569 -9456 2222 14490 3073 -6732 6975
668 6975 16394 2372 -5391 9192 15391 -237 -4782 10964 14010 -2560 -4630 11574 11344 -5969
682 -5969 -5695 9917 6008 -10525 -6682 8544 1724 -13881 -7065 7016 -2001 -15929 -6596 5067
696 5067 -5918 -17178 -5090 4892 -8098 -15980 -1821 5918 -7891 -13264 1681 6334 -8132
709 -8132 -10003 6129 7860 -6997 -5593 10441 9175 -5521 -1662 13274 8471 -5736 713 14768
723 14768 7105 -6182 2917 14948 4685 -7044 3482 13145 249 -9258 2946 10354 -3996
736 -3996 -11145 2503 7257 -7822 -11912 2452 3976 -11320 -12298 2429 1826 -13139 -10931 3944
750 3944 527 -13109 -7695 6094 47 -12423 -3796 8696 222 -10396 238 11378 1172
763 1172 -7386 5165 13333 1007 -5247 8793 14211 279 -3702 10670 13394 -1250 -2699 11607
777 11607 11001 -4294 -2925 11130 7363 -7443 -3557 9147 3022 -10404 -4148 7338 -1136 -13061
791 -13061 -4249 5757 -4190 -14260 -3768 4328 -7075 -13785 -1744 4399 -8302 -12150 1337
804 1337 4957 -7814 -9276 4707 5770 -6987 -5425 8666 6935 -5587 -1654 11926 7607 -4483
818 -4483 1787 13855 6799 -3977 4303 14926 5409 -4248 5912 14221 3089 -4864 6204 11826
832 11826 -686 -6121 6075 9092 -4475 -7439 5341 6197 -7459 -7792 4451 2729 -10330 -8082
846 -8082 4334 487 -11797 -7100 4908 -1022 -11744 -4521 5529 -2368 -11407 -2017 6630 -3029
860 -3029 -10144 763 7782 -3189 -7958 3962 8387 -3700 -6402 6102 7969 -4559 -4991 7617
874 7617 7153 -5070 -3477 8280 5376 -6680 -3030 8263 3004 -8423 -2403 7842 957 -8793
888 -8793 -1268 7108 -1595 -9601 -422 6428 -3659 -9788 1046 5805 -4610 -8126 3122 6063
902 6063 -5438 -6701 4945 5460 -6279 -4924 6930 5326 -5819 -2378 8850 4864 -5798 -563
916 -563 9786 3390 -6427 782 9835 1932 -6446 2261 9447 -243 -7176 2649 7803 -2750 -7618
931 -7618 2980 6194 -4827 -7345 3736 4793 -6654 -6861 4138 3105 -8064 -6219 4637 1714
945 1714 -8473 -4213 6092 1305 -8293 -1796 6873 262 -7805 109 7781 -319 -6610 2739 8717
960 8717 -881 -5451 4549 8457 -2058 -5082 5634 7438 -3487 -4190 6566 6171 -4739 -3922
974 -3922 6877 4029 -6518 -3766 6255 1724 -8046 -2999 6162 17 -8502 -2113 5806 -1837
988 -1837 -9062 -564 5606 -3137 -8388 1286 6058 -3672 -7005 3423 6095 -4264 -5325 5309
1002 5309 5850 -4490 -3306 7447 6023 -4041 -1329 8847 5106 -4695 -21 9077 3513 -5162
1016 -5162 824 8834 1597 -6057 1522 7797 -737 -6950 1391 6064 -3495 -7806 1638 4379 -5446
1031 -5446 -7817 1902 2805 -7291 -7488 2565 1753 -8029 -6370 3545 1158 -7952 -3984 5137 819
1046 819 -7347 -1593 6421 847 -6225 1000 8140 811 -4707 3504 8914 519 -3534 5550 9153
1061 9153 -329 -2904 6658 8040 -1782 -2672 6837 6671 -3584 -2919 6575 4056 -5775 -3124 5539
1076 5539 1711 -7570 -3288 4486 -1211 -9021 -3010 3632 -3232 -9720 -2128 3159 -4538 -9344 -611
1091 -611 3271 -5450 -7820 1102 3751 -5163 -5986 3728 4349 -4653 -3306 6234 4933 -4184 -1128 8033
1107 8033 5045 -3499 712 8972 4316 -3541 2211 9246 2923 -3614 3119 8633 928 -4378 2874
1122 2874 6966 -1586 -5277 2849 5119 -3972 -6088 2260 3115 -6043 -6405 2311 1263 -7571 -6012
1137 -6012 2410 -74 -8185 -4728 3082 -750 -8219 -3165 4409 -889 -7116 -641 5644 -1031 -5722
1152 -5722 1804 6625 -813 -4384 4025 7241 -955 -2908 5617 7184 -1452 -1895 6733 6512 -2492
1167 -2492 -1300 6964 4769 -3763 -1382 6755 2839 -5138 -998 5807 667 -6218 -793 4815 -1377
1182 -1377 -7066 -558 4037 -3130 -7402 105 3333 -4441 -6965 1186 3165 -5099 -5549 2778 3032
1197 3032 -5158 -4133 4331 2842 -5172 -2471 5700 2626 -4648 -550 6687 2385 -4243 1124 7154
1212 7154 1623 -4268 1833 6848 294 -3981 2991 6478 -1287 -4223 3291 5236 -2770 -4400 3465
1227 3465 3919 -4163 -4114 3837 2821 -5075 -3583 3847 1330 -5932 -2678 4301 445 -6264 -1466 4709
1243 4709 -358 -5822 -134 5066 -1122 -5433 1430 5237 -1703 -4744 2824 5224 -2211 -3855 3756
1258 3756 4572 -2936 -3136 4463 3924 -3811 -2626 4672 2845 -4753 -1960 4851 1357 -5269 -1519 4592
1274 4592 -136 -5757 -828 4358 -1374 -5971 23 4008 -2519 -5683 1040 3730 -3043 -5249 2115
1289 2115 3536 -3567 -3944 3521 3476 -3882 -2982 4471 3077 -3991 -1802 5399 2381 -4337 -500 5723
1305 5723 1512 -4233 500 5882 659 -4560 991 5111 -881 -4553 1611 4617 -1948 -4551 2201
1320 2201 3843 -3313 -4451 2526 2752 -4230 -3645 2974 2024 -4796 -2847 3765 1543 -4810 -1742 4414
1336 4414 891 -4767 -567 5175 540 -3987 1236 5690 324 -3760 2365 5691 -508 -3095 3458
1351 3458 5511 -1301 -2681 4079 4873 -2223 -2468 4200 3548 -3460 -2451 4085 2217 -4533 -2224 3798
1367 3798 795 -5109 -1862 3740 -672 -5864 -1567 3011 -1944 -5974 -334 3170 -2570 -5510 768
1382 768 3000 -2943 -4773 2055 3429 -3192 -3386 3523 3541 -2989 -1701 4862 3380 -3020 -783 5663
1398 5663 3124 -3084 443 6172 2292 -3093 1357 5953 896 -3400 1493 5249 -609 -4408 1596
1413 1596 4150 -1972 -4414 1559 2947 -3794 -4565 1755 1801 -5085 -4623 1850 692 -5702 -3612 2534
1429 2534 -65 -5930 -2765 2986 -234 -5364 -1424 3755 -421 -4573 335 4822 -570 -3891 2040
1444 2040 5054 -738 -2977 3243 5215 -908 -1842 4353 4684 -1894 -1542 4852 3869 -2588 -1343 4772
1460 4772 2384 -3454 -923 4639 1125 -4558 -982 3908 -512 -5134 -561 3385 -1864 -5430 -127
1475 -127 3092 -2862 -5422 705 2622 -3311 -4672 1675 2310 -3596 -3546 3049 2635 -3574 -2158 4127
1491 4127 2551 -3210 -887 4791 1957 -3105 577 5575 1897 -2727 1376 5732 968 -2846 1881
1506 1881 4966 -199 -3123 2400 4450 -1491 -3141 2531 3433 -2833 -3466 2425 1931 -3977 -3101 2792
1522 2792 1105 -4629 -2862 2613 194 -5102 -2253 2709 -603 -5157 -1030 3315 -968 -4680 286
1537 286 3288 -1237 -4111 1226 3620 -1592 -3357 2675 4047 -1505 -2383 3587 3773 -1915 -1591 4177
1553 4177 3018 -2553 -1033 4438 2134 -3174 -398 4222 1116 -3574 -257 3820 -192 -4019 218
1568 218 3344 -1121 -4464 443 2987 -2159 -4362 975 2263 -2953 -4029 1437 1953 -3346 -3295 2174
1584 2174 1663 -3663 -2580 2921 1230 -3697 -1536 3507 968 -3469 -520 3950 575 -3478 581
1599 581 4039 9 -3238 1300 4088 -672 -2822 1806 3790 -1118 -2652 2452 3140 -2281 -2504 2788
1615 2788 2582 -2824 -2044 2874 1671 -3244 -1270 3221 1135 -3591 -1025 3237 481 -3746 -293
1630 -293 3482 -147 -3467 635 3583 -903 -3158 1219 3537 -1375 -2863 1963 3172 -1822 -2454
1645 -2454 2650 2699 -2451 -2187 2892 2003 -2941 -1696 3033 1261 -3204 -1200 3239 402 -3675 -710
1661 -710 2992 -212 -3732 -92 3009 -950 -3634 864 2904 -1486 -3536 1520 2737 -1844 -2735
1676 -2735 2272 2838 -2390 -2037 2799 2323 -2585 -1309 3389 2113 -2568 -905 3797 1443 -2897 -51
1692 -51 3659 424 -3065 236 3520 -384 -3250 784 3006 -1349 -3369 1021 2567 -2136 -3365
1707 -3365 1268 1938 -2816 -3011 1873 1309 -3368 -2437 2145 786 -3733 -1925 2827 630 -3519 -778
1723 -778 3183 432 -3349 51 3769 -27 -2739 1256 4030 -186 -2263 2047 3749 -319 -1852
1738 -1852 2541 3397 -1050 -1459 2893 2975 -1918 -1468 3009 2028 -2701 -1433 2914 850 -3315 -1090
1754 -1090 2312 -158 -3998 -1193 2109 -1219 -4100 -692 1811 -1932 -4243 -24 1962 -2348 -3766
1769 -3766 449 1833 -2417 -2782 1445 2083 -2489 -2243 2693 2015 -2418 -977 3455 2128 -1977 82
1785 82 3968 1644 -1910 623 4117 1136 -1961 1182 4206 305 -2256 1554 3646 -602 -2568
1800 -2568 1544 2788 -1455 -2654 1433 1915 -2411 -2702 1659 1100 -3272 -2578 1583 370 -3632 -2093
1816 -2093 1619 -101 -3738 -1504 2188 -460 -3593 -404 2629 -745 -3225 582 3100 -548 -2601
1831 -2601 1547 3251 -629 -1587 2491 3268 -820 -1130 3095 2965 -1193 -509 3662 2413 -1676 -173
1847 -173 3457 1791 -2197 -12 3178 630 -2601 -129 2841 -375 -3083 -18 2270 -1419 -3557
1862 -3557 361 1744 -2226 -3360 411 1495 -2486 -3140 1010 1097 -3032 -2508 1747 1095 -2923 -1608
1878 -1608 2372 886 -2548 -860 2825 684 -2501 -69 3035 608 -2206 722 3413 123 -2182
1893 -2182 1405 3377 -588 -2103 1753 2860 -1051 -1875 2128 2268 -1692 -1632 2047 1709 -2268 -1605
1909 -1605 2121 887 -2665 -1247 2277 120 -3275 -947 2149 -415 -3124 -488 2248 -831 -3057
1924 -3057 239 2182 -1321 -2788 790 2126 -1378 -2379 1297 1869 -1586 -1771 2107 1853 -1764 -1265
1940 -1265 2395 1543 -2121 -611 2652 1133 -2160 -88 2860 604 -2110 57 2853 121 -2311
1955 -2311 548 2565 -732 -2249 886 2408 -984 -2229 1495 1917 -1405 -1908 1689 1816 -1918 -1492
1971 -1492 2210 1263 -2108 -1073 2242 1022 -2346 -580 2561 494 -2505 -85 2570 -21 -2421
1986 -2421 290 2569 -483 -2363 693 2159 -988 -2495 1020 1951 -1666 -1878 1412 1541 -1962 -1764
2002 -1764 1794 1402 -2124 -1420 2112 1037 -2213 -804 2138 395 -2298 -243 2705 452 -2218
2017 -2218 377 2719 16 -1901 694 2770 -364 -1845 1553 2663 -862 -1632 1758 2159 -1283
2032 -1283 -1455 1610 1611 -1830 -1360 1946 912 -2417 -1270 1728 295 -2768 -1096 1761 -287 -2994
2048 -2994 -488 1703 -775 -2847 -190 1781 -1220 -2576 349 1688 -1413 -2430 1002 1859 -1372
2063 -1372 -1530 1788 1836 -1520 -1274 2356 1647 -1681 -618 2611 1426 -1395 12 2884 1260 -1712
2079 -1712 470 2810 460 -1866 859 2592 -330 -2093 716 2338 -849 -2080 767 1675 -1742
2094 -1742 -2361 868 1182 -2110 -2396 967 645 -2570 -1859 1163 310 -2805 -1484 1636 -62 -2543
2110 -2543 -575 1718 35 -2454 127 2143 -365 -1952 843 2525 -320 -1616 1718 2471 -559
2125 -559 -1035 2089 2456 -663 -818 2383 2132 -1057 -501 2289 1677 -1680 -273 2396 641 -1949 -435
2142 -435 2203 63 -2290 -475 1770 -596 -2648 -212 1535 -1176 -2679 226 1239 -1532 -2508
2157 -2508 587 1171 -1894 -1897 1152 1077 -1920 -1522 1778 1066 -1614 -672 2186 926 -1701 -267 2601
2174 2601 666 -1578 408 2768 636 -1370 979 2741 87 -1349 1508 2496 -471 -1469 1492
2189 1492 2110 -1064 -1553 1453 1553 -1660 -1536 1452 952 -2192 -1485 1412 379 -2463 -1210 1351
2205 1351 -373 -2587 -887 1364 -547 -2733 -262 1639 -675 -2489 23 1836 -1016 -2108 913
2220 913 1571 -1137 -1579 1322 1665 -1100 -890 1790 1549 -1147 -646 2299 1350 -1263 -150 2193 826
2237 826 -1507 285 2389 396 -1886 298 1979 -140 -1992 336 1705 -876 -1984 625 1305
2252 1305 -1422 -2052 960 1045 -1772 -1991 931 848 -1919 -1393 1264 569 -2020 -1008 1508 300 -1957
2269 -1957 -576 1588 91 -1816 -113 1853 -263 -1710 528 1710 -429 -1647 935 1760 -717
2284 -717 -1542 1370 1730 -793 -1106 1437 1514 -1242 -941 1574 1040 -1309 -641 1968 668 -1742 -406
2301 -406 1637 367 -1767 -247 1712 10 -1723 354 1852 -540 -1810 431 1769 -689 -1559
2316 -1559 1091 1438 -951 -1442 1196 1338 -1335 -1116 1285 1013 -1461 -759 1372 711 -1828 -608 1529
2333 1529 392 -1796 -564 1493 -44 -1901 -189 1774 -255 -1779 449 1575 -633 -1703 766
2348 766 1489 -669 -1359 1176 1369 -1121 -962 1382 1263 -1183 -894 1741 1084 -1334 -461 1637 783
2365 783 -1421 -357 1766 373 -1550 152 1584 -253 -1759 355 1346 -492 -1606 360 1267 -1111
2381 -1111 -1768 588 973 -1324 -1635 702 866 -1665 -1441 1041 447 -1817 -1131 1203 470 -1843 -593
2398 -593 1488 86 -1695 -86 1708 239 -1335 353 2044 -53 -1238 872 2027 -186 -1038
2413 -1038 1230 1921 -660 -883 1471 1468 -852 -729 1572 1196 -1241 -694 1514 973 -1458 -580 1353
2430 1353 145 -1957 -530 1286 -374 -2131 -418 1122 -747 -2171 -93 1105 -1159 -2041 222
2445 222 966 -1127 -1527 633 1050 -1104 -1323 1222 951 -1248 -974 1487 1073 -974 -467 1924 782
2462 782 -1138 372 2183 654 -1106 329 1905 492 -1243 602 2008 -175 -1193 888 1601
2477 1601 -323 -1211 854 1235 -947 -1375 899 626 -1363 -1351 731 384 -1679 -1050 899 73 -1906
2494 -1906 -900 1101 -244 -1982 -574 1229 -83 -1946 -74 1556 -437 -1415 635 1452 -359
2509 -359 -1117 993 1610 -365 -737 1382 1671 -578 -417 1347 1341 -877 -190 1490 1036 -923 -192 1577
2527 1577 464 -1370 -88 1368 137 -1577 -31 1248 -431 -1574 -9 932 -1077 -1797 201
2542 201 881 -1242 -1609 456 601 -1451 -1335 638 421 -1567 -1236 807 580 -1460 -705 1282 434
2559 434 -1269 -160 1473 176 -1122 236 1569 99 -1244 595 1591 -176 -1079 1063 1587 -398
2575 -398 -841 1140 1373 -592 -826 1241 1068 -903 -855 1306 803 -1307 -438 1280 337 -1348 -613 1077
2593 1077 -35 -1799 -360 1112 -206 -1521 -29 1266 -578 -1607 249 1048 -902 -1340 524
2608 524 918 -825 -1048 1032 1092 -1002 -904 1225 604 -1073 -700 1321 746 -1126 -333 1449 430 -1169
2626 -1169 -25 1460 123 -1179 276 1300 -325 -1255 498 1298 -381 -1096 768 1051 -648 -1058
2642 -1058 750 811 -1014 -988 1099 880 -1161 -514 1004 537 -1190 -454 1153 341 -1471 -256 1170
2659 1170 -54 -1235 -62 1340 -354 -1428 280 1008 -576 -1188 472 1229 -539 -1125 651 814
2675 814 -656 -1033 862 776 -892 -861 1026 617 -869 -178 1365 432 -1062 9 1351 389 -1060
2692 -1060 261 1365 -195 -1068 510 1368 -156 -1043 421 1233 -402 -1007 790 1290 -532 -827 825
2709 825 872 -963 -888 878 381 -1074 -715 861 245 -1371 -516 655 33 -1370 -350 710 -447
2726 -447 -1524 -50 838 -377 -1274 92 1039 -526 -1072 537 941 -781 -896 810 1015 -412 -730
2743 -730 1205 1030 -832 -318 1380 819 -711 50 1472 593 -746 -1 1345 486 -973 282 1160
2760 1160 122 -889 291 868 -375 -807 355 952 -739 -1147 392 702 -1021 -1026 420 337 -1300
2777 -1300 -941 667 353 -1372 -779 893 251 -1084 -495 939 123 -1301 61 1185 89 -919
2793 -919 267 1324 -17 -962 528 1144 -280 -595 715 1453 -417 -622 1076 1068 -615 -373 1045
2810 1045 725 -815 -497 1019 602 -846 -372 948 270 -1359 -296 726 -436 -1472 -74 643
2826 643 -723 -1261 -24 725 -829 -1303 324 631 -1122 -1132 447 595 -890 -845 919 513 -872 -518
2844 -518 917 474 -898 -183 1366 537 -684 178 1318 371 -569 418 1280 295 -649 612 1384 30
2862 30 -823 662 1233 -411 -340 688 881 -656 -678 747 542 -971 -968 524 264 -1169 -536 826 -20
2881 -20 -1331 -634 728 -174 -1253 -482 632 -472 -1203 182 787 -446 -990 284 722 -544 -914
2898 -914 658 824 -401 -597 946 740 -437 -449 1067 734 -540 -226 1084 528 -747 -102 1220
2915 1220 268 -923 277 1258 74 -893 196 943 -419 -869 204 717 -539 -1058 316 523 -752
2932 -752 -828 584 509 -909 -717 623 354 -991 -520 588 414 -990 -420 731 -54 -1034 37 932
2950 932 -262 -1095 26 1054 118 -943 366 839 -400 -578 592 709 -453 -797 584 815 -341
2967 -341 -400 768 451 -836 -478 778 461 -973 -406 1130 263 -962 -89 1025 -156 -914 -55 729
2985 729 -74 -693 153 757 -266 -803 343 564 -760 -722 606 631 -661 -635 567 511 -798 -663 873
3004 873 351 -742 -329 700 -57 -797 -273 684 90 -823 53 877 1 -857 223 1019 -188 -538 472
3023 472 868 -193 -661 551 678 -335 -450 720 601 -535 -316 834 587 -575 -250 813 423
3040 423 -572 -309 979 127 -653 -129 722 11 -681 -15 478 -166 -833 183 513 -514 -845 231 279
3059 279 -862 -923 385 413 -878 -630 539 327 -703 -550 483 309 -756 -298 752 19 -760 -98
3077 -98 814 138 -540 341 1060 107 -511 529 967 -80 -389 561 967 -238 -453 843 772 -292 -327
3096 -327 844 832 -560 -183 771 318 -786 -420 578 25 -845 -310 487 -158 -894 -294 532 -377 -995
3115 -995 14 470 -617 -785 -97 510 -650 -921 330 601 -602 -571 555 356 -554 -567 715 537
3133 537 -406 -225 966 496 -614 10 1059 551 -485 417 903 277 -464 428 981 74 -711 458
3151 458 536 -137 -475 200 480 -313 -652 439 357 -638 -566 425 117 -957 -548 308 -44 -938 -513 390
3171 390 -279 -1014 -387 447 35 -1033 -212 712 -104 -842 187 758 -127 -692 230 818 -555 -299 775
3190 775 787 -255 -169 919 607 -208 -210 928 499 -558 114 795 228 -674 146 952 173 -789 -134 802
3210 802 7 -700 202 668 -222 -911 171 359 -498 -929 105 314 -643 -739 310 288 -850 -642 349
3229 349 -2 -809 -298 487 60 -861 -191 588 227 -459 -9 775 135 -403 272 911 24 -543 420 769
3249 769 -190 -489 550 786 -382 -328 678 536 -272 -270 616 445 -616 -225 612 124 -718 -102 699 49
3269 49 -823 -97 500 -101 -696 57 587 -198 -719 -41 533 -287 -703 31 405 -461 -370 478 369 -471 -492
3290 -492 555 364 -602 -315 588 402 -550 -26 905 235 -589 74 658 232 -580 -112 709 40 -630 244
3310 244 701 -13 -491 216 510 -166 -529 285 596 -397 -574 309 378 -585 -398 393 126 -579 -191 353
3330 353 36 -670 -251 456 201 -549 -51 626 -153 -772 -102 536 -169 -631 259 469 -245 -574 190 442
3350 442 -483 -395 347 486 -520 -297 668 361 -388 -210 488 350 -414 -49 777 93 -489 79 786 92
3370 92 -428 111 671 -129 -425 357 573 -66 -531 278 431 -340 -537 397 478 -501 -299 322 179 -586 -308
3391 -308 465 -3 -606 -431 417 -70 -742 -106 390 -162 -715 -79 302 -142 -512 16 584 -211 -455 285
3411 285 450 -230 -391 361 497 -404 -309 520 530 -374 11 715 615 -344 -112 850 397 -225 245 490 281
3432 281 -408 222 680 136 -541 190 387 -146 -578 112 605 -399 -597 186 184 -615 -474 39 114 -522 -606
3453 -606 175 73 -595 -340 309 -7 -739 -426 473 90 -565 -115 544 -17 -411 -6 701 60 -439 188
3473 188 630 -40 -246 366 604 134 -295 647 511 -256 -133 700 313 -202 -189 419 217 -483 -112 510
3493 510 20 -632 13 449 -11 -708 -241 249 -196 -705 -87 205 -246 -611 7 128 -631 -687 14 107 -454
3514 -454 -550 383 262 -367 -151 531 363 -275 -181 665 321 -329 -79 748 317 -283 294 632 97 -239 303
3535 303 463 107 -360 542 535 -175 -420 238 489 -196 -524 300 239 -429 -266 418 59 -512 -324 394 -190
3556 -190 -864 -463 372 -79 -752 -172 251 -398 -636 -200 377 -164 -651 6 445 -218 -440 249 477 -410
3576 -410 -242 504 625 -280 -233 561 327 -163 -150 587 346 -231 221 574 40 -356 105 655 300 -472 126
3597 126 520 -39 -546 -73 396 -310 -456 127 234 -421 -429 326 123 -563 -368 165 269 -614 -359 127 124
3618 124 -604 -159 381 103 -520 -191 525 -135 -399 142 536 0 -487 -15 589 -123 -418 400 337 -219
3638 -219 -135 357 360 -357 -235 346 558 -359 -138 557 217 -434 -88 560 111 -437 54 495 54 -390 156
3659 156 363 -59 -452 145 261 -316 -394 142 366 -299 -503 116 230 -498 -397 283 203 -655 -373 382 -71
3680 -71 -380 -321 397 -16 -353 -177 459 47 -409 -88 271 -132 -347 57 494 -112 -520 339 284 -189 -242
3701 -242 292 415 -189 -305 458 351 -235 -151 485 182 -175 -74 318 131 -202 -52 556 227 -353 -5
3721 -5 470 -243 -313 -80 399 -79 -471 -5 252 -227 -423 192 334 -292 -433 280 104 -590 -453 236 199
3742 199 -316 -241 275 186 -375 -244 540 179 -446 -223 426 155 -225 215 411 8 -48 286 337 112 -365
3763 -365 343 386 -171 -93 388 372 -230 -174 463 398 -272 -323 379 167 -323 -405 437 89 -415 -86 399 -183
3785 -183 -635 -145 53 -214 -643 -31 101 -102 -337 31 204 -259 -196 255 388 -225 -356 225 435 -320
3805 -320 -221 496 350 -288 14 543 238 -196 -154 608 270 -227 60 631 97 -126 231 683 -19 -98 245
3826 245 394 164 -385 329 299 -219 -373 343 132 -314 -149 230 28 -472 -326 49 134 -650 -191 145 -18
3847 -18 -402 -441 299 -153 -464 -83 356 -108 -321 189 370 -217 -509 -67 605 -25 -218 287 274 -221 -41
3868 -41 323 396 -127 -3 538 270 -62 -52 541 -11 -352 -97 439 -137 -211 -41 401 -19 -364 109 351
3889 351 -166 -435 68 288 -302 -565 73 140 -174 -440 58 100 -317 -392 256 128 -318 -375 301 184 -387
3910 -387 -12 423 164 -262 2 449 141 -285 155 480 209 -373 136 365 -71 -285 356 255 -35 -315
3930 -315 371 238 -96 -5 296 369 -371 -101 152 31 -353 10 132 -55 -310 53 254 -191 -368 14 290
3951 290 -206 -270 -54 56 -344 -472 -188 168 -187 -340 30 160 -311 -161 235 281 -284 -73 381 259 -227
3972 -227 157 204 127 -270 67 439 23 -195 88 566 -109 -263 202 367 -77 -91 236 280 -162 -140 137 137
3994 137 -431 -249 89 273 -161 -266 221 275 -312 -261 158 -161 -171 -177 406 1 -398 -91 70 -86 -394 -29
4016 -29 175 -57 -459 231 311 -148 -90 344 226 -139 -375 205 189 -198 -75 385 241 -286 -185 408 244
4037 244 -215 107 347 80 -298 -67 270 83 -150 30 359 74 -237 255 247 -150 -273 274 142 -304 -41
4058 -41 213 84 -165 -499 197 66 -421 -242 294 235 -381 -146 126 -196 -155 21 31 51 -396 -139 17 -9
4080 -9 -330 69 217 -100 -121 213 188 -128 -343 231 200 -201 -138 352 104 -70 -49 357 231 3 86 428 148
4103 148 -199 -67 200 196 -155 -113 146 80 -189 -95 264 -80 -309 45 147 -199 -26 -157 -137 -290 -298 -59 125
4126 125 -379 -259 34 -64 -400 -276 313 31 -310 26 181 -157 -375 52 241 -72 -124 -34 220 34 -101
4147 -101 -8 279 -145 -29 183 316 -39 -108 338 325 -76 -242 262 201 -69 -39 410 -29 -281 -81 192 115
4169 115 -219 -174 211 101 -182 -73 293 -264 -218 -98 130 -248 -230 104 221 -346 -245 72 119 -269 -185 75
4191 75 69 -193 84 272 97 -326 -115 469 123 -109 24 268 15 4 206 336 143 -103 40 432 -87
4212 -87 -146 126 316 -80 -55 143 293 -85 -67 -5 184 -239 -141 56 168 -312 -72 227 -72 -413 -4 70
4234 70 -206 -469 -248 208 12 -191 -154 -30 -124 -308 -77 209 -388 -162 187 214 -150 -217 172 234 -217 -195
4256 -195 169 312 -225 -40 303 239 -272 172 151 248 -157 77 237 131 -297 103 320 -58 -141 -45 324 -23
4278 -23 -220 -112 43 -192 -340 84 16 -284 -410 337 -30 -298 -160 165 -124 -282 -151 -51 -60 -360 -43
4299 -43 164 -93 -189 91 263 -40 -109 93 107 108 -185 154 276 -164 -118 190 311 -222 26 465 306 90
4321 90 27 215 139 -121 14 231 -28 -197 -59 194 -80 -203 -81 317 218 -184 93 55 -219 -290 95 149
4343 149 -149 -319 201 130 -169 -286 269 71 -294 -144 78 31 -255 -51 347 190 -202 145 100 181 -182
4364 -182 -77 248 -50 -157 80 150 -35 -65 -89 -24 -179 27 5 145 32 -190 282 -1 -33 -108 240 180 -305
4387 -305 -118 347 -129 -295 -19 154 119 -112 95 414 90 -176 -81 19 -70 -321 38 144 -191 -141 97
4408 97 -51 -136 -164 345 73 -79 -198 160 179 -229 -41 246 206 -121 -207 126 -23 -191 -78 287 155 -77
4430 -77 -75 168 -25 -165 281 307 -63 183 151 363 -90 -214 258 42 -78 -53 80 43 -201 114 176 81 -160
4453 -160 88 178 -25 -259 -76 60 -58 -353 -243 182 -56 -271 -87 98 -132 -451 24 152 -211 -125 -119
4474 -119 0 -68 2 184 103 -19 -79 101 -12 -151 -72 344 88 -54 -87 103 65 -187 93 265 -111 -87 63
4497 63 200 85 -59 165 154 -43 -274 -67 353 -84 -223 174 170 -247 -90 136 -68 -130 -231 245 132 -190
4519 -190 -188 94 -61 -187 6 -66 -91 56 -6 19 3 -199 116 339 -61 -47 61 53 -106 -137 -38 103 85 115 19
4544 19 -17 7 124 400 109 54 44 131 97 -209 36 244 267 -54 85 115 132 -177 116 249 -27 -164 118
4567 118 -7 -238 -334 -9 -142 -168 -205 145 214 -201 -132 -78 -35 -226 -208 121 143 -241 12 234 -43 -299 25
4590 25 68 138 -297 333 336 134 -18 185 149 40 169 35 275 22 197 177 271 -112 36 131 227 9 -39 58
4614 58 -36 -30 16 185 -119 -196 20 110 41 -61 40 14 -179 -114 -150 117 -227 -242 191 -28 -105 -468 23 -79
4638 -79 -169 -24 -58 90 -256 -229 37 -80 -93 182 317 208 -106 -168 131 -142 -62 132 470 -24 -224 59
4660 59 301 117 -90 78 227 -33 -110 225 4 84 -111 74 134 -132 -212 45 168 -95 -130 99 163 -161
4682 -161 -106 119 -137 -196 -40 20 -141 -328 69 182 -86 -227 -131 5 -111 -364 -18 84 -82 82 3 82
4704 82 -142 76 23 69 26 -15 124 85 -201 39 222 -6 -202 -43 269 -178 -34 -51 154 149 -91 86 193
4727 193 16 -61 -7 224 -113 -258 24 70 -260 -125 204 87 -201 -71 211 95 -272 -117 58 56 -226 -2
4749 -2 64 -138 -269 -264 39 -32 -219 52 148 -144 -289 309 72 -181 -145 87 61 -176 -88 38 -50 -13 158 174
4773 174 120 -166 -18 193 20 -70 -120 95 36 -80 -79 95 -22 -67 49 165 25 -122 100 182 -164 -370 150
4796 150 -20 -111 -98 41 57 -185 -54 191 -8 -105 -64 -184 243 -138 38 373 -130 23 106 -8 -143 5
4818 5 -4 173 89 -14 158 298 -49 -135 76 159 43 -107 99 139 -147 -110 -154 -2 6 -268 171 24 -115 -93
4842 -93 112 -19 -440 -1 111 -13 -107 106 -47 -228 -171 51 9 -121 -248 -7 53 -134 -64 -66 -55 16 -68 144
4866 144 133 -38 -12 80 -79 -97 -24 99 -39 -117 155 334 181 51 15 189 -33 9 152 139 43 -77 380
4889 380 259 -58 73 106 241 -106 -131 -56 70 -138 -115 216 30 -122 -106 61 153 -84 49 229 -28 -149
4911 -149 -51 -48 -87 -164 163 61 110 -151 87 93 -93 -39 184 142 10 -227 139 228 -222 -47 57 277 37 -98
4935 -98 106 216 17 23 140 -27 52 197 -11 -60 18 82 3 45 -37 116 83 -31 -151 -169 35 -135 65 160
4959 160 23 -137 -289 -54 -183 -174 -30 -107 10 -198 -163 -22 -47 14 -237 184 -58 -90 218 60 28 -281 140
4982 140 118 -76 -189 143 127 66 -43 29 130 12 74 156 256 -72 29 133 -21 -128 -5 -148 227 -49
5004 -49 19 64 -193 -77 94 83 -71 116 129 149 -183 48 -107 71 47 -213 91 -87 -27 -147 -33 -60 -239
5027 -239 -139 78 49 -173 -20 105 -48 -205 -29 -74 -137 -95 -125 26 2 -50 76 211 109 110 129 114 -120 -2
5051 -2 40 135 -144 13 100 39 58 17 94 93 -222 -25 202 -50 -52 -77 39 -108 -36 15 -112 -16 -247 -43 -131 -197
5077 -197 -92 75 89 -58 -200 80 19 -140 -128 -9 -235 -88 254 197 -220 -200 -57 112 -77 -98 1 177
5099 177 -98 -424 -1 129 -38 21 -43 -2 76 -62 -27 101 120 109 288 28 105 -207 54 137 126 -100 107
5122 107 -74 30 -21 -12 74 -201 -50 78 -44 -253 -132 75 177 -251 -174 123 59 -155 -61 101 -135 -59 -200
5145 -200 -28 -145 -220 62 0 115 40 10 80 -102 -46 -1 65 125 -3 13 146 -78 -100 184 -49 54 168 25
5169 25 8 23 173 155 77 59 16 98 24 17 -106 40 74 116 120 65 -34 -77 -9 13 25 -83 -15 -179 8 -101 159
5196 159 22 -113 -99 160 -35 -108 -82 105 -17 -163 41 85 80 9 142 156 -49 34 139 168 146 -166 98 -34
5220 -34 -111 136 149 -115 100 28 33 213 -168 -88 206 -56 -94 -26 -8 136 -99 44 180 -155 -175 -130 -82 -33 -243
5245 -243 -250 -105 -260 -56 28 0 -108 -62 98 -47 11 -122 107 -38 -83 -85 52 56 57 -179 53 38 -51 54 -63
5270 -63 19 -171 -59 27 238 19 114 55 -49 55 114 64 -134 -99 -97 2 -107 -31 159 34 60 -262 111 -60
5294 -60 -148 117 -172 -63 -225 61 119 -4 -139 -46 30 -100 -43 -258 -5 15 33 126 42 -130 47 48 99 41 -16
5319 -16 329 61 -100 -23 136 141 -31 108 225 -159 57 149 119 45 225 -99 89 183 -13 9 108 150 65 81
5343 81 66 -52 -26 130 -2 -139 -150 -2 175 25 -27 9 -193 -217 -81 -80 -9 -148 138 51 -195 -229 -50 3
5367 3 -77 8 -26 -71 -72 -183 -91 162 -260 -208 -27 5 108 -77 -50 193 -33 -152 242 201 -46 180 205 139 -280
5392 -280 44 174 -44 -34 -24 147 32 51 -39 300 -103 -171 285 85 -76 -98 -101 -127 73 -22 177 -103 -147 -177
5416 -177 144 -219 -63 -186 82 -157 -279 19 70 102 -114 115 -69 -100 -226 -60 12 -64 -23 90 -1 -83 -47
5439 -47 118 -16 7 -24 195 36 64 137 -57 187 112 129 168 -72 14 -40 188 -88 -61 -32 118 -158 -44 50
5463 50 21 4 -26 -18 -1 -158 58 -36 -193 38 -57 -138 38 -64 -47 -97 -9 -97 73 130 -146 77 -61 20 227
5488 227 -243 19 9 -99 -12 138 43 -135 92 10 -1 21 -84 74 33 -54 -77 3 75 -48 12 71 107 -12 -35
5513 -35 -111 12 -185 -70 136 20 -92 -4 -2 40 109 -72 162 -176 -4 77 87 -2 -222 12 -10 110 -31 63
5537 63 59 27 -29 -60 -69 -240 -96 113 -79 10 71 104 -56 115 -78 90 -41 213 86 122 18 -53 32 82 -61
5562 -61 -186 -22 137 -28 92 127 30 83 -17 157 -88 -76 237 95 -108 -150 31 164 206 -86 40 150
5584 150 -59 -84 -139 -102 41 -23 117 68 -116 -121 138 11 69 -11 85 100 -4 -218 -96 -20 -94 -57 76 75 -123
5609 -123 -87 169 -11 17 132 108 99 -75 184 160 98 -81 106 98 34 -65 67 -101 145 -125 -24 2 92 114 138
5634 138 -57 -9 47 96 -128 -185 143 -23 -9 -106 -16 -41 13 -205 -117 47 -103 -111 -64 -41 -92 59 47 151 -58
5659 -58 -207 6 105 -43 -121 44 111 -48 59 -15 135 -47 129 68 -100 -30 -22 101 185 -117 -161 -24 -6 -105
5683 -105 -70 42 61 -163 -46 -21 -48 28 74 55 -70 -97 -56 -109 -183 31 -2 100 -12 194 -162 122 -88 106
5707 106 -75 -72 -67 -74 -10 1 -46 -88 187 -143 -6 -60 -55 37 64 378 175 35 -14 -70 116 147 -112 -84 111 -161
5733 -161 -124 69 52 8 107 -67 78 15 93 89 162 -221 -33 -46 -80 -32 -24 108 -21 -56 -173 -179 -73 -117 95 55
5759 55 -30 -149 114 50 -81 -52 -4 -95 5 32 -88 -165 -129 80 54 44 -124 161 70 19 -135 219 103 32 22
5784 22 126 114 -137 38 67 59 63 -134 54 -65 76 18 66 202 188 -42 -126 128 -75 -52 41 -82 -203 -9
5808 -9 211 207 -127 -79 86 -171 -110 -113 -50 19 48 87 144 -168 -36 56 -92 28 72 29 59 -89 -146 -157 96 -115
5834 -115 207 -113 176 25 -183 189 66 -186 127 -85 42 20 63 -2 -26 -24 16 -72 -83 86 -15 69 -60
5857 -60 43 -15 11 -150 57 -30 -39 67 -28 -19 -8 -66 100 140 -72 -149 -108 -137 80 -54 -17 63 135 153 -122 58
5883 58 -78 58 -105 31 -41 56 54 -63 -31 -215 -24 179 39 84 32 87 73 21 162 -65 -118 53 152 -109
5907 -109 -34 57 -13 -102 -181 -38 -167 60 -29 1 8 51 -20 47 10 -160 -145 138 -4 -7 -134 243 -48 -207 -17
5932 -17 -12 -15 -47 66 -9 132 -64 87 25 -33 26 11 -52 -157 -175 251 133 -5 -143 -122 66 -1 68 236 123
5957 123 14 -132 -3 75 -190 -7 37 36 33 -54 200 -37 -93 204 -30 36 -72 -24 93 -81 1 -33 -71 -74 -45
5982 -45 -54 2 -59 -94 -6 26 -127 -17 -52 -52 47 -135 61 -198 -44 -19 -86 37 87 163 96 51 189 36 178 -121
6008 -121 -95 -102 -70 5 51 94 64 65 -137 -89 34 -64 5 18 -77 -59 24 166 82 14 -8 149 86 64 -112 -51 -44 -72 7
6037 7 -81 -71 -130 -39 -171 -126 -237 -45 -155 45 -58 -118 139 -52 -42 -66 123 -139 9 13 45 68 -129 253 250
6062 250 5 138 -25 212 48 36 -74 0 35 -79 42 160 20 -53 115 32 77 -80 84 -224 -60 119
6084 119 -67 -34 -11 -86 47 20 -6 132 -124 -102 -92 105 5 -81 -123 -39 -152 38 -198 33 90 15 6 49 24
6109 24 7 -4 83 -38 -38 114 -131 91 -78 47 121 158 68 7 -1 -109 138 35 42 -35 -81 132 -86 -32 -35 -68 -19
6136 -19 -6 -18 134 100 -96 -41 59 -56 112 29 72 -23 -112 -147 -176 -7 -32 -39 179 -143 -126 -183 10 -132 24
6161 24 34 94 61 -27 -52 55 -58 11 315 -189 24 -141 -85 -62 76 92 -21 40 -141 -20 -8 -22 167 45
6185 45 -77 74 91 -4 8 -108 133 -46 32 -189 183 63 -99 -19 76 -28 -41 29 222 24 -98 -175 255
6208 255 -92 -142 65 47 -116 -26 65 32 -52 70 -38 -161 -5 -44 -4 -123 -15 -43 66 108 -114 -111 -202 0
6232 0 198 -69 37 -61 80 -31 231 -78 23 -111 76 139 177 -147 16 -22 25 -52 -70 -25 105 118 28 96
6256 96 -110 -97 -39 -165 -161 20 3 -122 -63 52 -4 185 -99 -57 -24 97 -70 -84 105 -205 193 126 -97 7
6280 7 148 161 244 57 -60 -210 62 -136 85 53 -133 47 89 91 -20 -15 -130 130 133 -150 41 58 -44 -17 40
6305 40 17 -48 -105 76 -54 -51 -82 -147 30 77 -119 124 239 -121 -54 32 61 -38 -18 -58 -6 -52 -12 88 -145 33
6331 33 -274 -46 149 137 -9 -54 111 17 67 -156 59 138 97 71 -26 -19 -72 -101 -89 -223 -7 8 -93 5 -2 19
6357 19 -96 124 -1 107 56 109 78 -138 46 46 -54 -88 -106 80 170 -102 -32 72 0 120 -145 -138 -87 -25 -81
6382 -81 -21 -47 115 -57 0 117 -216 -35 12 -16 59 81 139 36 -34 44 15 87 104 149 45 -28 70 18 -146 -69
6408 -69 -113 28 13 -102 -8 -6 -76 9 -56 -20 -45 -45 -8 -44 113 52 97 -37 -76 -166 28 -15 133 -53 31 139 -185
6435 -185 -51 95 -34 -9 -27 38 121 -62 84 84 -140 -40 78 -84 -170 -54 160 -51 -59 -72 -50 -19 -112 -95 -94
6460 -94 246 -149 108 19 77 4 125 20 -57 -32 -93 6 47 -69 28 39 185 -33 -81 149 -70 -180 -123 -57 132
6485 132 -57 -22 221 -16 -184 -49 -19 143 160 9 -30 -34 -93 25 -4 127 -143 19 111 82 51 86 133 67 -27
6510 -27 10 -66 160 127 81 -5 17 193 23 153 -33 -160 18 -73 77 43 -45 -168 107 98 119 -9 -18 106 188
6535 188 10 -71 -27 29 -195 -12 116 -52 -61 37 1 -46 -110 -54 -92 -103 -109 85 -42 95 -5 -39 112 -68 -74 -25
6561 -25 117 -74 161 60 -62 131 19 82 43 -105 -106 60 41 14 210 -19 -60 -125 -1 53 92 219 11 72
6585 72 -56 -101 -59 -107 -76 -37 97 33 26 35 70 -5 48 109 -152 50 -6 -28 -58 82 86 32 34 94 -33 -74 -14 61 -70
6614 -70 0 -17 120 66 77 -72 -84 119 98 26 -57 35 -9 -93 -101 32 -56 122 86 -66 97 -39 -223 2 -28 35
6640 35 -124 30 21 78 -240 -172 -4 -132 -5 53 190 -126 -24 -161 -103 19 112 21 -5 70 -66 -161 27 -63
6664 -63 -122 63 -134 -37 -90 -26 -65 -14 -39 0 -172 -16 112 120 27 137 50 -2 64 -66 -58 97 55 134 57 -76 21
6691 21 -7 134 40 18 -101 -7 138 -89 -26 182 58 36 -20 -50 -216 -88 8 -50 58 61 -87 -158 -3 -89 -207
6716 -207 -150 -15 -110 -136 1 -105 89 -18 80 -107 -68 57 161 -38 -36 98 177 80 -131 -52 112 129 -120 44
6740 44 163 -30 254 -204 -58 -45 271 130 150 -53 33 -62 -29 -1 -68 -99 -29 -139 11 5 -78 -60 -101 118 -113
6765 -113 -23 0 -110 101 49 27 -39 -161 -71 -62 57 -83 -67 -91 -74 16 7 -137 -80 48 -232 -39 25 -160 34
6790 34 -35 72 -30 -75 -1 153 114 -153 167 26 -10 -15 40 163 -124 108 -2 88 -66 3 17 -115 52 -15
6814 -15 -282 -8 106 -33 -98 -42 104 -86 -68 43 25 113 -28 67 144 168 -13 167 35 -152 -218 -45 -7 23
6838 23 -53 -208 -46 -68 -181 168 124 99 -28 113 -85 40 -180 -186 51 -334 91 235 -115 -128 131 -21 -91
6861 -91 -10 103 -83 99 258 75 -182 164 140 46 86 3 -206 10 -194 -4 -186 -27 -47 -154 22 -74 -27
6884 -27 -132 102 -40 -15 -65 -52 20 0 33 -126 10 19 124 339 -38 67 -205 -83 -5 11 -18 -72 -51 17 76
6909 76 -184 -80 17 -154 -124 -35 44 160 -53 78 -31 -119 91 -335 76 156 -83 132 34 38 -85 -112 21 -26
6933 -26 0 -31 -172 -210 -88 -140 -73 91 21 -147 49 -73 50 -137 -16 -1 -36 -12 -66 64 -226 31 6 62
6957 62 91 -139 -1 61 -11 -90 2 75 -64 141 -55 124 -41 -157 17 30 87 -133 -81 -57 113 -71 35 258
6981 258 -87 -216 -109 -63 -135 -38 -182 -37 -3 -74 37 -84 47 4 -168 -29 3 16 -56 -173 -36 -37 106 -59
7005 -59 40 86 46 -209 95 -173 -19 18 96 -82 -44 -41 -55 2 -117 -109 -35 21 42 4 56 -31 -17 -61 87 75 119 -21
7033 -21 -161 112 -25 -144 126 99 -13 -115 120 25 -127 23 135 -20 -61 106 32 156 14 -24 24 40 49
7056 49 -95 -219 -47 -95 33 -28 24 -10 117 161 11 -168 175 -188 37 30 -68 82 128 61 -74 -53 162 -37
7080 -37 85 74 7 77 -12 -133 69 9 53 -101 -103 14 81 -26 -121 -119 -171 71 26 15 -2 -32 45 -57 10 33 -5
7107 -5 35 8 -33 -8 -143 26 -67 239 106 -12 183 -3 -54 -72 -89 45 -22 3 124 163 114 -11 -93 10 -43
7132 -43 -20 -85 -60 24 -297 59 49 -11 82 71 -83 -71 89 -50 -103 93 138 -133 -15 -162 -92 45 -76 13 23
7157 23 217 10 4 2 76 25 -108 -88 -132 79 8 57 -41 -239 262 -11 83 6 115 68 -71 20 112 156 -37 66
7183 66 -20 -101 101 275 -40 101 88 -38 104 -34 38 13 112 73 25 -105 -36 18 191 -26 -93 -77 -100 90 -55
7208 -55 -32 -3 -53 -99 8 -127 -41 78 -12 80 83 22 53 -12 -120 -46 -367 202 34 123 77 93 -9 -63 32 117 50
7235 50 170 -130 -32 -118 -90 -66 26 117 -170 344 102 78 -92 17 104 61 -5 9 40 -33 62 -14 37 114 -136 -16
7261 -16 -110 -43 94 30 76 149 -45 -92 -49 -130 -276 26 -56 -74 -200 -117 -7 146 -62 -10 4 98 98 -134 -218 40
7287 40 -52 122 -103 -136 7 -59 -25 -125 -40 -66 21 -25 117 121 -41 -130 14 230 179 -39 108 -22 53 -20 130
7312 130 -10 109 86 82 -24 -102 62 -182 39 -104 -109 -41 65 29 -91 -19 67 36 87 43 -182 35 26 -79 -5
7337 -5 -103 -32 -8 -84 -78 35 -65 9 209 26 -13 -83 -128 -72 0 89 36 -20 18 73 64 21 62 -144 19 -45 26 13 -27
7366 -27 -121 -18 74 -3 -155 45 89 -155 -233 -19 -41 85 -85 58 89 39 -41 24 194 15 -21 8 -105 33
7390 33 -15 21 -63 -138 -3 -229 36 -22 -119 32 -158 -139 143 278 -8 -24 49 -97 -70 192 34 -27 2 -3 50
7415 50 -112 11 167 -11 -87 18 44 164 -29 125 29 14 136 206 21 -115 245 61 -54 -54 76 -17 63
7438 63 1 -88 -38 -10 -204 16 121 -191 -126 -32 27 -135 -50 -89 113 -193 -28 57 -7 -179 -36 -114 -97 38 -6
7463 -6 -27 -128 -6 48 127 75 -83 283 -155 34 166 0 97 -35 169 -74 45 -97 132 -23 -1 109 -39
7486 -39 -78 169 -85 -213 -26 131 81 31 -15 61 -176 29 -230 -248 -161 -75 -74 8 7 -60 -83 121 -100 -158 53 -42
7512 -42 -148 41 14 -76 25 -1 76 25 59 -33 -42 1 129 58 -26 148 65 -35 -180 62 137 -114 138 -96 298
7537 298 105 81 143 103 145 -155 -77 -97 -106 204 16 -6 66 -127 -160 -63 -19 -23 -138 80 131 0 99 -141 83 -27
7563 -27 75 -105 -292 -113 54 -26 2 30 2 78 198 -122 47 161 43 6 64 83 230 136 139 -177 68 70 118
7588 118 -20 -54 -45 -56 -48 88 -65 22 178 -53 -87 -17 -51 32 -30 6 101 57 63 9 31 26 -14 -93 0 -96 -13 65 -112
7617 -112 -97 106 -155 -60 129 99 -75 -155 45 134 57 88 82 70 137 58 -4 20 68 -78 -117 9 -30 50 46 -51 -22
7644 -22 16 130 -31 31 122 -24 -116 -26 -93 71 182 59 1 56 -25 -10 97 -145 -163 -40 -63 -65 -81 -62 24 -66
7670 -66 -40 -126 -50 -117 148 -77 68 -44 107 -25 110 -58 -43 129 131 30 -175 -47 117 15 17 -61 -58 34 -1
7695 -1 -38 146 127 77 -81 -61 17 -154 68 -60 -91 -79 36 -3 190 253 71 -18 -59 29 27 -143 -151 111 43 130 -182
7722 -182 209 -121 98 6 -47 -104 -295 -90 -31 -58 -35 61 -37 187 76 7 88 39 122 -78 -118 -138 -38 -6 -222
7747 -222 -96 120 28 45 -78 80 -334 84 -100 54 9 -110 22 9 73 -13 -63 34 -23 -105 -166 51 23 43
7771 43 -199 -11 209 -44 280 152 22 -133 -115 -144 115 -114 -29 19 40 27 -2 -19 -53 36 -164 90 145 -159
7795 -159 194 -17 144 -3 -1 110 42 -51 126 -44 -120 121 -9 35 9 -90 107 138 104 133 84 49 -50 46 -140
7820 -140 25 19 14 65 -52 64 46 11 -134 -85 -94 19 127 -8 71 27 107 10 58 -19 91 -15 -75 -79 -158 -89 -138
7847 -138 -13 -84 -29 -29 -1 90 -58 19 89 -1 73 11 21 39 -85 138 259 -50 -68 153 244 -18 143 -38 -37 3
7873 3 71 122 -175 -52 128 34 -163 -61 -93 65 -85 -17 -67 -329 297 -181 -6 27 124 -2 57 -50 70 -69
7897 -69 83 102 -49 146 -72 155 -15 46 101 -102 171 -40 -56 14 122 123 -118 36 -66 -122 -172 -54 -92 -107
7921 -107 8 14 85 154 -122 220 -73 -147 98 -35 -116 -228 -55 -87 -64 -17 -152 -23 -117 -83 30 0 17 -15 221
7946 221 -53 -158 68 91 31 -136 20 69 -9 107 124 50 6 -164 65 151 54 157 -28 -80 35 -27 57 13
7970 13 -28 161 148 -4 -156 27 66 131 -159 -38 -151 18 -112 84 133 -166 -40 -136 50 -51 45 5 -108
7993 -108 195 -191 28 31 -68 43 -8 46 -144 -212 8 -95 4 110 27 103 -49 -108 19 3 15 14 -51 -10 74 -78
8019 -78 55 28 87 14 25 -63 -135 26 -23 243 136 -51 53 -253 -29 172 -94 -20 129 -25 75 189 -16
8042 -16 42 -124 -96 -244 140 -112 -134 -187 -92 -83 -8 -87 225 -257 -32 -5 -72 42 8 96 -68 86 -46 151 -85
8067 -85 -29 -1 -46 79 -48 -12 -140 128 -99 39 -29 58 103 -19 79 50 51 223 -42 17 70 95 -2 -58 -108 -49
8093 -49 110 119 49 -43 16 166 -65 -105 -83 73 215 14 -41 -42 6 -45 21 -47 -74 84 23 1 149 47 130 -221
8119 -221 -92 68 -18 -110 45 -136 2 -92 -18 -10 42 15 -54 44 76 70 35 40 15 -64 10 3 -122 85 67 -126 -79 105
8147 105 -59 121 -128 -213 -31 23 49 29 97 16 -103 -236 115 -8 -108 129 168 -107 -79 21 113 -41 107
8170 107 -40 84 162 -39 -82 128 -8 -116 18 49 -93 109 -38 45 -28 244 168 -39 -76 9 172
8191A72
##END NTUPLES=NMR FID
##END=
