##TITLE=1H_PHBF2805
 CDCl3, 8 sc, 
 28.5.2019
##JCAMPDX= 6.0         $$ Bruker NMR JCAMP-DX V2.0
##DATA TYPE= NMR FID
##DATA CLASS= NTUPLES
##ORIGIN= UXNMR, Bruker Analytische Messtechnik GmbH
##OWNER= root
$$ XWIN-NMR		Version 3.5
$$ Tue May 28 16:22:02 2019 Russian Standard Time (UT+4h)  she@DPX200
##.OBSERVE FREQUENCY= 200.13155
##.OBSERVE NUCLEUS= ^1H
##.DELAY= (6, 6)
##.ACQUISITION MODE= SIMULTANEOUS
##.ACQUISITION SCHEME= undefined
##.AVERAGES= 8
##.DIGITISER RES= 18
##SPECTROMETER/DATA SYSTEM= spect
##.PULSE SEQUENCE= zg30
##.SOLVENT NAME= CDCl3
##.SHIFT REFERENCE= (INTERNAL, CDCl3, 0, 15.7039)
##AUDIT TRAIL= $$ (NUMBER, WHEN, WHO, WHERE, WHAT)
$$ ##TITLE= Audit trail, XWIN-NMR		Version 3.5
$$ ##JCAMPDX= 5.01
$$ ##ORIGIN= Bruker BioSpin GmbH
$$ ##OWNER= she
$$ F:/spectra/data/she/nmr/H-F/1/audita.txt
$$ ##AUDIT TRAIL=  $$ (NUMBER, WHEN, WHO, WHERE, WHAT)
(   1,<2019-05-28 16:20:48.34 +0400>,<she>,<DPX200>,
      <created by zg, POWCHK disabled, PULCHK disabled
       configuration hash MD5:
       00 E9 B6 7A A2 85 ED C7 34 08 36 98 17 FE 4E 26
       data hash MD5: 16K
       3F A6 93 8E 61 E2 55 D5 AA E3 34 47 18 D4 1A 6F>)
$$ ##END=
$$ 
$$ hash MD5
$$ FD F2 51 8E 2B 62 33 59 A8 EF 08 EA 3A 4C 81 B1
##$RELAX= 
##$RELAX= 
##$RELAX= 
##$RELAX= 
##$RELAX= 
##$RELAX= 
$$ Bruker specific parameters
$$ --------------------------
##$DU= <F:/spectra>
##$EXPNO= 1
##$NAME= <H-F>
##$PROCNO= 1
##$TYPE= <nmr>
##$USER= <she>
##$AMP= (0..31)
100 100 100 100 100 100 100 100 100 100 100 100 100 100 100 100 100 100 
100 100 100 100 100 100 100 100 100 100 100 100 100 100 
##$AQSEQ= 0
##$AQ_mod= 1
##$AUNM= <au_zg>
##$AUTOPOS= <>
##$BF1= 200.13
##$BF2= 200.13
##$BF3= 200.13
##$BF4= 200.13
##$BF5= 200.13
##$BF6= 200.13
##$BF7= 200.13
##$BF8= 200.13
##$BYTORDA= 1
##$CFDGTYP= 0
##$CFRGTYP= 5
##$CHEMSTR= <none>
##$CNST= (0..31)
1 1 145 1 1 1 1 1 1 1 1 1 1 1 1 1 1 1 1 1 1 1 1 1 1 1 1 1 1 1 1 1 
##$CPDPRG= <>
##$CPDPRG1= <>
##$CPDPRG2= <>
##$CPDPRG3= <>
##$CPDPRG4= <mlev>
##$CPDPRG5= <mlev>
##$CPDPRG6= <mlev>
##$CPDPRG7= <mlev>
##$CPDPRG8= <mlev>
##$CPDPRGB= <>
##$CPDPRGT= <>
##$D= (0..31)
0 1.2 0 0 0 0 0 0 0 0 0 0.03 0 0 0 0 0 0 0 0 0 0 0 0 0 0 0 0 0 0 0 0 
##$DATE= 1559046047
##$DBL= (0..7)
120 120 120 120 120 120 120 120 
##$DBP= (0..7)
150 150 150 150 150 150 150 150 
##$DBP07= 0
##$DBPNAM0= <>
##$DBPNAM1= <>
##$DBPNAM2= <>
##$DBPNAM3= <>
##$DBPNAM4= <>
##$DBPNAM5= <>
##$DBPNAM6= <>
##$DBPNAM7= <>
##$DBPOAL= (0..7)
0.5 0.5 0.5 0.5 0.5 0.5 0.5 0.5 
##$DBPOFFS= (0..7)
0 0 0 0 0 0 0 0 
##$DE= 6
##$DECBNUC= <off>
##$DECIM= 24
##$DECNUC= <off>
##$DECSTAT= 4
##$DIGMOD= 1
##$DIGTYP= 9
##$DL= (0..7)
0 120 120 120 120 120 120 120 
##$DP= (0..7)
150 150 150 150 150 150 150 150 
##$DP07= 0
##$DPNAME0= <>
##$DPNAME1= <>
##$DPNAME2= <>
##$DPNAME3= <>
##$DPNAME4= <>
##$DPNAME5= <>
##$DPNAME6= <>
##$DPNAME7= <>
##$DPOAL= (0..7)
0.5 0.5 0.5 0.5 0.5 0.5 0.5 0.5 
##$DPOFFS= (0..7)
0 0 0 0 0 0 0 0 
##$DQDMODE= 0
##$DR= 18
##$DS= 0
##$DSLIST= <SSSSSSSSSSSSSSS>
##$DSPFIRM= 0
$$ [...]
##$SUBNAM2= <"">
##$SUBNAM3= <"">
##$SUBNAM4= <"">
##$SUBNAM5= <"">
##$SUBNAM6= <"">
##$SUBNAM7= <"">
##$SUBNAM8= <"">
##$SUBNAM9= <"">
##$SW= 24.9336996594482
##$SWIBOX= (0..15)
0 0 2 0 0 0 0 0 0 0 0 0 0 0 0 0 
##$SW_h= 4990.01996007984
##$TD= 16384
##$TD0= 1
##$TE= 0
##$TE2= 300
##$TE3= 300
##$TEG= 300
##$TL= (0..7)
0 120 120 120 120 120 120 120 
##$TP= (0..7)
150 150 150 150 150 150 150 150 
##$TP07= 0
##$TPNAME0= <>
##$TPNAME1= <>
##$TPNAME2= <>
##$TPNAME3= <>
##$TPNAME4= <>
##$TPNAME5= <>
##$TPNAME6= <>
##$TPNAME7= <>
##$TPOAL= (0..7)
0.5 0.5 0.5 0.5 0.5 0.5 0.5 0.5 
##$TPOFFS= (0..7)
0 0 0 0 0 0 0 0 
##$TUNHIN= 0
##$TUNHOUT= 0
##$TUNXOUT= 0
##$USERA1= <user>
##$USERA2= <user>
##$USERA3= <user>
##$USERA4= <user>
##$USERA5= <user>
##$V9= 5
##$VALIST= <valist>
##$VCLIST= <CCCCCCCCCCCCCCC>
##$VD= 0
##$VDLIST= <DDDDDDDDDDDDDDD>
##$VPLIST= <PPPPPPPPPPPPPPP>
##$VTLIST= <TTTTTTTTTTTTTTT>
##$WBST= 1024
##$WBSW= 4
##$XGAIN= (0..3)
0 0 0 0 
##$XL= 0
##$YL= 0
##$YMAX_a= 1018199
##$YMIN_a= -556779
##$ZGOPTNS= <>
##$ZL1= 120
##$ZL2= 120
##$ZL3= 120
##$ZL4= 120
##$ABSF1= 10
##$ABSF2= 0
##$ABSG= 5
##$ABSL= 3
##$ALPHA= 0
##$AQORDER= 0
##$ASSFAC= 0
##$ASSFACI= 0
##$ASSFACX= 0
##$ASSWID= 0
##$AUNMP= <proc_1d>
##$AZFE= 0.1
##$AZFW= 0.1
##$BCFW= 1
##$BC_mod= 2
##$BYTORDP= 1
##$COROFFS= 0
##$CY= 11.3945322036743
##$DATMOD= 1
##$DC= 2
##$DFILT= <>
##$DTYPP= 0
##$F1P= 18.9103706918063
##$F2P= -1.10871071338519
##$FCOR= 0.5
##$FTSIZE= 0
##$FT_mod= 4
##$GAMMA= 1
##$GB= 0.15
##$INTBC= 1
##$INTSCL= 1
##$ISEN= 128
##$LB= 0.24
##$LEV0= 0
##$LPBIN= 0
##$MAXI= 10000
##$MC2= 0
##$MEAN= 0
##$ME_mod= 0
##$MI= 1.114404
##$NCOEF= 0
##$NC_proc= 0
##$NLEV= 6
##$NOISF1= 3.799351
##$NOISF2= 2.8
##$NSP= 1
##$NTH_PI= 0
##$NZP= 0
##$OFFSET= 15.70392
##$PC= 1
##$PHC0= -8870.488
##$PHC1= 40.00025
##$PH_mod= 1
##$PKNL= yes
##$PPARMOD= 0
##$PSCAL= 0
##$PSIGN= 0
##$REVERSE= no
##$SF= 200.130013532006
##$SI= 16384
##$SIGF1= 3
##$SIGF2= 2
##$SINO= 400
##$SIOLD= 16384
##$SREGLST= <1H.CDCl3>
##$SSB= 0
##$STSI= 0
##$STSR= 0
##$SW_p= 3612.71676300578
##$SYMM= 0
##$S_DEV= 0
##$TDeff= 0
##$TDoff= 0
##$TI= <>
##$TILT= no
##$TM1= 0
##$TM2= 0
##$TOPLEV= 0
##$USERP1= <user>
##$USERP2= <user>
##$USERP3= <user>
##$USERP4= <user>
##$USERP5= <user>
##$WDW= 1
##$XDIM= 8192
##$YMAX_p= 0
##$YMIN_p= 0
$$ End of Bruker specific parameters
$$ ---------------------------------
##NTUPLES= NMR FID
##VAR_NAME=  TIME,          FID/REAL,        FID/IMAG
##SYMBOL=    X,             R,               I
##VAR_TYPE=  INDEPENDENT,   DEPENDENT,       DEPENDENT
##VAR_FORM=  AFFN,          ASDF,            ASDF
##VAR_DIM=   8192,          8192,            8192
##UNITS=     SECONDS,       ARBITRARY UNITS, ARBITRARY UNITS
##FACTOR=    0.0002004,     1,               1
##FIRST=     0,             0,               0
##LAST=      1.6414764,     0,               0
##MIN=       0,             -556779,         0
##MAX=       1.6414764,     1018199,         0
$$ Real data points
##PAGE= N=1
##DATA TABLE= (X++(R..R)), XYDATA
0@%%%qJ6j6K4l2M0m9O5q8J12j36J63j96K37k85L38m01M72n49O38p38Q49r73J112
27E95j267J436j624J833k062K314k591K894l227L592l994M433m916N449o035O679
43C509p394Q191r082J0086j1224J2526j4031J5795j7898K0457k3651K7771l3320
56a8265M1250n3618P5826j28405M84252O17159j57629O0037q4203r844p4286O316
68G58590m7283m897k4037K6933j1196M393j4636N420l1060k3461l1660j2654k9906
81E64546j4133q878J0776M11P221M610O330j3397k0963k8769k9035m0032l7541
94D01146k9719j8148j8728j2386m017J20q125j1923j2943j7199k7147k7845k0250
107A92836j6788j4491m615P916J1684J0839J2219J0881J987p993j3214j7041k3183
$$ y = [0, 0, 0, 0, -8, 8, -8, 16, -16, 24, -25, 40, -48, 64, -72, 91, -105, 132, -153, 185, -216, 256, -293, 345, -393, 456, -517, 595, -672, 764, -860, 973, -1089, 1225, -1366, 1528, -1699, 1893, -2101, 2332, -2584, 2865, -3170, 3509, -3885, 4306, -4776, 5310, -5914, 6612, -7419, 8376, -9522, 10935, -12716, 15055, -18265, 22985, -30633, 45193, -83212, 401040, 1018199, 860570, 920607, 836404, 826560, 752274, 758590, 711307, 706410, 682373, 709306, 698110, 702503, 687867, 693287, 662227, 638766, 607106, 594452, 564546, 550413, 541535, 552311, 552722, 559943, 564553, 570883, 557486, 536523, 507754, 478719, 438687, 401146, 371427, 353279, 334551, 322165, 318148, 318268, 310143, 298220, 285277, 268078, 240931, 213086, 192836, 176048, 161557, 156942, 164858, 176542, 187381, 199600, 210481, 212468, 204475, 191261, 174220, 151037]
120A51037k4008j8835j3175q025j082M802L305L09l609j0059j7702k1043k1622
133B0293k1364j8696r597M22O764J4001K0768K0903J5494Q632L313k886j1048
146D6999j2687r789p270l599L342J1302J3915J3102R971M831l962j3092j8733
159C4330j9557j9078j6462q842N60R198J3771J8473K0785J7454J0723M441P03
172F6499l403p108m658J813O512R810J6656K0951J8899J3400R566L637o222j4460
186A31892j5558j5287j5946j1213j599N143P785J1173J4285J1977N105J010j419
199A27348n046p722n391M2N266R118J6139K0592J9744J6222J1656O365j574r358
213B03401j3124j4279j4506j1929o579L25M526O100P176N607R6n771r849j1849
$$ y = [151037, 127029, 108194, 95019, 86994, 85912, 90714, 94019, 94328, 90719, 80660, 62958, 41915, 20293, -1071, -19767, -29364, -28942, -22178, -8177, 12591, 33494, 48988, 57620, 60933, 58047, 46999, 34312, 24523, 17253, 13654, 16996, 28298, 42213, 55315, 65286, 70117, 66155, 53063, 34330, 14773, -4305, -20767, -29609, -29049, -19851, -6080, 12393, 33178, 50632, 61355, 65796, 66499, 63096, 55988, 51330, 53143, 59655, 69465, 86121, 107072, 125971, 139371, 148937, 152574, 146352, 131892, 116334, 101047, 85101, 73888, 72289, 77432, 85217, 96390, 110675, 122652, 127757, 128767, 127348, 122302, 114580, 109189, 109231, 114497, 123615, 139754, 160346, 180090, 196312, 207968, 214333, 212759, 203401, 190277, 175998, 161492, 149563, 142984, 143309, 147835, 153935, 161111, 166718, 166814, 161043, 151194, 139345]
227A39345j4370j3554p622k68N054J0305J6119J9206J5604J0377O127j48r358
240A76817j2651j2979j1719j0440n888J389M885N041M817L926k867j0080j4747
253A15504j6076j8312j8081j2223m430J696P274J2482J5893J4146R388N749Q16
266A13826m884q862r254o385m391n02M807Q834R181O629M538oo667j2886j5736
281G8242j7486j6683j4680q355j705L436P669J0374J1032P669L903k08l470o354
295E3384p611n038j577J831O684J0751J1659J1734Q308L599k425q065j2907j5710
309E4617j6000j3484r393n216J056N574O906O900N345K319k714o710p782p889
323A3529o843k527L590Q577J2445J4357J5273J2822O955R14l562q876j2278j3171
$$ y = [139345, 124975, 111421, 103799, 103531, 108585, 118890, 135009, 154215, 169819, 180196, 186323, 186175, 176817, 164166, 151187, 139468, 129028, 123140, 124529, 129414, 134455, 139272, 143198, 140331, 130251, 115504, 99428, 81116, 63035, 50812, 46382, 48078, 55352, 67834, 83727, 97873, 107261, 113010, 113826, 108942, 100080, 90826, 84441, 80050, 79548, 84355, 93189, 102370, 108999, 113537, 113531, 106864, 93978, 78242, 60756, 44073, 29393, 21038, 19333, 22769, 30438, 40812, 51844, 59513, 63416, 63208, 59738, 53384, 45773, 40735, 39158, 40989, 47673, 58424, 70083, 81817, 90125, 93724, 91299, 83234, 70327, 54617, 38617, 25133, 15740, 10524, 11580, 17154, 24060, 30960, 36305, 38624, 35910, 29200, 21418, 13529, 6686, 4159, 7749, 16326, 28771, 43128, 58401, 71223, 78178, 79092, 75530, 66654, 54376, 41205]
337D1205j0540o795l419M02N391N906M575J439j368o096j0655j2461j0571q722
351a1709n503L22O953J1074J2910J3633J2972Q352K710j794n085q134r264o890
365B0547k864j79K061O109O943N050Q59j815o017j0869j3530j2256j0636p528
379b4125k600L417P823J0429J1283J1600P988M121Ok727m742o149l720o94K517
394A4427N787Q257R311P247L886M6m780r917j2811j3850j2048r506n706K29M544
409a4884P105Q422Q574N962K018j366l635n479m932l381J185M650Q644J0830J2491
424C6204J0400O947L128j934o628j1154j1154j0691q735m907r19L708M924N505
438A4694N678L153r71l821n655o886o508l557R50M529Q734J1529J3484J1476Q950
$$ y = [41205, 30665, 23870, 20451, 20853, 26244, 32150, 36725, 38164, 36796, 30700, 20045, 7584, -2987, -11709, -17212, -16890, -9937, 1137, 14047, 27680, 40652, 49004, 51714, 49920, 44835, 36701, 27437, 20547, 17683, 17504, 19565, 25674, 32617, 37667, 38526, 36711, 30694, 19825, 6295, -5961, -16597, -24125, -26725, -23308, -15485, -5056, 6227, 17827, 25815, 29936, 29942, 27215, 22473, 16324, 12604, 11910, 14427, 20214, 28471, 37782, 45029, 48915, 48961, 44181, 34264, 21453, 7603, -4445, -13951, -19657, -19428, -14884, -7779, 643, 9217, 15179, 17197, 15831, 12196, 6717, 1785, -1596, -411, 4239, 12883, 23713, 36204, 46604, 53551, 56679, 54745, 48117, 36963, 25809, 15118, 6383, 1476, 557, 4265, 9189, 14694, 20372, 23525, 22554, 18733, 13078, 6192, -316, -3873, -2923, 1606, 10340, 21869, 35353, 46829, 55779]
453E5779N730J028m020o954q304p829o659l880l6K505M259M280L300O37l506o388
469B9942q341r076r452o867k112J468N531R389J1463J1142R050O794L032j234
483E0729m404n103n210l978j329J865M964N908N755M837J862k579o255q778j0190
498B8094j1100r150m426j076L074O316R448R305P481N412K749j416m021m712l764
513C2214k122K50L627P197P439P423N831L066j514n756q559j0569j1228j0069
527A7230o303l157J012L833O208N982M785K710J69k714m897m662l783j104R63
542A6272N121P978R515R319Q003N070P21l163n890q777r125q752n918l523k3K072
558A8900L287M255K131L95k325m736o883p074n552l219k03L862P075R191R587
$$ y = [55779, 61509, 62537, 58517, 51563, 43259, 35430, 28771, 24891, 24855, 27360, 31619, 35899, 39199, 39836, 36330, 29942, 21601, 12525, 3073, -3794, -5906, -4438, 1093, 10482, 21945, 33087, 42137, 48931, 51963, 50729, 46325, 41222, 36012, 32034, 30705, 32570, 37534, 43442, 49197, 54034, 55896, 53317, 47062, 38284, 28094, 16994, 7844, 3418, 2342, 5416, 11732, 21180, 30485, 37966, 43378, 46127, 44711, 40690, 35978, 32214, 30092, 30342, 33969, 41166, 48605, 56028, 61859, 64925, 63411, 57655, 49096, 38527, 27299, 17230, 10927, 7770, 8782, 12615, 18823, 24805, 29590, 32300, 32469, 29755, 24858, 20196, 16413, 15309, 16272, 21393, 29371, 38886, 48205, 56208, 61278, 61999, 58836, 52946, 44169, 35044, 26292, 20374, 16851, 16828, 18900, 22187, 26442, 28573, 28968, 26643, 21907, 15024, 7950, 2398, -821, -1024, 2838, 9913, 19104, 28691]
573B8691Q684P336K629j025l812o331p285o590m696j730p4K258M036L606J318
588B7015r76l478o695r128r347p326n664k278K064N538Q155Q709Q301P409M010
603B6309j31k167l654m124m356j531J471L390M931N620N194K662j05l223o437
618B3849q057r987q766o122l616N1L188O248O948N966N396K869P04k199l003k878
634A0591j821m75K658N160O943P918P214N353K553p79m826o621p506p375o120
649A2867l662k32J682M186N802N878L675K024K31j946l219l321j522R01L490N633
665C2467Q803R878R672P257N575K577j815n063n861n810m914l249m56K902L755
680E5718L553M071L114k06k942l857n026n590m695j270K982M956O917R326R588
$$ y = [28691, 37375, 44711, 47340, 46315, 42503, 36172, 28887, 22297, 17601, 15871, 15797, 18055, 22091, 25697, 27015, 26039, 22561, 15866, 6738, -2609, -9935, -15599, -17877, -15813, -10275, -2120, 6589, 14890, 22299, 26309, 26178, 24011, 20357, 16233, 11877, 10346, 11817, 15207, 20138, 25758, 30952, 33614, 33509, 30286, 23849, 15792, 5805, -2961, -9083, -12699, -12648, -9460, -3212, 3736, 9702, 15098, 17967, 18671, 16472, 13469, 10591, 8770, 8295, 10953, 16113, 23056, 30974, 38188, 43541, 46094, 45315, 40489, 33868, 26362, 18987, 12867, 9205, 8973, 10655, 14841, 20643, 26521, 30196, 32220, 32451, 30505, 27286, 23965, 22443, 23344, 26834, 32467, 41270, 51148, 60820, 68077, 73652, 76229, 74414, 69351, 63490, 57680, 52766, 49517, 49061, 51963, 55718, 59271, 63342, 66456, 66250, 63308, 59451, 54425, 48835, 44140, 42870, 45852, 50808, 57725, 67051, 76639]
695G6639P532M543L001L78k922m978m088k837k456j8L399M880L434K766J690q34
711I0129m086o187o304o479n931l912k5L487M356O471Q185P027L953K078N80j620
727I1722l130l517j545m5M61K668M468M576L523J498k88m076p507q036p946p464
743F5362o224l934J61J724L045M276M436L076J96j453k867m149m199k594J01J966
759E8923L679N152N754N399L141N96k110n356p080q478p699n767l646j278J520
774D2750L248K670K573P29k18l028m632m955m243k813o96K423N442O092O585O334
790E8261M957J153j559k967m750o167o675m500k687j373N06K426K658P42j306
805C8719k473m429o144o697n238l530k213L70L994N502N796N558N339L059J57
$$ y = [76639, 84171, 88714, 91715, 92093, 89171, 84193, 80105, 77268, 74812, 74794, 78193, 83073, 86507, 89273, 90963, 90129, 86043, 79856, 73552, 67073, 61142, 57230, 57205, 60692, 65048, 71519, 79704, 86731, 90684, 92762, 93342, 91722, 88592, 85075, 83530, 83485, 83946, 86614, 91082, 95658, 99181, 100679, 100391, 96315, 88808, 80772, 72826, 65362, 59138, 55204, 55365, 57089, 60134, 64410, 68846, 71922, 72118, 70665, 67798, 63649, 59450, 56856, 56957, 58923, 62602, 67754, 73508, 78907, 82048, 82644, 80534, 75178, 68098, 59620, 51921, 46154, 42508, 41230, 42750, 45998, 48668, 51241, 51970, 51752, 48724, 44092, 39137, 34894, 32081, 31385, 33808, 39250, 45342, 51927, 58261, 63218, 64371, 62812, 59845, 55095, 48928, 42253, 37753, 35066, 33693, 34199, 36625, 39283, 40025, 38719, 36246, 31817, 25673, 18976, 13738, 10208, 7995, 8365, 12359, 17861, 23657, 29215, 34554, 37613, 37770]
820C7770j890l021l823m192k840p12O14J105K572L256J655j12k621l608o706p449
836I998o668m804l884p97K197L545M951N291M752K676R39j277k496l032l576j611
852F204L90K030L598L888M749K980N92j003l683n877p506o930o012m664k288J265
868a2267L035L650L476K916J534o97k019k613l088k722p95J548L654M916N848
883F376O259M759K272J75j994l820n388n812m449l537j355M77K247L106K612J212
899C140M62j475k905l897l592k510j753J309L337M988N647O029N751L964J220
914A9715p23k123l641m142l773k253o16Q32J634K392K247R23l62j917l605m642
930e4m984m303k456k66J765M068N702N481N778M716K457M18j001k178k664k103
$$ y = [37770, 35880, 32859, 29036, 24844, 22004, 21292, 21906, 23011, 25583, 28839, 30494, 30382, 27761, 24153, 17447, 9998, 3330, -1474, -5358, -6155, -3958, -413, 4538, 9829, 14581, 17257, 18196, 16919, 14423, 11391, 7815, 6204, 6594, 8624, 12222, 16110, 20859, 23839, 24431, 23428, 19745, 13868, 6362, -568, -6580, -11244, -13532, -12267, -9232, -5582, -2106, 810, 2344, 1647, -372, -2985, -6073, -8795, -9590, -8042, -4388, 528, 6376, 12635, 17394, 19666, 19841, 17847, 14027, 8639, 2827, -1622, -5159, -6514, -6037, -3790, -684, 1928, 3140, 3602, 2127, -778, -4675, -8267, -10777, -12530, -11221, -7884, -2896, 2751, 8780, 14531, 18495, 19715, 18992, 16869, 13228, 9086, 5313, 3060, 2444, 3276, 4910, 7302, 9549, 10472, 10110, 8193, 4588, -54, -5038, -9341, -11797, -12063, -10298, -6230, -528, 4953, 10731, 15447, 17904, 18322, 17321, 15143, 12479, 10376]
946A0376q12P11K396K837L692L470J492l58j969m357n094o051n326l715j699o2
962d469K397M404M218L935K722J605O3j811k049k767j060m44J415L212M306M015
978A9692L689K555N14j951m243m603n286n661m508k233l79O70K113K565K700J246
994F880Q5o69k723k987k032j381QJ745K974M951N082M425L721J859M63k471l329
1011A6601m234l980m162k245l13L12J355J843J915M30j169j881k502m255l497
1026e782k651p69O28K253L989N398N030M123K568J037p68k662k883k800l024j327
1042B360L03J535K089K238J993P92j331k200l826m634m134k965j817J62J805L950
1058c680M706M715M219L193J357l19j076k091j870j091L63J419K317L183L272
$$ y = [10376, 9564, 10275, 12671, 15508, 19200, 22670, 24162, 23804, 21835, 17478, 12384, 6333, 1007, -2708, -4407, -4469, -2072, 2332, 6550, 10485, 13207, 14812, 14875, 13064, 11015, 8248, 7188, 6744, 8159, 11371, 15677, 19692, 23381, 25936, 26450, 24499, 20256, 15653, 10367, 4706, 198, -2035, -2414, -1744, 369, 2934, 5634, 6880, 6965, 6296, 3573, 586, -1446, -2827, -2819, -1074, 1900, 6851, 11933, 16358, 20079, 21938, 22401, 19930, 16601, 12367, 8387, 4225, 1980, 1667, 1979, 3334, 5177, 7092, 7522, 6353, 4472, 1970, -2285, -5782, -8433, -9202, -8574, -6321, -2332, 3066, 8096, 12219, 14787, 15824, 15056, 12394, 9511, 6711, 3687, 2360, 2663, 4198, 6287, 8525, 10518, 11310, 9979, 7779, 3953, -681, -4815, -7780, -9597, -9435, -7630, -3680, 1026, 5741, 9960, 13153, 14510, 14191, 13115, 11024, 9154, 8063, 8426, 9845, 12162, 15345, 18617]
1073A8617K586J137j002k400l830m331n061l690k616j543J004K123L329L070K854
1088A0247J774J061l59j540j955q98p29L98K347K602M426L823L274K033J37j320
1104B5321k619l971m014m082l283j093J23J359J973K045J809J221J09j112k079
1119A1707k173j392j618L28K143L022M053M767L917L090R30R4j811k919l761l151
1135A7226k856j559K51M46J548J455J122l6j274k596l396l376l454k147n18O67
1151A503K892L761L579M479K830J508J53q91k309k621j962j522o89O55J554J803
1167A4723J832Q39j0j631k638l585m332l805k638j488j27J679K704K986L040K404
1183I953J594n7p54j719j814j747p48j11Q34K040K432K004J278k75j065k854l968
$$ y = [18617, 21203, 22340, 21338, 18938, 15108, 10777, 5716, 2026, -590, -2133, -1129, 994, 4323, 7393, 10247, 12021, 13082, 12723, 11183, 9228, 8330, 7601, 7999, 10346, 12948, 17374, 21197, 24471, 26504, 26641, 25321, 22702, 18731, 14717, 10635, 7352, 6259, 6382, 7741, 9714, 11759, 13568, 14789, 14898, 13786, 11707, 9534, 8142, 6524, 6852, 8995, 12017, 16070, 20837, 24754, 27844, 28774, 28868, 27057, 24138, 20377, 17226, 14370, 12811, 13062, 13508, 15056, 16511, 17633, 17597, 16323, 13727, 10331, 6955, 3501, 1354, 836, 1503, 4395, 8156, 11735, 16214, 19044, 20552, 20705, 19814, 17505, 14884, 12922, 11400, 10711, 11366, 12920, 14723, 16555, 17394, 17384, 15753, 13115, 9530, 5198, 1393, -1245, -2733, -2860, -1181, 1523, 4509, 7549, 9953, 11547, 11490, 10736, 9017, 7203, 5456, 4708, 4597, 5431, 7471, 9903, 11907, 13185, 12910, 11845, 8991, 5023]
1200E023m498m472l430k317j229j56J565J760J654J611P66l61j327j737k182j290
1216a0620o29J54J555K364L411K463K573R06N8k032k779l468l599l377k447q80
1232a6347j39R23J429J727P97J35r81j605k361k322j622p30N09J385K761M090
1248a2351L456K976K314O22r70j481k272k493k210j911p1O00Q48J586J401J037
1264h919j17j344j921k426k785k084n03J07J554K692L805M056L210K882J890R34
1280A031m94j096p80j100k56K97K037K190K120K049J445L63j304j355k471k293
1296C83k723j521m01R74J885K993L074L004K272J669O40k50m62q07l00J72Q44
1313A1446K014K950K596K551J473J215m79k081k204k681k915k149o06k03J280
$$ y = [5023, 525, -3947, -7377, -9694, -10923, -11079, -9514, -7754, -6100, -4489, -3723, -4084, -5411, -7148, -9330, -10620, -11249, -11095, -9540, -7176, -3765, -1302, 1271, 2177, 2235, 203, -2576, -6044, -9643, -13020, -15467, -16347, -16486, -15563, -14134, -12407, -11610, -11475, -12456, -14061, -16422, -18744, -20366, -21096, -20587, -19202, -16441, -12351, -8895, -5919, -3605, -2983, -3953, -5434, -7706, -10199, -12409, -14320, -14391, -13791, -12943, -11357, -9956, -8919, -9036, -10380, -12301, -14727, -17512, -19596, -20099, -19992, -18438, -15746, -11941, -7885, -4675, -1793, 97, 1031, 537, -559, -1339, -2439, -2695, -2398, -361, 1829, 3949, 5998, 7443, 7806, 6502, 5147, 2676, 383, -2340, -3861, -4262, -3288, -1403, 1590, 4664, 7668, 9940, 11609, 12249, 11999, 11537, 10730, 10430, 10602, 11446, 13460, 16410, 19006, 21557, 23030, 24245, 23766, 21685, 19481, 16800, 13885, 11736, 11130, 10927, 12207]
1328A2207J999K320K242J739P25K11j003q68q67k22K00J113K527L090K823K942
1344C1178K319J625l57q02k321k184k834k228j408m60O22N93J287M29O98p54j096
1361B4307j634k198k038k039n86N84J137J975K850K174K066Q15K10j088k021j897
1377B2617k308k101j787j74k76M03J012M83j67j273k137k622k577k679k598j334
1393B482k52L33J479K053K476J823J068l5k78j190j932j852r74n03m74O11J394
1410F229R56K7N79p01j773k909l384k615k911k099o45J04P40J015J452J835N51
1427c549k6j89r03j587j835o67N15M04R42K147J586J256J84J91q36k054k786k279
1445i486k389k271j386N66O87J010J020J669M21j43n88n97n01j995q38M61J555
$$ y = [12207, 14206, 16526, 18768, 20507, 21232, 21443, 20440, 19572, 18705, 18483, 18683, 19796, 22323, 25413, 28236, 31178, 33497, 35122, 34765, 33963, 31642, 29458, 26624, 24396, 22988, 22528, 23150, 23743, 25030, 25459, 26157, 25403, 24307, 22673, 20475, 18437, 16398, 15812, 16396, 17533, 19508, 22358, 24532, 26598, 27413, 27623, 26535, 24514, 22617, 20309, 18208, 16421, 16247, 15971, 16374, 17386, 17869, 17702, 16429, 14292, 11670, 9093, 6414, 3816, 2482, 2230, 2563, 4042, 6095, 8571, 10394, 11462, 11427, 11149, 9959, 8027, 6175, 5201, 4698, 4224, 4835, 6229, 7185, 7212, 7791, 7090, 5317, 2408, -976, -3591, -6502, -8601, -9246, -9142, -8402, -7387, -5935, -4100, -3549, -3575, -3764, -4667, -6254, -8089, -8756, -8241, -7837, -6895, -4748, -3162, -1906, -1722, -1531, -2367, -4421, -7207, -9486, -11875, -14146, -15532, -14966, -14279, -13269, -12249, -10580, -10159, -10302, -10890, -11487, -11988, -13983, -14821, -14360, -12805]
1462a2805J153K720K504K281J237O92o7j335j799k054j459j636j177j72O44Q83
1478a0390R67J261L45p62j022j697j239j250j216L53J173J430K393K648K419K259
1494b328J133K85k27n82j928q54j8j25M27O71J323J478O93L25K09j079j824j623
1512d044j354j283K09j65J555K416K129J926K120J257P25j19m4r41n89m89N41
1529C850J035J194J163J695Q59K38n23j021j243k454k010j484j048m83L07J689
1545A764J836J012J299J133Q0l01r39k19o53k00P86Q27J609J917J497J738J019
1562A4205o59m21j307j875j604j776j036n87p9Q54J131R55O46K88j00q19j144
1579F672j203m49o65NJ243J592J023K187J646P21J90m64j089j683k231j479r22
$$ y = [-12805, -11652, -8932, -6428, -4147, -2910, -2218, -2285, -3620, -5419, -7473, -8932, -10568, -11745, -11917, -11273, -10390, -9423, -8162, -7817, -8579, -9601, -11298, -12537, -13787, -15003, -14650, -13477, -12047, -9654, -7006, -4587, -2328, -1195, -910, -1137, -1719, -3647, -4501, -4519, -4644, -4217, -3546, -2223, -745, -52, 273, 482, -597, -2421, -4044, -5398, -6681, -6472, -6637, -5082, -2666, -537, 1389, 3509, 4766, 5491, 5372, 5328, 4387, 3798, 3309, 3850, 4885, 6079, 7242, 8937, 9796, 10034, 9511, 8490, 7247, 4793, 2783, 1299, 251, -232, 75, 1764, 3600, 4612, 5911, 7044, 7124, 6823, 5884, 5665, 5012, 4812, 5598, 6425, 8034, 9951, 11448, 13186, 14205, 13546, 13125, 11818, 9943, 8339, 6563, 5527, 4940, 4861, 5715, 6846, 7801, 8447, 8735, 8635, 7816, 6672, 5469, 5020, 4355, 4360, 5603, 7195, 8218, 10405, 12051, 12772, 12962, 12498, 11409, 9726, 7495, 6016, 5094]
1596E094o50m13L90M89N9N05m27o34j452j748j615j207r30l1M71J344J268K048
1614B561J536J067M94j95k61j386j094q87m51l39j49Q42O17P68L11k80j139j248
1632G67j867j947j487r73r15J22P24J291J411J283J181M21O4o60o85r46m30l32
1650b978l5O33R96R92R22P15j43q78n80j695j968j866j249q83j41O74R74J201
1668e309R49J017O10k63k95n98l18j77j58Q06J145J676K000R95J814P94o14m97
1686C577j035j178j343j175m44l91L99P27R13J247K35k19k74n30q32q52n98J22
1704a651N66J095J500J645J874J369P55K13J15j185p01r91p50n89r7N19M01J162
1722E250L22K72N0p22j025r83r81r33l89L06J000J448J782J508J428O65P60K61
$$ y = [5094, 4444, 4031, 4421, 4910, 4969, 5474, 5047, 4413, 2961, 1213, -402, -1609, -2539, -2570, -2099, -755, 513, 2561, 4097, 5164, 5658, 5463, 5202, 3816, 2722, 1835, 1384, 1045, 896, 1738, 2355, 3123, 3434, 3154, 2015, 767, -1100, -3047, -4534, -5507, -6422, -6300, -5576, -4285, -2874, -1591, -410, 11, 75, -585, -1270, -2216, -2646, -2978, -3013, -2380, -1384, -392, 530, 1245, 1102, 224, -356, -2051, -4019, -5885, -7134, -8017, -8158, -7484, -6510, -5309, -4360, -3343, -2733, -2996, -3291, -3889, -4207, -4384, -4542, -3736, -2591, -915, 1085, 2080, 3894, 4688, 4074, 3577, 2542, 1364, 21, -1154, -1598, -1989, -1590, -863, 50, 1297, 1532, 1313, 1039, 509, -323, -1175, -1773, -1651, -1085, 10, 1510, 3155, 5029, 6398, 7153, 7366, 7481, 6296, 5595, 4604, 3854, 3265, 3168, 3687, 4088, 5250, 5572, 5844, 5894, 5172, 4147, 3164, 2183, 1250, 861, 1167, 2167, 3615, 5397, 6905, 8333, 8998, 9758, 10019]
1740A0019n34n85q86L2m87L67N87P69P47Q30J49n06o17j219j224k036r80j418
1758C008J43k0R30R41J362R98M89Q6j55m21o61o65n1O5K41P34J191R79N63P07
1778A0464J62p11j320j403j239j293j055j58jN05N74J240Q58L28P6l69m01n85
1796E672l25k88J36J269R87Q77J487J086R60M61m28o25j370q60j204p31o27k73
1814F204M52P09N67q7K36L07o75j057p94m39q26J7L80J170R68J653J149J117N58
1833A1609L15l96o81m60p40o56j23k28P68O32Q88K39K24n38l18j220r07n93q61
1852F954o3j01J120R85J272J435J141R58k18jm11n40p42n24K12L23R99L60N41
1871A3700M24R6l00r18j017j358j030j370j028L05L40L38P25M10J070N29j01r5
$$ y = [10019, 9485, 8900, 8014, 8046, 7559, 7926, 8513, 9282, 10029, 10859, 11008, 10502, 9885, 8666, 7442, 5406, 4426, 3008, 3151, 3131, 4061, 5002, 6364, 7362, 7851, 7937, 7782, 7361, 6700, 6035, 5984, 6049, 6290, 7024, 8215, 9194, 9757, 10464, 10626, 9915, 8595, 7192, 5953, 4660, 3605, 3447, 3446, 3951, 4525, 5765, 6623, 6951, 7027, 6658, 6257, 5672, 5347, 5059, 5195, 6464, 7451, 8328, 9815, 10901, 11861, 12322, 11894, 11269, 9899, 9039, 7835, 7104, 6477, 6204, 6656, 7365, 7932, 7845, 8081, 8388, 7713, 6656, 5862, 5423, 4597, 4614, 4994, 6164, 7132, 8785, 9934, 11051, 11609, 11924, 11528, 10847, 10387, 9647, 8991, 8868, 8640, 9408, 10040, 10928, 11167, 11391, 10853, 10535, 9315, 8408, 7815, 6954, 6891, 6790, 7910, 8895, 10167, 11602, 12743, 13701, 13483, 13482, 13071, 12531, 11789, 11265, 11477, 11800, 12799, 13159, 13700, 14124, 14220, 13920, 13002, 11985, 10627, 9597, 8227, 7199, 7504, 7844, 8182, 8907, 9317, 10387, 10916, 10815, 10720]
1889A0720o91M9j168K67o3P53R93M77J350N05Pl50q8j016j286j001q23o55p29
1908G251j92O06Q14J63L60K9K3n38j40n92r70K32j29L95P47N70J199N22L67J20
1928A0837p80k65j007j105j040n71o26M7R0q1K33P1K17m59p15q63p54r33q18K27
1948A705M67N76J191J280P88P16L00k55k4q13o23o53l21j38J73M14M59N45N2j57
1968E682m47m94j044q95r46m55m10J9R41O47N08J246P75k2o1J79p45n85k45M0
1988C688O2K92J79J071N61k39n9l88m72j130j120j003m45n86OL90P77M64N48N20
2008C116M43j38J14l22q7n57Q9J82J011L31J163O63O33M18l13l26m27j071n84
2027D338o85n65k41K70J38M94L39M89r1Q5r87m25j97n60j71j54Q97M03J073N16
$$ y = [10720, 10029, 10078, 8910, 9177, 9114, 9867, 10860, 11337, 12687, 13192, 13199, 12849, 12761, 11745, 10459, 9458, 8635, 7980, 7251, 7059, 7665, 8479, 8642, 9002, 9031, 9054, 8516, 8376, 7784, 6814, 7046, 6917, 7312, 8059, 8629, 9828, 10350, 10717, 10837, 10057, 9792, 8785, 7680, 6640, 6069, 5443, 5490, 5580, 5499, 5732, 5803, 6020, 5561, 4846, 3983, 3229, 2296, 1478, 1705, 2172, 2748, 3939, 5219, 6007, 6723, 7023, 6768, 6744, 5931, 5308, 4655, 4334, 4196, 4369, 4783, 5242, 5787, 5839, 5682, 5235, 4741, 3697, 2802, 1856, 1401, 991, 1010, 1951, 2598, 3106, 4352, 5127, 5105, 5044, 5223, 4478, 3893, 3648, 3688, 3750, 4042, 4221, 5292, 5853, 5614, 5555, 5167, 4695, 3565, 2445, 1442, 997, 411, 417, 807, 1584, 2048, 2596, 3116, 3559, 3421, 3535, 3213, 3126, 2569, 2658, 2840, 3851, 4182, 5345, 6008, 6641, 7059, 6746, 6420, 5993, 4922, 4338, 3653, 3088, 2847, 3117, 3255, 3749, 4088, 4577, 4486, 4571, 3584, 3159, 2962, 2402, 2231, 2077, 2974, 3377, 4450, 4966]
2047D966P90M69j35n94k49p17o53p92o72J09k97K72O44K77j44k37n95l22p01o73
2067G46o62l7L28J93P19Q14N97N88P93L10j39o06l47q7n61n23M76K50O0p8O17
2088C451K28n04k85m71j093j164m39l31m97l1M27P54P15J07N88j09J83k79l27
2107I23m52l47j27M1P06L22J72Q68R2j35j01q70m75n35q87n34m64q4P83P02O04
2128B02L95K93Q9J26m26J55l67K48m6J20O62Q67P52O24P25K59%n34q26m24o59
2149B235m44j31J96l0K24M19J85P40m20J79m48m04o52J85L04M40M6R30Q69Q43
2169E266O60M23O68l91m44j88n91k12k29M51L45K45N19O7N24l12l7k23j54p80
2189E607k97L74J41L54R29N94J072P45k17L94J8j19l20j61j64o12O30L67J58N06
$$ y = [4966, 5756, 6225, 6090, 5496, 5247, 4530, 3877, 3085, 2413, 2522, 2225, 2497, 3141, 3418, 3274, 3037, 2442, 2120, 1419, 746, 84, 47, 375, 568, 1287, 2101, 2698, 3286, 4079, 4389, 4250, 3644, 3297, 3210, 2649, 2126, 2602, 2852, 2912, 2834, 3451, 3679, 3175, 2890, 2419, 1326, 162, -277, -608, -1105, -1136, -709, 45, 760, 867, 1455, 1346, 1529, 1250, 923, 471, 124, -3, 38, 744, 1066, 1238, 2106, 2198, 2063, 1962, 1092, 617, 82, -805, -1339, -1803, -1887, -1104, -402, 202, 597, 890, 979, 1105, 679, 834, 467, 715, 669, 789, 1451, 2318, 3070, 3694, 4419, 4678, 4678, 4144, 3318, 2894, 2235, 1791, 1660, 1856, 1826, 2050, 2469, 2654, 3394, 2974, 3153, 2705, 2301, 1649, 1834, 2138, 2578, 2624, 3554, 4423, 5266, 5926, 6349, 7017, 6626, 6182, 5994, 5403, 5191, 4962, 5413, 5758, 6003, 6522, 6589, 7113, 6801, 6764, 6541, 6387, 5607, 5310, 5684, 5825, 6179, 7108, 7702, 8774, 9519, 9302, 9696, 9714, 9595, 9275, 9114, 8950, 8338, 8968, 9335, 9493, 9999]
2209I999kL01n63l82r08l38r55l28o25j36M54N6N23N05N27PR0k98p1o82k10j05
2231F859k00L89Q0M05M30J31L37j60j11p52p82n49p52m35N0j13k16J15J69J51
2251E046L9k23K1o82l32n47j89J22j42K67O16nK73J76l06l66n15j061o33o33o57
2272B69o67K3j18J8k58L40lq10l71l54o92m45n3l86P4K38N14Q04L05L9J01k95
2294a727n4j97m22l24l73N2k3K37J76J54j1K77o45j20n17m84k88k54r8L6O26j92
2316d171O26P40N7N12j61P1l15k86N7n27M27n1O60K50MM22j56j92l83m48l45m18
2338c627N1j94L51k6N88M33K46M82J43L28j11j95K46k64M13O46J69J68R68L96
2358A211M25J74K50l0m82n53j00r9o1m4L2K86M15M40L31L75k04k03k63%l88K63
$$ y = [9999, 9997, 10298, 9735, 9353, 8445, 8107, 7152, 6824, 6199, 6063, 6517, 6573, 7096, 7601, 8128, 8135, 8225, 7927, 7856, 7174, 6964, 6859, 6659, 7048, 7128, 7533, 7963, 8094, 8431, 8271, 8160, 7408, 6626, 6077, 5325, 4890, 4940, 4827, 4611, 4726, 4895, 5046, 5085, 4862, 4883, 4201, 3869, 3322, 3133, 3255, 3113, 3380, 3996, 3991, 4264, 4440, 4134, 3768, 3253, 2192, 1559, 926, 269, -398, -375, -493, -475, -733, -393, -396, -1206, -1577, -1931, -2623, -3068, -3121, -3507, -3433, -3195, -2681, -1877, -1572, -1533, -1432, -1727, -1781, -1978, -2400, -2724, -3097, -3045, -3068, -2831, -2655, -2501, -2512, -2235, -2880, -3000, -3517, -4001, -4289, -4543, -4641, -4605, -3979, -4171, -3545, -2805, -2748, -2236, -2397, -2326, -2641, -2927, -2870, -3397, -2970, -3021, -2361, -2111, -2107, -1685, -1841, -2033, -2416, -2864, -3209, -3627, -3576, -3770, -3419, -3445, -2857, -2424, -2178, -1696, -1553, -1225, -1336, -1531, -1285, -1549, -1136, -490, -321, -153, 815, 1211, 1636, 1810, 2060, 2030, 1548, 995, 895, 796, 735, 691, 723, 1009, 1424, 1864, 2195, 2570, 2366, 2163, 1900, 1900, 1512, 1775]
2380A775L15j7J019J96L29M29L02k8r7j77k71m69j98k70j83M65J61O5j14M07k67
2401C372M3n07k28j8k08l87L62L02L56O68J36M17KM10j73l23j9l90J08j40j23
2422C660k07J51L10l13j7Ll48l74k35n95j73m17k31K7K74K15Q1K24L09j28L8P3
2444B327m84k10j97J9k32K76N32J04K04L35o07N7k19k27l35m84L7j27J48K40O00
2465A757J83L14K06j34M77j93p9J10K20j1J98K04O57m6N31N04K2l1m20K81o92
2486D058j86p62K71P3K10J30j89L62J12J12m0J23o63K65l99L11O7k57O04L12N27
2507E041M34N3r5Q7m56j45K63n56O4J26r8L36R7O1K53L40J05o12j76K8j57O8M21
2530E482J97N6N41K86L10L22r9j54k2Q0l15K2j00j06K37L2K16k50n6J33m72j91
$$ y = [1775, 2090, 2073, 3092, 3288, 3617, 4046, 4348, 4320, 4223, 4046, 3775, 3306, 3108, 2838, 2655, 3120, 3281, 3346, 3232, 3639, 3372, 3415, 2908, 2680, 2662, 2454, 2067, 2429, 2731, 3087, 3755, 3891, 4308, 4310, 4720, 4547, 4224, 4205, 3815, 3923, 3783, 3660, 3453, 3604, 3914, 3601, 3584, 3587, 3239, 2865, 2630, 2035, 1862, 1445, 1214, 1241, 1515, 1730, 1811, 2035, 2344, 2216, 2254, 2327, 1843, 1633, 1436, 1455, 1223, 1499, 2031, 2135, 2339, 2674, 2067, 2124, 1905, 1678, 1343, 859, 896, 769, 917, 1157, 1757, 1940, 2254, 2460, 2326, 2803, 2610, 2531, 2641, 2861, 2850, 3048, 3252, 3909, 3863, 4394, 4898, 4920, 4889, 4469, 4750, 4058, 3872, 3110, 3381, 3454, 3664, 3794, 3605, 3967, 4079, 4191, 4151, 4274, 3611, 3876, 3477, 3788, 3855, 3598, 4202, 4514, 5041, 5475, 5528, 5433, 5520, 5064, 4919, 5182, 4626, 4690, 4816, 4718, 5054, 5151, 5212, 5465, 5805, 5910, 5298, 5122, 5150, 4993, 5061, 5482, 5679, 5735, 6276, 6562, 6872, 7194, 7095, 6941, 6919, 6999, 6684, 6706, 6606, 6500, 6737, 6769, 6985, 6735, 6679, 6812, 6340, 6149]
2552F149j34m88m54p4k93K18L69K86r8L24K28k49L5k28N0o03k24L02j03L21k3
2573E311L14J18k73Q4r9k59n69k84k49j10j99k52K28M17K40o06K90n4k59K11l59
2594C641J31k28k9p3J34j25N00l58J91n2q5l17l86l96l09n12j3l17M66k58l2Q5
2616A658J66l74J61l84j35m06J33l2jR9J15M03N51l13O7q3M35m76J60l59l16J15
2638A184J66k6L78j56J39j13K20j96n26Q2m14j85J16OJ28K22K37p2M01J41k86
2659A446Kn04j17n23O97m56l86K07O3o1J27k46k1l88l65r9l35m75l87J41N7K71
2681a352j09K09Qk6kO8o03K09l93K77k7J82J41k89J88J90J25k53j06M1m58l03
2703b283l15l57K47m8J24Q8m7r5J49k48O0n81J54J22k86R6j54J25J48K32j96K71
$$ y = [6149, 6015, 5527, 5073, 4999, 4706, 4924, 5293, 5579, 5481, 5805, 6033, 5784, 5819, 5591, 5641, 5038, 4814, 5116, 5013, 5334, 5311, 5625, 5743, 5470, 5554, 5455, 5196, 4627, 4343, 4094, 3984, 3785, 3533, 3761, 4178, 4418, 3812, 4102, 4048, 3789, 4000, 3641, 3772, 3544, 3515, 3442, 3576, 3451, 3951, 3593, 3784, 3732, 3647, 3330, 2944, 2548, 2239, 1727, 1714, 1397, 1863, 1605, 1573, 1658, 1824, 1450, 1611, 1227, 1092, 686, 819, 787, 786, 885, 1000, 1403, 1954, 1641, 1708, 1625, 2060, 1584, 1744, 1385, 1069, 1184, 1350, 1324, 1702, 1546, 1685, 1572, 1792, 1596, 1070, 1152, 738, 553, 669, 675, 803, 1025, 1262, 1190, 1591, 1732, 1446, 1448, 944, 827, 304, 1001, 545, 159, 366, 429, 368, 495, 249, 228, -160, -525, -624, -959, -1434, -1821, -1680, -1623, -1352, -1461, -1252, -1244, -1270, -1272, -1204, -1807, -1598, -1991, -1714, -1741, -1559, -1418, -1707, -1519, -1329, -1204, -1457, -1563, -1522, -1980, -2283, -2598, -2955, -2708, -2756, -2632, -2544, -2591, -2686, -2537, -2785, -2725, -3306, -3152, -3030, -3316, -3220, -3374, -3249, -3101, -2869, -3065, -2794]
2725b794O5m37N2l63l63k48j66J89k4q6j8N34r5M9m8l34J19L1k25J27j2K70K01
2748c576L82M14J20M6K91K74q1o5K18l35J13K02j79P75L1l51N10N5L7j76M7M6
2770a202k01n8L56k12M48K23O18K23M2J63M86J49J99m68K40N3j82M35N34L3K75
2791B154K81J47m8M5J39J71j88n4J00K05Q5N45O8M63L31J42l4J92K70L06k01r3
2813E026L66J55NN10L87j3K22j01k69M2m08NJ29l19R4l51K17N2r2K48K7K9k88
2836E673O1k47n68J95m1K27k40K5L06N1k97Q8J01j84j99j70j89q3j78j03K73l97
2858D104M34l21m14k7N9j27l45p0l41L5K2R8L39J49j26o8k76K18l62k14l86n5
2880B326k14M23n29J22l88j56K4O2l00j11n53K28o99K4p4m18J21P3K41M5j2k71
$$ y = [-2794, -2729, -3166, -3114, -3477, -3840, -4088, -4254, -4065, -4089, -4175, -4193, -3659, -3754, -3705, -3753, -4087, -3968, -3937, -4162, -4035, -4047, -3777, -3576, -3194, -2780, -2660, -2614, -2323, -2049, -2130, -2195, -1977, -2312, -2199, -1997, -2176, -1401, -1370, -1721, -1211, -1156, -1119, -1295, -1248, -1202, -1403, -1461, -1105, -1317, -869, -646, -28, 195, 237, 400, 886, 1035, 1234, 766, 1006, 1059, 877, 1312, 1846, 1879, 2154, 2435, 2582, 2534, 2579, 2718, 2889, 2701, 2647, 2747, 2952, 3037, 3582, 3650, 4113, 4444, 4586, 4552, 4744, 5014, 5320, 5119, 5026, 5392, 5547, 5552, 6062, 6449, 6436, 6658, 6557, 6288, 6330, 5922, 5927, 6056, 5737, 5831, 5480, 5697, 5749, 5657, 5905, 5932, 5961, 5673, 5734, 5487, 4919, 5114, 5073, 5300, 5060, 5085, 5391, 5442, 5145, 5233, 5334, 5150, 4951, 4781, 4592, 4509, 4331, 4228, 4501, 4104, 4538, 4217, 3803, 3776, 3835, 3708, 3363, 3293, 2952, 2987, 3009, 3107, 3446, 3595, 3469, 3401, 3125, 3343, 2981, 2767, 2381, 2326, 2112, 2535, 2006, 2128, 1740, 1584, 1608, 1670, 1370, 1259, 706, 934, 235, 259, 185, -233, -112, -39, 202, 247, 235, -36]
2902c6J37k25j05q4j86k0N3L26J37r0N3q7L06l23L0l82J87m25M1L9K33Q7l6L69
2926aK37j55L19N4j42j07N3l2j1O8M45j08O14o83K60Q4M5k82J42J13o13J08k66
2949A42J17J17L86j89K57n69J44K46k71p5L53j3M5p2j36l8K88K19K80R9L2p1j11
2972A180j50J02Pm53L90l3P7J71m33L30l27K13l89J22l56K55K3l81J64j42k18
2993A52L63k61M43l12K22p65J77n14J18l23O6j41j2j19j20J54p2k48k52l18m53
3014b215L20m33N4q0j33J43Q7j13K43l96K20j94k2P0k54L18l76M81k76K25K72
3035b059l75r9J60k22m21K39J5j55j4J08q7J42n6J28Oj78L90m20j35M36Pp5K13
3058b452k12J71M92l60K64j87M31o8l10n7K7L37j81J48Q6O2j7N65o2L32p3P0M5
$$ y = [-36, 101, -124, -229, -313, -499, -519, -466, -140, -3, -93, -40, -127, 179, -144, -114, -496, -309, -734, -693, -654, -421, -334, -370, -1, 236, 81, 400, 454, 312, 205, 258, 226, 215, 283, 728, 620, 1234, 551, 811, 895, 940, 658, 800, 913, 300, 408, 142, 259, 376, 762, 573, 830, 261, 405, 651, 380, 305, 658, 645, 690, 618, 482, 444, 732, 951, 1231, 1330, 1362, 1291, 1180, 1030, 1132, 1139, 686, 1076, 1043, 1120, 1291, 858, 1188, 861, 1074, 685, 807, 451, 706, 729, 348, 512, 370, 152, 515, 254, 697, 385, 607, -158, 19, -495, -377, -700, -634, -775, -787, -906, -1026, -872, -944, -1192, -1444, -1762, -2215, -1895, -2328, -2274, -2354, -2487, -2344, -2257, -2370, -2127, -2523, -2303, -2497, -2519, -2449, -2703, -2385, -2761, -2280, -2556, -2331, -2059, -2434, -2533, -2373, -2595, -3016, -2777, -2762, -2917, -2931, -2823, -2910, -2768, -2824, -2696, -2690, -2868, -2478, -2898, -3033, -2597, -2590, -2665, -2452, -2664, -2493, -2001, -2361, -2097, -2284, -1853, -1921, -2231, -2288, -2261, -1924, -2105, -1957, -1871, -1809, -1826, -1261, -1323, -991, -1064, -994, -949]
3081i49N11j4K53o4O7O23J67K49K59L78J85k49J76K83J22k8K47M44m0L11P6J87
3103C194n7K80l89O36l38J92k7K91J99M58J32j39N8L33j0J81L15J13p7k33M3L36
3125E491K67k5L62q8J35J11p5K27N4l5K11l48J99K3K05N15l8j6L5L22j66L57l02
3148G421j26L65J1K28R4m0j82K84o8j34l5l1k6j07k13k95m4P5l16R1L94o50L47
3171G043l70J99l29k32j62o0j27l7k91k42K57p3n7N0q5j21l3l23n4m07N9k72J2
3194D345k88K86k64J40k75m19J67j00k58r8m2j17k05k21J36K64k55j14k43j76
3214B263j40m99O3N5k22k44J95n19k07J69R4n64r0l2k10n12j41j69K64j37j5n37
3236a135K5N5l2j33K53l31M8l05N8J55j94o7k19j23K33L07j14l34K23l71J39K0
$$ y = [-949, -438, -452, -199, -263, -196, 427, 594, 843, 1102, 1480, 1665, 1416, 1592, 1875, 1997, 1969, 2216, 2660, 2620, 2931, 3007, 3194, 3137, 3417, 3028, 3664, 3326, 3518, 3491, 3782, 3981, 4439, 4571, 4432, 4490, 4823, 4813, 4994, 5309, 5422, 5345, 5112, 5155, 5491, 5758, 5733, 6095, 6007, 6142, 6253, 6178, 6405, 6459, 6424, 6635, 6287, 6486, 6509, 6714, 7229, 7191, 7175, 7210, 7532, 7366, 7723, 7421, 7295, 7660, 7671, 7899, 7993, 7953, 7771, 8055, 7987, 7853, 7818, 7787, 7761, 7654, 7441, 7146, 7102, 7177, 6861, 6952, 7346, 6696, 7043, 6673, 6872, 6543, 6311, 6149, 6089, 5962, 5925, 5634, 5392, 5649, 5576, 5519, 5569, 5484, 5363, 5330, 5007, 4953, 4546, 4605, 4333, 4345, 4057, 4343, 4079, 4219, 3944, 3525, 3692, 3592, 3334, 3236, 3194, 3077, 2872, 2651, 2787, 3051, 2796, 2682, 2439, 2263, 2123, 1624, 1687, 1742, 1520, 1276, 1471, 952, 745, 914, 1008, 444, 354, 322, 112, -400, -541, -710, -446, -583, -598, -1135, -1110, -1055, -1087, -1220, -967, -1298, -1250, -1555, -1497, -1342, -1536, -1603, -1822, -1945, -1712, -1405, -1519, -1853, -1630, -2001, -1862, -1842]
3258a842o4j19L02P5k37J79J84q6k58L67k79J81P2JJ26j88K23q6J47O0J28L41
3280g73q9o8N0j97lL8K19j54j87R4L14J91l16K87j12K49k98L05K66J08K28M0l
3303A89J18L59K58k42M4J38J02J52K57k73M13r0L57l1J95j29K01j44Q1O40l80
3324B215M08k35j10L02k3J05k0L45J67R0m91L9K40l40j22J06M8N5j91r2j35K09
3346B570L5j57J16j69K42o8o09J92l76L80j7J45Q8j12l01p6K02k45l8n8J89J3
3368A946j83l5L2j72l9l4l8J02l05nm08J27L5l18L73m34J44j59j66m7Q9j84K37
3391E58p4l66l44J43O0r1k88j7J49k99Q9j48j49l82L21l52p7J66l36k6j5J82m27
3414a723J63r8j40j0J52k74K41j4q7K20q2j34L82k6l51M62l12k0R9k10K96k24
$$ y = [-1842, -1906, -2025, -1723, -1648, -1885, -1706, -1522, -1608, -1866, -1499, -1778, -1597, -1525, -1524, -1398, -1586, -1363, -1449, -1302, -1242, -1114, -773, -862, -930, -880, -1077, -1080, -1042, -823, -977, -1164, -1070, -756, -565, -881, -594, -706, -457, -755, -450, -184, -76, 152, 192, 189, 307, 666, 924, 682, 726, 864, 966, 1118, 1375, 1102, 1515, 1425, 1782, 1751, 1946, 1817, 2018, 1874, 1955, 2595, 2215, 2623, 2388, 2278, 2580, 2557, 2662, 2642, 2987, 3154, 3244, 2753, 2792, 3032, 2692, 2570, 2676, 2724, 2779, 2588, 2496, 2361, 2570, 2605, 2448, 2564, 2395, 2637, 2569, 1960, 2152, 1776, 2156, 2139, 2284, 2372, 2260, 1959, 1883, 2085, 1840, 1802, 1744, 1933, 1946, 1763, 1728, 1760, 1588, 1549, 1515, 1477, 1579, 1274, 1269, 861, 988, 1023, 705, 1078, 644, 788, 629, 463, 416, 505, 321, 558, 484, 118, -226, -83, -23, -114, -402, -419, -270, -569, -480, -628, -777, -1159, -838, -1190, -1267, -1101, -1437, -1463, -1478, -1296, -1723, -1560, -1658, -1798, -1808, -1656, -1930, -1689, -1703, -1790, -1570, -1652, -1786, -1404, -1430, -1781, -1319, -1631, -1651, -1552, -1762, -1466, -1690]
3436a690q0J94M1k22L52k55J53j86M77j37k54J63K1k80M93j74K2po9j6M32j42
3458a164l4Q8K3K09j08k9L98l38K06K95j05k49L82j12R3J26k6j40K06J61L24K14
3480D20l6J4m4N42k91J61Q2J43j60J93J5J9N39l94J07M57l79J40OJ60p8j5J89
3503A790L5j07r9J25j12K67o5o3N7J68r0m9m56K45L10j63k02J89M6L0P8K37K6
3526B197J21n81K39J0Q0l9J16j4l2J61q7l6J15k49J90N3l1mp9P3K12k23J76q2
3550B286k98M16j77k5P5o1j84k30K71k64J48r5j78j23J88m04q8m4K06l32r0l38
3572F59J29k28L55l51N4n04R3J14J75j38l00n2j56k4j29R5j16J7j19p0p3K94M0
3595b35m48K4k70P1P0j13J98l63M08m46J91o3Q4m70K38R8l68J07k55J7K87j85
$$ y = [-1690, -1770, -1576, -1535, -1757, -1405, -1660, -1507, -1693, -1216, -1353, -1607, -1444, -1423, -1703, -1210, -1384, -1362, -1369, -1438, -1454, -1022, -1164, -1198, -1110, -1087, -878, -986, -1015, -617, -955, -749, -454, -559, -808, -426, -538, -445, -319, -345, -485, -279, -118, 206, 420, 384, 398, 354, 896, 605, 766, 848, 991, 831, 1024, 1039, 1058, 1597, 1203, 1310, 1767, 1388, 1528, 1534, 1694, 1616, 1601, 1790, 1825, 1718, 1619, 1744, 1632, 1899, 1834, 1771, 1828, 1996, 1906, 1857, 1401, 1646, 1956, 1793, 1591, 1780, 1826, 1856, 1934, 2171, 2197, 2318, 1737, 1976, 1986, 2066, 2027, 2143, 2129, 2097, 2258, 2171, 2135, 2250, 2001, 2191, 2244, 2213, 2209, 2130, 2203, 2415, 2192, 2368, 2286, 1988, 2404, 2227, 2202, 2277, 2216, 2032, 1802, 2073, 1809, 1957, 1862, 1684, 1561, 1749, 1345, 1257, 1213, 1419, 1087, 997, 659, 788, 560, 915, 564, 618, 114, 207, 321, 496, 358, 58, 6, -150, -174, -303, -208, -324, -307, -426, -496, -569, -275, -235, -683, -659, -929, -858, -788, -901, -703, -1066, -658, -1104, -913, -976, -892, -1362, -1124, -1026, -1394, -1287, -1542, -1525, -1238, -1423]
3617a423j65j47j08J40j44P9r0j04O6k07L47l18k35Q09r29O69m10j31K15j7n7
3638b160j45N2L84q0J5P9N8N1pl12L7P4j9M14m41M73j50j68M44j97j9J77j88J43
3662a485Nj27L07J78k26M35k49O8J54m01L67J3J1o1j21J56J62%k47L12k05J91
3684g63j34qL50k70j35p0K35j04K95p6j85L32j65K96J70k72M5K63J01m8Q5j22
3706a80K50k3R9p6QJ90j23J02JJ80l94M79k86P7N6J53k04j45J74J33j23K48k79
3729C17K0m15L18M5l28J10K71k70k00M13m38r9K08O8k18rOK31l40J82k03J62K3
3752a46j27K32J12k09j18K26K05m15K42L25o6o2K72j39m4k43L14j95K34k75R6
3773B19L90j02R3l1j87L35J29k93M21k2l10K64J4k06Q2J44k61N00k31J42P4K02
$$ y = [-1423, -1588, -1735, -1843, -1703, -1847, -1768, -1858, -1962, -1896, -2103, -1756, -2074, -2309, -1500, -2429, -1760, -2170, -2301, -2086, -2103, -2160, -2305, -2253, -1869, -1949, -1934, -1855, -1797, -1746, -1753, -2065, -2028, -1954, -1973, -1559, -2000, -1527, -1677, -1845, -1401, -1598, -1617, -1440, -1628, -1485, -1480, -1607, -1300, -1122, -1348, -913, -1162, -1094, -940, -1341, -974, -961, -950, -1011, -1132, -976, -814, -814, -1061, -749, -954, -763, -897, -905, -555, -825, -960, -1030, -795, -899, -604, -680, -865, -533, -698, -402, -232, -504, -459, -196, -95, -143, -58, -180, 70, 47, 146, 70, 78, 268, 145, 247, 248, 428, 34, 513, 227, 304, 360, 513, 309, 164, 338, 471, 348, 596, 317, 337, -78, 240, 285, -43, 67, 338, 68, -132, 281, -157, -256, -48, 20, -198, -207, -201, 30, -310, -128, -331, -169, -146, -273, -41, 71, -138, -256, -30, 175, -240, 2, 327, 261, 199, 471, 332, 288, 45, 359, 164, 398, 123, 219, 609, 507, 600, 569, 382, 717, 846, 553, 974, 952, 642, 906, 920, 714, 796, 940, 679, 1179, 948, 1090, 1164, 1366]
3795A366l67K74j4mn08M05J07j07N6K47P6j27J32m15L82J06o4oM3J78P1K29m10
3818A650P2K71q8J24K25K23j60j16K32r2j80J75J57J25O2o0j19J97J93r5m34N12
3840B874k61Q0N0k97J36O2p6nk23K9L08k47k22k2k17K71l18L05R8k11j37o9K2
3863A930J91k61J52k24K00m61n9J51K39j11r3K0k22J96l47k83J82k97L62J90%
3884A455j21j07l17q7J67r5j62j79K29J49k78k13J72l68k4j39k95L29j81o1J71
3905D5k58K18l27o9j32P9n4k10P4J17k01m4K35o02K07k02L97r5r4L25j01j32n1
3928h75n3N9R1oK9j65K36Lj19J9j14L39l5k5K98j95l47K82K31K48k40lJ14p5k74
3953e77L08Rl6J6j35N5J97k84J33J9k15K84n39N45L7j79J10J11k33Q9M2l5K47
$$ y = [1366, 999, 1273, 1259, 1255, 747, 1152, 1259, 1152, 1208, 1455, 1531, 1404, 1536, 1121, 1503, 1609, 1545, 1539, 1582, 1760, 1831, 2060, 1650, 1722, 1993, 1905, 2029, 2254, 2477, 2317, 2201, 2433, 2341, 2161, 2336, 2493, 2618, 2680, 2620, 2501, 2698, 2891, 2796, 2362, 2874, 2613, 2693, 2743, 2446, 2582, 2644, 2568, 2563, 2340, 2369, 2677, 2430, 2208, 2186, 1969, 2240, 1922, 2227, 2325, 2114, 1977, 1908, 1930, 2121, 1860, 2012, 1788, 1988, 1527, 1468, 1619, 1858, 1747, 1654, 1674, 1452, 1648, 1301, 1018, 1200, 903, 1265, 1455, 1455, 1334, 1227, 910, 823, 990, 895, 733, 554, 783, 932, 654, 441, 613, 245, 221, 82, -213, 116, -65, -126, 45, -213, 5, -322, -391, -523, -444, -498, -708, -634, -517, -718, -762, -527, -1129, -922, -1124, -727, -822, -916, -591, -692, -824, -875, -928, -869, -778, -784, -755, -920, -684, -681, -800, -781, -895, -556, -591, -616, -318, -513, -860, -578, -347, -99, -339, -342, -228, -303, -577, -269, -260, -296, -280, -415, -360, -163, -447, -314, -295, -510, -226, -765, -220, -183, -362, -252, -141, -374, -285, -243, -278, -31]
3976c1j46M8lJ49j92K0P9K60l4l32M30j14L36n10n0L02n2nM38j48m01N07j32k54
4000A65J1J13J2j35j40J44K00K63k25j33Q9j57k05L35m09j11R5N5R0k52J6j10
4022b89K07o0M5j86q7L23j52N0n1l02k9J54l4J08J05qk52K5o7NL30j70o6L76k29
4047b54k4j30J75k26J32J1o6L33p0j9j52J54k34P9L2J3J74R1l69M7K22l30J0M9
4071c52Q2q1J84K22j46l41K03J19j95k4K0J18o1K68n0Kr0J4O8l4k4L98n6j77J47
4096B14j83n1L15o4J52K34oj71O3J1n6J08NJ66r5N6K65k24Ml41M29l10M67k29
4120G59M0p9J92k20K71j85K3p2j60L13J1qk92K58j95r1l6R5k8O6O6j51j89Q5L96
4145H69m43Q1k62M76m52J32k24L25r6j09n4j10L55J99l54j30J05Q3M3k65p3M11
$$ y = [-31, -177, -129, -132, 17, -175, -155, -76, 184, 150, -182, 248, 134, 470, -40, -90, 212, 160, 155, 593, 445, 44, 551, 419, 165, 176, 289, 301, 166, 26, 170, 370, 633, 408, 275, 364, 207, 2, 337, -72, -183, -88, -33, 57, -195, -179, -289, -82, -142, -97, -283, -370, -47, -199, -149, -200, -502, -531, -377, -411, -303, -198, -206, -458, -433, -500, -495, -165, -335, -401, -25, -254, -278, -408, -233, -459, -327, -316, -382, -49, -119, -138, -290, -136, -370, -291, -259, -246, -72, 19, -350, -303, -81, -411, -401, -352, -270, -351, -167, 55, -91, -432, -229, -110, -305, -329, -309, -191, -252, 16, -34, -32, -122, -108, -40, -74, -98, 300, 244, 67, 214, 31, -20, 295, 231, 383, 617, 611, 440, 503, 514, 458, 566, 571, 737, 642, 698, 963, 739, 743, 402, 831, 521, 988, 759, 799, 720, 912, 692, 963, 778, 801, 729, 569, 882, 893, 885, 593, 851, 656, 565, 529, 624, 596, 662, 728, 577, 388, 473, 869, 426, 507, 245, 721, 269, 401, 177, 502, 406, 297, 243, 133, 488, 687, 333, 203, 308, 391, 434, 169, 96, 507]
4167E07R4k58j81J12L5l30J82J36P3j38J11l62j03J82l9k74M36J09l73k48K05
4188a24k38L08K2j94J16k6j14Km02L23O4PJ7j04PK38j30p1j0K5P8m5P7Q7p2K68
4214A09k32J04k16K85j69k7O8j95M71J10l33PJ93P5m70J30M4k6J87P8m7O8K7N
4238B46m49L05j71OK53j48k67J44N0j52q0L06k90J29J70j0k50L98p6k98j18K96
4260fJ31k49j0J6K26j0rk6J06j88J93P9k65L10k05L17k93J22K17k02P3K15k02
4283C40k95L43j53k07N4N6K69J47l34m6j85k1J27J2J34k39p8L90J11l71k45J29
4305f2k81K62n2K47j19j56N19m91K44m15M79k50N0K0n2J58j34P5K08J60n89L84
4327B05P0K39k63J49k62k28P48j54k19o8K92N3k86K05j88K2l8J99j64K36p4n5
$$ y = [507, 601, 343, 162, 274, 309, -21, 161, 297, 370, 232, 343, -19, -122, 60, 21, -253, 183, 292, -81, -329, -124, -362, -54, -32, -226, -110, -136, -250, -248, -650, -327, -263, -256, -239, -343, -336, -98, -228, -299, -309, -284, -206, -251, -174, -87, -159, 109, -123, -19, -235, 50, -119, -146, -78, -273, 198, 308, -25, -18, 175, 250, -220, -90, -46, -72, 115, 193, 146, 214, 241, 246, -203, 102, -69, -63, 190, 42, -225, -81, -31, -183, -263, 43, -247, -118, 52, 42, -208, 190, 114, -184, -302, -6, 125, -124, -134, -118, 108, 98, 89, 63, 169, -19, 174, 253, -12, 298, 93, 410, 117, 239, 456, 254, 327, 542, 340, 45, 388, 235, 28, 82, 138, 407, 554, 220, 174, -11, -32, 95, 107, 241, 2, -76, 314, 425, 54, -191, -62, -343, -81, -133, 114, -5, -161, 358, -133, 111, -304, 175, -75, -25, -5, -57, 101, -33, 42, 250, 410, -179, 205, 275, 514, 251, 400, 138, -90, 658, 504, 285, 217, 509, 562, 276, 481, 293, 315, 277, 476, 312, 548, 474, 419]
4349D19j03K25J56k05q1J69k13N1J60j9p2j6N4l14J59jM5K00k07p2J9m1J16K49
4373F78k59J03J7Q7k56K18j16q9M88m67L33j16P7N4l66K55K57l39M09k86j5j23
4395E44L89j8o51N91K41l60Mj75K73l08J67k29J19j48N9J57j15nn3M47l92j23
4417D14L65l33k21l7p9M86l24j86R8K1j69L25l65K29P2Q0J90j61l7k21Q6J9J41
4440C93L8J81l37n2J55r8j16M1K22l3k6J4K54j46L4P9k75N1k02K36j31K67J86
4463G35m25k1K31l01o4L19k39K0J27j10R4j35o8J69k80K06L12k17j31n2K36p8
4485C28j17%K43J48n15J55k65L13K40q2N7M0k72K90k57l6N37j90q8r7L09k5kJ40
4509H54l7j15k76M50q6O1K3K1n7M5j79J67k72K65k83j69K08q9J73j59J79k36N7
$$ y = [419, 316, 541, 697, 492, 411, 580, 367, 418, 578, 559, 487, 471, 525, 211, 370, 369, 414, 614, 407, 335, 354, 313, 429, 678, 419, 522, 539, 626, 370, 588, 472, 383, 871, 404, 737, 621, 698, 752, 386, 641, 898, 559, 968, 682, 667, 544, 933, 915, 264, 855, 1096, 736, 740, 565, 838, 530, 697, 468, 587, 439, 498, 655, 540, 535, 482, 929, 537, 414, 779, 446, 225, 188, 109, 595, 271, 85, 183, 204, 35, 360, -5, 224, 296, 376, 566, 405, 368, 147, 233, 252, 393, 431, 612, 275, 223, 378, 280, 164, 205, 427, 394, 368, 382, 636, 490, 524, 603, 328, 379, 177, 413, 282, 549, 735, 310, 289, 520, 219, 155, 474, 235, 255, 382, 272, 366, 231, 163, 332, 52, 258, 570, 353, 222, 170, 406, 328, 211, 211, 454, 602, 87, 242, -23, 290, 530, 448, 505, 545, 273, 563, 306, 270, 807, 617, 529, 432, 741, 716, 714, 854, 817, 702, 426, 876, 790, 851, 874, 895, 838, 883, 704, 871, 599, 864, 581, 412, 620, 531, 704, 545, 724, 488, 545]
4532E45l40J64J49L26m04K72k66J85k06j3K41k32L48L0K6k44k33K28n4rK28k76
4554D65o9N8R8m5pJ11K44j03k34O8J11M4J85m03N2O9j31R3j99J5J59K01m9l23
4578D10K1k18J05K28j11J34j14k05J7J67M5l0m0k28o7p1n0j00N55l94L76l57Q4
4601A57M9k04L10k82L17k48L45l54J13J82k08L0j55J82N4j40j70K15Pr7J4K57
4623C74k00N0J81o9j12K13l86J09j75J61j88J18l63K19l8K67k17p5J11q4J1q5
4645a78j23K34K1j47Ql44l2K38K02j70R6j37L31n66M52m80R2L22R5k03j26K05
4667b10J79K8k58L2j0q4J99J83k15K98q9q8k06N89k73j44K86n2l26K84j16q9J07
4690B5n1jj45Q1K97k89Ok12o1oK15j20J21%j73L30m54K85J16R5r7K02j72k71J80
$$ y = [545, 205, 369, 518, 844, 440, 712, 446, 631, 425, 412, 653, 421, 769, 799, 825, 581, 348, 576, 522, 513, 741, 465, 396, 454, 552, 507, 500, 611, 855, 752, 518, 586, 697, 741, 926, 523, 575, 644, 513, 606, 407, 422, 581, 782, 733, 410, 431, 213, 318, 546, 435, 569, 455, 250, 267, 434, 479, 449, 409, 181, 114, 43, -7, -107, 448, 54, 430, 73, 157, 206, 2, 312, 30, 347, 99, 444, 90, 203, 385, 177, 207, 52, 234, 288, 148, -22, 193, 200, 103, 117, 374, 174, 224, 405, 336, 224, 437, 51, 160, -15, 146, -42, 76, -287, -68, -106, 161, -56, -131, -20, -104, -93, -178, -301, -67, -46, -193, -185, -529, -561, -323, -121, -291, -195, -332, -1, -567, -115, -595, -503, -181, -86, -289, -415, -210, -31, -3, -261, -229, -239, -323, -124, 59, -156, 142, 53, -35, -241, 348, 75, -69, 217, 165, -161, 123, 7, -82, 25, -26, -27, -172, -91, 206, -83, -77, -289, -350, -356, -141, -261, -140, -140, -313, 17, -437, -152, -36, 59, -38, 164, -8, -279, -99]
4715i9J79j25K72O7j22j95n3L13l3j52j02J34M07r2k15K42k21N6K00k69m4K3K49
4738D20j34j71J25L55r8j01j29k60L51L36p6l25k92N53k02k3M24q54N01l40M5
4759A05L6J88j43K35l99J28K49k12K7j26k7K04m3k2J56p2k60L23K31L2k10Q2r5
4782C87j4mL3j76J84J05k97M38l21K82m55L03m45M09lk2N9n07K48M87m03N8l6
4805C10J10j81J26l62R7K09j22j4J06j58K00k22J57j83j5J54j96J84N3N0j59j86
4827d2J38P5j90K01J94j60M8q1P3N0k7J41l12L55j32Qj34J83k14j38L32L6k90
4850A14L51j52j30j20R9K99m30K75J36J32k13jJ70k0m50J99j8K47P4k39p1l0Q4
4873C06R2j44J70K9J25j73O0j97j12L52k84Jk48L03J7j60K53j41l02L29K52k88
$$ y = [-99, 80, -45, 227, 294, 172, -23, -76, 237, 204, 52, -50, 84, 491, 399, 184, 426, 205, 261, 461, 192, 148, 171, 420, 286, 115, 240, 595, 497, 396, 267, 7, 358, 694, 618, 293, 1, 554, 352, 329, 753, -101, 400, 60, 105, 141, 329, 186, 421, 22, 150, 399, 187, 214, 88, 61, 265, 222, 200, 356, 284, 24, 347, 578, 610, 400, 482, 387, 373, 369, 402, 226, 410, 515, 218, 656, 335, 617, 162, 465, 20, 429, 426, 404, 463, -44, 204, 691, 288, 346, 310, 420, 239, 365, 3, 100, 309, 187, 173, 279, 121, 321, 99, 256, 73, 58, 212, 16, 200, 253, 303, 144, -42, 96, 171, -19, 182, 376, 216, 264, 183, 256, 306, 279, 420, 108, 463, 331, 339, 205, 388, 174, 36, 368, 404, 114, 465, 313, 183, 63, 162, 461, 31, 306, 442, 574, 361, 360, 530, 510, 60, 259, 241, 488, 562, 323, 252, 222, 306, 398, 254, 424, 453, 578, 405, 465, 268, 156, 508, 224, 225, -23, 280, 297, 137, 390, 249, -53, 276, 528, 240]
4895B40J8K63j86l6j78K97k38J13K36j80j32J00L18l16q4J99k22Pk5q9J48k6J67
4918C94j52o6N2m29M16k4j64Q9j99P6J35j80J21Q5m67l8j33K21K17M8J78M1k24
4941cj06j73R8K70j97K87j06LJ36l74L12O8J15j56O6j33Q6J44m37O3M80l95J05
4964A53J98l8j83P5j31l7K17n3j12r2Q8ro8k5K5R3J63m80J21Q8O4Pj51J99o0j43
4990i1q7J92q8k0K01j50j34L02q6j2K59j85Oj54JL89k75Q0j53l6Q1J29j59q6K25
5015A49r6M25l35k3J17j50K44j47j34p0L06l2p7l2K78l51M7j35k2K23m07J99K36
5038B13k35j89Q9NM22q7m00K22j43o9K48J05l20M19j08M8m09J67j17L48J10k07
5060A12L20m71O1Nr3J42J80l22L70j2l84l1N29k37l80J73j53L46j30J74Ok01K3
$$ y = [240, 258, 521, 335, 299, 121, 418, 180, 293, 529, 349, 217, 317, 635, 319, 235, 434, 212, 219, 194, 105, 253, 227, 394, 242, 176, 228, -201, 215, 191, 27, 116, -83, -7, 128, -52, 69, 154, -313, -351, -484, -263, -46, 2, 180, 221, -3, -109, -282, -184, 86, -111, 176, 70, 73, 209, -165, 147, 215, 330, 174, 240, 107, 193, 337, -100, -37, 443, 48, 153, 351, 313, 130, 205, 74, 37, 254, 201, 89, -3, 85, 76, 8, -17, 8, 101, 264, -216, -95, -7, 57, 64, -87, 112, 52, -91, -178, 14, -74, -94, 107, -43, -177, 125, 39, 27, 286, 101, 107, -47, -46, 343, 68, 148, -5, -41, 40, 169, 10, -76, 149, 53, 478, 143, 120, 237, 87, 331, 184, 50, -20, 286, 254, 177, 145, 423, 72, 119, -16, -38, 185, -222, -23, 213, -22, -211, -122, -117, 305, 218, -182, 40, -103, -172, 76, 181, -139, 280, 172, 220, -189, -22, -139, 209, 319, 112, 432, -39, 22, 27, -66, 76, 256, -66, 304, 292, -92, -123, 406, 169, -211, -38, -191, 155, 25, 199, 205, 4, 27]
5083B7O6j18j00J39j27J69p2q2j63K05K02j65Q2m27M92j30Lj48j33l3O7J63m6
5106a29k36L50k80L66k91R3J85K14l09j14K97l05K42m5j03J29j11J11O9n3O1o3
5128G8P6J02M3K11n49J83pMJ15q7j95K87L1L2n60K29P7n1M70m56o4j95P0J28K17
5153A89j74l4L54n99J55K88l74JL83k26k64L20K0J14j63q0j94K14K31j83j13J25
5175a0K1j43J54j2Jj21j12K59k22J36j36L22q8J30l64L78Qj54Q9o8j53K20Jl79
5199b43J14j73J25K5J01J17j99J96j77Pm92K23M73n47K39l5j04J48j2Pj5k94O17
5222A01l25O0J44k01J33k11L03K14j61k55m4K37o7k5J35Rq1j31R5j62K72K48l31
5245d3K91l95K92j82L24m25K67j46k2J57j93LK05l3k07K29j11k6J59J48l64j8
$$ y = [27, 93, -25, -125, 14, -113, 56, -16, -98, -261, -56, 146, -19, 63, -364, 128, -2, 1, -147, -280, -313, -246, -83, -129, -365, -15, -295, 71, -220, -127, 58, 272, -37, -151, 146, -159, 83, 38, -65, 64, -47, 64, 133, 80, 141, 78, 154, 256, 299, 510, -39, 144, 137, 141, 256, 169, -26, 261, 292, 324, -236, -7, 70, 19, 489, 33, -31, -226, -156, -28, 189, 15, -19, 335, -264, -109, 179, -195, -194, 189, -37, -301, 19, 39, 153, -10, -90, -284, -70, 161, -22, -135, -10, 11, -132, 22, 10, 11, -110, -222, 37, -185, -49, -185, 137, 49, 179, -185, 193, 201, 47, 136, 68, -85, 135, 136, -243, -129, -302, -177, -152, -51, 66, -133, 63, -114, -107, -599, -376, 97, -450, -211, -246, -350, -202, -214, -207, -222, -516, 101, -224, -164, -20, -221, -88, -299, 4, 218, 57, -198, -242, -5, -72, -97, 38, 47, -34, -165, -70, -232, 40, 288, -43, 248, -147, 145, -37, 287, -138, 129, -17, -39, 118, -75, -72, 133, 100, -107, 122, 11, -15, 144, 292, -72, -90]
5267i0j5K10Ok94J11k18M00j89K57k18k2M0j92L03j46J61J04p5J19q0n5K0j02
5290C5o8N08m24J71J9o7L22j75k21N8J70o1rM9k41J93L5j27j27M73n52l9N94j51
5314C65M5l46j0J03R9l8j6j29Oj01K01J48K58m84p5Q4m3K22K6j00q5k5j34K18
5338A89j44J17K04J30k75L0k7J4n9j6K61k8j47j08J95Q1k02M4%L23J38m88n1k1
5362A60J18J53J4k66J48j23K02j64pJ08p2n7K99j97l3P0J11k21j03Ro2J44j65
5385F6K82J3j95N2k0k60J83N87l59j71k59K12J0N6J31R1m08K59J50o1o5J42k60
5408A76J84K33k57J7k07M93l17L6p0K3k7K36m64M12r4j60J58j3l0j2J38j08l13
5431C4l8J70j14K44n2k22K16j32j0L21k47j90Q7k51K28o8J18K22l51J04mj81K06
$$ y = [-90, -105, 105, 111, -183, -72, -290, 110, -79, 178, -40, -62, -22, -214, 89, -57, 104, 208, 133, 252, 172, 117, 137, 35, -33, 475, 51, 222, 241, 174, 496, 321, 100, 158, 328, 267, 258, 307, 66, 259, 294, 167, 40, 513, -39, -78, 516, 365, 410, 64, 54, 157, 256, 218, 202, 73, 79, -22, 179, 327, 585, 101, 26, 110, 67, 289, 315, 215, 130, 105, -29, 189, 45, 162, 366, 496, 221, 251, 224, 238, 179, 163, 424, 396, 249, 141, 336, 417, 215, 259, 259, 582, 720, 232, 181, 160, 278, 431, 445, 179, 327, 204, 406, 242, 235, 343, 271, 214, 513, 316, 283, 353, 464, 243, 140, 149, 87, 231, 66, 348, 361, 166, 218, 198, -62, 121, 708, 349, 178, -81, 131, 141, 197, 328, 419, 11, 270, 420, 359, 294, 436, 176, 360, 593, 336, 353, 146, 639, 322, 358, 288, 311, 284, 520, 56, 468, 374, 214, 372, 359, 329, 317, 455, 347, 34, -4, 166, 52, 296, 244, 22, 238, 106, 96, 417, 170, -20, 67, -184, 44, -24, 94, 316, -35, 69, 65, -116, 90]
5454I0J61j79j42J32k16K77p0j05oO0q1J33Q0J31k11k12J25M5j58O3O8q1J46R8
5478A48r0Q9j86N9j70O6J77j72J96J15l53o7K95k26K0p6J73m10M71k94J37p3j04
5501b75J58p5N59m27p2J9J48l84K61k3j79M44j59K15q0j43K65m67k75J022n81
5522d9J62J16l64j62M98J59m19R6J80k68Q7J96J09p9k28K65j89j73M3J57n7J14
5544A94J1k64o1M19l84K32n12L09L2l8J22p0k47K26P4j63J36n1k2m9N28k68q6
5567F8r2K73j73L26j08p6n0j99K91j36K03k31K3J51J73q8o4j84L8P1l1lq0j60
5591e8J87R2pk2k55J01J03p9J82k04J38N3j02j02K63j3o4Q1o5l69M4M05m1M7m
5616C11k11l5J24l02j02L53J60m79K58J34k53O5K72j28k00P86l82j08J99l9j52
$$ y = [90, 251, 72, -70, 62, -154, 123, 53, -52, -58, 2, -79, 54, 134, 265, 54, -158, -33, 12, -146, -83, -15, -96, 50, 148, 58, 147, -39, 20, -150, -84, 93, -79, 117, 232, -121, -188, 107, -119, -99, -175, -2, -412, 59, -235, -98, -171, -275, -117, -192, 367, -60, -132, -113, 35, -349, -88, -111, -290, 154, -5, 210, 130, -13, 252, -215, -490, 532, -49, 113, 229, -135, -297, 201, 360, -59, 37, 217, -51, 36, 232, 341, 262, 34, 299, 110, -63, -20, 137, 80, 194, 205, -59, -120, 299, -85, 147, -365, -56, -24, -62, 60, -10, -257, -31, 43, -120, 16, -35, -57, -106, 422, 154, 68, -24, 249, 76, 402, 294, 218, 168, -31, 260, 124, 327, 96, 119, 270, 443, 355, 291, 107, 145, 216, 185, 182, 102, -58, 129, 221, 214, 192, -63, 38, 141, 62, 244, 40, 178, 231, 129, 27, 290, 277, 213, 294, 229, -140, -96, 309, 268, 315, 311, 100, 65, 189, -113, -215, 138, 298, -181, 77, 211, -42, 23, 295, 167, -33, 753, 371, 263, 462, 423, 271]
5637B71J9r6L50l80O7O2j73N4R8k93K73k52L39j10Ml54R6K35J06k97K17k72L56
5660C20k10j08pN9MJ4J0r3K45m95M04j87J35R3k04J17l6n1k4j2K1K2P5k3K55m09
5686h5J2L59j64j5K4k06J94l20L33k8m1r0k57L64p8O4J89j57k8j95J11O5N3l33
5710b29k58M43k14K34n3l3j8j25J6L0K0L8j14j41J26P5m57M28J8j61N59j61k45
5733b22m6j44J90J83l01J46J0l20N04n23K92K19m05L33j44L52j55l21K89o9q9
5754b21J60L3k84M2M9J71L7j82J72m43N75l39m1K02k84K43M4l10J2k2J19j24K41
5777a50Mm6j40j08J20k6j33M99m9k41o6O0J94l6p5J32k37J17l2K8l4L6N28p69
5801d24N54m9m53K60m3J51j88O4O8J62j62j59K85k00K34L6k97J11j16rM0j8l4
$$ y = [271, 290, 194, 544, 164, 231, 293, 120, 174, 272, -21, 252, 0, 339, 229, 233, -121, -25, 210, 316, 19, 236, -36, 320, 110, 2, -5, 54, 58, 72, 82, -11, 234, -261, 143, -44, 91, 184, -20, 97, 61, 10, -14, -26, -5, 17, 92, 69, 324, -85, -73, 286, 122, 107, 131, -75, 119, -201, 132, 104, 63, -27, -284, 80, 2, 66, 255, 98, 70, -125, -14, 51, 104, -229, -487, -44, -258, -24, -77, -110, -128, -253, -237, -207, -187, -149, -263, -404, -278, -203, -660, -232, -214, -375, 184, 23, -222, -268, -412, -222, -39, -340, -194, -184, -504, 0, -523, -231, -12, -417, -84, -228, 124, -31, -352, -63, -132, -221, -61, -28, -312, -270, -221, -50, -13, -195, -23, -466, 109, -230, -271, -69, -353, -110, -66, -376, -364, -386, -267, -391, -150, -146, -192, -332, -440, -320, -346, -479, 20, -29, -270, -336, -276, -82, -118, -193, -61, -298, -181, -213, -185, -219, -183, 345, -424, 130, 81, -372, -112, -155, -4, -192, -128, -60, 102, -60, -219, 66, -134, 100, 136, -161, -50, -166, -175, -135, -153, -187]
5824a87q9NJ98Jk66M4J01R9L4j18K00k22JR6j36L95k53J51j05j58p5N8k4K63J06
5849A19K52n43K75j47J40l95R05n48j00k20L50k31K58J18nk5j93j56L19k0j67
5870a4J45j59J1J23K6m57L14J11k8j58J17l0r7j82K06m8nJ53J9j90J38k37%J81
5894f1K14m10L52r1O0j33N0k15J9N59m62L92l05K61k97L28m28KJ40K91k39QR5
5917A30j05K5J02j57O8j26n0K90N1m3k26K37k44p5M14j60n12L80k47K55j19N9
5939e3L4j47L11m6o5J70j10o4J16j94J82L6m7l39M16m26J70o2J29nj5j2K00k08
5963b9j92M11K0l72J53N32m36K57q6j35o5L5K55k17j24P1j08J73J00l8l79J55
5985a9J22j65K63j26J36Q5k65P3r3j0K43m45J74L79j97P9l28M19n11K79j8J46
$$ y = [-187, -276, -271, -73, -72, -338, -294, -193, -94, -60, -178, 22, -200, -199, -103, -239, 156, -97, 54, -51, -209, -284, -226, -250, 13, 119, 371, -172, 103, -44, 96, -299, 606, 58, -42, -262, 88, -143, 115, 233, 228, 203, 10, -146, 173, 153, -14, 131, -28, -17, 106, 132, -325, -11, 100, 72, -86, 31, 1, -96, -278, -72, -120, -125, 28, 47, -143, -5, -242, -242, -61, 153, -257, 95, 4, 64, -69, -19, -234, -215, 344, -118, 274, -31, 230, -67, 261, -167, -165, -25, 266, 27, 35, 130, 25, 50, 152, -5, 63, -63, -113, 177, 228, 185, -41, 196, -48, -123, 291, 131, -381, -1, -248, 7, -112, -53, -19, -166, 145, 99, 34, 204, 94, 30, 146, -48, 134, 170, 123, -216, 200, -226, -56, -118, 11, 6, -9, -21, 179, -29, -221, 190, 210, -162, -9, 523, 87, 344, 258, 123, 58, 93, 348, 131, 7, 78, -30, 143, 243, 205, -174, -19, 103, -62, 201, 75, 211, 296, 31, 104, 11, 1, 244, -201, -27, 352, 155, 234, -94, 325, -186, 93, 75, 221]
6007B21P4k57Rl9J21j82OJ57k40L2n6J97j06l0L45l1M0j32N9J5L3j45J54n2J39
6032C32m70M00J67k48l55J26J92j75K69k60K49l94J99O9J90m73L25k92N1k53L91
6053D0j02O6m6j26M1l0J55j46m2O7K14J92j87k43JM9K4k7j24K55L28k66l91L17
6077A9j70J25J92j89j54N14l53M8J23k22L21m16L37p3l5j88q5L75m65J49J60q8
6099g5J69j74J29m52M10L0J32j20N6k04j84K95k31j86L53Q5l13J6J51o8K1r2k31
6122d83L84P0L6J7J76k12k03J11K76k56k1j61Q8J48J28k21J20m8J8L22n5l35K6
6145g5O4k58L41k05K90r8K4k39o3O5J32Jnj07J26k28K09j89J54n1kMN21k79J27
6170B59j09k44j4L4O7M0mk31M27j59P0n4j9k37L7J46l8MN3J33m31J18J82j42j95
$$ y = [221, 295, 38, 47, 8, 129, -53, -47, 110, -130, -98, -154, 43, -63, -93, 252, 221, 261, 129, 188, 203, 236, 91, 245, 193, 332, -138, 262, 429, 181, -174, -48, 144, -31, 238, -22, 227, -167, 32, 101, 291, -182, 143, -149, -98, -351, 40, -62, 4, -42, -168, -127, -157, -2, -148, -190, -123, 91, 283, 96, -147, -146, -97, -73, -100, -224, 31, 359, 93, -298, 19, -151, -26, 166, -23, -177, 337, -16, 32, 155, -67, 254, -162, 175, 102, 67, -121, -206, 169, -296, -147, 13, -75, 94, -80, 49, -403, 7, 37, 169, 49, 105, -99, -283, 12, -219, -405, -52, 33, -280, -264, -113, -181, -160, -252, -483, -99, -29, 7, 24, 200, -12, -215, -104, 172, -84, -105, -266, -178, -30, 98, -123, -3, -51, -33, 289, 234, -101, -75, -11, -269, 72, -133, 157, 59, 83, -156, -219, -154, -22, -21, -26, -133, -7, -235, -26, -215, -61, -112, -114, -110, 411, 132, 259, 150, -94, -108, -74, -7, 33, 29, -202, 225, 66, 136, 82, 63, -174, -137, 9, -29, -25, 28, 161, -270, -152, 30, -112, -307]
6195c07L13p3k04L07P8J00k84k5K32j03lj27m6L86j61K2k17K64O2m30l6J85M5
6218b2m0J28j65N8J50k61o2R7K31J6n1o8j47L1K54j98J1j39K85k46N8l2J30M4
6242F2Q5J04m25M9J35K3J99O6k20J45Nk10M1l1J00M0J56k97L42n18O0J31k00K63
6266A05m6Q7MJ5J2m3k14L14l31K95l10o7J05J19q0l1J54Q0j36j30ML40j00Q2k43
6291a5L57m23n2K21m5L39k67k7j16j96o6L0L71J78j52k03j72L77l4k1j69o5L07
6314A57m92N36Q4n14L24o2l9L44O7n61J66K44l26m4OK82j14J93l57r4Q8L49m15
6337a78Jj1q4K52lk3K23j6n27L52M7J70k35J00J38p9M2k38O9k8j3Q6jL45n39K33
6363H3J11K74k56j67J78r9Jk0R4k17j7J15J99k59J90j36j94J31Q8j24J51j14K3
$$ y = [-307, 6, -67, -271, 36, 114, 214, -70, -95, 137, 34, 31, -96, -142, 244, 83, 105, -112, 152, 214, -216, -252, -67, -22, -62, 66, -99, -41, 109, -152, -214, -117, 114, 130, 79, 11, -136, -105, 149, -49, -38, -177, 108, -138, -80, -112, 18, 62, 147, 251, -174, -125, 10, 33, 232, 298, 78, 223, 228, 18, 59, 28, 128, 168, 324, 27, 369, -149, -89, 42, -158, 105, 59, 146, 150, 165, 177, 134, -80, 234, -97, 198, -112, -179, -74, 45, -35, -66, 88, 168, 32, -98, -94, 246, 146, 228, -15, 342, -81, -133, 88, 43, 382, 115, 88, -28, -224, -290, -260, 111, 289, 137, -66, -238, 139, 105, 84, -85, -150, 157, -335, 201, 285, -229, 95, 33, -6, 338, 405, -156, 10, 254, -72, -116, -110, 172, 58, 251, -106, -200, -112, 237, -178, -177, -188, -272, -20, -23, -46, 177, 161, -366, -14, 33, 203, -32, 68, 206, 127, 169, -69, 0, -28, -41, 45, 44, 389, -150, 83, 194, 468, 212, 45, 223, 124, 125, 105, 199, -18, -35, 80, 279, 20, 210, 74, -120, 11, 99, -25, 126, 12, 35]
6386C5l1q8K64l48K97j69J04J69k80j49L05n5o8p1K99r6j70M6n1J72j74j94J55
6409i8j29J56J47k13M26j04m79K91lk48N2M64j02q8o1nL52m31K19P1J97l90J26
6432A50K24o6k47O0K73k39k01J20Q5j35M5J41n7k16J37J14m03K80J05j27K38k88
6454gR5n3k17O6k8J53R6m40K89K72k29q5k8q4M41m36M16n32L09K1N1M5j20J26
6478A21k9j68J15Rl2O6j50J18pj63K02J47j01j63L6k03J09K83j35J45m55J89k0
6501h6Q3O6j16O3L21k70r5j01J58l03Q3J38Q0j38j82L65Op4j05J3k13J30L0K89
6525A42%n74N56Mk44m9J09k87J87k23M81j2N0j71m1K42k90J69M3o1j25j05Q3Q8
6549b8L4K7j57l0JL81l96j20K17L55m90R9L9mJ35j3O5j20j76J12j8P5K7n0P7J30
$$ y = [35, 4, -84, 180, -168, 129, -40, 64, 233, -47, -196, 109, 54, -14, -85, 214, 118, -52, -6, -57, 115, -59, -253, -98, -227, -71, 76, -137, 289, 185, -294, -3, -6, -254, -202, 262, 160, 72, 11, 6, 358, -73, 146, 217, 414, 24, 150, 374, 308, 61, 121, 394, 155, -46, 74, 159, 24, 69, 210, 153, -63, 74, 188, -215, 65, 170, 43, 281, -7, 88, 35, -182, -116, -144, 9, 105, -335, -46, 226, -3, -88, -116, -200, 241, -195, 221, -311, -2, 19, 70, 115, -5, 121, 92, -76, 39, 48, 16, 82, -68, 50, 43, -120, 82, 229, 128, -35, 1, -202, -93, 190, 55, 200, -255, -66, -86, -3, 63, -53, 10, 331, 61, -34, -135, 23, -280, -197, -59, 21, -117, -299, 66, 72, -2, -107, -94, -307, -177, -147, 142, 142, -432, 124, 128, -116, -165, -56, -343, -156, -379, 102, 90, 140, -31, -72, 170, -120, 49, 92, 31, -94, -199, -116, -28, 6, 33, -124, -154, -153, 228, -168, -288, -71, 284, -206, -107, -68, -72, 63, 50, 115, -5, -181, -69, -87, -12, 15, -35, 42, 172]
6575A72M11m08R5m14L20j95J57J8l32L16k73L09j05j82N19j77l07L20m9J43j89
6596A49k37K87q1K54l44K83l47J69j03N2LJ01J93m83J90j49K59j24J34j61l6j85
6618a76K05M69o57L39p7K14j60J73n9j54n2R2l0J08j12J19j22k72J5M34l64j71
6640b38N63j19O7k22J29k31K66q3j39KJ65j47M7J31j13J08k81M51l10K22j09K7
6662A86R6k21L13l84J42l84K80J12j41J81l82K59j19o6L3R6j69L81l85k09N11
6683A30k00p2K9J23J7l11K27M0j07K67L4j29j34O0L6P4K36l00l40O9K03J43n9
6706C6j22K10j02Ml13J35J47l42K18J08J2j02K7j50J99l7J30k34J96k02K65l22
6728b39J63J92k62mk35J17O8L47o54M89J48m76K52J94m3j89J62o9P5j65J00n4
$$ y = [172, 583, 175, 270, -144, 176, -19, 138, 156, -176, 140, -133, 176, 71, -111, 408, 231, -76, 244, 195, 338, 149, -88, 199, 118, 372, 28, 311, -36, 133, 30, 82, 85, 186, 379, -104, 86, -63, 196, 72, 206, 45, 9, -176, 29, 498, -159, 180, 103, 317, 157, 330, 271, 117, 65, 157, 127, 235, 123, 242, 120, -152, -137, 297, -67, -238, 325, 206, 273, 51, 180, -51, 215, 132, -7, -5, 160, 13, 60, 191, 78, 186, -95, 356, 46, 268, 159, 186, 282, 61, 374, -10, 132, -252, 28, 140, -1, 180, -202, 57, -62, -128, -95, 1, -168, 213, -172, -381, 130, -70, -142, -113, 10, 27, -284, -57, -17, -124, 143, 177, 48, -86, -26, 10, 84, 320, 20, -320, -251, -48, 95, 36, -86, 124, 22, 26, -287, -152, -5, -347, -129, -21, -9, -111, -84, -234, -35, -72, 58, -176, 20, -182, 83, -239, -76, 116, -146, -150, -385, -268, -200, 147, -507, -18, 130, -346, -94, 100, 57, -132, 30, -39, 36, -129, -29, -83]
6750h3L7j92K56j81O1R4J34k38k9K51k05J12j92K90ll63K32R9l27J18N8r1J98
6773C6m86K55J42l38L49j4j01N5J31k06J27l93K78J69k45Q2K31Rk26k16J83O5
6795a13K19j76r0O5L09j36J9n7J17k43j4j02m0N1j32L54K6j42o4L0J93j59J58
6818G3K17j64Q5m55J68k5P6k9P4n8J38k42L64j71k53J05m1J91j39L04n09K20J19
6841D8j69J00p6J65r3k17N39n8o79M42J56r8o0l5jK32r2j29j40N08n7k98lk0j6
6866e1k46R8L09P2m04Q8K59j66P1J56m02L70j97M90m98J7o9j28K27J26j21k49
6888b48N74k54j85J08O9K33l76M04l23P8j3Lk09K38Ok35N2k5K12k95K09ko3j5
6912e7j61N5L92k2j57k61L11k5K71k94l7k71K73j39K0Q6L30m24K45l25K20k8j23
$$ y = [-83, -46, -238, 18, -163, -102, -8, 126, -112, -141, 110, -95, 17, -175, 115, 112, -251, -19, 80, -247, -129, -71, -162, 36, -450, -195, -53, -391, -42, -56, -157, -102, 29, -177, -50, -443, -165, 4, -241, -159, 72, 81, -145, -361, -178, -113, 106, -70, -160, -95, 214, 78, 97, 40, 157, -86, -100, -202, -242, -191, -323, 31, 57, -85, -149, -119, 74, -85, 73, 290, 126, 211, -244, -76, -101, -25, -54, 20, -38, 100, -142, 222, 51, -202, -97, -138, 53, -86, 218, -291, -71, 48, -121, -21, -97, 68, -25, -242, 297, 239, -440, 2, 158, 60, 0, -35, -36, 196, 104, -25, -165, 343, 286, -12, -15, -35, -51, -297, -199, 110, 182, -222, -134, 125, -41, 30, 186, -216, 154, -43, 447, -51, -34, -103, -231, -4, 122, 1, -248, 326, 72, -113, -5, 64, 297, -79, 325, 2, 80, 67, 70, -139, 99, 105, -130, -78, -103, 109, -186, 23, 21, -42, -57, -218, -163, 229, 207, 50, -211, 100, 75, 346, 52, 15, -256, 17, -122, -102, -16, 314, -110, 135, -190, 30, 2, -121]
6935a21O8p7J12K4m3l2J69P6l04j6J80J45k94L01q0Nj76J47r1m4N4j88K44k70
6959b11O24m98K02l78K80J9K59m59J62J12n4J48l51p9n6K28J70n7m55M02j64K09
6981E3l0k3Nr8N0R7N1k14j64J34J40M1J50k2M2l03j53P3J71r4k50N48k73j45J34
7006h0J73j38k01J62k93K58K27k45lJ29J36K47l31J76k04n3K21l06K13k15j8K7
7028a18J91j38j54J43n4J40j0M4j24L8M0J07l89M16k96L47K8l19K8R6j88K59J79
7051B66o9k18m4M3J98k36J3K42l39J10k47L70nk09j50MK74j10J87K3q5p8Oj50
7075b04N6N16l92r4J92R1k03o4j37Q3m3Q9Q7k36O9L3n9m2L09k05M51m62%R6L68
7100B99l91J99j72K67j61j46O5p8K52j38j02R4J18l40M58l20j77J88M1p6PJ70
$$ y = [-121, -53, -130, -18, 6, -37, -69, 100, 176, -128, -144, 36, 181, -113, 188, 108, 113, -63, 84, -7, -51, 3, -185, 59, -211, 413, -85, 117, -261, 19, 38, 297, -162, 0, 112, 58, 206, -145, -224, -280, -52, 118, 61, -394, 8, -156, 53, 23, 0, 5, -93, -43, 54, 105, -109, -273, -139, 1, 42, 192, 170, 212, -91, -244, -171, 0, -94, -344, 204, -69, -214, -80, 93, -45, -246, -84, -377, -119, 108, -137, -140, -11, 125, 372, 41, 217, 13, -40, 181, -125, 88, -127, -145, -118, 73, -65, -219, -76, -130, 10, 0, 44, -80, -42, -2, 105, -284, 132, -164, 183, 211, -108, -80, 16, -172, 87, 266, 197, -21, -65, -22, 176, -60, -47, 195, -144, -34, -281, 89, 84, -125, -275, -271, 3, -107, 80, 103, 18, -60, -54, -204, -148, 368, -24, -118, 74, 165, -38, -102, -239, -156, -199, -110, -23, -259, -190, -157, -216, -258, 51, -154, 297, -165, -165, -69, 299, -92, 107, -65, 202, 41, -105, -40, -118, 134, -4, -106, -12, 106, -234, 224, -96, -273, -85, -44, -120, -113, 57]
7122E7Qk8J89k37J07l7J7O9k98n0r7L88L7k76K10k10l4K16k1J47l3j07k5k65K65
7147hj58j8L40k81Q8Q2j3OJ31q2k13L81l29rP8J80j06k46NM13k58j34K8n6N68
7172C89m35J02l74K31J26Q9q5j13J99l2k3o2l7Q4o2j63J14K48R1n02O6K50q6K3
7196C8r6P4j55J08lj17K2J97k98J67J86k40J35j82K86j54j23N83m13K33k04K79
7218C23m91J88m5j60R4O5j67M8J36K28l73J12J95k19M3O3j67M2J25r1K58l77K0
7241a50R8N1j88Q9J51K18k92j24K45m63J47L56j8j20j26J82j95J54K10n65J40
7262b00N7J87J02kl54N38k13k25K12j33L24q7l68J47k05M70j47r1J69J98l08j79
7284a08J94l7PL2j85N1j89K91r2L23l56R4K3L34m61n7J03M2j82P4K91j23j55O6
$$ y = [57, 65, 37, 226, -11, 96, 59, 76, 145, -153, -203, -300, 88, 125, -151, 59, -151, -185, 31, 10, 157, 124, 17, -8, -273, -8, -166, -184, 156, -125, -37, 45, 32, 38, 169, 87, -126, 255, -74, -83, -5, 175, 69, -177, -172, 241, -17, -151, -123, -179, 389, -46, 56, -318, -87, 39, 128, 43, -70, 129, 97, 74, 12, -25, 59, -3, -166, -52, 196, 287, -215, -149, 101, 15, 38, -58, 16, -139, -31, -34, -151, -129, 68, -230, -63, 123, -117, 18, -164, 122, -32, -155, 428, 15, 248, 44, 323, -168, 20, -25, -185, -91, -26, -193, -145, -9, 219, -154, -42, 153, -66, -23, 40, -127, -85, 40, -51, 207, -170, -150, -52, -1, -189, -100, 51, 269, -23, -147, 98, -365, -218, 138, 120, 0, -126, 56, -139, 15, 225, -340, -200, -143, 44, 146, 144, -210, 328, 115, -110, 102, -31, 293, 206, -162, -15, -220, 250, 103, 12, 181, 379, 71, -108, 86, 49, 56, 88, -97, -46, -235, 56, -36, 287, -69, 25, 48, 382, -79, -136, -33, 9, -173, -99, 192, 69, -86, -20]
7308b0P9p5Q5k7Q1k92L9R8L7J2m4o5NJ17L5n7r6k91N52r9J57k12Q2Q1P9j97k62
7335a98m0J99J09j59K4M5L71o20L76J2j09n7R1j46K42m74o3M48J42l64M48l33
7357e6q5q4K2O2j17L72mo0l85L21O0j34k35P3K19m3j18K48j3n2k62J90K5J04j33
7382h5J32j15k04Q0j8J10J74K09m27M24l06r6J45j78M04k17k9j09J01J19l64Q1
7404a69j4K24m7J59k41J70J74j46j52k66P4J97J09j74K17k21J45k25K57j67J13
7425A7J13k05J60j39pK04q4N4k76O4P2K81k99j02K06J49l09Q5J3o1K97j22N5j87
7449b1j53J99Oj60M0K8k4q3K25j79P2K31j99j4Q3K28m81K14k2Kq1R5K1j98L65
7474A94k98K77k62j0K86k80M1J14j14J11l4p3j13K26J44k75K15m2k42P5L34Nl42
$$ y = [-20, 59, -16, 69, 42, 123, -169, -130, -32, 5, 17, -27, -92, -87, 30, 65, 8, -88, -379, 173, 74, 231, 19, 101, 182, 261, 64, -198, -238, -39, 70, -89, -65, -20, 351, -269, 107, 119, 10, -47, 44, -102, 140, -334, -397, 51, 193, -171, 277, -56, -141, -225, -203, -141, -258, 114, 110, 50, -335, -14, 46, -88, -323, -250, -31, -74, -192, 56, 43, -9, -271, -81, -56, 48, -85, 47, -68, -272, -192, -210, -100, 74, 283, -144, 280, -26, -122, 23, -155, 249, 32, 3, -106, -5, 114, -250, -169, -183, 41, -6, 153, -88, 82, 256, 110, -42, -308, -234, -37, 72, -102, 115, -106, 39, -186, 71, -96, 17, 130, -75, 85, -54, -61, 143, 59, 113, -163, -99, -27, 254, -45, -147, 59, 208, -101, -16, -3, -64, 233, 111, 166, -21, -174, 25, 31, -129, -89, -61, -85, -168, 57, -122, -50, 181, -18, -32, 51, 279, -202, 12, -10, -8, -89, 6, 27, -171, 194, -104, 173, -89, -99, 187, -93, -52, 62, -52, 59, 25, -48, -161, 65, 209, -66, 149, 107, -135, -60, 274, 279, -63]
7497f3q2N46l93j18J37L1K4P7j51K1k23k94K69Q9L17k16rK0L81n86J90j17J95
7520D5k40o0L44j50J13K07j88o6J79j67O8j22j13o0K16K12m59K32Jmk3l7N9j05
7544a18P4j02m4K50j4L47m46K94k38K55k36O9j26L40j58J16k92j0Lr0J02k05M67
7567B38k25Jj4l8Q3J88m50J70j7L7P9j4k16L28k03OO5n07M15n7J60N2p1Rj85J61
7593eQ2L11m79L62m66K71k7k52L03j36K40j78O2k6J24l17J05j84K02j10K7M5J95
7616A49j26j9q0K83l55J43j37m8L08j86p7J32J9N4l23M04Km32L50j7p6K78l05
7639e9M7r4J31l36M31m07M66JN1n16K23r8m2R4r3M23j16r4J60m97K73o6K24J4
7663A20j44L48l06q0J56l01kM36k62k04J42K45O0l15J08l62Q0K07K08m91L12k34
$$ y = [-63, -145, 401, 8, -110, 27, 58, 82, 159, 8, 29, -194, -488, -219, -130, 187, -29, -38, -18, 363, -223, -33, -150, 45, -195, -255, 89, -61, 52, 259, 71, 5, 184, 17, 85, -37, -150, -210, 6, 218, -241, -9, -8, -12, -35, -72, -13, -118, -44, -146, -190, 60, 46, 393, -53, 241, 3, 258, 22, 91, -35, 305, 147, 263, -29, -39, -36, -126, -24, -229, 238, 13, 14, 0, -38, 45, 233, -217, -47, -64, -27, 52, 38, -178, 150, -53, -47, 18, -489, -74, -131, 29, 81, 10, 19, -166, -5, 77, 388, -91, 271, -195, 76, 49, -203, 100, -36, 204, 26, 88, 62, 186, -131, -26, -210, -8, -118, -91, -46, 149, 23, 4, -76, 207, -148, -5, -142, -190, 118, -68, -145, -13, 6, 60, -263, 141, 143, -289, 61, 44, -32, 246, -59, -12, -106, 25, -311, 120, -287, 179, 180, 231, -285, -62, -160, -202, -108, -201, 222, 106, 12, 172, -325, -52, -118, 106, 120, -24, 324, 18, -62, 94, -207, -209, 227, -35, -239, -97, 148, 208, -107, 1, -361, -281, -74, 134, -357, -45, -279]
7685b79K92j29j09K90m0j70P5R1n3J78k66rJ68K9j75O0m1K08j72J47j78Q4P0l11
7709b40N76n33J00K61j60j51K24J24p51M33Q4J13j00jJ46l54L03j78J9K47k27
7730f5M06m12Q8N8J87m51J69M25n15R1m5j9L4O8l77K98k28K42j31L36m54J04L05
7753A14j35J77l59K84j90J24l57M55J53J1k23Q2j97j75J02M06p0k95P2J56j46
7774a1R3L08k97q0J6K6n6Q8j81M5P0p2r4J03K18j32m6l7J84j96j90R2j73L45j54
7799a31L73j98j65K66k09J3K6pl8K22m44K88o8j8N2j4k64N30k90J94j59J20q1
7822bj01J51j19k9K59q6k20L41j74R4J38n1j78j95K34p2J0K89j74K12m10M50n77
7845b10M47j24j09m4M6j94M8R1j1pK12l02J31m9N0j64K85J53l41O0r5L5k7j43
$$ y = [-279, 13, -116, -225, 65, 25, -145, -70, 21, -32, 146, -120, -129, 39, 68, -107, -47, -88, 120, -52, 95, -83, 1, 71, -240, 336, -197, -97, 164, 4, -147, 77, 201, -550, -117, -33, 80, -20, -21, 125, -229, 74, -104, -85, 162, -65, 341, -71, 17, 75, 262, -189, -20, 405, -110, -19, -64, -83, -49, 19, -358, -60, -288, -46, -177, 159, -295, -191, 114, -21, 156, -203, 81, -109, 15, -342, 113, 266, 277, 54, 136, -61, -236, -134, 272, 202, -93, -21, 135, -11, 82, 390, 93, 13, 29, 55, -1, 87, -94, -49, 21, -51, -145, -42, 176, 44, -2, -39, 145, -51, -241, -149, -322, 23, -131, 242, 44, -121, 145, -64, -51, -25, -32, -70, 152, -292, -4, -72, -90, -38, -52, -316, 214, -76, 118, -41, 79, -2, -103, 48, -71, -100, 159, 73, -147, 194, 20, 114, 252, 201, 23, -172, 62, -10, 0, 289, 115, 327, -83, 367, -210, 237, 113, 4, -40, 6, -188, -140, -49, -60, -67, 145, -157, -26, -75, -25, -189, 96, 249, -92, -32, -127, -92, -119, -262]
7869b62L04j21K9Qj87n8O6M43k77J13j92OK30p6j24l38N29j27k10K37k54N71j08
7892B02J55m71J57r7J19O0M4p2J24k89K90k8o6j26k8O7q0J56O6j27j51L6n3J98
7916H6k18K89J20q1k46K18Nk02K0k3p1K31m48J75J84J15k77J31J80k03M6N1j86
7939a04l6K92k93L64m52J58q6J30k5J43Rk69j42M76k52k2MJ71L3j77k8O3L4j46
7963a55R7N7j31K89k87l6K48k10Q9j32q3K50J33l84L85j46p7J93n7j60r1M18l4
7986A76n21K70K68j02k3R1k80Ll7P0J06l2%M9p6m0J22J18l33N7K42J20l22L87
8010C13o7k08M6O4l56M7m6J57L53j74K4n47K25m0m2J22R5L08o22K08K66p4q2L36
8034C06l21K8J2O2J5M3o7L3n2J01Q7m97J02j17L55j35Oj68K76j47K38o3j89M5
$$ y = [-262, 42, -79, -50, -42, -229, -287, -221, 222, -55, 58, -134, -128, 102, 26, -98, -436, 93, -34, -244, -7, -261, 310, 202, 357, -114, 43, -54, 65, 125, 169, 97, 221, -68, 222, 194, 128, 2, -26, 41, -39, 117, 183, 56, -95, -59, -112, 86, -132, 157, 277, 196, -50, 168, 173, -29, -9, -32, -103, 128, -320, -145, 39, 154, -123, 8, 188, -15, 31, 82, -104, -140, 152, -141, 223, -229, -71, -157, -27, -52, 91, 100, -169, -311, 165, -87, -109, -105, 66, 99, -78, -106, -43, -9, -155, -58, -1, -132, 157, -130, -166, 82, -128, -39, -171, -254, -4, 129, -255, 130, -16, -93, 100, 43, -117, -208, 210, 176, -345, -75, 193, 91, 68, 159, -121, -118, -155, -85, 21, -11, -11, 38, -38, -78, 44, 162, -171, -114, 128, 248, -74, 313, 246, 38, 84, 148, -208, -161, -207, -50, 303, 129, 153, -394, -169, -209, -251, -129, -34, 274, -348, -140, 126, 52, -30, 306, -15, 13, 25, 87, 102, 145, 78, 111, 59, 160, 247, -250, -148, -265, 90, -45, -39, -207, 69, -78, 160, 97, -92, -47]
8058d7K23l69o4%L38p0j23J72K2p4J60K9l3j47Oj4J43M9j42l63L17n7k43L90j05
8083br1k7k35K67L97k21m6K8j36O7J13m02L24r6L16m02l3J51J38l24J95J49J49
8106B79l35J27m5J14l6m9l29L59J8j35J11m2j90J7K44O7j95K83j17j44R9k81M49
8129B69j99J32j30j35K14n84L14M28m07K39j14rr0K69j7m57K62M9j45J05J94j53
8151C5j13k06L53l4j98K84k34K67l74K02K40J88m64Q1J26l09J54r0J96Q5j38k36
8173a85L90J12k29J79p9m44L59o5M1n1k0r0J60r7Q0j00k43Q7
$$ y = [-47, 176, -193, -257, -257, 81, 11, -112, 60, 82, 8, 168, 197, 164, 17, 23, 9, 152, 201, 59, -304, 13, -44, -287, 103, -2, -93, -120, -355, -88, 309, 88, 42, 70, -66, 1, 114, -288, 36, -60, 256, -146, -179, -28, 110, -214, -19, 130, 279, -56, 71, 26, 140, 104, 55, -274, 85, 103, -32, 79, 37, -153, -136, 108, 175, -20, 263, 146, 2, 101, -180, 269, 70, 202, 72, -63, 151, -433, -119, 309, -98, 141, 27, 18, -72, 197, 180, -277, -15, 34, -111, -6, 188, 35, -78, -284, 69, 35, -163, 121, -113, 154, -220, -18, 222, 410, -54, 27, 153, -156, -2, -92, 104, 189, 51, -185, 205, 317, 88, 267, 188, -256, 103, 38, 79, 28, 8, -82, 78, -19, 61, -39, -282, -195]
8191a95
$$ Imaginary data points
##PAGE= N=2
##DATA TABLE= (X++(I..I)), XYDATA
0@%%%OrLqJ6k4L2m0M8n6P0q6J04j26J50j77K07k42K83l29L83m42N05n75O54p44
29c97Q42r47J066j199J342j498J672j861K067k295K545k820L123l458L829m240
45b229M701n222N812o485P264q178R268j0593J2248j4386J7263k1379K7807l9359
59b3468O6743k51133l22714R4854k4896J5386l4447J1812l5021k1675l0313Q204
71e46668j0111O283J2464L8104J9994K3316J8821K1276n419j0781j3837p475j7969
84d72002j0688l62J2402Q958J2596J5561J7141M919j343l350m424j2090j0997
97d43679q4J0951J3808K1975L3185L6673L0803K6490K4334J7269M077L78L154
110b20666K110J163Q705J7967K0373J9768K2373K0316J1443J909k054o912j0385
$$ y = [0, 0, 0, 0, 6, -3, 0, -8, 8, -16, 16, -24, 24, -32, 38, -48, 56, -70, 80, -97, 110, -132, 151, -178, 205, -237, 268, -307, 347, -397, 445, -502, 564, -635, 707, -791, 881, -980, 1087, -1208, 1337, -1483, 1640, -1818, 2011, -2229, 2472, -2750, 3062, -3423, 3841, -4337, 4931, -5662, 6586, -7800, 9463, -11916, 15891, -23468, 43275, -207858, -530572, -435718, -460614, -445228, -479675, -467863, -502884, -524559, -554872, -546668, -556779, -550496, -538032, -499928, -479934, -456618, -437797, -416521, -421940, -432721, -446558, -454033, -472002, -482690, -483052, -470650, -461692, -449096, -433535, -416394, -411475, -412818, -416168, -420592, -432682, -443679, -443763, -432812, -419004, -397029, -363844, -327171, -296368, -269878, -245544, -228275, -224198, -223820, -220666, -218556, -217393, -208688, -190721, -170348, -150580, -128207, -107891, -96448, -94539, -96593, -103505, -113890]
123a13890q917l772K537Q928J8326K6086K8351K8917K7753K0120J1191N632K238
136E3500j524n29N611J1976J5262J9354K4948K4480J7266J0816L680n965j4998
149A63877j8332j5309j1555p313R72R498J5294J6723J8226J5836J0000J608l712
162A95813o235p555n939n19P527J3708J7219K0423K1074J6759P275m37o651j4651
176B57811k0768k0883j5876j2601q981R3N985N766L125K317p80q928j4763j4594
190A56923j3937j4913r656k31N823R341J3402J5811J3540N597m31n699j2610j8786
204A44174j8569j6597j3464j0827m989O79J362m39k865o330j3337j9617k1168
217A8013k0812j9501j5440q311M35N554R536J2376J2824Q295J111l785p887j3344
$$ y = [-113890, -122807, -126579, -124042, -115114, -96788, -70702, -42351, -13434, 14319, 34439, 45630, 51262, 53500, 51976, 51447, 57058, 69034, 84296, 103650, 128598, 153078, 170344, 181160, 184840, 178875, 163877, 145545, 130236, 118681, 111368, 112340, 121838, 137132, 153855, 172081, 187917, 197917, 199525, 195813, 189578, 182023, 176084, 175565, 183092, 196800, 214019, 234442, 255516, 272275, 279550, 279113, 272462, 257811, 237043, 216160, 200284, 187683, 178702, 178795, 184780, 190546, 193671, 195988, 195208, 186280, 171517, 156923, 142986, 128073, 118417, 118186, 124009, 133350, 146752, 162563, 176103, 181700, 181269, 175570, 162960, 144174, 125605, 109008, 95544, 84717, 79728, 80407, 81769, 81330, 78465, 72135, 58798, 39181, 18013, -2799, -22300, -37740, -46051, -45616, -40062, -30526, -18150, -5326, 2969, 4080, 295, -7592, -20936]
231b0936j5123j2052o877m038k7O178P707M737L89k724r310j7767k0964k0243
245a11050j7976j5869q340R98O462J0091J2788J3400R614L064r78l567p221q443
259a17027n693P93M661Q159J2446J5104J1916P453J777l507j0811j5510j6688
272a06927j5237j2102p877j152N243Q126R450R481P390K914k094m553n434o100
286a18872l867J318O794J1417J4175J6893J6779J1941P488J597m390r225j1657
299e9609j1664r991o009j647L087O721Q404P446M891J282k852o578r257p924n232
314h8932r60L987J0376J5053J7318J6885J5055J1119M636j621n374p694r423p725
328b7300l088Q38M127O713Q113O282K275k587o600r996j3909j3202r242m998n68
$$ y = [-20936, -36059, -48111, -54988, -59026, -59053, -52875, -45168, -40431, -40042, -42766, -52076, -69843, -90807, -111050, -129026, -144895, -153235, -152237, -145775, -135684, -122896, -109496, -99882, -96818, -97796, -101363, -108584, -117027, -122720, -121927, -117266, -109107, -96661, -81557, -69641, -62188, -60411, -63918, -74729, -90239, -106927, -122164, -134266, -142143, -143295, -138052, -129926, -120476, -110995, -103605, -100691, -102785, -107338, -112772, -118872, -122739, -121421, -114627, -103210, -89035, -72142, -55363, -43422, -35934, -34337, -38727, -47952, -59609, -71273, -81264, -87273, -88920, -85833, -79112, -70708, -63262, -58371, -57089, -59941, -66519, -75776, -83700, -88932, -89892, -85905, -75529, -60476, -43158, -26273, -11218, -99, 4537, 2916, -2458, -10152, -19575, -27300, -30388, -29550, -25423, -18710, -10597, -4315, -2040, -4627, -11227, -21223, -35132, -48334, -57576, -62574, -63142]
343f3142N904J1750J4251J3959J1976R800M474j501m058n230n662m670p45M649
357h245P309Q128Q714P915L374k843o451j0256j3577j4650j1469p254l291J521
371d1075O904R568J0224Q155O671L199j586m735m980m079l393K45N292Q722R779
386H911J0617R404N732K24m742q810j2295j4063j2234r049n932j315L040N886
400b4626O427N416L330m04l490o760o833o452l511O96N216R442J1907J2927J2175
415A5460Q312L979j003n709q832j0878r943p131m136p84L531N276N158L006J036
430b658k621o378r046r207p848n411j145M624Q411J1823J2439J2563R985N429
444B0960J036k402n323o971o370l797q43J313M612O216N136K974K35l199p399
$$ y = [-63142, -57238, -45488, -31237, -17278, -5302, 4498, 8972, 7471, 3413, -1817, -7479, -12149, -12894, -8245, -936, 7192, 15906, 23821, 27195, 24352, 17901, 7645, -5932, -20582, -32051, -39305, -42596, -41075, -34171, -24603, -14379, -6224, 447, 3646, 2060, -2675, -7655, -11734, -15127, -14882, -9590, -868, 8911, 19528, 28932, 34664, 34888, 30146, 21336, 9041, -5022, -17256, -26305, -32237, -33552, -30512, -24626, -18199, -12783, -9453, -9857, -13347, -20107, -26940, -33392, -36903, -36207, -30991, -21549, -9642, 3285, 15460, 23772, 27751, 26748, 21039, 12207, 1329, -8614, -15745, -19881, -20665, -17134, -11858, -6700, -3694, -2658, -5279, -11657, -20703, -29910, -37758, -43169, -44314, -39690, -31279, -19456, -7017, 5546, 15531, 20960, 21996, 19594, 14271, 7300, 930, -2867, -3710, -2397, 2215, 8431, 13567, 16541, 16776, 13577, 6178]
459F178j0726j0461j0086p421l815J250N928Q498J0563J0888R114N984K520l30
473A8084k621m020l500l46J663M573P623Q973Q026N975L477j377n569q973j0412
488B1576j0323q649n939q28K953N650P686Q656P124L912R99j519l579m915l473
503A9331k86K557N200Q400J0661R780P021M862O85m314q304r332j0195q925o525
518B0616k425J156L251N182M918L521R83j857m654n753o287m873j675K000N139
533A9242Q158J0743J0536P997N857K226k158n763p527q096p517n281j988k19K041
548B8251L205L097J007j750m843p527r066r170p681n119j360K715N324Q491Q761
563A4335P781N927K533j187m201n955n726n979m081n51J356K942L400L464J020
$$ y = [6178, -4548, -15009, -25095, -32516, -36331, -35081, -29153, -20655, -10092, 796, 9910, 15894, 18414, 18084, 15463, 11443, 7943, 7597, 9260, 13833, 21456, 30429, 38455, 44430, 47907, 46530, 40961, 31988, 21576, 11253, 2604, -3335, -4163, -1210, 4440, 12126, 20782, 27906, 31818, 32817, 31298, 27719, 22804, 19331, 19045, 21602, 26802, 35202, 45863, 55643, 62664, 67526, 68211, 63897, 55593, 46261, 36066, 27141, 20616, 18191, 19347, 22598, 27780, 32698, 36219, 37202, 35345, 30691, 24938, 18651, 13778, 12103, 14103, 19242, 27400, 38143, 48679, 56676, 62533, 64759, 62601, 56838, 49311, 41215, 33698, 28417, 26429, 26210, 28251, 31456, 34553, 35560, 33810, 28967, 21440, 12374, 3204, -4477, -9596, -10956, -8241, -2917, 5574, 14335, 22116, 28043, 30576, 29389, 25188, 19233, 13507, 7528, 3447, 2896, 4252, 7194, 10594, 14058, 15078]
578A5078k123n230q467j0227j1408j0054p467l677n8L676O238P305O377M642K589
593a2806o70l484m842m352l465j663J550N063N722N990N810L106p2m122o976r064
609b4275j0686r851p946m289j564J543M119N429M589K351M28j649l493m762m103
624e4159k134K0K910N611Q102Q735P678O017K880n48m251o697o889p473n700l822
640d9720k02J818L092M337L843K123j20k498m314n221m955k948k94K936O111Q163
656c7849R055R554P799N164K623j075l573n668m959m054j748L10K721M374M608
671a2718K419J610k60l262o487o617n832n314l010J387N461P128Q291R062Q853
686G11N462J915J17p97k987m040j369J129K671L824O096O821L917J624l35l135
$$ y = [15078, 12955, 7725, -742, -10969, -22377, -32431, -39898, -43575, -43633, -39957, -33719, -26414, -20037, -15395, -12806, -13476, -16960, -21802, -26154, -29619, -31282, -29732, -24669, -18947, -12957, -7147, -4041, -4113, -8235, -15211, -24275, -34961, -44812, -52758, -57047, -58611, -57068, -52949, -47520, -42931, -40580, -40152, -41801, -45294, -50056, -54159, -56293, -56273, -53363, -47752, -39650, -30915, -23237, -17220, -14340, -14888, -19139, -25836, -32725, -40198, -45898, -49720, -49922, -48104, -45012, -40675, -36832, -34709, -34829, -37327, -41641, -46862, -51817, -54765, -55059, -52123, -46012, -37849, -28794, -19240, -11441, -6277, -3654, -4729, -8302, -13970, -18929, -22983, -24731, -24421, -21700, -17326, -12718, -10299, -8689, -8949, -12211, -18698, -25315, -31147, -36461, -39471, -38084, -32623, -25495, -17204, -8142, 711, 6173, 8088, 8205, 7408, 4421, 381, -988, 141, 2812, 6636, 12732, 19553, 23470, 25094, 24759, 21624]
702B1624o583p665o591m704m086j305K931N605O217O196P300N273J264o03r82
717B3891j625k608l58K215M142N104O251P714O006L177P3j744m804p216p484n868
733B6866m085k218L60K919M248L758M057L459R16j662k733l104k200j230J477
748C0828M148O232P588P693P801N603K614K06k920m816o009n848l848j700L01
763D7873K655L676L921K252R42j405k701m666m951m515k562J0K244N223P904P909
779F3809O922N510L630n5k903l760l993m631l704r68J187K359K267K910K211j189
795F9602l593n460o625p425o563m490j795n4K454M878O456N032L976K930L04k005
811E7622l572l250k582k033O6J793L562K751K962K580K4k715n012p011p420q031
$$ y = [21624, 15041, 7376, 785, -3919, -8005, -9310, -6379, -774, 5443, 11639, 18939, 24212, 25476, 24873, 23891, 22266, 19658, 19300, 21515, 25657, 30761, 37012, 44726, 50732, 53909, 53982, 52238, 47434, 40218, 32734, 26866, 22781, 20563, 20923, 23842, 28090, 31848, 35905, 39364, 40280, 38618, 35885, 32781, 30581, 29351, 30828, 34976, 41208, 48796, 56489, 64290, 69893, 72507, 72713, 69793, 64977, 58968, 53120, 49272, 47572, 47873, 50528, 54204, 58125, 60377, 61319, 59914, 57213, 52547, 47596, 43081, 40519, 40529, 42773, 47996, 55900, 63809, 70731, 76241, 79871, 79816, 76913, 73153, 69160, 64529, 60825, 59857, 61044, 63403, 65670, 68580, 70791, 69602, 66009, 60549, 53924, 46499, 39936, 35446, 33651, 33597, 36051, 40929, 47385, 52417, 56393, 59323, 59627, 57622, 54050, 50800, 48218, 46185, 46251, 48044, 51606, 54357, 57319, 59899, 59923, 57208, 52196, 45185, 37765, 29734]
827B9734o373l678j224P8K751L692L666K514J374j36j981l373l624k877j185k98
843A9060K776M576M752M627L979J435j550l607n326p292p663o356m210k547O3
858B717J763L091K074J629M72k456l143m075m296k828j528O52L913N063O270N853
874A5171N642L180L82j636l965m973n138m318k571j096M67K007K693J975P62j021
890G561k795m200n781n008l750j941K59K629M481N803N728M781L964J452l06k344
906A0533k991l170k755r93R9J766K552K955K238J054n31l425m065n039n712n062
922a2546k862q73J169L386M671N553M592L456K155M10j396j946j379j159m74J381
938D138L482M488L934L812K499j21k110m048n163o141n814m309k601K90J414L011
$$ y = [29734, 23361, 19683, 18459, 18537, 21288, 24980, 28646, 31160, 32534, 32398, 30417, 27044, 23420, 20543, 19358, 19060, 21836, 26412, 31164, 35791, 39770, 41205, 39655, 36048, 30722, 23430, 15767, 9411, 5201, 2654, 2717, 4480, 7571, 9645, 11274, 11746, 9290, 6147, 2072, -2224, -5052, -6580, -5928, -2015, 3048, 9318, 15171, 20813, 23993, 24375, 22739, 18774, 13801, 8663, 4345, 1774, 678, 1145, 3152, 5845, 7820, 8582, 7561, 4766, 566, -5215, -10223, -13973, -15914, -15655, -13026, -8545, -2742, 2986, 7767, 11731, 13183, 12877, 10533, 7542, 4372, 1617, 624, 723, 2489, 5041, 7996, 10234, 11288, 10757, 7332, 3267, -1772, -7484, -12546, -15408, -16281, -15112, -11726, -7055, -1502, 3090, 6546, 8701, 9111, 7715, 5769, 4390, 3231, 2757, 4138, 7620, 12108, 16042, 19854, 22353, 22232, 20122, 16074, 10911, 4770, -1044, -5353, -7954, -7664, -6250, -3239]
954c239L822L695J575O67j322k208k403k955j513P26K018L666N143N361M517K801
970B0351J573q69l087n092m812m692l671j964j013J390K137K410J909R12j155
985D327k379k844l112l285k091J72K165L482M780N934M904L937K127O59j452l065
1001A4259l525l074k497j847J26J394J890J250J640q0j440l254l988m109m563
1016g818l623j428P80K484L709M150N013L790K466J030m22j673k867k410j264
1031A917p33J007K112L014K919J563Q87r40k752m506n009m753l722l102m6J055
1047a1089K953M044L813L269K228R35p14j415k184j806j131O73J997L374L520
1062H467L323K745J637p65k588m118m790n335m429k627j550Q9J692K141K441J914
$$ y = [-3239, 583, 4278, 5853, 6520, 5198, 2990, 587, -2368, -3881, -3155, -1137, 2529, 7672, 13033, 17550, 20351, 21924, 21055, 17968, 12876, 8064, 3372, -299, -2263, -3276, -1886, 251, 2661, 4570, 5482, 4327, 1948, -896, -4008, -7293, -9384, -9212, -7047, -3565, 1215, 7149, 12053, 15990, 18117, 18776, 17324, 14259, 10734, 7660, 5163, 3316, 3442, 4836, 6726, 7976, 9616, 9536, 8096, 4842, 854, -3255, -7818, -11441, -12869, -12089, -9605, -5896, -1746, 3267, 7057, 9523, 10553, 10131, 8458, 5591, 3181, 1917, 1184, 2191, 4303, 7317, 10236, 11799, 12686, 11746, 8994, 4488, -521, -5274, -8996, -12098, -12144, -11089, -8136, -4092, -279, 2990, 5218, 6153, 5439, 4024, 1840, 34, -1097, -424, 1573, 4947, 8467, 11790, 14535, 16172, 15407, 12819, 8701, 3911, -1424, -5853, -8480, -10030, -9941, -8249, -6108, -3667, -1753]
1078a753O40k27j415k472k409j808n51J057K231L359M281M248L966K571M40r02
1094A1256k955l241l452l867k427j209q6Q37J839J931R89j56o04k331k812l127
1110i415k553j350o6J671L088M419M568M048L131J721j91j473k378k766k936j568
1126b050j172M58J692J708J663O46m24j330l172l752m623l075k839o56N86K224
1142a4116L291M308L616L014J923J43r38j078k322j683m39N76J705K351K586K471
1158E408J566J2j295k888m025m064m231k935j554n69J443K222L083K785J761J178
1174b103m06j421j543j311j416k99R01J877K853K793L144J551P86j095j948l683
1190a320l957l954l493k042p44O7J097J827J409J440L6q31j491k062j889j477
$$ y = [-1753, -1113, -1340, -2755, -5227, -7636, -9444, -9995, -8938, -6707, -3348, 933, 5181, 9147, 11718, 12158, 11256, 8301, 5060, 1608, -2259, -4686, -5895, -5981, -5144, -3305, -1374, -385, -541, -1145, -3476, -6288, -9415, -11968, -13318, -13384, -11713, -8625, -4206, 362, 4410, 7541, 9262, 9071, 7598, 5220, 2454, -482, -2050, -3222, -2764, -1072, 636, 2299, 2945, 2521, 1191, -1981, -5733, -10356, -13431, -16270, -16926, -16340, -14116, -10825, -6517, -2901, 113, 2036, 2179, 1241, 163, -2159, -3842, -4281, -3705, -2000, 351, 2937, 5408, 6974, 6986, 5691, 2803, -1222, -5286, -9517, -12452, -14006, -14575, -13132, -10910, -7827, -5042, -3281, -2103, -2509, -3930, -5473, -6784, -8200, -8499, -7598, -5721, -2868, -75, 3069, 4620, 5406, 4311, 2363, -1320, -5277, -9231, -12724, -14766, -15510, -15443, -14346, -12519, -11110, -9670, -9634, -10465, -11956, -14018, -15907, -17384]
1206a7384m72J230K181K738M204L935K658J626Q77r16k372k683k955k485j499
1221a1317q69Q10J330J678J217J024j97j450j952l012k455k253j079P79K030K900
1237a2816L532L928L611J900J339j92j177k085k001j253p24K29J122K065J935
1252e87J049O98K9j799k424k764k815k785j619k24J413K383K944L482L076K202
1268B259J383L29k84j138j257n41J20J042J730K525K476J784J225K19j202k689
1284G981k620l428k661k543j097j95J280K003K200J849J297N92l82r06j523j484
1300C63o60K13J274J692K687K884K424J478L91n71j790k771l213k551k751j132
1316b033n57R71O98J533J553J99k59r83j528j618k020j183J61O89K135K739L007
$$ y = [-17384, -17856, -16626, -14445, -11707, -7503, -3568, -910, 716, 1593, 677, -1695, -4378, -7333, -9818, -11317, -12186, -11376, -10046, -8368, -7151, -6127, -6324, -7774, -9726, -12738, -15193, -17446, -18525, -17746, -15716, -12816, -9284, -5356, -1745, 155, 1494, 1302, 125, -1960, -3961, -5214, -5938, -5709, -4587, -2522, -587, 462, 1160, 1189, -610, -3034, -5798, -8613, -11398, -13017, -13241, -11828, -9445, -6501, -3019, 57, 2259, 3642, 3971, 3687, 2549, 1292, 751, 871, 1913, 3643, 6168, 8644, 10428, 11653, 11872, 10670, 7981, 5361, 1933, -728, -3271, -4368, -4563, -3283, -1280, 920, 2769, 4066, 4658, 4276, 3370, 1847, 363, -297, -84, 1190, 2882, 5569, 8453, 10877, 12355, 12746, 12175, 10385, 7614, 4401, 1850, -901, -2033, -2590, -1619, -921, 612, 2165, 2364, 2105, 1122, -406, -2024, -4044, -5227, -5066, -4377, -2242, 497, 3504]
1333C504K776J733R89J63r52k166l040k116k248j843L34J80M85N13P91p6j283
1350b256k337k182k711k703k026r86j10J200K200K703K741J848O82M05J0j772
1366e294j777j775r28l84N0R68J322J226O60P15n78k285k727k519k546k091j423
1383a9386J06J003J365K365K287K168J838M47k42n70j132r76j61J49J598J275
1399g866K024J986J735P29k14q50j772k727k952j909j893n19P26J235J789J369
1415i109J394J193L39r86k95r34p22p53R23J788K018K074L165K534J007J75j62
1432C649p30k237k151k287m03q99o63J854J733R06P95R53j91j162j507r33q14
1449d087l08k5J144K321K284K700K983J825O60No99j061j912j707m72l88k59O60
$$ y = [3504, 6280, 8013, 9002, 9165, 8213, 6047, 3007, 891, -1357, -3200, -2866, -2686, -2201, -1688, -897, -973, -2256, -4593, -6775, -9486, -12189, -14215, -15201, -15311, -14111, -11911, -9208, -6467, -4619, -3937, -3532, -3522, -5294, -7071, -8846, -9774, -10158, -10108, -9140, -7818, -6592, -5932, -5217, -5795, -8080, -10807, -13326, -15872, -17963, -19386, -19280, -18277, -16912, -14547, -12260, -10092, -8254, -7807, -8049, -8619, -9751, -10727, -10888, -10739, -9141, -7866, -5842, -3856, -2121, -1392, -1606, -2456, -4228, -6955, -9907, -11816, -13709, -14228, -13502, -12267, -10478, -9109, -7715, -6522, -6183, -7169, -7464, -8398, -9120, -9873, -8950, -7162, -5144, -3070, 95, 2629, 3636, 3811, 3649, 2919, 682, -1469, -3756, -4159, -5058, -5721, -3867, -2134, -1228, -433, 520, 329, -833, -2340, -3273, -4087, -4395, -4420, -3276, -955, 1329, 4029, 7012, 8837, 9497, 9502, 8803, 7742, 5830, 4123, 3651, 3263, 3004, 3664]
1467C664R82J577L58l65q2j572k644j950j417r68p06O22J876J796K353K192K052
1484G768J391K51j49r84j007j226m10j6P90J178J463J406P22p9r54r15k359k690
1502D180j630k114r48J5R25J480J725J504R25P18J97o56r94q87o91o59j5J350
1520D425J273J226J548J173k09q28j379k047k108k279k522q60o66o02Q27J062
1536a966R31O61M9j70r02j345j207q95J76J34O63J792K181J635J562O75L86j326
1554C034j266j590k170j907j195K9l28K9R73O32L61p10j60j138k120j683j313
1571a0522n86l19R95J340J714J476J675J137L62n91j031j105j824j311j134j20
1587i844l9O47M23O17J39k72j292j186k044j627j757p22p21N99J294J861J819
$$ y = [3664, 4646, 6223, 6581, 6216, 6134, 4562, 1918, -32, -1449, -2417, -3123, -2501, -625, 1171, 3524, 5716, 7768, 9159, 9410, 9261, 8277, 7270, 6044, 5634, 5618, 6408, 7586, 9049, 10455, 11177, 11098, 10144, 9229, 6870, 4180, 2550, 436, -512, -497, 428, 1908, 3633, 5137, 6062, 6780, 6977, 6321, 5327, 4440, 3749, 3090, 3075, 4425, 5698, 6924, 8472, 9645, 9436, 8608, 7229, 5182, 3074, 795, -1727, -2587, -3253, -3855, -3028, -1966, -1035, -374, -325, -495, -1397, -2742, -3949, -4844, -4668, -4534, -3871, -2079, 102, 1737, 3299, 3974, 4360, 3034, 1768, 178, -1992, -3899, -5094, -5065, -5393, -5364, -4391, -3759, -3398, -4108, -4268, -5406, -7526, -9209, -10522, -11108, -11427, -10432, -9092, -7378, -5902, -4227, -3090, -2728, -3319, -4350, -5455, -7279, -8590, -9724, -9844, -9883, -9236, -8813, -8196, -8057, -8329, -9621, -10807, -12851, -14478, -16235, -16957, -17678, -17079, -15785, -13924, -12105]
1604a2105J508J415L34K00k76q89q18n17j50K83P39R84J128J218M31k11j227p26
1622h679k067j863j939j246m16j64R82R27J239J234P82M08N18o96q13m10o37K30
1640a2610N66P67J817J354J421J302K47o02j050j316j487j555j171j064L52J23
1656a2906R07J009R34P89M9J38o70q89m58p00K33R66J065J920K158J293J623O20
1674a919K22n36j277j018j437r55p65%O94L43N97M59J01k98p76j265j137j194
1692a0161j161j5K92J300Q09J807J563J251O60L12k93m69j160r08q82o4K69K04
1710f646R77N73J90L12k67j241j192j337j579p86j028K73K99R82J135J499J360
1727f476P55M31m62j71p51p31m28J51L35N26J212J092P49p2l34j046j369j550
$$ y = [-12105, -10597, -9182, -8848, -8648, -8924, -9813, -10631, -11148, -11298, -11015, -10276, -9292, -8164, -6946, -6515, -6726, -7953, -8679, -10746, -12609, -14548, -15794, -16210, -16374, -15392, -14465, -13226, -11992, -11210, -10802, -10284, -10980, -11793, -12203, -12840, -12610, -12044, -11277, -9460, -8106, -6685, -5383, -5136, -5738, -6788, -8104, -9591, -11146, -12317, -13381, -13029, -12906, -11999, -10990, -10056, -9267, -9218, -9080, -9750, -10639, -11097, -11797, -11564, -10598, -9533, -7613, -5455, -4162, -2539, -1919, -1697, -2233, -3510, -4528, -5965, -6920, -7685, -7685, -6991, -6648, -6051, -5592, -5491, -5789, -6565, -7830, -8967, -10161, -11322, -11337, -11045, -9745, -8936, -7129, -5566, -4315, -3655, -3343, -3636, -4105, -5265, -6173, -7055, -7119, -6850, -6646, -5669, -5096, -4906, -4594, -4861, -6102, -7294, -8631, -10210, -10996, -12024, -11751, -11452, -10470, -9335, -7836, -6476, -5721, -5290, -5752, -5923, -6674, -7405, -7833, -7682, -7347, -6821, -5609, -4517, -3768, -3840, -4174, -5220, -6589, -8139]
1745h139j528j124j329o15K94M40N68J054Q85L01L21p21n88l13p03l65K65N26
1763a0771J461Q99J628P93J003K04o02p10j000j339j253o57o49K34J024L08R18
1780h509O44M70l07j92q39o20p74l95L65R97R19J603J718R74J029N08J09o81r98
1799c979p06r76o41m43J64K96L05O45N29j60q79m17q76j092q81n99j05L72J055
1818h388J256J278J202J038R59J1l45m35n07n73K6m86N24N88Q65O14M82J15p20
1837b496o24j115q79j115j401J27m26Q73Q49N75J103Q32R23j48O1p08o22p77j88
1856e156m5J093M37J102N44L78K4l51r34j177j422j186j100j005j6n3L96Q41P41
1875f889J17J19j83l02l59k88p95J21N33O38J002J154J109O39P32N3q17m30r29
$$ y = [-8139, -9667, -10791, -12120, -12735, -12441, -12001, -11433, -10379, -9494, -9193, -8872, -9593, -10181, -10494, -11197, -11562, -11297, -10771, -9310, -8411, -6783, -5990, -4987, -4783, -5385, -6095, -7095, -8434, -9687, -10344, -10993, -10759, -9735, -9427, -8509, -7865, -7395, -7702, -7894, -8733, -9353, -10127, -10522, -10157, -9160, -8241, -6638, -4920, -3946, -2917, -2409, -2300, -2981, -3979, -4685, -5661, -6302, -6745, -6581, -6285, -5980, -5335, -4806, -4966, -5845, -6262, -7138, -8230, -9111, -9710, -9815, -9443, -8388, -7132, -5854, -4652, -3614, -2655, -2644, -2989, -3424, -3931, -4504, -4478, -4964, -4440, -3852, -2987, -2373, -1891, -1776, -2496, -3120, -4235, -5114, -6229, -7630, -7503, -7929, -7056, -6207, -5632, -4529, -3697, -2774, -2922, -2861, -3569, -4191, -4968, -5156, -5201, -4108, -3671, -2569, -2025, -1647, -1623, -1974, -2908, -4085, -5507, -6693, -7793, -8798, -8814, -8867, -8471, -7630, -6889, -6772, -6653, -6836, -7138, -7497, -7785, -8580, -8459, -7926, -7288, -6286, -5132, -4023, -3384, -2652, -2599, -3416, -3846, -4775]
1894d775r32q02o80q4K25J90O84K43J36J47l44l88r05p11l91k85J64Q50N48J120
1914e990J447Q90M41N15k97k59p00q32o54k24j30k62Q91K28O17K41K37o68m65
1933d974p56r62l46n31K76J60J005J291J286J291Q86L64R4Q1j84m20j54J58J9
1952a416O91Q84N97R65K25Q2l7o16j009j125o83k21m29K70L90O33J040P95P10
1971A746L24K11k9n92m3j29K2J1O92R80Q01M29J070O0l20m31j054o12j250o07
1991A279Nj42M52K81N59P45O04k33R7n10k01m84j8P7L57M95J181R09Q74P01K59
2012G287p4m40p32m97r44r15k01j74k92L78K69q4L14l46p41m76j111n71k80m28
2032e8J35K41K41J075N56O39K06K4m57l94q21l83o34r69K28n0J83N55pL22o78
$$ y = [-4775, -5707, -6509, -7189, -7273, -7048, -6858, -6174, -5931, -5795, -5648, -5992, -6380, -7285, -7996, -8387, -8672, -8508, -7658, -7110, -5990, -4543, -3653, -3212, -2697, -2994, -3253, -3953, -4785, -5439, -5663, -5793, -6055, -5164, -4936, -4319, -4078, -3841, -4509, -4974, -5730, -6692, -7038, -7569, -7293, -7133, -6128, -4837, -3551, -2260, -1374, -1010, -916, -835, -1019, -1439, -1593, -1435, -1416, -725, 159, 756, 1721, 1946, 2028, 1991, 1375, 366, -759, -1442, -1663, -2092, -1822, -1432, -799, 241, 1036, 1746, 2070, 2281, 2252, 1660, 1617, 1488, 1510, 1521, 2213, 3193, 3994, 4423, 5493, 5553, 5233, 4802, 3748, 3136, 1886, 1279, 1284, 1142, 1594, 1875, 2434, 3179, 3783, 3550, 3647, 3137, 2936, 2452, 2434, 2511, 2868, 3363, 4544, 5453, 6327, 7028, 7287, 7213, 6773, 6041, 5544, 4600, 3685, 3484, 3310, 3018, 3396, 3665, 3581, 3895, 3549, 2808, 2332, 1221, 650, 370, -58, 77, 318, 559, 1634, 2190, 2829, 3035, 3059, 2602, 2208, 1387, 1004, 370, -599, -371, -421, -238, 317, 310, 632, -46]
2053d6m65j014j262o10n29l10l29M37M42N29O84M87M43L43m0l09j058j47p93m4
2073c591L21M13L06K27K51K69l09r22p76o65j183j214n79l51J66K43N56J38O11
2092f089l16M10O3o42m82l42J51l00N18K66R17N28L62M67J04n24n79k91r46m65
2112g190o58J00K95l7rJ058M60K04p19J80K3m02j84O7r1M08P60P88J079O28L15
2133b925M81N6o34l51m87k96o75j79O0L34R3J75M91j5j11l96j14m28o31o50L68
2154e834O64M75P99O50P68M47L42P55j85m47k81l15J32o9J85N68N75K01K01J56
2174b13O1l7r30k69m54p89j54K73Q8R13O22N52Q63m87M84j11J48q83k54J60J56
2195b61J55J4M04R29j78k2k50l60r47q56l07n12n92J23p4K49K68N41L03L51n07
$$ y = [-46, -511, -1525, -2787, -3397, -3926, -4236, -4565, -4128, -3686, -3157, -2473, -1986, -1543, -1200, -1240, -1549, -2607, -2754, -3547, -3591, -3270, -2857, -2551, -2324, -2073, -1804, -2113, -3035, -3811, -4476, -5659, -6873, -7452, -7803, -7637, -7394, -6838, -6700, -6089, -6405, -5995, -5932, -6574, -7056, -7398, -7247, -7547, -7029, -6763, -5846, -5318, -4956, -4489, -4385, -4909, -5488, -5779, -6725, -7190, -7848, -7748, -7453, -7490, -7499, -6441, -5981, -5777, -6496, -6316, -6293, -6695, -6879, -6812, -6903, -6495, -5735, -4947, -3868, -3240, -2925, -2444, -2388, -3022, -3373, -3860, -4156, -4831, -5010, -4950, -4616, -4523, -4348, -3857, -3872, -3983, -4379, -4493, -4921, -5552, -6202, -5834, -5170, -4695, -3896, -3246, -2478, -2031, -1689, -934, -1119, -1566, -1847, -2162, -2030, -2099, -1914, -1346, -771, -570, -369, -213, -152, -189, -1119, -1388, -1842, -2631, -2785, -2512, -2424, -1511, -889, -337, 526, 39, 523, 412, 560, -323, -577, -417, -261, -106, -92, 312, 1241, 1063, 1041, 791, 431, -516, -1372, -1679, -2191, -2783, -2660, -2734, -2485, -2217, -1676, -1373, -1022, -1529]
2216a529N4j11l67k91K5K37N39M2P92O20K55L40l4J74j097l45k58o47l48j14M07
2237a656R1K5Q9M56R3m42m35k45j36k99m89L74J68O24M23K90O98N56k64K7m10
2258d62l53n47o54p2q7J52J1M14K30K1j30j61k37k87m89m44K37RK70N60N69P34
$$ y = [-1529, -1475, -1586, -1953, -2244, -2219, -1982, -1443, -1401, -609, 11, 266, 606, 572, 746, -351, -696, -954, -1601, -1949, -2063, -1656, -1565, -1540, -1451, -995, -902, -1344, -1779, -2024, -2160, -2459, -2948, -2574, -2406, -1782, -1359, -1069, -371, 185, -79, -52, -462, -815, -1362, -2016, -2088, -2175, -2023, -2012, -1598, -1368, -1347, -1477, -1638, -1875, -2162, -2651, -3095, -2858, -2849, -2579, -2019, -1450, -716]
$$ [...]
8191a17
##END NTUPLES=NMR FID
##END=
