##TITLE=1H_PHBC0602
 CDCl3, 8 sc, 
 7.2.2020
##JCAMPDX= 6.0         $$ Bruker NMR JCAMP-DX V2.0
##DATA TYPE= NMR FID
##DATA CLASS= NTUPLES
##ORIGIN= UXNMR, Bruker Analytische Messtechnik GmbH
##OWNER= root
$$ XWIN-NMR		Version 3.5
$$ Fri Feb  7 14:00:24 2020 Russian Standard Time (UT+4h)  she@DPX200
##.OBSERVE FREQUENCY= 200.1315
##.OBSERVE NUCLEUS= ^1H
##.DELAY= (6, 6)
##.ACQUISITION MODE= SIMULTANEOUS
##.ACQUISITION SCHEME= undefined
##.AVERAGES= 8
##.DIGITISER RES= 18
##SPECTROMETER/DATA SYSTEM= spect
##.PULSE SEQUENCE= zg30
##.SOLVENT NAME= D2O
##.SHIFT REFERENCE= (INTERNAL, D2O, 0, 15.7039)
##AUDIT TRAIL= $$ (NUMBER, WHEN, WHO, WHERE, WHAT)
$$ ##TITLE= Audit trail, XWIN-NMR		Version 3.5
$$ ##JCAMPDX= 5.01
$$ ##ORIGIN= Bruker BioSpin GmbH
$$ ##OWNER= she
$$ F:/spectra/data/she/nmr/H-F/1/audita.txt
$$ ##AUDIT TRAIL=  $$ (NUMBER, WHEN, WHO, WHERE, WHAT)
(   1,<2020-02-07 13:59:11.81 +0400>,<she>,<DPX200>,
      <created by zg, POWCHK disabled, PULCHK disabled
       configuration hash MD5:
       00 E9 B6 7A A2 85 ED C7 34 08 36 98 17 FE 4E 26
       data hash MD5: 16K
       7B E6 4D 37 EB 71 3F 77 2B B3 52 C2 A9 C2 84 9F>)
$$ ##END=
$$ 
$$ hash MD5
$$ 04 79 A1 85 0E E5 5E 9A 44 E5 D6 27 EC AA 94 5C
##$RELAX= 
##$RELAX= 
##$RELAX= 
##$RELAX= 
##$RELAX= 
##$RELAX= 
$$ Bruker specific parameters
$$ --------------------------
##$DU= <F:/spectra>
##$EXPNO= 1
##$NAME= <H-F>
##$PROCNO= 1
##$TYPE= <nmr>
##$USER= <she>
##$AMP= (0..31)
100 100 100 100 100 100 100 100 100 100 100 100 100 100 100 100 100 100 
100 100 100 100 100 100 100 100 100 100 100 100 100 100 
##$AQSEQ= 0
##$AQ_mod= 1
##$AUNM= <au_zg>
##$AUTOPOS= <>
##$BF1= 200.13
##$BF2= 200.13
##$BF3= 200.13
##$BF4= 200.13
##$BF5= 200.13
##$BF6= 200.13
##$BF7= 200.13
##$BF8= 200.13
##$BYTORDA= 1
##$CFDGTYP= 0
##$CFRGTYP= 5
##$CHEMSTR= <none>
##$CNST= (0..31)
1 1 145 1 1 1 1 1 1 1 1 1 1 1 1 1 1 1 1 1 1 1 1 1 1 1 1 1 1 1 1 1 
##$CPDPRG= <>
##$CPDPRG1= <>
##$CPDPRG2= <>
##$CPDPRG3= <>
##$CPDPRG4= <mlev>
##$CPDPRG5= <mlev>
##$CPDPRG6= <mlev>
##$CPDPRG7= <mlev>
##$CPDPRG8= <mlev>
##$CPDPRGB= <>
##$CPDPRGT= <>
##$D= (0..31)
0 1.2 0 0 0 0 0 0 0 0.06 0 0.03 0 0 0 0 0.0002 0 0 0 0 0 0 0 0 0 0 0 0 
0 0 0 
##$DATE= 1581069551
##$DBL= (0..7)
120 120 120 120 120 120 120 120 
##$DBP= (0..7)
150 150 150 150 150 150 150 150 
##$DBP07= 0
##$DBPNAM0= <>
##$DBPNAM1= <>
##$DBPNAM2= <>
##$DBPNAM3= <>
##$DBPNAM4= <>
##$DBPNAM5= <>
##$DBPNAM6= <>
##$DBPNAM7= <>
##$DBPOAL= (0..7)
0.5 0.5 0.5 0.5 0.5 0.5 0.5 0.5 
##$DBPOFFS= (0..7)
0 0 0 0 0 0 0 0 
##$DE= 6
##$DECBNUC= <off>
##$DECIM= 24
##$DECNUC= <off>
##$DECSTAT= 4
##$DIGMOD= 1
##$DIGTYP= 9
##$DL= (0..7)
0 120 120 120 120 120 120 120 
##$DP= (0..7)
150 150 150 150 150 150 150 150 
##$DP07= 0
##$DPNAME0= <>
##$DPNAME1= <>
##$DPNAME2= <>
##$DPNAME3= <>
##$DPNAME4= <>
##$DPNAME5= <>
##$DPNAME6= <>
##$DPNAME7= <>
##$DPOAL= (0..7)
0.5 0.5 0.5 0.5 0.5 0.5 0.5 0.5 
##$DPOFFS= (0..7)
0 0 0 0 0 0 0 0 
##$DQDMODE= 0
##$DR= 18
##$DS= 0
##$DSLIST= <SSSSSSSSSSSSSSS>
##$DSPFIRM= 0
$$ [...]
##$SUBNAM2= <"">
##$SUBNAM3= <"">
##$SUBNAM4= <"">
##$SUBNAM5= <"">
##$SUBNAM6= <"">
##$SUBNAM7= <"">
##$SUBNAM8= <"">
##$SUBNAM9= <"">
##$SW= 24.9337058887773
##$SWIBOX= (0..15)
0 0 2 0 0 0 0 0 0 0 0 0 0 0 0 0 
##$SW_h= 4990.01996007984
##$TD= 16384
##$TD0= 1
##$TE= 0
##$TE2= 300
##$TE3= 300
##$TEG= 300
##$TL= (0..7)
0 120 120 120 120 120 120 120 
##$TP= (0..7)
150 150 150 150 150 150 150 150 
##$TP07= 0
##$TPNAME0= <>
##$TPNAME1= <>
##$TPNAME2= <>
##$TPNAME3= <>
##$TPNAME4= <>
##$TPNAME5= <>
##$TPNAME6= <>
##$TPNAME7= <>
##$TPOAL= (0..7)
0.5 0.5 0.5 0.5 0.5 0.5 0.5 0.5 
##$TPOFFS= (0..7)
0 0 0 0 0 0 0 0 
##$TUNHIN= 0
##$TUNHOUT= 0
##$TUNXOUT= 0
##$USERA1= <user>
##$USERA2= <user>
##$USERA3= <user>
##$USERA4= <user>
##$USERA5= <user>
##$V9= 5
##$VALIST= <valist>
##$VCLIST= <CCCCCCCCCCCCCCC>
##$VD= 0
##$VDLIST= <DDDDDDDDDDDDDDD>
##$VPLIST= <PPPPPPPPPPPPPPP>
##$VTLIST= <TTTTTTTTTTTTTTT>
##$WBST= 1024
##$WBSW= 4
##$XGAIN= (0..3)
0 0 0 0 
##$XL= 0
##$YL= 0
##$YMAX_a= 545646
##$YMIN_a= -449546
##$ZGOPTNS= <>
##$ZL1= 120
##$ZL2= 120
##$ZL3= 120
##$ZL4= 120
##$ABSF1= 10
##$ABSF2= 0
##$ABSG= 5
##$ABSL= 3
##$ALPHA= 0
##$AQORDER= 0
##$ASSFAC= 0
##$ASSFACI= 0
##$ASSFACX= 0
##$ASSWID= 0
##$AUNMP= <proc_1d>
##$AZFE= 0.1
##$AZFW= 0.1
##$BCFW= 1
##$BC_mod= 2
##$BYTORDP= 1
##$COROFFS= 0
##$CY= 11.3945322036743
##$DATMOD= 1
##$DC= 2
##$DFILT= <>
##$DTYPP= 0
##$F1P= 16.9975609425685
##$F2P= -3.02152046262296
##$FCOR= 0.5
##$FTSIZE= 0
##$FT_mod= 4
##$GAMMA= 1
##$GB= 0.15
##$INTBC= 1
##$INTSCL= 1
##$ISEN= 128
##$LB= 0.24
##$LEV0= 0
##$LPBIN= 0
##$MAXI= 10000
##$MC2= 0
##$MEAN= 0
##$ME_mod= 0
##$MI= 1.114404
##$NCOEF= 0
##$NC_proc= 0
##$NLEV= 6
##$NOISF1= 3.799351
##$NOISF2= 2.8
##$NSP= 1
##$NTH_PI= 0
##$NZP= 0
##$OFFSET= 15.70392
##$PC= 1
##$PHC0= -9785.748
##$PHC1= 14.60081
##$PH_mod= 1
##$PKNL= yes
##$PPARMOD= 0
##$PSCAL= 0
##$PSIGN= 0
##$REVERSE= no
##$SF= 200.130013532006
##$SI= 16384
##$SIGF1= 3
##$SIGF2= 2
##$SINO= 400
##$SIOLD= 16384
##$SREGLST= <1H.CDCl3>
##$SSB= 0
##$STSI= 0
##$STSR= 0
##$SW_p= 3612.71676300578
##$SYMM= 0
##$S_DEV= 0
##$TDeff= 0
##$TDoff= 0
##$TI= <>
##$TILT= no
##$TM1= 0
##$TM2= 0
##$TOPLEV= 0
##$USERP1= <user>
##$USERP2= <user>
##$USERP3= <user>
##$USERP4= <user>
##$USERP5= <user>
##$WDW= 1
##$XDIM= 8192
##$YMAX_p= 0
##$YMIN_p= 0
$$ End of Bruker specific parameters
$$ ---------------------------------
##NTUPLES= NMR FID
##VAR_NAME=  TIME,          FID/REAL,        FID/IMAG
##SYMBOL=    X,             R,               I
##VAR_TYPE=  INDEPENDENT,   DEPENDENT,       DEPENDENT
##VAR_FORM=  AFFN,          ASDF,            ASDF
##VAR_DIM=   8192,          8192,            8192
##UNITS=     SECONDS,       ARBITRARY UNITS, ARBITRARY UNITS
##FACTOR=    0.0002004,     1,               1
##FIRST=     0,             0,               0
##LAST=      1.6414764,     0,               0
##MIN=       0,             -449546,         0
##MAX=       1.6414764,     545646,          0
$$ Real data points
##PAGE= N=1
##DATA TABLE= (X++(R..R)), XYDATA
$$ [...]
3050d185P434J285p373j490O575K508n945l090N972L142n757l588N972L739n403
3065b04m260N204M940m380o093L828O801l495p054K232P492j018p687L93P450
3080D149O73p252j789O669K627o108l088N494L389n143l875M624M198m096m608
3095d136M277M687l938n325L554N616k874o408K219O713q13p222O21O883N8o685
3111b773j562O652K448o404k625N820L432n044m537M401N141m089m823L329M966
3126D332k550n254K185N362k105n553J769N476j168n444L70N880N7o226p59O373
3142B745J132n947k421O150L119n784m123N168M871m392n202L571N350k430o086
3157d279J982N577j191n473Q37N473m47n142k6N162K12n188o75N721P26n316j574
$$ y = [-4185, 3249, 4534, -2839, -4329, 2246, 4754, -1191, -4281, 1691, 4833, -924, -4512, 1460, 5199, -204, -4464, 740, 5680, 1300, -4793, -965, 5836, 2341, -4713, -2481, 5011, 3993, -3694, -3301, 4149, 4822, -2430, -4219, 2450, 5077, -1031, -4119, 1375, 4764, -379, -4254, 370, 4568, 472, -4136, 141, 4828, 890, -4435, -881, 4735, 1861, -4547, -2328, 4385, 3572, -3650, -3029, 3854, 3912, -2773, -4335, 2317, 4765, -1639, -4264, 1556, 4988, -56, -4593, -192, 4949, 860, -3963, -634, 4332, 1782, -3472, -1287, 4075, 1970, -3583, -1814, 3662, 2494, -2950, -2580, 3300, 3357, -2869, -3628, 2745, 3877, -2070, -4491, 1659, 4778, -1006, -5129, 39, 4910, 518, -4684, -1113, 4237, 1807, -4279, -2297, 3280, 2089, -3384, -2547, 2926, 2479, -2663, -2689, 2473, 2685, -2503, -3178, 2543, 3269, -2047, -3621]
3174c621N455K109n193k890N140L604m999m065M082N158l264o148L021N711j816
3189B284n763P92N722P8n547n12N215P05m916j225M466J787m637j750M398K168
3205C265m248k882M165K891l935l270L710M209m079m274L160N388k864n860J821
3220b803O255r27o184L44N790Q69n939j753N758K044m885k814M136L497l762l272
3236c646L006L541l094l236K651L606k794l757K896L719k188m418J889M628j349
3251A454n181Q13N658j90o072n32N979J265n110k710N119L585m633m163L871M101
3267C254k880m566K799M110j827m352J507M416j437l894R22M021o88m184O58M602
3283B461l38n067j00N193N97m882j394N060K323m937l001M338M194l868m622K978
$$ y = [-3621, 1834, 3943, -1250, -4140, 1000, 4604, -395, -4460, -378, 4780, 1516, -4632, -1611, 4100, 2284, -3479, -2687, 3035, 3113, -2434, -2946, 2269, 2974, -1942, -3167, 1299, 3086, -1551, -3301, 1097, 3265, -983, -3865, 300, 3191, -744, -4014, -304, 3905, -174, -4448, -1288, 4100, 1236, -4624, -2803, 3452, 2525, -3659, -3315, 2475, 3344, -2595, -4348, 1410, 3454, -1431, -4245, -109, 3388, -374, -3646, -640, 2901, -193, -3429, -778, 2828, 34, -3723, -827, 2892, 704, -3714, -1825, 2803, 1454, -3727, -2914, 2744, 2554, -3518, -4050, 1929, 3194, -1916, -4626, 493, 4078, -555, -4718, -847, 3254, 374, -4192, -1393, 2717, 890, -3462, -1955, 2461, 1024, -2870, -1948, 2073, 1385, -2799, -2141, 2461, 2123, -2944, -3044, 2149, 2746, -2136, -3530, 1530, 3853, -1084, -4085, 253, 4447, 579, -4043, -1065]
3299a065N035k546m956J764N139r42n137O40M767J83m644k08M181O98m171j179
3315b441M233J449m322j502M036K141m021k668L932L244m271l308L445M522l381
3330A088m463K433M806j572n370J183N406l86n107q74N440J184m463k301M570
3345A574K031l857k720L689K621k953k605K371L043l090k816K874L214k739l562
3360b925K104M128j798m729J736M603o60n058L5M906R42n011j546M417K250l898
3376e04l282M051L406l457l695K992L251k114l742K194L689j767l890J553L922
3391B607j251m239R40M299l83m488j42M603O85m610j188M371J795m199k815M394
3407C79K829l247l606K989L842k560l927J723M436j576m071O66M246j49m453L78
$$ y = [-1065, 3970, 1424, -3532, -1768, 3371, 2429, -2708, -2068, 2699, 2882, -1762, -1970, 2211, 2909, -1262, -2441, 1792, 3241, -1081, -2583, 1453, 3594, -427, -3095, 837, 4081, -190, -3498, -53, 4469, 1088, -3375, -942, 3864, 2292, -3078, -1895, 3511, 3125, -1982, -2856, 2584, 3768, -695, -2996, 1574, 3605, -252, -2972, 717, 3338, 385, -2220, 151, 3194, 104, -2712, 162, 3376, 637, -2925, -821, 3307, 1509, -3220, -1484, 3119, 2459, -2599, -2564, 2342, 3284, -1727, -3273, 1144, 3394, -504, -3786, 265, 3671, 214, -3481, -489, 2762, 648, -3094, -900, 2789, 1022, -2868, -1315, 2607, 1356, -2883, -1943, 2356, 1973, -2515, -2657, 1946, 2631, -1979, -3167, 1204, 2999, -1200, -4015, 379, 3208, -39, -3645, -656, 3186, 626, -3301, -1578, 2858, 1282, -2789, -2123, 2123, 1974, -2479, -2101]
3423b101L553O29l725p23L917R29l657j766M170J559m138j830L629K586l163l116
3439c247K910L627k536m231K349M286j213m659M44M798J08m436n16M296O52l707
3455a075j135L385J287k928j804L113J563l228j703K938K351k924k462K851K491
3470B720k394l132K067L912j817m174Q55M588m81m423n46M404J067l814j639L639
3486H32J838l038k433L052K197k805k181K287K266j819k669K024K664j750k672
3501b207J273L251j478l455J218L548o10l689p2L816M70l569j169L653J749l836
3517a107k224L257K902k709l257K086L692j719l409R28L203n24l241N25L060k1
3533A442l014m5K763N30l397j94L207N73l464o36L631J022l452j587L101K362
$$ y = [-2101, 1452, 2081, -1644, -2367, 1550, 2479, -1178, -2944, 1226, 2785, -1353, -3183, 446, 3032, -131, -3247, -337, 3290, 754, -3477, -1128, 3158, 1945, -2714, -2270, 2528, 2636, -1800, -2316, 1980, 2632, -1075, -2210, 1175, 2462, -466, -2270, 843, 2406, -822, -2525, 413, 2764, -160, -2622, 229, 2720, 326, -2806, -739, 3173, 1356, -2818, -1963, 2625, 2144, -2279, -2825, 1579, 2646, -1168, -2807, 832, 2670, -368, -2801, 251, 2448, -357, -2538, -251, 2015, 196, -2473, -449, 2215, 465, -2207, -934, 2317, 839, -2616, -1398, 2150, 1540, -2149, -2221, 1595, 2065, -1504, -2673, 980, 2729, -1107, -3331, -74, 2828, 119, -3138, -1052, 2640, 921, -2488, -1560, 1643, 1119, -2122, -1597, 1463, 1442, -1572, -1617, 1146, 1676, -1721, -1915, 1292, 1865, -1599, -2235, 1396, 2418, -1034, -2621, 480, 2842]
3549B842k957l050L096L221k277l728J485M125o55l986j68M010L35l287j018L211
3565A199J295l101j012K554Q76k286j057K289J629k474j756K845J276k340j819
3580a882K309K386k230k698J799L341j601l677J001L484Q8l699m35L396J107l664
3596i75j159K885J653k634j887K608J701j666k170J226K264j562k026J507K152
3611A917j360j939J021K195j138k124Q01K835j108k875M76L080J07l259q74L420
3627A175J307l074j685K590K053j968k572J596K674j490k945J207K608l98k420
3642a342PK140J41j987l88K023J29j935k56J976N86k330k26K162P85k502j179
3659b196K370J925k367k381K378K496j757l286J625K905m98k910J11L079k45k432
$$ y = [2842, -115, -3165, -69, 3152, 875, -2853, -1368, 2757, 2102, -1884, -2052, 1958, 2293, -994, -2012, 1199, 2494, -607, -1619, 935, 1811, -475, -1532, 757, 2386, -88, -1844, 1001, 2277, -63, -1882, 427, 2813, 583, -2115, -316, 3025, 1424, -2253, -1252, 2232, 2320, -1379, -1814, 1582, 2689, -975, -2134, 751, 2404, -230, -2117, 491, 2192, 526, -1644, -418, 1846, 284, -1742, -235, 1917, 557, -1382, -361, 1834, 696, -1428, -627, 2208, 1100, -1775, -1299, 1781, 1888, -1371, -2245, 1175, 2482, -592, -2277, 313, 2366, 398, -2174, -578, 2096, 606, -2339, -1132, 1476, 1078, -1342, -1335, 805, 946, -1041, -1429, 594, 723, -1212, -1468, 508, 1094, -1236, -1462, 700, 1485, -1017, -2196, 174, 2099, -268, -2649, -271, 2225, 468, -2818, -1193, 1712, 1214, -1696, -1585, 1494, 1249, -1183]
3675a183n24K247J129k398r46K444O54j747j247K275P60j763j092J528J308j339
3691A06j576J719J598j571k311J279K814j374k469R84K696m98k829j60K988J12
3707A508k252r96K222J355k110j652K040J537j646j924J532J861j141j824J139
3722c51J588r83j752J072J676q72j873P42K110l36k604J95K600L27k681n17K759
3739A100O39j982j756K081J720j946j672J605J728j001j902Q72J715o51j980R37
3755d93J494m61j875L79J689K7j952O8K013Q2k181k82K353L57k071j437K745J088
3773A543j977j803J752K055j433j718O74K176n55k560P75J954J86j888k4J476
3789F33J31j345l00J569L08j306o23J546Q09j877p22J591J225j913j228J857J746
$$ y = [-1183, -1707, 540, 1669, -729, -1675, 769, 1423, -324, -1571, 704, 1464, -299, -1391, 137, 1445, 106, -1470, 249, 1847, 276, -2035, -756, 2058, 684, -1785, -801, 1895, 1397, -1432, -1592, 1396, 1508, -744, -1740, 482, 1837, -273, -1925, 115, 1652, 6, -1918, -386, 1475, 334, -1490, -351, 1237, 254, -1498, -426, 1250, 378, -1495, -753, 1357, 1021, -1583, -1388, 1212, 1539, -1142, -1659, 1100, 1739, -243, -1999, 82, 1802, -144, -1816, -211, 1517, 516, -1386, -514, 1201, 550, -1430, -493, 1001, 540, -1335, -956, 733, 760, -1192, -1124, 889, 971, -1210, -1492, 861, 1218, -853, -2290, 455, 1543, -434, -2237, -485, 1570, 137, -1581, -907, 1269, 714, -1846, -1071, 883, 1069, -819, -843, 633, 764, -581, -881, 688, 996, -310, -933, 613, 1422, -455, -1177, 414, 1639, -274, -1502, 355, 2101]
3806B101j541k171J456J809n95k262M94K177k17k175m0K241L57k151p41K120P05
3823A567j755q12J729P32j526q16J417O09r38j169J441J350j659j402J347J809
3839A924j459j839P07K486o47k205K80K330M20l080l80K427J254k496j223J664
3855A63K008j913j587J312J395m53j962P17J395k35j673P39J310p30j419O28J355
3872A050l30j924P14K042o21j930r2K457J50k642r41K505J373k198j544J470K012
3889A551j615j683J082J988o73j969L3K335l80j731l16J812J01j755MJ604L53
3906G41j356n30J468O13j952m36K134P5j428r77J812J319j768j887J389K561j383
3923C95k499J008K596l24k499l33K642K48k074p47K141N57j562j499J924J055
$$ y = [2101, 560, -1611, -155, 1654, 1059, -1203, -709, 1468, 1251, -924, -964, 1277, 1634, -517, -1258, 862, 1567, -188, -1000, 729, 1461, -65, -881, 536, 1145, 207, -962, 479, 1829, 170, -1232, 115, 1924, 465, -1374, -667, 1819, 1172, -1033, -753, 1577, 1997, -1083, -1463, 964, 2218, -278, -1501, 163, 2171, 258, -1329, -17, 1378, 925, -1037, -320, 1075, 840, -833, -94, 1216, 486, -933, -305, 1050, 720, -1204, -490, 1552, 931, -999, -1091, 1366, 1516, -1126, -2067, 438, 1811, -387, -1931, -461, 1551, -64, -1747, -665, 1323, 650, -1319, -1286, 1049, 669, -1062, -1378, 434, 535, -1220, -1216, 388, 741, -615, -1145, 323, 936, -1016, -1452, 682, 757, -671, -1648, 164, 1483, -285, -2172, -783, 1778, 395, -2104, -1096, 1500, 1176, -1323, -1656, 986, 1234, -840, -1587, 554, 1111, -451, -1950, -26, 1029]
3939A029j373j088J259J224j199j118J397J089j347j567J413J828j530j694J283
3954c94K046j165k287O43K478j05k630n23K938O65j952j655K424J299j914j394
3970a526J514J773j314j673Q17J670p72j705Q83J452n82j563O06J841m40k210
3986a229N85J853j24k303J90K164M55k399r27K777O87k415j190J784K357k009
4002B56k052J172K602j263k153K54K525m60j914K57J591J45k017j89J866K16j537
4019g01n59J892M21j515j120K189R39j846j446J864J737k049j711J426K048j102
4035D67k556J056K507j09k631o1K188O78k261n91J824R65j798j014J812Q35j824
4052e13q68J676R93j304j459J247J710j423j771J652J678j031k149N38K361k95
$$ y = [1029, -344, -1432, -173, 1051, -148, -1266, 131, 1220, -127, -1694, -281, 1547, 17, -1677, -394, 1652, 487, -1800, -1157, 1321, 1216, -1414, -1937, 1001, 1666, -286, -1941, 483, 1782, -132, -1526, -12, 1761, 447, -1226, -409, 1261, 489, -1216, -333, 1119, 537, -1026, -420, 1421, 981, -1229, -644, 1209, 1085, -1218, -1028, 1136, 1591, -808, -1735, 1042, 1729, -686, -1876, -92, 2265, 256, -1796, -624, 1978, 715, -1438, -1184, 1341, 881, -1033, -776, 815, 960, -1057, -1246, 620, 836, -701, -1260, 632, 1053, -462, -1582, 607, 1546, -300, -1746, 118, 1855, -194, -1905, -479, 1569, 467, -2089, -1033, 1474, 1365, -1266, -1327, 861, 1539, -722, -1313, 511, 1476, -322, -1336, 476, 1311, -513, -1381, 295, 1288, -16, -1475, -228, 1482, 59, -1712, -60, 1618, 587, -1562, -1024, 1337, 1042]
4068A042k250L5K305L54k644m66K361J193k330j152J727J529j699j523J407J518
4084A407j077j335Q85J415o54j927Q49J988q68k081P10K008n19k193N09K184K6
4101A327k030p24K363N65k124j037K016J600j999j687J733K114j553k393J346
4116d83K198o42k569M11K462l48j852j92K087j00j954n6K032K95k271j05J727
4133F40M67j944o97K109J296j991j804J898J770j668j960Q87K800j156k477Q59
4149i71K302k15k349l15K050P60k049p01J843Q71j768p62J462R67j547q86J080
4166b28J609j490j275J441J472j504j736J125K115j158k296J251K180l59k824
4181a677J80K574O31k592o94K432O74j767j213J306J602j436j405J060J594j072
$$ y = [1042, -1208, -1173, 1132, 1486, -1158, -1624, 737, 1930, -400, -1552, 175, 1704, 5, -1518, -111, 1407, 330, -1005, -120, 1295, 641, -1286, -437, 1551, 683, -1398, -688, 1320, 801, -1392, -883, 1301, 1327, -703, -1427, 936, 1501, -623, -1660, 356, 1956, -43, -1730, 3, 2117, 564, -1829, -483, 1715, 1073, -1496, -1085, 1377, 1029, -823, -1015, 1072, 972, -982, -1038, 994, 1289, -982, -1087, 640, 1107, -837, -1534, 575, 1871, -120, -1924, -26, 1744, 76, -1884, -997, 1803, 647, -1830, -971, 1331, 1116, -1233, -1548, 502, 1262, -787, -1488, 355, 1226, -542, -1304, 158, 1125, -422, -1308, -228, 1381, -109, -1384, 57, 1529, 25, -1711, -586, 1529, 371, -1925, -674, 1506, 1147, -1677, -1497, 1077, 1708, -884, -1578, 854, 1528, -239, -1452, -146, 1456, 20, -1385, -325, 1269, 197]
4197A97j569J079J279q57j344N87J682n53j427M99J729l90j672J3J996J24k566
4214a193P1K230N02k147j187K446J033j695k051K038J692r78k232O30K606q30
4230I35j871K38J982k13j835KJ491L15j328m03J584j4j686o4K157j79j678q81
4248a448K143J044k297j060J677J898j509k277J281K399j135k086M76K202j84
4263A124k192m18K494L73j970q55J949O49j790o11J746M52j253p80J087Q91j131
4280b35j293J373J185j111j367J203J681j240j753J077J688l77k101o0K367Lk243
4297a203l69K160M15j669j064J797J281j556j298J170J775j415j401Q44J509n53
4313D23j556Q64J505q96j503P39J509n77j839M63K149j98k363J27K176Q8j752
$$ y = [197, -1372, -293, 986, 129, -1215, -628, 1054, 501, -926, -427, 1302, 912, -760, -747, 1249, 1373, -1193, -1122, 1108, 1610, -537, -1724, 722, 1755, 60, -1991, 47, 1739, 761, -1471, -841, 1765, 935, -936, -698, 1284, 1071, -764, -762, 729, 1044, -284, -687, 897, 883, -803, -867, 1290, 1111, -567, -1448, 695, 1739, -558, -1618, 59, 1957, 448, -1829, -548, 1851, 716, -1370, -894, 1308, 1124, -1068, -1486, 1008, 1381, -589, -1444, 505, 1154, -636, -1247, 499, 951, -302, -1082, 5, 896, -235, -1528, -155, 1030, -81, -1448, -245, 1436, 196, -1557, -480, 1208, 831, -1270, -1330, 1037, 1040, -1203, -1572, 588, 1003, -666, -1730, 67, 1348, -208, -1506, -336, 1439, 24, -1377, -533, 976, 423, -1133, -269, 1236, 340, -1163, -424, 1085, 508, -1331, -868, 1281, 1083, -1280, -1153, 1023, 1111, -641]
4330f41q53K187R54j848j657K334R90j411j486J248J386n25j805P95J531j95k060
4347a056O54J667l17j529j46J679J01j758n06K272J26j905o42K076O69j433j460
4364a508J829J528j716j619J473J775j280j685Q12J760l35k172J96J865j95j655
4380i27J95J645Q1j891K4J638K87j557o17J728M98j572p94K036P22j779j371J642
4398a2J286q28k268J495J865j188j823K39K602n12k151o4J909O67j811o33J699
4415D72O90j786o93J574P33j165r85J305P81r90j425J455J250j390j287Q97K039
4432A475j191k014N63K367l82k281K27K497M4k450l36J983R90j917j485K271J288
4449A649k005r85J358J176r40j437J063J166o05j578O31J918q28k080R40J949
$$ y = [-641, -1494, 693, 1647, -201, -1858, 476, 1466, 55, -1431, -183, 1203, 678, -1127, -332, 1199, 1004, -1056, -402, 1265, 948, -581, -727, 952, 1053, -705, -1211, 1061, 1187, -718, -1360, 716, 1385, -48, -1508, 321, 1849, 133, -1486, -13, 1762, 482, -1203, -391, 1369, 1034, -1138, -942, 923, 728, -927, -732, 913, 994, -897, -873, 765, 1052, -505, -1122, 606, 1104, -468, -1262, 774, 1496, -283, -1654, -12, 1274, 446, -1822, -327, 1538, 350, -1473, -1234, 1368, 856, -1295, -1359, 550, 1217, -594, -1227, 472, 1162, -624, -1317, 257, 990, -175, -1160, 145, 926, -64, -1489, -34, 1216, -174, -1461, -564, 1475, 284, -1730, -1167, 1200, 818, -1463, -1236, 1261, 1305, -1145, -1481, 502, 1492, -425, -1910, 361, 1649, -356, -1341, 17, 1193, 253, -1184, -121, 1045, 440, -1138, -507, 1411, 583, -1497, -557, 1392]
4465A392o12j940M70K056k20k230k90K376N12k099o08J776J273k036j268J489
4481D1J504q09k295J070J744n83k035L72K212m91j882M58J733j55j978M46J619
4498I71J50k100l1J952J82j990o09K316R34k288j056K212J199j910j687J577K056
4515A878j284k103R33K106m33k433J22K200K38k220k95J955L02j865k05J568O28
4532A092j524o68J878K83j562p64J875Q10j476j381J177J937j642j728J174J991
4548A472p55k172Q4K580O1k787K51J812J056k155j204K081J307j980r65J646J128
4565A460j478j393J189J580j593j477J467J583j048j862J446J240p04j736O33
4580f93J958l27k077M7K410o0k341k70K433P31k145j266J758J271j470j533J256
$$ y = [1392, 780, -1160, -690, 1366, 1146, -1084, -1374, 1002, 1514, -585, -1193, 583, 1856, -180, -1448, 41, 1545, 736, -1559, -489, 1255, 672, -1363, -991, 1221, 730, -1152, -694, 1039, 884, -1094, -648, 971, 1121, -979, -1010, 942, 1124, -866, -1475, 841, 1775, -513, -1569, 643, 1842, -68, -1755, -178, 1878, 594, -1509, -576, 1530, 1097, -1336, -1214, 986, 1224, -996, -1291, 664, 966, -899, -1104, 464, 1092, -432, -1100, 778, 1061, -501, -1265, 610, 1420, -56, -1437, -260, 1677, 35, -1693, -519, 1472, 717, -1455, -1371, 1209, 1270, -1517, -1266, 546, 1602, -553, -1757, 324, 1631, -349, -1314, 332, 1460, -18, -1411, -222, 1358, -235, -1712, -245, 1338, 290, -1572, -126, 1114, 410, -1326, -693, 1265, 938, -1139, -1092, 1318, 1258, -1083, -1353, 1080, 1811, -334, -1600, 158, 1429, -41, -1574, -318]
4597c18J945j190j737Q66J892r58j728O72J397J08k278M35K175m13j922M94J505
4614I45J61j924m08K161O27k308q48K318J167k093j504J739K122j637j801Q06
4630d77K204p54k257M70K168j56k390L29J844Lj856J23J700m9j293p41J789P78
4648A435k031o89J841Q45j841j341J853J358j066j916J105K036j074k080P51J856
4664A042n51j792J41K134P0k151j56J648Q96j793j001K048O65j754j104J680J346
4681A368j691r29J223J458j300j922J493J819j410j708R18K328q90k061J69K343
4697A208N8k505k64K123Q14k098r64K098J034j978j103J421J611j384j668J317
4713b80J794j232j534N88K058p54j924N62K109p59j964L63K164J17k295m38K531
$$ y = [-318, 1627, 437, -1300, -434, 1458, 500, -1228, -556, 841, 949, -1329, -894, 1281, 868, -1054, -560, 945, 1106, -818, -1226, 935, 1562, -746, -1594, 724, 1891, -202, -1706, 33, 2155, 518, -1283, -477, 1727, 973, -1284, -814, 1354, 1198, -1192, -863, 981, 984, -872, -749, 951, 902, -391, -1132, 657, 1435, -596, -1285, 556, 1401, -440, -1781, 72, 1430, 364, -1552, -447, 1589, 515, -1565, -814, 1042, 491, -1301, -1160, 974, 1044, -1107, -1263, 385, 1281, -512, -1513, 535, 1200, -554, -1658, 22, 1368, -323, -1252, -29, 1429, 129, -1793, -300, 1519, 109, -1599, -681, 1647, 757, -1304, -1135, 1208, 1266, -1239, -1503, 620, 1434, -664, -1628, 470, 1504, -474, -1577, -156, 1455, 71, -1597, -280, 1514, 282, -1252, -664, 1394, 640, -1284, -722, 1387, 628, -1336, -973, 1191, 1308, -987, -1425, 1106]
4730A106K87k083j047K301R85j489j941K198J396j457j786R45K199r44k029N63
4746g96J956m61j665J02K078j58k075l4K020J5j680l27J887L99k018o95K134Q98
4764A580k108j205K103J015j240j753J179K273j621k110J311J607l72j703N1K054
4780A061O2k189l15K028M59j899l09J560O05j275r47J500R92j624j245J572J331
4797A367j321j512J089K087j275j923J123J754o46k248L36K174J38k176n95K352
4813G24N71j750j153J973P48r39j502J266J671j881j056J394J488j389j293J284
4829A56J099q97j514R78J757j089j576O83J900m08k051j66K242M62k366m66J924
4846F68J074k112p81J406J441j462j372R15J624n76k016R86J569p37j488N37J785
$$ y = [1106, 1393, -690, -1737, 564, 1549, 60, -1881, 317, 1713, 256, -1530, -585, 1614, 670, -1359, -796, 1160, 699, -966, -864, 1214, 1056, -1019, -1053, 967, 982, -698, -1025, 862, 1261, -757, -1452, 682, 1580, -528, -1733, 370, 1385, 145, -1608, -429, 1844, 223, -1887, -576, 1031, 659, -1044, -993, 1061, 1123, -1066, -1381, 647, 1106, -793, -1102, 458, 1063, -212, -1159, 341, 1333, -291, -1536, 36, 1367, 46, -1466, -377, 1710, 435, -1488, -365, 1389, 743, -1505, -1169, 1005, 1143, -1033, -1628, 724, 1295, -455, -1608, 365, 1113, 174, -1328, -62, 1609, -272, -1328, 66, 1554, 165, -1128, 156, 1255, 358, -1156, -178, 1579, 490, -1086, -403, 1497, 1089, -962, -1128, 1114, 1576, -790, -1256, 668, 1742, -370, -1151, 255, 1696, 234, -1138, -223, 1401, 825, -1191, -205, 1364, 627, -861, -324, 1461]
4863A461n62j706M70J463k92j673L38J614J82j983j70J888M04j841r98J852J206
4880A653j708j448J628J548r47k193J086J845p05k110M65K026j96j775j18J507
4896E58J69j609j25J426O97j770m00J652K91j305o92J683O73j555j029J447J195
4913A306j543j759J632J565p95j936P15J833j66k220K9K083K04j973n55K129O85
4930A234k111n45J197Q02j008p19R41J214j580q04J121J146j208j075Q62J840
4946A307q62k018P77J846m21k203M82K148k92k154k5K139K66j654o37J698R55
4963A352j789j256J718J258j435j659J642J101q37j335O11J406n37j438Q67J458
4979A127n42j656J51J935l73j994K69K152R0k257k56K114N11j853o37J509J262
$$ y = [1461, 899, -807, -337, 1126, 834, -839, -501, 1113, 1295, -688, -858, 1030, 1434, -407, -1405, 447, 1653, -55, -1503, 125, 1673, 726, -1467, -381, 1464, 759, -1351, -886, 1140, 944, -831, -949, 558, 727, -882, -1007, 419, 1116, -654, -1054, 598, 889, -416, -1108, 575, 1248, -307, -1336, 111, 1306, -237, -1996, -364, 1201, 406, -1530, -815, 1018, 852, -1368, -1339, 744, 948, -1025, -1580, 549, 1234, -877, -1422, -225, 577, -431, -1150, -209, 1005, -575, -1379, -258, 888, -320, -1395, -533, 1307, 445, -1573, -796, 1050, 629, -1574, -1092, 1056, 764, -1390, -1415, 724, 990, -664, -1301, 397, 1352, -437, -1693, 25, 1283, -152, -1811, -169, 932, 95, -1240, -629, 777, 240, -1198, -331, 1127, 585, -1071, -920, 1015, 642, -1352, -1083, 1069, 1159, -1098, -1354, 760, 1271, -582, -1219, 290, 1552]
4996A552j610j223Q22J719r73j450O56J802r42j287M59J749n17j802J86J982k87
5013H36j608J27J254J86j444m41K005M87k232l94J818J246j932j308J547J525
5029A672j342j479P38J691p74j692K73K146l61j997K79J726J06j807j09J430N70
5046A070j500n80J495N71j787k62J426R60j255j142J250J076j057j442O52K009
5062A484j075j709O48J803j66j735j08J955k16j545j99J518N96k036l4J274O34
5079A089j431q38J118J179j326q11J201P63r16j011Q32J803j361j511P08K083
5095A571o64k142M16K303l86k101l06K296L82j969o53J854J140j897q99J054J608
5112A607j541p27N69J578r33j494N48J491o24j482O49J743p78j577P22J302q3
$$ y = [1552, -58, -1281, -459, 1260, 287, -1163, -507, 1295, 353, -934, -475, 1274, 757, -1045, -859, 1123, 836, -772, -645, 609, 795, -649, -1090, 915, 1402, -830, -1224, 594, 1840, -92, -1400, 147, 1672, 330, -1149, -411, 1280, 506, -1186, -913, 1233, 872, -1125, -846, 880, 986, -821, -930, 500, 1070, -430, -1010, 485, 1056, -731, -993, 433, 1393, 138, -1004, 246, 1322, 265, -1177, -525, 1484, 409, -1300, -652, 1151, 985, -750, -858, 1097, 881, -664, -863, 655, 1251, -785, -819, 455, 1089, -342, -1180, -62, 1117, -209, -1020, 181, 944, 28, -983, -151, 1652, 291, -1220, -512, 1571, 907, -1235, -819, 1484, 1098, -1003, -1309, 987, 1369, -600, -1253, 601, 1741, -156, -1055, -1, 1607, 66, -661, -92, 1486, 553, -941, -393, 1098, 474, -1008, -359, 1384, 606, -971, -249, 1053, 970]
5129I70j823j73J887N40j631q41K038M87j712j135J543J598j702j491J050J695
5145A300q28j750O15J814l65j815L72J661m09j414N5J539l17j640j03J882M92
5162A089k015k49J722Q48j796j128J893Q65j808j074J381J687j206j840J070J812
5178A251m38k087q2K156L8j864j29J628L96j320p07J372O95j158p05J287K68r46
5196c45o47J044R52j254j119J137J416j364j032M90J892m90k185Q71J607n0k089
5213a166j00K120K73j845q81K209M06j499p68J071J443j481r28J334Q88j345r10
5230a179J240J092j052j248Q48J586p86j450J87J884m91j528j39J687M72j642
5246e19p43J793P62j706r17J655J102j476j342J378J180q21j598Q44J747q92j684
$$ y = [970, -853, -1026, 861, 1401, -230, -1071, 967, 1454, -258, -1393, 150, 1748, 46, -1445, -395, 1300, 472, -1278, -663, 1151, 786, -1029, -657, 1004, 595, -819, -764, 775, 458, -1182, -1285, 597, 1089, -926, -1175, 547, 1395, -401, -1529, 364, 1229, -579, -1653, -272, 1415, 209, -1631, -561, 1251, 813, -1274, -1356, 800, 838, -1026, -1155, 473, 869, -451, -1158, 214, 909, -249, -954, 333, 601, -345, -992, 52, 1004, -250, -1369, -232, 1184, -180, -1212, -722, 1170, 680, -1505, -634, 973, 923, -1166, -1266, 854, 1127, -718, -1599, 610, 1016, -483, -1251, -180, 1263, -218, -1146, 188, 1076, -269, -1179, 61, 1153, 101, -1147, -299, 1287, 501, -949, -762, 1122, 631, -897, -1036, 651, 1123, -519, -1262, 531, 1293, -413, -1330, 325, 1427, -49, -1391, -13, 1167, 346, -1252, -408, 1339, 447, -1237]
5263a237J024J215k19j779K18J823l09j309j07J318M95j909m40J939K27j364p46
5280a160J683J029j695j421J702J266j319j352P79J986j130j425M33J404l9j771
5296a030j10K134m3j732p5J453L19j408n83J430M98j329o28J483P68j309q93J062
5314GJ242j085j208R15J048p29j380Q40J394r3j829j44J739J18j183p24J776N9
5332G63j127o86J392N80j163r82J212P56p85p67O40J312j122j181J167J183j125
5349F7o38K0J677j12j742j5J521J41j389m87J581P29j887n32J186J112j203j145
5367a116J094J178o29j351N12J226m87j250O87R98n35j156P00J215m69j324J63
5384e44J566l2j662O8J278K68j331n29J521M92j458q25J666P49j190j190R37J524
$$ y = [-1237, -213, 1002, 783, -996, -778, 1045, 736, -573, -680, 638, 1133, -776, -1216, 723, 950, -414, -1160, 523, 1552, -143, -1564, 138, 1404, 85, -1267, -488, 1498, 368, -1057, -624, 780, 741, -1030, -1140, 994, 951, -781, -856, 597, 916, -492, -1075, 355, 853, -476, -1104, 379, 1147, -162, -1055, 7, 1249, 164, -1044, -129, 919, 190, -1190, -350, 1044, 951, -878, -1022, 717, 835, -348, -1072, 704, 763, -364, -1050, 342, 922, -241, -1223, -11, 745, -40, -807, -167, 1145, 23, -1158, 9, 1192, 67, -571, -551, 1126, 1014, -728, -743, 778, 919, -470, -957, 624, 1353, -534, -1066, 120, 1232, 29, -1116, -22, 1156, 527, -824, -312, 914, 427, -823, -136, 862, 327, -829, -129, 1086, 617, -707, -544, 1022, 990, -672, -604, 674, 942, -389, -918, 603, 1095, -363, -1188, 478, 1227, 37, -1153, -216, 1308]
5402A308j009j385O48J453m62j267J27J221K5j420n4J489J92j756J80J109M69
5419H68j332n24J430O05j273q58J432O46r27j056R07J282j022j478P10J780r77
5436B13j148L28J463r6j467k39J372M28j315m72J255N1r72k00P27P96q72o87R43
5455A08L98p10r39R50J065q83r51Q50J310r25j451O32J256J15j830mJ875J63j699
5474f70n01J546N87j478m81R10R25q80p66J046P07q29r67O89R13o27q68N98R06
5493G60m24j266P37J280n91j011m42J747M8j426m06J657M20j334p20J606O04j229
5511A0q88J042J208j199p68L16R85m62p83J03J223o0j403N81P68j63j160K28J421
5530I99k54j208k02J219L68j431m53J376M75j236n75J052Q10q26p78K15J568n59
$$ y = [1308, 299, -1086, -438, 1015, 553, -714, -587, 634, 659, -761, -815, 674, 866, -890, -710, 399, 868, -464, -988, 442, 1047, -226, -1084, 348, 994, 67, -989, -82, 1200, 178, -1300, -590, 1190, 213, -935, -607, 856, 760, -707, -946, 426, 854, -461, -933, 322, 373, -599, -799, -72, 724, -148, -835, 108, 506, -204, -1143, -193, 872, -11, -962, -112, 1198, 273, -1178, -546, 710, 825, -1005, -1009, 866, 1029, -670, -1171, 375, 962, -516, -997, -87, 838, -42, -808, 238, 945, 116, -851, -162, 751, 124, -744, -146, 760, 336, -930, -193, 1087, 496, -515, -957, 790, 838, -588, -994, 663, 1083, -251, -971, 635, 1239, 10, -878, 164, 1372, 173, -595, -279, 706, 244, -539, -436, 787, 727, -676, -95, 673, 510, -650, -422, 999, 745, -463, -665, 554, 922, -509, -962, 414, 889, -347, -922, 130, 940, 114, -664, -449, 1119, 560]
5548E60j469L32J585l66j420J73J206N1j155L2J092j56r21q5Q54L76j192j52Q06
5567A51N33n23q24P06R03j300p03R87J051n14j562M94J620p43j099J21J283K02
5585G83j675p3J168O39j250p01J426M96q40o95N89R79r35o43N77R03m92j294J011
5604b7P20m38j101N44J071o20r74L69J202l78j081j91J150M32r94n52J218J044
5622A394j499q28J075Q12r09r79P13R34m26j275O42Q85l50j142P60Q73k51j265
5640h36M16J191k48j176M1J359l4j124l30R76N22q32q06R85O02q58q98J137O93
5659G80m45r59L98R12n36r03L46J192l97j127K82J038l13q70m0O55N20r47m1J050
5679E95J80j371m38J333P45j464n93J011J084q32r43M48R60l02j153j9J314J34
$$ y = [560, -909, -577, 1008, 642, -778, -605, 601, 652, -503, -471, 621, 465, -456, -541, 313, 689, -503, -655, 151, 684, 161, -663, 43, 946, -354, -1057, -70, 981, 467, -1095, -601, 1019, 276, -823, -702, 581, 783, -892, -965, 203, 842, -408, -1109, 317, 813, -27, -722, -133, 846, -89, -732, -155, 748, 256, -1038, -27, 693, 255, -846, -302, 769, 149, -825, -456, 746, 368, -713, -904, 246, 678, -316, -868, 350, 1394, -105, -933, 142, 954, 45, -934, -221, 713, 287, -988, -346, 539, 189, -953, -193, 680, 429, -836, -420, 771, 523, -653, -612, 747, 713, -411, -741, 235, 757, -75, -881, 104, 706, -152, -1050, 87, 780, 335, -624, -226, 686, 150, -753, -407, 785, 388, -739, -457, 581, 268, -602, -642, 13, 533, -414, -455, 595, 775, -596, -1034, 299, 1044, -420, -1013, -2, 1082, 250, -693, -245, 715, 413, -740, -759, 555, 689]
5697F89j418J67J007j4q40m52J184K02j096R2P27O9n91n09Q28M75o94o26J035
5716B35L05q20o72Q71Q25l80j039L83J218m14j075j02J056M11j335q1R90O08j038
5735e4n98J097L98r33o75Q54N48n02p04N55P57o38m41L01P70o74o41L43J060n7
5755G66j384K9J430j16j086j18R95O68j224q96J137P75j056q83P48J069l62j236
5773g44P50P92l27q53j1J142j06j057K02O30P5q93R9O86J11p48k25J034N91j508
5793c60k26J107M82r73r19R33R36p59j032O54Q01l41q75O6R56j41p47k75R01N44
5813G32j022k25J103ro99m69R13J1n81l00O96N19q00o21J142M33j022k99J60J005
5833F67q59o63L36J299m62r72K61Q69q4j216J9J093L16j131j33N95N85p13m20
$$ y = [689, -729, -562, 445, 431, -409, -861, 323, 525, -571, -479, 248, 317, -274, -783, 45, 520, -174, -800, 235, 540, -280, -952, -81, 744, 364, -675, -292, 926, 512, -563, -665, 391, 802, -533, -614, 376, 984, -54, -652, 445, 843, -90, -765, 89, 637, 135, -569, -14, 743, 105, -336, -35, 735, 61, -580, -237, 823, 766, -618, -589, 841, 725, -361, -479, 516, 1184, -40, -936, 201, 976, -80, -963, -215, 854, 492, -744, 6, 798, 471, -382, -393, 749, 643, -414, -212, 418, 493, -400, -301, 385, 496, -252, -477, 557, 1148, -360, -586, 521, 1003, 30, -889, 44, 980, 221, -811, -157, 644, 303, -572, -506, 450, 309, -438, -713, 188, 732, -290, -515, 588, 579, -120, -589, 324, 335, -246, -546, 150, 669, -131, -752, 390, 823, -199, -498, -338, 667, -192, -855, -519, 780, 318, -654, -393, 476, 392, -824, -805, 288, 604, -527, -660, -65, 520, -193, -613]
5852f13L25J206r59m83M51Q36o54n08L11O81m16j054O66P45m05m28l02J332p0
5871F61j250m6Q90N52r61n95O98R48r75p84P65P64m36o93J56R80m93o82K25Q16
5891E40l66m80PP63k17o14M7P74J93p71m24R23J56j036m3N31Q83j057n54N41O21
5912D17l06j096P00Q99j84p55J91M45J99j070J98O91K55q10k82Q47J14p58j23
5931d28Q15Q5q17q6N08M73n83m89O06L70o08o95J027J53l76n07J46J011o19l65
5951c79j35J042q9j266J50Q21L79r94l9O57J02p89j54P79L80o32l10M27P96q26
5971h0l39L37P92o88r27N56R08l48o45L01N03P4j135K8J060R5p18m64P70L32m18
5992fl08J75Q12r49k45P16M67o88l37K87O75n88o32N74N70k19o45j3J054n33m57
$$ y = [-613, -288, 918, -41, -524, -73, 763, 109, -399, -88, 593, 177, -877, -211, 534, 129, -299, -601, 731, 661, -589, -635, 255, 807, -154, -749, -51, 897, -78, -862, -97, 667, 231, -462, -306, 674, 181, -501, -276, 540, 174, -306, -299, 464, 247, -367, -320, 454, 647, -124, -548, 375, 531, -505, -548, -17, 866, -191, -745, -204, 417, 111, -985, -285, 614, 430, -325, -134, 311, 510, -560, -362, 329, 584, -226, -508, 339, 453, -305, -428, 387, 472, -345, -431, 77, 550, -33, -522, 84, 454, -154, -849, 178, 331, -45, -552, -406, 605, -14, -379, -514, 528, 439, -827, -677, 144, 523, -471, -510, 147, 249, -540, -694, 85, 465, -167, -477, -50, 746, -80, -419, -82, 710, 22, -905, -349, 559, 211, -434, -133, 370, 444, -691, -663, 397, 492, -226, -690, 80, 412, -6, -314, -139, 673, -276, -521, 195, 662, -26, -363, -76, 599, 11, -621, -47, 523, 304, -341, -354, 700, 167, -290]
6013b90k13R63M7q25j55J131J86r14m76P82J36n56l87L54R04n98p19N05N46q4
6033C37o78M23K71k0n95j28P44j60m97j7O68M4p79J6Q90L66j145l81P45O27m84
6054B47r15N56R36p36n05K01J026n15q10N34N24k75m25l82P09K72n09n43P29M08
6074E27n49m55Q44N3n32k33K59N42m75n31O55K43j83n98J78P25l22p83K75Q13
6094D53O5r63K27M82J31p67j2N12K26k44o02L48P03n71n95O36J32k50m18N31L12
6115C36n14j38K40P00o57m02K04O01N8r89K66J005j07r31j02N66L11p05l53R01
6135B90L17o01k56J60P09n32n27M7N50j13o45L04P18j49m54J99M31l81l66R4O50
6156D45k9r64J22O77K96p13l81N85Q74j053o71J023N85q47m35M73K14j25n69J27
$$ y = [-290, -503, 460, 507, -318, -473, 658, 844, -70, -546, 236, 372, -184, -571, -217, 687, 89, -630, -125, 421, 337, -341, 82, 353, 333, -262, -390, 354, 194, -303, -320, 348, 392, -387, -371, 519, 885, -260, -641, 104, 731, 247, -668, -112, 824, 88, -417, -216, 810, 295, -515, 19, 543, 268, -157, -539, 170, 442, -67, -610, 119, 527, -22, -477, 367, 420, -112, -345, -86, 456, -19, -550, 105, 348, 165, -433, -255, 470, 148, -635, -360, 453, 518, -445, -218, 264, 395, -372, -384, 128, 354, 110, -492, -144, 559, -12, -607, 29, 161, -89, -507, 24, 336, -178, -316, -76, 624, -33, -435, -231, 370, 428, -561, -295, 710, 603, -328, -430, 136, 447, -258, -611, 290, 607, 6, -250, -90, 619, 87, -440, -393, 157, 44, -601, -297, 421, 272, -182, 17, 448, 67, -299, -205, 445, 416, -548, -426, 251, 547, -166, -547, 38, 912, -141, -812, 211, 796, -51, -486, -13, 201, 76, -493, -366]
6176c66M28J54l03o01Q42m4m39n5K74P52r45k04N12R5k18r0L31K87p51l78P64
6197D5N35p44l84N26N34m92q05N64P69l53n58k39J044L27j301L46O17k55k70k80
6217c74K46M66m37m05N70O36r58j74N39M5k34j70K13N12k38r23R07Q2j26o43L28
6238a38L19K05p87O2P19K06q78j22M39R44j350j56O52M06k33j127P22L59j51m87
6258c96J94M07Om58P2O76j27q02N14M10n79p5j75O50J99o66l75P69J71l29m03
6279c17O97L08q26m61Q22L63k50q07L21O84n78l93K02P73m0q12J25K84J77n64
6299b92j46Q56P2l89n48N21M11n51p31R28J28k90n08N15N15n12n24J46R30m37
6319I4n61L62P56l46q13J0Q08k62l99J9N36J36o06l58N25L29k34m10N33N63p54
$$ y = [-366, 62, 216, -87, -688, 154, 110, -329, -384, -110, 642, -303, -507, 5, 100, -118, -208, 123, 410, -341, -719, 45, 580, -164, -548, -22, 512, 20, -785, -221, 548, 195, -363, -602, 442, 769, -532, -186, 431, 176, -94, -374, -128, 338, -99, -504, 66, 702, -256, -430, 109, 154, -80, -250, -37, 475, 237, -686, 221, 303, 177, -466, -138, 181, 386, -401, -339, 380, 586, -292, -414, 25, 969, -381, -537, 115, 521, 288, -839, -117, 242, 91, -396, -202, 205, 211, -247, -175, 501, 374, -428, 86, 496, -83, -158, -333, 317, 516, -150, -525, 244, 415, 86, -317, 380, 688, -138, -599, 223, 586, 336, -471, -150, 534, -44, -437, -235, 538, 498, -314, -189, 95, 272, -292, -438, 418, 490, 101, -447, 74, 485, -66, -797, 131, 259, -31, -539, -24, 491, -21, -545, -399, 531, 94, -467, -105, 651, 305, -508, -498, 310, 48, -351, -332, 204, 340, -266, -624, -99, 230, -4, -414, 119, 682, -72]
6340g2k46N26J96o4p48K10M28J05q87N91M56k57m67k37Q63o0p06q8N28P68r75
6361a36o53N53O52m89n36L99N85j61l48L5J13K43p07L83L11O3p80K45N33k47j72
6382a14j48M17K97p86j24Q72J85p46j56N10K90m19o77L60Q36k44j074O71M91j05
6402C36q22L07M54m2l49j54N75J51o73P7M61J77q83N2O61m4o54nO86K78o45k90
6424c46K94N41k86n59L79O32p54k51J6O81k3p40L25J60J12l57nK49M06o21k80
6445d27O44O3l27k25K18K73k78n72N93O59q43l19M70K97j37n59N5Q15o4n96j28
6466c88P28J09p37r5N55L61p14j33M51K25l88j57J35L49j49m48K45M99o99k7L00
6487B2K70k36l66JP52k66k21m26R23J38q24K64KL43m65k25M33K68l58n20M9J184
$$ y = [-72, -318, 208, 404, 340, -408, -198, 230, 335, -552, 39, 495, 238, -229, -466, 397, 337, -369, -457, 71, 839, -136, -789, -236, 416, -73, -609, -210, 375, 214, -134, -99, 14, 257, -450, -67, 244, 307, -473, -228, 305, 58, -114, -262, 155, 452, -334, -458, 414, 599, -147, -303, 207, 497, 78, -599, -239, 597, 353, -721, -50, 441, 336, -486, -179, 275, 233, -116, -270, 305, 456, -217, -140, 321, 498, -385, -333, 328, 284, -370, -375, 311, 589, -56, -346, -52, 489, 203, -356, 23, 655, -99, -350, -334, 347, 324, -416, -91, 69, 181, -176, -181, 68, 474, -147, -427, 217, 280, -47, -272, -54, 219, -59, -631, -38, 621, -222, -541, -71, 226, 89, -470, -415, 400, 336, -260, -388, 340, 449, -288, -383, 172, 533, -181, -314, 137, 362, -26, -183, -48, 301, 152, -296, -51, 448, -251, -278, 22, 292, 56, -310, -309, 443, 177, -44, -470, 453, 591, -233, 31, 33, 376, -89, -314, 119, 387, 29, -491, -442, 742]
6509G42n19n83M99P6j53l49o3O80j42m16K89L32l14j28k42O47J5l89k49N10J18
6530C61n31j84P45J36o12J46o0N63l37n34L10R4J71o50J23K38N62n73J42M50m46
6551A14m84J99M94k62k49o1O51j28l56j33O58k61k29n53P43j75Q5l65oQ25k99
6572B08n39K68L11m4o21K75J19K83j99l78O42k3m89R5L9L42l22l9J03k0j06j78
6594b73L43L68m65j08J73M50l58n42K23Q35n99m57K16P20j40o13j35M00J00j41
6614ck72O31N7n33l98M22O13o13l66K80O03j81j86j85K45j74j86L84j1j9n25K28
6636a89M44J77o22L24O5M72j081J91L72J87o78j31L68M54K1p44M55M90m78m20
6656c23J38L33j24m13M11Q6L22o46M6L20j65j75K81K37q7m25N6K93M1m59k69P04
$$ y = [742, 223, -360, 139, 215, 62, -287, -350, 330, 188, -228, 61, 393, 79, -49, -291, 356, 371, -18, -267, 243, 361, -170, -354, 391, 527, -85, 61, 1, 564, 227, -307, 3, 97, 268, -382, -259, -21, 541, -32, 110, 560, 114, -370, -171, 323, 61, -188, -249, 402, 274, -82, -215, 443, 182, -47, -600, 143, -32, 53, -312, -318, 507, 208, -331, -63, 248, 204, -417, -142, -23, 260, 61, -317, 325, 302, -187, -92, -53, 289, -33, -72, 31, 11, -95, -273, 70, 438, -27, -135, 38, 488, 130, -412, -189, 646, 47, -410, -194, 526, 386, -227, -362, 38, 138, -3, -275, 356, 413, -120, -518, -96, 517, -96, -462, -182, 421, 240, 54, -131, 114, -60, -246, 138, 127, 108, -417, -189, 255, 432, -190, 134, 199, 671, -410, -219, 153, 340, -338, -469, -101, 353, 374, -370, 85, 575, 97, -323, -185, 148, 24, -389, 22, 108, 430, -216, -170, 150, -15, -190, 91, 328, 241, -184, -128, 165, 206, -253, -522, 182]
6678A82L88r31j61P06J66l81l09K70L17k8j89k67M76R8q07M10K85J00l33m94O94
6699A92k6l50q9L99J00j48n3K14M34r13K36j80L62j14l68L57O9Np39O71K52m1
6721B70n27j50P96k70k33n0J68J01j45l80M59M17n33k11L30K38k44k82J78N32
6741D64m37m63N05n3j22l04J16N38r5k64j11P39r6o13P4L80O1m06m28O68N39o67
6763B5q7K39K39o05j87M33L42L4n43o1L67K03n39O2N89k51n76K64N10j73k02j25
6785d2N78l81l40p6M08L03o28k23M39J96m97PJ03P23k87l59l7M66k16n08L22L89
6807C40l29J33m9m4J14m02J49J50J87m93J74L27m0j89k77J65p2J43L6j94N40k95
6829G4m93K19N99k41m51p5N25K30p21K00K35Q9m07j50N23L62n43n0K87k03o8l14
$$ y = [182, 570, -361, -522, 184, 350, -31, -340, -70, 247, 219, 30, -237, 239, 337, -470, -60, 225, 325, -8, -502, 192, 166, -184, -273, 126, 226, 78, 25, 239, 673, -240, -4, -184, 178, 64, -304, 53, 122, 127, -612, 59, 311, 270, -257, -407, 389, 119, -114, -164, 4, 105, -40, -420, 39, 456, -77, -288, 42, 280, 36, -246, -68, 464, 27, -436, 69, 16, -106, -410, -294, 244, 149, -115, -226, 513, 417, -196, -122, 258, 319, -87, -515, 153, 692, 25, -62, 177, 416, -189, -376, 57, 399, 433, -110, -171, 196, 399, -140, -78, 511, 260, -316, -52, 458, 285, 83, -42, 536, 155, -185, -261, 147, 450, -178, -401, 38, 234, -263, -256, -153, 570, 283, -76, -113, 353, 137, -371, -49, 340, 11, 144, 95, 51, 165, -237, -88, 62, 249, -244, -70, 257, 217, 28, -249, -84, -156, -13, 23, -171, 369, 74, -419, -200, 399, 158, -293, -368, 157, 387, -334, -134, 101, 190, -217, -367, 156, 518, -25, -75, 212, 9, -59, -373]
6851c73K45O4O8k02L20O7Mn99J85L02j88k37J72N41k98k96k6O19k4p10K90M13
6873C37k03j94k42K43M35m96j35K27J56q1k29M34P3k10m44lL95o3l31L57L01R
6895C36l37m20Q88l16k01k53O25M6m88k21O84k73j96j69L49r8K42k43o3M29l82
6916f1l71J65M07J80m38k12N58Rk39j63J48K07n89J33M20J06l84l08N80M0q9m25
6938c26N67J32k45k91N2M13j68o60J30O62m5n56l4N86l74j42J52N7J91k67j74
6959c40L23L5O1j50L03K91o83J1R7K71p1l09L28K43r5o66K16N5N04q43Q5L95P8
6982A39k50J30J64N7n71J32K91K02n46R4K31R5k20l9kN7R9l16K32L06l76k87K61
7005a17P49m69l40O3J72R0j41l77M40J50j96k47L83K20n92r1L58K73m44LK47M05
$$ y = [-373, -128, -64, 4, -198, 122, 189, 193, -406, -221, 81, -107, -344, -172, 369, 71, -225, -251, 368, 344, -366, -76, 337, 134, -60, -302, -59, 376, -120, -255, -28, 128, 47, -182, 252, 325, 115, -329, -332, 63, 0, -331, 26, 327, 336, -1, -421, 467, 151, -50, -303, 322, 368, -120, -341, 343, 70, -126, -295, 54, -44, 198, -45, -108, 321, -61, -432, -267, 140, 320, -118, -330, 228, 237, -2, -165, -17, 190, -399, -266, 154, 260, -124, -432, 148, 188, 99, -326, 241, 373, 128, -163, -111, 302, 134, -526, -396, 266, 221, -335, -369, 217, -157, -299, -147, -90, 101, -166, -340, -17, 18, 79, -71, 232, 523, -160, -149, -52, 219, 148, -161, 167, 410, 315, -351, -135, -80, 424, -419, -334, 61, 139, -111, 19, 183, 240, -331, -199, 92, 294, -252, -158, 73, 168, -52, -91, -93, -36, 63, -253, -21, 285, -91, -378, -117, 632, 163, -177, -114, 58, 148, 7, -370, 70, 220, 24, -223, 160, 380, -212, -303, 55, 328, -116, -113, 134, 539]
7027E39n85l01Q4N59n23k2M59J38p1l99m3L26j64j70J13L85q2l88J62L30J42p11
7049b22L05O8K61m12l17K40L83k42k27K1N55j97j34j73J76J30l42J00OL4j48j05
7071b40L20J8j68p1J72M9k59o2J39N86q82R4L76N15o68k07J16N26n20k40L7N59
7093A90O3l71m27Q05j33l16%J80J81k96N0K14O9m18L9O8L69j32J06k96L17km68
7116b08j9J6M06n71M70J07l32j77O3L71J1l69K0K64J41k01k69L95j12p1O4r2N06
7139D13l81n33L64J12o0j48j3O61o45l9N07J33k30m75L47L29k92l74N0N10K33
7160D69r87N16L02ll90l51N26J07j77l72O12Q4j69k32K19J79n85K26j70K04J94
7181B02l94K41r5K21k97M26Jl31j87K34k23M60q2l06M03j43k26k02M52N90m55
$$ y = [539, -46, -347, -263, 296, -227, -249, 210, 348, 277, -122, -165, 161, -3, -173, -60, 325, 243, -145, 17, 347, 489, -222, 83, 151, 412, 0, -317, -77, 306, 64, -163, -142, 413, 216, 82, -91, 85, 215, -127, -27, -21, 13, -135, -240, 80, 98, -70, -141, 31, 80, -179, -241, -102, 484, -398, -304, 72, 587, -81, -288, -172, 354, -166, -406, -369, 190, 253, -118, -545, 260, 127, -189, -189, -9, 172, -124, -74, 140, 209, -209, -170, -102, 267, 135, 241, -55, 262, 260, -208, -227, -211, 195, -376, 94, 201, -131, -308, -245, 126, 137, -232, -212, 52, 193, -8, -277, 118, 6, -65, -1, -93, 413, 32, -501, -137, -25, -85, -233, -246, 415, -230, -269, 238, 371, 141, -334, 13, 342, 50, -324, -274, 236, 469, -518, -2, 300, 297, -93, -444, 82, 189, 12, -360, 252, 336, 167, -65, 154, 333, -252, -26, -196, 8, 202, -192, 49, -46, 175, -122, 304, 305, -26, -213, 21, -202, 258, 176, -130, 273, 130, -96, -298, 154, 744, 289]
7202B89l90j0J11J38l97J32M30l13n2K31j17k44K9l4K20lr4Q4J43J64n04j48O36
7225C01l02J40j80J23k8M0l99Q0M39K6j57j28L85k62j95l50Q61m55k08J31M2J79
7247H3k65j31L21OO3k83M21L67o94q4N45k20k31n2L7M10n17lK87K29k06l03J60
7270f0P4L74o63l1O09ll98n8k2K37o9j27K48O1k76L69k9Q7k00k96K15M06m94j58
7294b04o2M03j09j59j3M3M28n81J27M4L75m50P8K43M3k55p4J04L61n53k23N07
7316G3J92j22j59lN8o9l03Q4K89M5l40M3K16M9k75K40K87j40n15j6N06J98m38
7339a00k77M15J17k38J6oM64l98k72L30L95n96j58L30J34N1o98O37l6Q5l83j34
7361c22K31J26j41J22j10L63j18m84P54k26k03l25L68K25m0n92L48K22j78m89
$$ y = [289, -101, -111, 0, 138, -259, -127, 303, -10, -62, 169, 52, -192, -163, -197, 23, 20, -74, 10, 153, 317, -187, -335, 301, -1, 139, -41, 82, 54, 94, -305, -225, 214, 240, 83, -45, 340, 78, -117, -467, 394, -61, -269, -138, -96, 83, -182, -313, 8, 14, 77, -206, 215, 582, -112, -196, 349, 129, -102, -154, -117, 293, -224, -227, 60, 289, 83, -220, -60, 14, 388, -275, -306, 303, 300, -98, -156, -178, 59, -10, -137, 111, 172, -104, 265, 236, 323, 123, -173, 42, 448, -46, -204, -266, 137, 28, -131, -144, -101, 327, -254, -127, -83, 292, -158, -80, 163, 206, -49, -123, -19, 342, -211, -434, 73, 265, 143, -16, -19, 39, -30, -333, -249, 40, 85, -255, -212, 4, 53, -222, 18, 305, 165, -350, -366, 140, 338, -100, -377, 38, 155, -83, -67, -73, 391, -7, -279, 51, 446, -150, -308, 22, 156, 207, -491, 146, 110, 195, -188, -322, -91, 35, -106, 16, -94, 269, 151, -333, 421, 195, -8, -333, 35, 260, 220, -372, -24, 198, 20, -469]
7381d69L07K32M2k25m6K09K50m42o2L51Q5j75j52L12j94j56O7J08J48j25m70K4
7403c81O24l28m37M46J67r7j52L7J95M6n30L49M31k62j81J7M77j69o19P8O05k59
7425E7j84n9N37J86n98n7L59J17r3p23M50M36o66k28K74M33k50k08J77L73j24
7446B09m45J18L73j08m43lN16m1k97l1K76K57k43k63L53K23l21l52J20K51P8m85
7468b58L78r4P9m07J36L81q3j53L9M25m6n07P2j7N5M7j13j3O40m87m34L96L13
7491C49n89k08N56K3O6p61M81n3J23j71J56J90m0l39J56J21K66n87Q9J19M70l65
7513E2j46J38j97k0j10O22K69o07p2J87J66j41k71K16K11j81k94K08K74j60m29
7534b85L82J28k5k94j70K75J72l07k6L02nj18k9%L35l86m4M8K40o1j39k18M47
$$ y = [-469, -162, 70, 112, -113, -159, 50, 300, -142, -204, 147, 232, 57, -95, 217, 23, -133, -66, 42, 190, 65, -405, -381, 243, -85, -522, -76, 91, -6, -158, -121, 74, 120, -410, -61, 370, 108, -73, -56, 421, 252, -367, -289, 316, 57, -127, -186, 351, 537, -61, -118, 241, 358, 265, -458, -8, 428, -238, -466, -192, 241, -9, -217, -40, 333, 209, -236, -118, 255, 147, -296, -299, 217, 176, -121, -152, 124, 381, 138, -125, 228, 451, 130, -222, -102, 149, 227, -258, 120, 26, 105, -302, -166, 215, 132, -21, 18, 443, 397, -110, -38, -55, 0, 47, -66, -79, 561, 74, -360, 36, 349, -240, -448, 108, 131, 197, -564, -83, -136, -13, -184, -28, 162, 122, -217, -61, 60, 326, -261, -172, -53, 417, 52, -94, 44, -153, -173, -283, 339, 608, 1, -71, 116, 282, 141, -130, 86, 297, 116, -178, 30, 304, 144, -285, 97, 225, 200, -94, -264, 11, 183, -124, -150, 152, 147, 29, 0, 0, 335, -51, -95, -47, 193, 132, -7, -225, 222]
7557B22O5n62N2L03K2k52k43M02J58k10nK50p7J8m06J98M73k30m14k5O28l70j78
7580a81K76K6J28m76K60m9R2j76l07P14m4m25K01J91j33m1l08L29J23l50n3K61
7602E8J00k97k9J52K71o7n26K93K26j01m61M18J29n6j52m7RL09k32k13N26l02
7624Hk29K85j3%k3l19M99O9k27m15O48nl1j76j36K36O3p67L35L37p5k83K91J37
7648B09J67l87k92M37J56k98j38K16j9k76Q6K85l19m3r9L81K96l41m21L85J69
7669A54j82k73L16N2j00j27M5M60n2k50O0j7nj04M4O6L71o37o9J74K35k35k75
7692c49K00L25L74o71LL98k14k63K58N9k62N1K47J40k44l48l6K54J92k49J66L10
7714C41k52l10L5J23K32l06O5J50K86l41k73r1R8L97l88J50J38j19q9L87M4l52
$$ y = [222, 287, -275, -223, 80, 102, -150, -393, 9, 167, -43, -48, 202, 125, 143, -263, -65, 408, 178, -236, -261, 367, -3, -181, 95, 121, 249, -227, 33, -16, 76, -100, -407, 307, 263, -162, 39, 230, 97, 56, -252, 77, 200, -150, -203, 58, 158, -139, -168, -16, 255, 188, -338, -45, 181, 80, -381, 37, 166, 110, -42, -89, -80, 229, -3, -216, 310, 8, -221, 64, 51, 51, 28, -291, 208, 277, 50, -365, 283, 278, 247, 71, -65, 171, 234, -533, -198, 139, 64, -219, 72, 209, 376, -11, -303, 134, 290, -8, -146, 70, 51, -225, -139, 146, -173, -216, -315, 66, 362, 21, -400, -15, 154, -28, -301, 15, 67, -33, -160, -115, 345, 293, 43, 103, 86, 81, -23, 21, 87, 458, -179, -248, -74, 161, -74, -349, -149, 176, 550, -121, -118, 280, 66, -197, 61, 120, -142, -91, 156, 296, 52, -296, -332, -78, 114, -135, 31, 341, 89, -221, -186, -63, 169, -137, -72, 78, 364, 23, -250, -341, -243, 154, -234, -84, 54, -65, -154, 233, 277, -75]
7736g5r1J19L38l61q9Q6J82R7o50K81L99P7l90j12L21K86o47O3K74K9k32l0L13
7759A88M4k20k70K80k41N61o75j90N39J69M5j98P2O3k94j39N50j65k18OK21j11
7781A7j98k56M63J49M9m00j26K55L38n23Q4O75j4q46kL31J62l54k22M00K81k70
7803gn8K45k00Q2l36K49M17n37J22Q5J50k20m1q0L21L9o45K36N32k03k59mL57
7826B45P8m28m5M11J11k86j89J63J78k63l66O41n7j17l32J99N75o52M3J44R8j52
7848ak40K90J54j54m2j7n1J89j82n5J60K13p56L88P1K09n89L56J31K10l28m12
7870d56M41J76j22l34J98J55k32j18J10L59L9l07j41M66k84k53L33J58J41r53
7890f24M96L82N1l29l56N08K8q6l39O9K56l60J24J22K12J84n16k9L36j68k2P7
$$ y = [-75, -166, -47, 291, -70, -159, -73, 109, 206, -444, -163, 236, 313, -77, -189, 132, 418, -229, -166, 108, 137, -95, -125, 188, 232, 12, -258, 22, -219, 342, -333, -523, 16, 185, 230, 32, 104, 167, -127, -266, 284, 119, -99, -93, 128, 17, -181, -437, 26, 175, 224, -176, -302, -47, 291, -232, -148, 527, 513, -333, -335, -4, 158, -196, -418, -18, 263, -7, -65, 180, -20, 62, -274, -25, 392, -145, -23, 62, 212, -8, -49, -129, 192, 231, -414, -178, 354, 151, -108, -112, 245, 323, -105, -150, 261, 372, 86, -103, 60, 238, -25, -391, 250, 193, 76, -256, -57, 518, -134, -91, 53, 151, -1, -241, 49, 203, 49, 7, -10, -61, 128, -54, -109, 51, 264, -492, -104, -33, 176, -413, -57, 74, 284, -44, -456, -15, 161, 39, -295, -97, 58, -174, -292, -182, 177, 216, -91, -232, 234, -50, -303, 30, 188, 329, -624, -128, 254, 305, -24, -380, 128, 156, 70, -269, -200, 56, -304, -180, -58, 154, 338, -178, -207, 129, -39, -61, 16]
7912A6J29K12n76P7L06P9n64L70J25K18n89j35M74j1n78P0L88L10j69m02J93R9
7934D2J90n03K28K98J9l92j47L47J46k34l28O04J11k68j91KJ90j23p6N8L27l07
7956gk07k4L66O9k66j46J49J38l97K62K85n1l96K11O8J94m02j85K52N31o81m4
7978b81K47M42n49j70L50J47k98j39M49J19n35o7L88K25k65l33O1M18k95l90L47
7999a29L10o5m47J04K73J42l83mK85J73m39M0J12K10k08l33K75L45l59N8L5K20
8021B15j67k60o8N02j69m20K44L18p6l37j36K81L01n66K62K21M4m37j01L83M00
8042D34m39k74K47L61m01j87M37j76j4m18J27M30N6l64J45L4J97n09K25M93k25
8063A79l11K1M06L1m26j24K1K21k13L5K28K03j89n04K60O85k45n44K55J25Q4m35
$$ y = [16, 145, 357, -219, -142, 164, 243, -321, 49, 174, 392, -197, -332, 142, 131, -447, -377, 11, 321, 152, -250, -57, 42, 232, -271, -43, 255, 274, -118, -265, 82, 228, -6, -334, 270, 381, 113, -78, -76, 114, -9, -85, -27, 300, -7, -214, -238, 128, 197, -69, -215, -66, 72, -325, -63, 222, 171, -225, -14, 54, 248, -154, -339, -87, 444, -237, -281, -34, 408, -141, -311, 39, 186, -112, -251, 198, 317, -218, -285, 103, 328, 63, -270, -209, 209, -86, -476, -129, 181, 116, -331, -227, 46, 188, -195, -199, 86, 259, -180, -140, -28, 182, -26, -359, -84, 261, -98, -40, -5, 215, 48, -212, -280, 222, 53, -367, -123, 195, 119, -218, -354, -73, 228, -338, -76, 145, 189, -248, -349, 34, 434, -5, -279, -32, 329, -72, -259, 178, 2, -12, -430, -303, 127, 183, -181, -36, -2, 195, -314, -89, 404, 179, -132, -111, 295, 326, -100, -224, -203, 18, -195, -160, 68, 271, 82, -422, -162, 523, 278, -266, -11, 114, 198, -237]
8085b37K12L64j2n12n7L79km36R4L59R4j56l30L18L93l74j59o1O47m56l40K05
8107f7K86k36r5j80P00l47k61j97N47O5l35k4M14k32Jk21J37K70l18k38K29J39
8129C7j75M8J60K72k26j73K53k79M6k53L66L66j62l16j85N29j65m86J33J02J95
8150H7j94J6J54K33l80k66M41j04J17m20L88L54k02l56K01K13k34m53L05O7K62
8171B29k87j5L60J78l79k47L68r9k43o0M87j13k77j91L14J45j07j80o0P52
$$ y = [-237, -25, 339, 327, -185, -242, 137, 135, -301, -207, 152, 246, 90, -240, 78, 471, 97, -62, -123, 524, 68, -272, -67, 219, -17, -112, -292, 408, 61, -200, -397, 150, 215, -120, -144, 270, 38, 39, -182, -45, 225, -93, -331, -102, 37, -138, -90, 70, 342, 116, -57, 196, -83, -37, -290, 76, 442, 280, -36, -221, 308, 143, -343, -210, -108, 87, -107, -91, 63, 296, -84, -350, 91, -13, 104, -316, 72, 426, 224, -132, 69, 282, 48, -405, -100, -33, 229, -58, -73, 287, 465, 86, -161, 207, 108, -135, -195, 292, 179, -98, -289, 25, 170, 63, -117, -177, 575]
8191E75
$$ Imaginary data points
##PAGE= N=2
##DATA TABLE= (X++(I..I)), XYDATA
0@%%%qJ6j6J6k4L2l2M0n6P2q8J12j43J68j93K32k80L27l75M33n05N83o62P57q68
28d62R81j102J244j403J572j755J961k191K437k707L008l335L690m085M528n015
44b634N552o156O840p615Q499r527J0739j2185J3946j6155J9022k2898K8463l7200
58b1309N2977r0224L29002K75200o94011k7847N32911J13653o06165j57296N31591
69B38482K46445n10970k61317M52164L17201m24019l26265L84409L81245l44190
79A53185l96955K82253M04845k75881m43224K20002M81745j55216m73455J12699
89i0002M87481q0730n22656p642N09483O3670m89163j06516M92927J74671m63066
100c1543k29890M25037K68392l94279l15134L44420L35121l18042l82280K56639
$$ y = [0, 0, 0, 0, -8, 8, -8, 8, -16, 16, -16, 24, -32, 40, -48, 64, -79, 89, -104, 128, -152, 175, -200, 233, -272, 311, -351, 406, -462, 519, -583, 661, -742, 830, -925, 1036, -1155, 1282, -1425, 1583, -1752, 1938, -2147, 2381, -2634, 2918, -3238, 3602, -4013, 4486, -5041, 5698, -6487, 7459, -8696, 10326, -12572, 15891, -21309, 31668, -58556, 270446, 545646, -148365, -176212, 356699, 470352, -135813, -293109, 238482, 484927, -26043, -287360, 164804, 482005, 57986, -268279, 116130, 497375, 153185, -243770, 38483, 443328, 167447, -275777, -55775, 425970, 270754, -202701, -90002, 397479, 316749, -205907, -213549, 295934, 359604, -129559, -236075, 256852, 431523, -31543, -261433, 163604, 431996, 37717, -277417, 67003, 402124, 84082, -298198, -41559]
110d1559L93100k05459l91094J82905M20083j29731m28004P4826M13317n0934
120B37450m29724j714M20617L7169m22859q7347M11453J30958m00015j75901L82627
131A02714K19650l62889k71741L23886L04628k89386l39384K50220L70909k01758
141A06849l93924J43740L92488j10392m07557N8047M05985j1272l93539k3332
151b32907L87270O1244l74079r1223L67424J30439l50770j66021L25390J85591
161B42358l21083k30450K93206K66317k55115k84246K32308L16905j94813l42527
171b77140J48898L54838j05671l61969O5218L65823k5358l69736k2347L55935
181A28491N6676l46003q9324L36363J24419l19652j56284K99712J82354k81204
$$ y = [-41559, 351541, 146082, -245012, -62107, 357976, 228245, -199759, -124933, 288384, 237450, -192274, -193988, 226629, 263798, -159061, -246408, 165045, 296003, -104012, -279913, 102714, 322364, -40525, -312266, 11620, 316248, 26862, -312522, -62302, 308607, 106849, -287075, -143335, 249153, 138761, -268796, -210749, 195236, 183964, -209575, -232907, 154363, 215607, -158472, -249695, 117729, 248168, -102602, -268623, 56767, 242358, -78725, -309175, -15969, 250348, -4767, -289013, -56705, 260200, 65387, -277140, -128242, 226596, 120925, -241044, -175826, 189997, 164639, -205097, -227444, 128491, 185167, -160836, -250160, 86203, 210622, -109030, -265314, 34398, 216752, -64452]
191f4452k08260K63697K37668k36637k61297K05527K75901j85820l01857J48864
201a26666L17414j11887l24047Q0651L36681l9429l35967M242L36098L4572l29708
212a58046p1209L16714J03762l03416j36997K83847J65480k62684j89647K41965
222a0231K14728k14212k30276J92436K50109j65324k64706J37067K75796j10572
232G4815k87187Q1642K96518m9584l02246J5142L00734J5990k99768n0000K93835
243H9891Q7332k77072j15268K61885J43101k43686j71474K16999J90061j92541
253a0772k05618J69624K19415j45324k33165J20237K41268r4764k46421P6147
263a09373K59286m8304k64454K0845K65933N036k70164l4591K70632O8943k61149
$$ y = [-64452, -272712, -9015, 228653, -7984, -269281, -63754, 212147, 26327, -275530, -126666, 190748, 78861, -245186, -164535, 172146, 132717, -203250, -199008, 137090, 171662, -158046, -229255, 87459, 191221, -112195, -249192, 34655, 200135, -62549, -252196, -10231, 204497, -9715, -239991, -47555, 202554, 37230, -227476, -90409, 185387, 74815, -212372, -130730, 165788, 116204, -186042, -170900, 129834, 145824, -153944, -203944, 89891, 177223, -99849, -215117, 46768, 189869, -53817, -225291, -8292, 181769, -10772, -216390, -46766, 172649, 27325, -205840, -85603, 155665, 60901, -185520, -109373, 149913, 101609, -162845, -142000, 123933, 128969, -141195, -175786, 94846, 163789, -97360]
274i7360r7040K50175J26239k35815j53780K17205J80469j90434j95873J68942
284b7272K12436j43464k26174J16192K32160r0948k37124O8939K43083m3785k45030
295a40987J9931K44903J894k44316k4572K45099N1187k39320p5836K33018R9631
306A70632k26109j27110K12097J52045j95347j72457J76647J95099j52853k12910
316a80266J25547K25353r8992k32527P2064K39042m2013k38289J5646K34184P138
327A26887k29318k9389K23063N1708k12835o7302K06042Q4861j99189j03920J89869
338D0477J21953j79006j38536J70252J60023j55411j80604J35838J97056j15075
348E6967k12700R1054K27092o0303k33381L1037K34213m523k32861k4313K25971
$$ y = [-97360, -194400, 55775, 182014, -53801, -207581, 9624, 190093, -341, -196214, -27272, 185164, 41700, -184474, -68282, 163878, 72930, -164194, -95255, 147828, 104043, -140987, -121056, 123847, 125741, -118575, -143147, 101952, 153139, -86181, -162017, 71001, 170632, -55477, -182587, 29510, 181555, -13792, -186249, -9602, 185497, 32644, -180266, -54719, 170634, 71642, -160885, -88821, 150221, 108208, -130081, -114435, 119749, 126887, -102431, -131820, 91243, 142951, -69884, -137186, 68856, 153717, -45472, -149392, 40477, 162430, -16576, -155112, 15140, 175163, 19752, -160852, -25014, 172042, 56967, -155733, -64679, 162413, 102110, -131271, -100234, 133979, 129456, -103405, -127718, 98253]
359I8253N0926k13493p0712K01994Q8102j90648j06296J76406J19372j63231j31077
370a40404J54069J45157j41788j59796J26338J71582j12716j85312R6087K00051
380A53268p3549k09822M9809K16174k6251k22255j663K22299K9966k15832n4961
391a32817K07799P8899j97005j02452J79583J20761j61804j34807J45347J48435
401A51939j26886j59198J07027J65016r1798j71546P4915J78778n7059j82940
411a11752M1060J86557k5539j92360N170J95459J5445j95348l5800J94701N8668
422A36261j91428q4720J81087J06160j68089j26652J53287J46915j33766j62033
432a42978J11216J70509r1024j79092O9715J83847m7699j84355K9520J82537j4156
$$ y = [98253, 149179, -64314, -135026, 66968, 155070, -35578, -141874, 34532, 153904, -9327, -140404, 13665, 158822, 17034, -142762, -16424, 155158, 42442, -142870, -46783, 153268, 79719, -130103, -80294, 135880, 109629, -112626, -114289, 108010, 137976, -77856, -132817, 74982, 153881, -43124, -145576, 34007, 154768, -7036, -141843, 3504, 151939, 25053, -134145, -27118, 137898, 46100, -125446, -50531, 128247, 71188, -111752, -70692, 115865, 90326, -102034, -96864, 98595, 114040, -81308, -117108, 77593, 136261, -55167, -139887, 41200, 147360, -20729, -147381, 5906, 152821, 19055, -142978, -31762, 138747, 47723, -131369, -61654, 122193, 74494, -109861, -80341, 102196, 88040]
443H8040j84230l667J82196K0650j79983l4991J79276N2619j77549p3270J70446
454C9537R0984j63395j10293J53506J30208j37938j48192J18940J60279j00771
464C2865j72218P9339J81630n5290j83219L4602J83627j5629j83541n968J79406
475G5604K3923j73372l9544J68381N5981j62606p2402J53178Q6445j44125r8907
486a27444J36163J15873j23686j29111J09371J39811r7189j52123P9099J61824
496A12588n9933j68565M1711J72177k2050j76072Q18J74980K0056j69619l6914
507a10823J64947N5954j58557p4043J45810Q5943j36260j00093J26283J11973
517A11134j12885j21792J00357J31272q8110j40569P5555J50185n8152j55635
$$ y = [88040, -96190, -99857, 82339, 102989, -76994, -111985, 67291, 119910, -57639, -130909, 39537, 130521, -32874, -143167, 10339, 140547, 2609, -145583, -26643, 133636, 32865, -139353, -60014, 121616, 66326, -116893, -82291, 101336, 85707, -97834, -103802, 75604, 99527, -73845, -113389, 54992, 110973, -51633, -124035, 29143, 115588, -28537, -127444, 8719, 124592, 906, -128205, -18834, 120977, 23788, -128335, -49236, 112588, 52655, -115910, -74199, 97978, 75928, -100144, -99326, 75654, 95710, -73909, -110823, 54124, 110078, -48479, -122522, 23288, 109231, -27029, -127122, -839, 111134, -1751, -123543, -23186, 108086, 19976, -120593, -45038, 105147, 46995, -108640]
527a08640M2942J61038k6630j67136M868J66894J4777j64623l2627J61964N3864
538A06691j52790p0878J42394Q6576j30106r7665J18601J10267j04156j19037
548a10103R0114J23912p9822j32381O5823J38627n0726j42235L9404J48387k3444
559F7556j52184O678J53418J1013j52749k8017J50118M6094j45627o5730J34127
570B4697P8959j25060r2532J13682J06761r7372j13775Q4254J20876p0690j27111
581i7311N6816J30856m2662j33179L0404J34434j8624j38118L531J37928R712
592G3787j36401k1133J38378L8780j33499n2928J28186O7461j22224q2762J13873
603A1518R5897j01632j08407Q7184J16898p4288j25936N7547J31596l9337j31657
$$ y = [-108640, -65698, 95340, 68710, -98426, -93558, 73336, 88113, -76510, -109137, 52827, 106691, -46099, -116977, 25417, 111993, -18113, -115778, 2823, 113090, 8934, -110103, -19989, 103923, 24101, -108280, -42457, 96170, 45444, -96791, -57387, 91000, 67556, -84628, -77950, 75468, 86481, -66268, -94285, 55833, 101927, -43700, -109430, 24697, 103656, -21404, -113936, -254, 106507, 9135, -104640, -20386, 100490, 29800, -97311, -40495, 90361, 47699, -85480, -55076, 79358, 60734, -77384, -73853, 64075, 73787, -62614, -83747, 54631, 93411, -40088, -93016, 35170, 102631, -19593, -102355, 11518, 107415, 5783, -102624, -15440, 101458, 27170, -98766, -41219, 90377, 51040, -80617]
614h0617K6260J33231j1240j32063m764J27036J5275j23688k7302J18446L6384
625G6958j15679m7643J09858N5675j05658o6456J01868P9542r2484q9161Q5332
636g848R9435p6270j12223O0735J19221m5505j25254K9052J28370j2698j28024
647g1009m461J24771K0369j17310l0386J12730M4639j03468n2794R4977N7841
658G5899q9802o5852Q2869P1784p5465p7974P0697Q5134o3769r2454N7104J01514
670G9685m5263j05916L5883J13631k2113j19050N216J17370P628j17440k2305
681g2674J14469L7944j07540m9853R9154O1675q9735o9008Q0797P7447o8654q0938
693f6916N9252Q4554n1917q9545M1063R0134l2625r1354K7530R5166j6868r6428
$$ y = [-80617, -54357, 78874, 67634, -64429, -69193, 57843, 73118, -50570, -77872, 40574, 76958, -38721, -86364, 23494, 79169, -26489, -92945, 8923, 88465, -4019, -93180, -7848, 91587, 15317, -96906, -36171, 83050, 37545, -87709, -58657, 69713, 57015, -71009, -75470, 49301, 69670, -47640, -78026, 34704, 79343, -24125, -76919, 18058, 75899, -13903, -79755, 3114, 74898, -567, -78541, -7844, 77290, 13521, -78933, -21829, 79685, 34422, -71494, -35611, 78020, 55907, -63143, -57927, 59443, 67071, -50369, -72674, 41795, 79739, -27801, -77654, 21500, 83175, -6560, -75568, 5229, 82676, 14022, -66916, -7664, 76890, 24973, -64572, -23509, 66625, 34000, -57354, -29824, 65342, 48474, -47954]
705d7954Q729R9164J853r9005j0803J01810K3826r9760l6511R5063M7528r1369
717g429o0416Q2745P2193p1087p7903O1341Q5605m8851q8624L6179R0262k4798
729D9217q9340J6329Q7560q498q7583q56Q2978M805q3581j1293Q3948J9805q2254
742a8763k6859Q1396L4559q1196m5495P7144N5669p1636o6085O2525P2958n4829
754A9388q2585M2388Q5415l1220q7835K1272Q9554q532q7444j681Q3884P845q1558
767c1109j6082P9045K2787p5884k9866P1086L3468o9755m0477O6116M7353o0585
779c903n2620N7463N9443n1973o6886M3349P0736l6477p6022K7096P9009j7949
791C1266q1525O242P9880K359p9338j1683P6745K2522p1710k8820O6075L3910
$$ y = [-47954, -39225, 59939, 61792, -37213, -48016, 53794, 77620, -22140, -58651, 36412, 83940, -7429, -67845, 14900, 87093, 16006, -61897, -556, 85049, 36198, -52426, -16247, 74015, 49217, -40123, -23794, 63766, 55268, -32315, -33171, 49807, 54612, -28969, -40262, 43686, 63491, -18763, -45622, 35774, 70333, -10863, -56358, 20786, 76455, 4819, -61266, 1259, 74217, 19388, -63197, -20809, 64606, 33386, -54449, -33177, 56377, 47845, -39599, -41280, 42604, 50449, -31109, -47191, 31854, 54641, -21243, -51109, 19977, 53445, -16310, -56787, 9329, 56682, -3903, -56523, 940, 60383, 8410, -58476, -15127, 55609, 19132, -56890, -29794, 49215, 31266, -50259, -44017, 35863, 38222, -41116, -52799, 23946, 46468, -25242, -54062, 12013, 45923]
803D5923o2422m1582N5460M5090m9873m8218M5232N0950m1883n5488L6722N8712
815C8623l1240o1403K7088O6868j9249o9580J1677P1715n241p3572n099P3708
827B4295J5665p0119k3226O5942L1373o1823l8119N5908M4509m7842m6200M2599
839g038N0141l7415n2476L1087N2784k6696n4880K2646N8339j7152o0264J1442
851b9482O2122n881o4039j403O5608R978o3791j7230O1622K5193o0529l3663N4233
864B738L9000m7786m3025M2996M7637l6581n0886K9309N2266k4049n2532J9579
876b1334N4632j3824n4495Q820N3981m994n5446m23N5896O568n4245j0875N5119
889A9380J6408n4011k3790N1408L0105m7733l4950M4522M1400l9258m6943L2557
$$ y = [45923, -16499, -58081, -2621, 42469, -7404, -55622, -10390, 40560, -1323, -56811, -20089, 38623, 7383, -54020, -26932, 39936, 20687, -48893, -37216, 34499, 29258, -44314, -49413, 24295, 39960, -30159, -53385, 12557, 43930, -17893, -56012, -104, 44405, -3437, -49637, -7038, 43103, 5688, -46788, -15701, 37083, 10387, -44493, -21847, 36492, 19340, -40924, -29482, 32640, 26759, -37280, -38683, 26925, 36903, -26888, -44118, 17504, 42697, -17832, -51495, 2738, 41738, -6048, -49073, -6077, 41560, 4979, -45907, -16598, 35668, 11619, -40913, -21334, 33298, 19474, -35021, -26201, 27780, 22786, -32660, -33083, 22813, 29381, -24864, -35739, 19380, 35788, -18223, -42013, 9395, 39500, -8233, -43183, 1339, 42739, 3481, -43462, -10905]
901a0905M9400k6882n0993K0155N3543j2094n3027O019N1511j980n0790k647M9202
914B0512P175m6857r660M6340J2766m6500j7671M5409K1034m3922k5387M3627
926F866L2265m0711l7893L5591M2726l1124m6956K5138N1464j6571n1931Q906
938b2230N1474k238n0604l851M7933R706m3330j2292M1280J5523l9244j8495L6854
951A0486J9727l4480k1388L5134K5286l3006k9284L0775L2609k9371l6806K6005
963d313M1943k0157m4809J4404M7011q686m8902P93M8965N978m5931j1467M3888
976A8717J6542m0811k2203L6207K4134l2235k5950K9264K8181k5336k9566K2085
988i71K9223k0997l1238J9374L3263j6183l5022J4563L6635j2447m0270P664M2182
$$ y = [-10905, 38495, 11613, -39380, -19225, 34318, 22224, -30803, -24784, 26727, 24747, -26043, -28690, 20512, 27687, -19170, -28830, 17510, 30276, -16224, -33895, 11514, 32548, -11374, -36761, 6866, 39131, -1580, -39473, -3882, 38844, 7720, -39236, -14098, 37366, 20795, -31136, -22230, 29244, 27006, -23598, -27449, 20484, 30190, -13140, -25432, 15848, 31371, -7873, -26368, 10486, 30213, -4267, -25655, 9479, 34765, 1759, -27525, 3250, 35859, 6488, -30318, -4313, 37630, 17473, -27336, -12932, 34079, 25393, -23509, -22716, 26249, 32227, -13704, -25171, 18717, 35259, -5552, -27755, 8452, 32586, 351, -25599, 3665, 31846, 6510, -23056, -971, 28252, 7255, -23983, -4609, 28654, 12471, -22551, -7988, 28647, 16200, -24070, -16406, 25776]
1001B5776k444m3449k832M5230Q652m4645j5895M1037K1276l7698k6318L3339
1013B029L0848k7058l3596K1120L3432j7326l3646J2268L3431q625l1457O748
1025a1832L0106n930l1485L870L1586k287l2285Q29L4522K965l6983p948L6010
1038A1138J2698l5979j7790L4449K4477l0563k8856K5435L1339k1499l4059J5484
1050a3726L5353r242l3881M997L2486j697l1910j697K9674L613k7118m464K7192
1063I580O077k6812q509K6156R210k5975j2286K6969J6356k5866j9154K3983K2342
1076B2071k2319k6740J9300K9793j4139l1168R829L3263n744l3838l44L2332M346
1089A6642k9788p361K8493J0788k5315j3627K2321J3755j9981j4263J9009J5385
$$ y = [25776, 23332, -20117, -22949, 22281, 30933, -13712, -29607, 11430, 32706, -4992, -31310, 2029, 32877, 5819, -27777, -6657, 26775, 9449, -24197, -11929, 21502, 12877, -18580, -11832, 18274, 12344, -19141, -15271, 16315, 14028, -18257, -17428, 17094, 20059, -16924, -24872, 11138, 23836, -12143, -29933, 4516, 28993, -1570, -30426, -4991, 26348, 4849, -29210, -13726, 21627, 12385, -21496, -16499, 15987, 14290, -17620, -19317, 10357, 13970, -13148, -17612, 9580, 15657, -11155, -19664, 6492, 15702, -10273, -22559, 4410, 20766, -5100, -24254, -271, 22071, -248, -26988, -7688, 22105, 7966, -23202, -13373, 19890, 14146, -19692, -20036, 12296, 16642, -13146, -20507, 7986, 18774, -6541, -20168, 2153, 15908, -4073, -18336, 673, 16058]
1101A6058j6705j5966J5756J6346j6142j8340J4921K0732j3085k2424J1345K5671
1113A8167q767k7847M017K8611j47k8287l995K8439Q859k6308j3022K2199J4717
1126A6636j9530j6583J6809J8062j3241j6800J1282J6453j0731j6817R072J6882
1138A1494p661j7099P868J8495p504k0370M930K0974k579k1996M15K3708M072
1151A4747k3188p048K1199R620j9848j2624J7238J5763j4087j6161J1321J5990
1163A2922r295j7073P245J6619m558j5037L779J5861l043j5883J200J5018n80
1176G175j5386J71J6009J908j6395l617J5731M717j5956p198J5919J0268j3477
1189a31j1505J1862J3018j0405j4999P065J5891m665j5228K840J4703m85j3742
$$ y = [16058, -647, -16613, -857, 15489, -653, -18993, -4072, 16660, 3575, -18849, -7504, 18167, 9400, -18447, -14430, 14181, 14034, -14253, -18248, 10191, 19050, -7258, -20280, 1919, 16636, -2894, -19477, -2668, 15394, 2153, -14647, -3365, 13088, 2357, -14460, -5388, 11494, 3833, -13266, -5398, 13097, 5593, -14777, -9847, 11127, 8548, -13448, -13033, 10675, 14747, -8441, -15489, 5710, 15330, -4518, -17142, 96, 15859, 1772, -14389, -3068, 12922, 3627, -13446, -6201, 10418, 5860, -9177, -5398, 10463, 7420, -8463, -7263, 7755, 7175, -8211, -8040, 7969, 9877, -6518, -10135, 5596, 10313, -5643, -12841, 3078, 13346, -131, -11636, 226, 13244, 2839, -12160, -5095, 10796, 6131, -9097, -6257, 8446, 7961, -5781]
1202e781j485J2010K015j0545j666J0943K838j0138k752R638J589j0440l186J1331
1216D371M718j1240n803J1512Q343j1409j0838R127J2694o393j3295N198J3557
1229A0542j921j3916r59J1116K024j0064k963R076L383p122k962O255J922o648
1243b237j559O959J741o775j647P734K553r498n100Q411O198p995p613P809R658
1258H639n850j0603L757J0477j948j0141K25J0380J900q481k956O129K905o449
1272b016k968M544L188l243j338L178J209l935p92M121K07n014K1O038J524o961
1288b237l266O302L867o814o232O285Q120l557p951J633Q016R2q391k270O912
1303E09L850m875l875L093L600k490l019M86J115j04Q60J870j550k211K330L581
$$ y = [-5781, -7266, 4744, 6759, -3786, -5452, 5491, 8329, -1809, -4561, 5077, 6666, -3774, -6960, 4371, 9089, -2151, -7954, 3558, 11901, 492, -10346, -1219, 11475, 5082, -8213, -3015, 10542, 8621, -5295, -6254, 4862, 6886, -3178, -6141, 2935, 6318, -804, -3766, 2489, 4411, -2237, -3796, 3163, 4904, -1871, -3518, 4216, 6769, -2729, -7829, 582, 6780, -1215, -8828, -1019, 8639, 2789, -7814, -4057, 6420, 4472, -5669, -5444, 4936, 6836, -1645, -4601, 1528, 4433, -2016, -4984, -440, 2748, -495, -1833, 1345, 2554, -1381, -2173, 1948, 2155, -2859, -2838, 3200, 4724, -2237, -5503, 799, 4666, -2148, -8380, -2095, 6025, 2468, -5483, -3850, 4166, 4258, -4133, -6403, 509, 4359, -516, -4391, -1298, 2302, -188, -3207, -2721, -1606, -1710, -850, 1020, -530, -2741, -411, 3170]
1319C170k110n986N52P336J968p800l441P199N323o194p916M346P780j098p219
1334d090J04P547J916o071l301L291K989j691k640J603J467m49m05M40j453k241
1350b984K292L346j425m129J656O055o11p380j958P190L574o786n102N958P496
1365G192m754q275K695P997j348p729j44P798K284n617k827M392J908l752k345
1380b525K816J454k097M73K420n13l975Q16M548p44o011M26P891K138q378m121
1396e382P552N822q005p792O032R612l176j0443J415J0081N85r912k243P962L996
1411F104o583l014M962K575m653k363L460J006m427K66N621j4o021j074P292J564
1427D701q343l868Q738N981p591p508P211Q477n514j0572K404J0616n34r738l86
$$ y = [3170, 1060, -4926, -4374, 2962, 4930, -2870, -6311, 888, 6211, 17, -7899, -3553, 4227, 3129, -4090, -3986, 3561, 5477, -594, -3895, -604, 2385, 694, -1946, -343, 1124, 675, 270, 710, -743, -2984, -692, 2654, 1229, -2900, -1244, 4811, 4200, -3180, -5138, 2052, 5626, -1160, -6262, -304, 7192, 2438, -5837, -3142, 4855, 3507, -4222, -4366, 3432, 5716, 99, -2728, 1664, 3572, -180, -2525, 291, 1745, -352, 121, 2541, 2028, -1947, -1131, 3417, 2673, -3338, -2912, 4979, 7117, -1261, -5382, 2170, 7992, -13, -7805, -1773, 7839, 4663, -5780, -4365, 5716, 6301, -3611, -5854, 2108, 6104, -479, -3493, 1469, 4044, -609, -2972, 488, 1494, -2933, -2667, 2954, 2940, -3081, -4155, 3137, 4701, -3642, -7510, 1228, 7209, -382, -7890, -679, 7798, 2284, -8288, -5884, 4732, 4198, -5540, -5926]
1442e926R211K202q484l436P345K898o024k876N833L312n333k713N209K074o686
1457c394k758O684L421n853m056O789N218o582p213N790P724m367q911L672J0161
1472F325k181j0206m26J0074J026r432k557R400M024p013m879O077M555n197n004
1487e414M663N132m194m458M439M770m680n658M262O303m817o573N110Q720l551
1502D054j0140K346R903o10j0548j035J0943L239r749m768Q625N599p660o547
1516f348N777O929m236n904L907N767l530o221L239N717l845o022M290P448l459
1531C509q572K959Q781j779j0438M82J1434J894j0821l793J0450N113j0353o650
1545g784Q666P463o786p618N980Q019m991q187L785P653l718p403L742P960l473
$$ y = [-5926, 3285, 5487, -2997, -6433, 912, 3810, -2214, -5090, 743, 4055, -1278, -3991, 1218, 3292, -3394, -6152, 532, 3953, -1900, -5956, 833, 6051, -531, -7744, -1954, 5770, 1403, -7508, -3836, 6325, 4144, -6062, -6488, 3586, 4612, -4820, -7377, 2023, 6047, -966, -5845, 232, 4787, -410, -5414, -751, 4381, 187, -4271, 168, 4938, 258, -5400, -1138, 5165, 348, -6225, -1115, 7605, 4054, -6086, -3740, 6163, 5553, -4995, -6030, 4913, 8152, -1597, -6365, 2260, 7859, 199, -6348, -571, 6358, 2122, -3782, 125, 5892, 2362, -3859, -620, 5097, 1252, -4770, -480, 6968, 3509, -5063, -2104, 6677, 4898, -5540, -5058, 6376, 8270, -2551, -6344, 4106, 9219, -1134, -7784, 882, 8345, 1559, -6059, -79, 7940, 2949, -5238, -1453, 6200, 2482, -4921, -1179, 6781, 3308]
1560C308p628K881Q247l443r179K358J0272q95j0610k26J1193J668j2041l541
1574g636J1386N365j0358o836J0025Q459q664j0019O767J0159n104j0440L955
1587b941J0335k017r471J032Q492r37q513P57Q426n93q098J249R086j546j0304
1602e043M42J0979R07j1750k105J2585M603j2150p455J0866R100r650j0804Q036
1616a439J2492n345j2642L256J1397r90j1496k30J0370J102q612j026Q029P87
1630E653q656o38Q240M91q727q40J0320J655j0910l516J0951N248j1806p076J0745
1645A134J0131r488j1566P264J2474n220j4291L171J3787l82j2875j361J2646
1658E424K195j1753m113R933M698r219m416Q383N053p953n553P790M852q279n403
$$ y = [3308, -4320, -1439, 6808, 3365, -5814, -3456, 6816, 5921, -4689, -4915, 6278, 7946, -4095, -7636, 3750, 9115, -1243, -8079, 1946, 10405, 1741, -8278, -1511, 8648, 3544, -6896, -2941, 7394, 5377, -4094, -3062, 5430, 4493, -4020, -3263, 5163, 4570, -3528, -2279, 6807, 5261, -5043, -4601, 6378, 7285, -4465, -6570, 6015, 10618, -1532, -8987, 1879, 10979, 1329, -9475, -1439, 11053, 5708, -6934, -3678, 7719, 6729, -4767, -4997, 5373, 6475, -2137, -3163, 4866, 5653, -3003, -3641, 4599, 5090, -3637, -4477, 5843, 7498, -3412, -6928, 4023, 9271, -2535, -9611, 1134, 11265, 1777, -9789, -2525, 9949, 4729, -9562, -6391, 7396, 7014, -5861, -7222, 5424, 7619, -4134, -8247, 1686, 6384, -2835, -7251, 1132, 6185, -1768, -7321, 469, 5321, -2958, -8361]
1673h361Q778O313q206q030Q749R264q514j2118P265J3504n558j4370L345J6154
1687H215j221j6266k473J5574M557j4423o338J3139P866j1123r322R398Q882q042
1701a577r114P538Q855o137q868O661Q776o824j0465O879J1245o179j2443N799
1715e854J4574m083j6173J724J6627Q24j7122l456J7210O557j5671q948J4391
1728F00J0056j2692j1648J0553J2787q365j2393O934J2287n683j2640M653J2380
1741F829l939j1914L602J3167k601j3963J383J4322n40j5309p14J6073L631j6209
1755f182n563J5678P646j5393j0053J4035J2757j1938j3886J0563J4756q362j6000
1768a1942N322J6453l607j5742K446J5809o36j5625j011J5039J443j4248k679
$$ y = [-8361, 417, 6730, -1476, -9506, -757, 8507, -7, -12125, -4860, 8644, 3086, -11284, -7939, 8215, 6994, -9272, -11745, 3829, 8386, -6037, -12375, 764, 8630, -2493, -11815, -2417, 6465, -1577, -10691, -3153, 5702, -435, -9303, -2642, 6134, -690, -11155, -4276, 6969, 790, -11653, -5854, 8720, 4637, -11536, -9812, 6815, 7639, -9483, -12939, 4271, 10828, -4843, -13791, 600, 10656, -2036, -13684, -3131, 9656, 1291, -11102, -4168, 8119, 2436, -10204, -5551, 6829, 2890, -9024, -5422, 7745, 5144, -8819, -7436, 6886, 6346, -8963, -9677, 6396, 10027, -6182, -11745, 3933, 11579, -3814, -13867, 168, 12925, 987, -12899, -2336, 12420, 4058, -11942, -6620, 9833, 6226, -9516, -7070, 8739, 8103, -7522, -8533, 6506, 7949, -6299, -8978]
1781h978J4871M022j4451m962J4176O563j4919q320J4233J0672j2858j2685J2423
1794b13J4543j0812j6496P946J7808n333j8293L580J8397p42j7911j902J7006
1807G578L079j6186m462J5760N839j4479o789J3907P493j3518r320J3479J0924
1820A3305j2487j1928J1664J3923j0732j5782Q422J7243o412j7909M244J8989
1832A2540j612j8800j083J8545K627j7661m774J7144P005j5611q532J4755R470
1845A4013j4144j0733J2562J2308j1506j3108J1522J3847j0000j5180Q199J6242
1857A4022o789j7494N388J8956l087j9305M74J9262J255j9199m341J9230O737
1870A5109j7619r279J6653J1038j5198j3188J3277J3648j0792j4690R493J5224
$$ y = [-8978, 5893, 9915, -4536, -9498, 4678, 11241, -3678, -11998, 2235, 12907, 49, -12636, -213, 14330, 3518, -12978, -5032, 12776, 7443, -10850, -7270, 11127, 10385, -7526, -9428, 7578, 10657, -5529, -9991, 5769, 11608, -2871, -9660, 4247, 11740, -1778, -11098, 2381, 13305, 818, -11110, 554, 14477, 3745, -12037, -3615, 13628, 7216, -10693, -6449, 12540, 10928, -7872, -8955, 9590, 12217, -5444, -10218, 6926, 13931, -1680, -10212, 4543, 14013, -131, -10864, 1698, 14006, 2500, -10608, 914, 14761, 4761, -10419, -2220, 14022, 7233, -10261, -4873, 14083, 10996, -8309, -7835, 11427, 12682, -6517, -10858, 8372, 15109, -2510, -11789, 4864, 15902, 704, -12484, 793, 14441, 3649, -11041, -1548, 13676]
1882A3676q204j5838O337J5425n618j5954M471J7346l209j7667J388J8277n59
1895I871j9179k415J9747N061j9302p813J8141J0636j7589j3276J4978J5407j2688
1908A579j6687J0303J7510p676j7938M803J7413l265j6849J460J7070p47j6800
1921i824m25J5987J715j7167k642J7196M631j7456o205J7823Q003j7902j0326
1934a6592J5930J3456j5130j5260J3140J7579j0644j9315P185J9515m176k0369
1946a4681K500J9724P30j9104k800J8048M333j7442n567J6195P282j5111p975
1959a3868J4807Q916j4368j0074J3544J1256j2811j2325J2372J4733j1464j6266
1971a5548R747J7867p652j9813N525K1437k043k1770n40K1401L532k0377o378
$$ y = [13676, 5472, -10366, -4029, 11396, 5778, -10176, -5705, 11641, 8432, -9235, -7847, 10430, 9871, -9308, -11723, 8024, 13085, -6217, -14030, 4111, 14747, -2842, -16118, -1140, 14267, 1579, -15108, -4805, 12705, 5029, -12909, -8106, 9307, 6042, -10807, -9347, 7723, 6976, -9824, -10249, 5738, 7453, -9714, -12356, 4840, 9471, -7985, -14190, 3633, 11636, -6266, -16592, -662, 12794, -2336, -17596, -4456, 13123, 2479, -16836, -9651, 9864, 5688, -14681, -12181, 7543, 8273, -10831, -13631, 4417, 8750, -8692, -14259, 1936, 9218, -5893, -13868, 939, 9855, -4513, -14587, -1043, 10213, -2598, -14923, -2551, 12182, 718, -15548, -5801, 12066, 4414, -15399, -9874, 11563, 9520, -12250, -12790, 8611, 12143, -8234, -14612]
1984a4612J8893R280j7218j0411J5133J2213j3537j3133J1994J2881j0184j2955
1996a1656R908J3639q817j4444P766J5329p154j6297N969J8182m017j9202K321
2009h473J9521K89k0454l381K0261O827j9361r163J8008J2008j6170j3939J3587
2022d40J5090j1546j5488R516J6398p377j6094N443J6153m649j6087L691J5968
2035A0578j800j6641J276J6935J58j7607k204J7703M405j7774n869J7594Q265
2048A5019j6579j1262J5195J3213j3724j4903J2053J6390r430j7684O512J8347
2060A3147m856j8073K074J8003O0j7381j444J6453L007j6403m220J5378N580j5156
2074c831o213J5196P307j4680r369J4373J0493j3458j2841J2780J5033j1067j6419
$$ y = [-14612, 4281, 13561, -3657, -14068, 1065, 13278, -259, -13392, -1398, 11483, 1299, -11656, -1748, 11891, 3074, -11370, -3604, 11725, 4571, -11726, -5757, 12425, 8408, -10794, -8473, 11048, 11337, -9117, -12498, 7763, 14590, -4771, -13934, 4074, 16082, -88, -14027, -440, 14650, 3104, -12384, -2868, 13530, 6153, -9941, -4498, 11655, 7006, -9081, -5390, 10578, 8778, -7863, -6587, 10348, 10506, -7101, -9305, 8398, 12803, -4971, -10840, 6754, 15019, -1560, -12822, 2373, 15586, 1862, -13041, -988, 15402, 5972, -11712, -5200, 13147, 8291, -9782, -7708, 10295, 10355, -7026, -8470, 7983, 10990, -5413, -9633, 5745, 11325, -3831, -10044, 5152, 12459, -2221, -11590, 2783, 13276, -182, -13023, -243, 14790, 3723, -12696]
2087a2696Q985J7564o897j8715M200J9450j246j9113j003J8354L077j7760n199
2100a0999J6839O550j5420p617J4756Q636j3788r968J3093J0799j2437j2477J2094
2113F1J3525j0545j4967R105J6165q018j7512N248J8986l169j8720O07J9158J311
2127A1235j9329l556J7650O233j6827p785J5704R462j4736j0546J2895J1512j2106
2140a94j2536J1318J3610r553j4853Q339J5309o961j6633N565J7286l808j7619
2153a0730K202J8027L61j8814k896J8523M487j7461o605J6806Q882j6000j0696
2166a3914J4182J2306j2844j3208J1057J4149q934j4911P759J5134o610j5717
2178a1551M959J5872l517j6114K402J6876j105j7678q74J7768L239j7939n385
$$ y = [-12696, -3711, 13853, 6956, -11759, -7559, 11891, 10645, -8468, -9471, 8883, 11960, -5800, -10999, 5840, 12390, -3030, -10647, 4109, 12745, -1043, -11011, 2082, 12881, 444, -12033, 61, 13586, 3041, -11926, -2821, 13344, 5326, -12186, -6938, 12048, 8879, -9841, -9234, 9924, 11235, -8094, -11650, 6000, 12233, -4594, -12379, 3325, 12787, -1949, -12495, 400, 11912, -194, -12730, -1412, 12198, 2645, -12208, -3869, 11440, 4479, -12154, -6589, 10697, 6889, -10730, -8528, 9499, 9860, -8954, -11850, 6673, 11160, -6301, -12906, 3900, 12782, -3218, -13914, 268, 12574, -270, -13478, -2421, 11728, 2794, -12117, -4358, 10776, 4166, -11551, -6592, 9280, 5763, -10351, -7949, 8927, 7822, -9856, -10730, 7038, 10277, -7662, -13047]
2191a3047J7944P743j6956j0364J5252J2793j4301j4236J2254J5710r768j5888
2203a2864P274J6186n252j6816L553J6638k048j5832R94J5937K92j6027j735J5945
2217F245L109j6174m049J6390O374j5965q656J5298J0737j4676j2999J3555J4629
2230A3818j1090j6230R501J7272p031j8533M505J8389j643j8190L6J7448K482
2243A0734j7528m107J6452N030j5441o107J4891P399j4328q673J3952R502j3567
2256a791j1050J2694J3003j1768j4294J0859J5320q926j7154O672J8564m295j9342
2269a1508J703J9979P09j9423l850J9093N803j7695p798J6403R753j4511j0984
2282a2326J2739J1415j1513j2276J0314J2822r091j3167Q646J3911p910j5142
$$ y = [-13047, 4897, 12640, -4316, -14680, 572, 13365, -936, -15172, -2918, 12792, 3024, -12864, -5590, 10596, 5344, -11472, -7919, 8719, 6671, -9161, -8167, 7770, 8062, -7965, -9700, 6245, 9354, -6820, -10869, 5521, 11895, -4070, -12726, 2572, 13309, -1367, -14366, -811, 13818, 2728, -13502, -4001, 13271, 6240, -12293, -7788, 10601, 8958, -9232, -9196, 8252, 10734, -6794, -10901, 5551, 10581, -4860, -10967, 3924, 11323, -3005, -11678, 2274, 11776, -1791, -12841, -147, 12856, 1088, -13206, -2347, 12973, 4047, -13107, -6435, 12129, 7834, -11508, -9805, 10174, 10883, -8540, -12390, 6703, 12506, -5189, -12987, 3416, 13169, -1342, -12326, 413, 11828, 315, -11961, -1647, 11175, 2084, -11083, -2437, 11474, 3564, -11578]
2294a1578O481J6502n300j7456L735J8442j205j9546j268J9132L939j9196o424
2307a3742J8465Q791j6295j0969J4307J2764j2841j4277J0959J4782q525j4823
2319a1404O555J5615n512j5666M076J5419k838j5621J982J5848l38j6100j407
2332i391J6694K604j6680m657J7093O790j6110r138J5564J1064j4005j3204J2546
2345h30J4728r908j6495Q325J7061n879j7611L310J7758j396j6804o38J6382K055
2359A0058j5506l889J5377M473j4806n904J4739O658j3744p973J3179R606j3114
2372h46j1505J2541J2637j0962j4269R267J6075p402j7299M811J7897k613j8076
2385i744J72J8054K244j6970m674J6048O089j5125p371J4144Q407j2532r641J1693
$$ y = [-11578, -5097, 11405, 6105, -11351, -7616, 10826, 9621, -9925, -11193, 7939, 11878, -7318, -13742, 4723, 13514, -2781, -13750, 557, 13321, 480, -13797, -2838, 11944, 3419, -11404, -4849, 10766, 5254, -10412, -6336, 9083, 6245, -9376, -7394, 8454, 8116, -7984, -9391, 7303, 9907, -6773, -11430, 5663, 12453, -3657, -12795, 2769, 13833, -172, -13376, -830, 13898, 3990, -12505, -4180, 12881, 7002, -10609, -7299, 10459, 9063, -7741, -8379, 8003, 10058, -5448, -9337, 6040, 10513, -4293, -10197, 4542, 11200, -2544, -10517, 2662, 12268, -846, -12351, 190, 12827, 1865, -12404, -3137, 12938, 5536, -11763, -6952, 10945, 8332, -9744, -9572, 8482, 10726, -6244, -10918, 5130, 11219, -3906, -11277, 2867, 11274, -1258, -10899, 794]
2399G94J0619j0946j1800J0473J2564r490j3447Q354J5046p240j5783N135J6426
2412A0705l416j7185J191J8011R92j7581l306J6941M887j6512p123J5487Q828
2425A1919j3847j0103J2356J1078j1140j1883R129J3074q346j3538P057J4219
2437I975n800j4878M084J5064k791j5509J593J6201J81j6054k298J5930M069j5758
2451e991o389J5672Q126j4201r837J3334J1065j1599j2393R469J3730p865j3711
2464a0590O323J4405m929j4494L315J4228j775j4493N22J4785O47j4731j867J4744
2478F090L530j4755n027J4462P069j4110q204J2539J0658j1984j2068R850J3482
2491A1532q251j4036O202J4913m259j4952K150J4928j075j4655j05J4083J926
$$ y = [794, 11413, 467, -11333, -860, 11704, 2214, -11233, -2879, 12167, 4927, -10856, -5721, 10705, 7289, -9896, -8705, 9306, 10298, -7283, -10589, 6352, 11239, -5273, -12396, 3091, 11919, -1928, -12031, 325, 11403, 263, -11620, -2491, 10583, 2237, -11301, -4244, 9975, 4175, -10703, -6619, 8445, 5654, -9855, -8262, 7939, 8120, -7934, -10232, 5698, 9767, -5991, -12380, 3292, 11418, -2783, -12620, 714, 11779, 180, -12213, -2744, 10986, 3121, -10590, -4267, 10138, 5209, -9285, -5970, 8258, 6483, -8010, -7488, 7297, 7944, -6787, -8654, 6090, 9620, -5135, -10162, 4300, 11369, -2741, -10945, 1594, 12252, 268, -11800, -1950, 11532, 3281, -10755, -4553, 10360, 6101, -8851, -6701, 8227, 7152, -7503, -7608, 6475, 8401]
2504H401j3698k647J3199L867j3349m984J3147O147j2330p500J1974R343j1407
2517A63j0654R901J2231q884j3083P361J4402n302j5044L210J5221j310j5385
2530g173n42J5021K535j4477l592J3214M979j2737o450J2162P050j0982p797J0171
2544A382Q526r550r963Q952J0076p763j1351P399J2129o101j3624M831J3922l056
2558E809j4542Q28J5387J132j5282k923J4567M721j4228o621J2785Q272j1181
2571a276r136J0062R872q734j0437P304J0442o226j0727O009J0476m590j1209
2584h170L583J2486l492j2849J990J3533n31j3663r75J3940L196j4325n043J3220
2598B900O916j2318q633J0971J0586r775j1231P632J1931o257j2397N191J2336
$$ y = [8401, -5297, -7944, 5255, 9122, -4227, -9211, 3936, 10083, -2247, -9747, 2227, 11570, 163, -10491, -590, 11641, 2757, -10326, -2965, 11437, 6135, -8909, -5699, 9522, 8212, -7173, -7715, 7306, 9841, -4636, -8228, 4986, 9965, -2772, -9222, 2940, 9990, -992, -8789, 1382, 9908, 358, -9605, -653, 9423, 1660, -9691, -2292, 9837, 3736, -9888, -5057, 8865, 5809, -8733, -7905, 7482, 8614, -6668, -9591, 4976, 9697, -4531, -11152, 1633, 9905, -1276, -10412, -350, 9522, 788, -9649, -2345, 8097, 1871, -8856, -2847, 7629, 3039, -8170, -4587, 7899, 4407, -8442, -6452, 7081, 6550, -7113, -8088, 5852, 9048, -5277, -10320, 2900, 9816, -2502, -11135, -164, 10422, 647, -10584, -2952, 8979, 2722, -9675, -4484, 7852]
2611G852l598j1919J917J1788q62j2265M21J1831L82j1225j859J2310K541j2254
2625d940l902J2365N250j1867o631J1845P960j1036r403R264J1265q004j2007
2638i841O445J2954m549j3047K501J3322j059j2985n53J2726J836j1886k781J1255
2652D338L552j0644m665R942N424r754n466R335P255r721q190Q732R186q237j0354
2667i267P519J1479n761j2624M151J3309k775j3723R26J3353J264j3086k907J2545
2681D403M183j1646n210J0202O280r547o536Q621P524p932q132P224Q794o995
2695A233r447O315J0107n316j0760M790J1055l489j2047J564J3109l59j2676j676
2709g597J3021K965j2251m877J1502O000j0566p003R469Q233q345q831O984R296
$$ y = [7852, 4254, -7665, -5748, 6040, 5178, -7087, -6666, 5165, 5547, -5678, -7537, 4773, 7314, -4940, -8842, 3523, 8773, -3094, -9725, 2120, 10080, -956, -10359, -1095, 10170, 2166, -9841, -3396, 9558, 5009, -8038, -5537, 7785, 6726, -6259, -6812, 5914, 7750, -4136, -6917, 4338, 7890, -2754, -7419, 2523, 7947, -1807, -7273, 2062, 9317, -404, -8594, 138, 9324, 1087, -9267, -1748, 9731, 3970, -8654, -4503, 8806, 6031, -7692, -6766, 6587, 7851, -5235, -8142, 4403, 8586, -3060, -8270, 1932, 8212, -1335, -7871, 750, 8274, 342, -7790, -566, 8228, 1233, -8214, -1899, 8208, 2892, -7868, -3078, 7977, 4488, -7559, -5995, 7114, 6755, -5921, -7597, 5424, 8389, -3862, -8739, 2763, 8763, -1803, -8806, 663, 8896, 551, -8280, -1296, 8000]
2723H000o158r666N284R831l940j0448L233J0776k651j0621J092J1178nj1919
2737f014p30J1986K261j1755l815J1756M693j0799o506J0273P968q925r433P968
2751a072R894o527j0499N388J1034l999j1038K801J0779j476j0629kJ1046P48
2765F448j0631j382J0491K533j0960l100J0373M497j0721n384J0124O881r117
2778E2q387Q356R356p012j0794N973J1172m196j1148K181J1484r59j1541k33J1099
2793E403J030j0564j945J0556K536r976l835R875M076r727m905Q936O722q941
2807g59o978P632Q418p291r523O495J0098m988j0766L404J1425k359j1283K47
2821f228J1467J085j1219k252J0746L306r860m787R069N588q473n988P711O734
$$ y = [8000, 1842, -7824, -2540, 7291, 3351, -7097, -3864, 6912, 4261, -6360, -5268, 5910, 5905, -6014, -6744, 5242, 7503, -4252, -8067, 3689, 8382, -2417, -8923, 1350, 9318, 393, -9040, -1072, 8822, 2295, -8204, -2816, 8218, 4219, -6819, -4018, 6761, 5285, -5344, -5346, 5700, 6448, -4183, -5565, 4926, 7459, -3501, -6601, 3772, 8269, -2452, -7836, 2288, 9169, 52, -8335, 21, 9377, 2365, -8429, -2456, 8716, 4520, -6628, -4447, 7037, 6078, -5463, -5696, 5403, 6433, -4131, -6076, 4480, 7016, -2960, -6795, 3080, 7156, -2571, -7476, 1460, 8182, -759, -7737, -105, 8313, 1022, -8501, -2006, 8092, 3104, -7662, -4258, 7167, 4808, -6475, -6228, 5239, 6324, -4895, -7147, 3599, 6905, -2955, -7742, 1327, 6915, -1558, -7546, 165, 6899]
2835F899o969p335O582P541n868q208M793R118m039r702L273J0545k599j0938
2849f907J321J1078J56j0963j825J0899L495j0549m882R515O077q583p000P652
2863e16P876o698q313N649Q294m537q415L410R015l043q370J576R439j674r363
2878e670O52R731L68j0220q82J0379K290j0165l778R880N489r560o641Q610P841
2893H324p265q758O203R063m644r940L483J0129k130r755J282R483m30r112n29
2908d596R104P00q425j816Q557K582q773k965Q164M078q315n314Q184O480p454
2923A91p336O326Q143n328r672M585R678k769j0153J445R921J45r890j150R385
2938C521K404q819l420Q284L764p190m800P106M886o704m835N887N335n320o263
$$ y = [6899, -70, -7405, -823, 6718, 850, -7358, -2565, 6553, 2514, -7188, -3915, 6630, 4031, -6907, -5586, 5492, 5648, -5315, -7140, 3759, 7254, -3295, -8177, 1338, 7415, -1168, -8168, -516, 7360, 662, -7651, -2002, 6292, 1755, -6660, -3250, 5765, 2722, -5648, -4072, 5367, 3693, -5670, -5018, 4713, 5081, -5139, -6021, 4358, 6648, -3517, -7295, 2585, 8074, -1486, -8127, 483, 8324, 1059, -7699, -1496, 7567, 2923, -7017, -3534, 6595, 4465, -5290, -4008, 5475, 5045, -4067, -4596, 4508, 5208, -3217, -5033, 3524, 6106, -2667, -5632, 2532, 6610, -1705, -7019, 1165, 7645, 191, -7145, -819, 7324, 1996, -7676, -3091, 6587, 3818, -6335, -4890, 5031, 5176, -4714, -5864, 3521, 5925, -2894, -6314, 1970, 5734, -1456, -6256, 850, 5736, -968, -5803, 84, 5419, 99, -6164]
2953f164N688O349m985p531M233Q541l424r165K734R399j100r974m07R875J798
2968E867r787k783Q764M295p732n469P081N675o005o215N183O019l856o489L557
2983a895O732l698o578K720P019k529p019K133P300n75q580q8Q520J183q475k407
2999f237Q911L540q364m505P778N446p070o126N953O827m420p371L602P967l279
3014B652p355J665P802j100p413N52P629j44p202l89P199J031p361j585P092K660
3030E733o939l666P476L874p022n011O240N893n278o587M073P405l219q142K434
3045b736P928j062p679l01P635Q08p238j575P225J827o594k741O609K687n961
3060a168k827N296L577n342m158N224M877m944n586M125O575l931o900L015P466
$$ y = [-6164, -476, 5873, 888, -6643, -2410, 6131, 2707, -6458, -3724, 5675, 4575, -5399, -5806, 4069, 5867, -3920, -6703, 2061, 6356, -1376, -6845, 236, 5911, -94, -6309, -1126, 4893, 1037, -5452, -1895, 4837, 1139, -5439, -2719, 4300, 1771, -5248, -3115, 4185, 3610, -4970, -5058, 3462, 4645, -3830, -6237, 2674, 6214, -2150, -6655, 1123, 6569, -501, -6627, -674, 6153, 1733, -5638, -2036, 5931, 2652, -4703, -3038, 4764, 3664, -3749, -3197, 4432, 4288, -2914, -3303, 3896, 4927, -2434, -4019, 3073, 5733, -1206, -4872, 2604, 6478, -544, -5555, 685, 6578, 1300, -5287, -1214, 6191, 2972, -5170, -2736, 5192, 4130, -3549, -3850, 3785, 4593, -2645, -4220, 3005, 4832, -1762, -4503, 2106, 4793, -1168, -3995, 1301, 4878, -464, -4622, 602, 5479, 535, -5051, -926, 5649, 1718, -5182, -2167, 5299]
3075E299j749p840Q56P755O3p425j022O806K330o672k926O001L332n410l236M081
3091B43M151m233m526M023M640l732m990L411N443k925o011K201O205j589o749
3106d438R70P114j89p262p15O932J544o422k773O531L299n879l842N322M102m658
3122c64m584L835N056l265n321K856N653k600n187J938N067j294n291P60O066
3137C325k62o065l58O035J067o196j821O149K740n974l396N545L824m616n079
3152e082L957N421l056n663K350N891j943n684J111N493l60n457J47N329l1n032
3168b609n99N135M45m897j235N418J879n682k453N220L506n443l942M975M437
3183D155l510n560L208N849k280o073J168O026k41n787j59N486R25n236j406N061
$$ y = [5299, 3550, -4290, -3434, 4321, 4384, -3041, -4063, 2743, 5073, -1599, -4525, 1476, 4808, -602, -3838, 243, 4394, 161, -4365, -342, 4298, 566, -4424, -1013, 4430, 1505, -4506, -2305, 3900, 2311, -4438, -3468, 3646, 3457, -3805, -4520, 2412, 3956, -2466, -5239, 1292, 4591, -1288, -5130, 192, 4294, -364, -4948, -1113, 3943, 678, -4643, -1787, 3866, 1266, -3921, -1983, 3084, 1790, -3501, -2741, 3325, 3063, -3002, -3360, 2675, 3742, -2454, -4275, 1874, 4614, -1360, -4756, 789, 4613, -3, -5082, -1125, 4296, 1240, -4423, -2073, 3818, 1875, -3809, -2698, 2795, 2435, -3022, -2875, 2454, 2423, -2609, -3208, 1927, 2372, -2525, -3760, 1658, 3537, -2145, -4598, 622, 4128, -1315, -5257, -282, 4155, 645, -4915, -1707, 4142, 1862, -4211, -3043, 2983, 2742, -3045, -3204, 2282, 3207, -2029, -3435, 1626]
3199A626J223m436j825M222K052l928k391M086K855m450l421M328L788l818m199
3214d288L277N224k957n448J841O039j485o357O63O220M45o156j294N779K023
3229C526n194k684M967K715m165k679L337L190l103l323L023L382k673l549K742
3244d88L610k227m109J780M960j767n199J663N295m54n854k03N755J407n823j867
3260c521N250K965m625l599M220M154l939m356K723M434k048m460J791M520j594
3275A915m121J283M044j063m292M27M805n19m839L97M637R36n661j061N226K136
3291D250n082k974M934L389l862m810L933M410k617n085K243N044j269m842L54
3306a984M412L85m752l02M458Q44m312j052M035J084l906j331L977J378l818k001
$$ y = [1626, 2849, -1587, -3412, 810, 2862, -1066, -3457, 629, 3484, -966, -4387, -59, 3729, -89, -4288, -1011, 4213, 1256, -4192, -2351, 3688, 2203, -4154, -3491, 2729, 3174, -2982, -4276, 1503, 3526, -1668, -4352, 615, 3330, -835, -3514, -177, 3013, -90, -3413, -390, 2992, 319, -3230, -488, 3122, 895, -3214, -1434, 3526, 1759, -3440, -1777, 3518, 3064, -2790, -2993, 2762, 4169, -1654, -3521, 1729, 4694, 69, -3530, 690, 4844, 905, -3451, -728, 3706, 1658, -2802, -1011, 3509, 1915, -2206, -923, 3121, 2058, -2234, -1807, 2998, 2479, -2360, -1963, 2674, 3610, -2051, -3112, 2114, 4250, -832, -3806, 1128, 4517, 655, -4155, -222, 4188, 1571, -3514, -1271, 3773, 2504, -2338, -1984, 2428, 2813, -1939, -2241, 2217, 3061, -1251, -2303, 1732, 2816, -1090, -2421, 1556, 2934, -884, -2885]
3322b885M094K210l734l156L611L645l678l961K723M965j947n608J503N579j055
3337B306n218j52M975J127n079j558M513K006l965k613L888K693k982l173K897
3352c35K839k654l100K959K993k591l696K508M028j842m605J676M610o47n182
3367c039J40N256P26n299j575N134J911m186k727L583L130k947l532L230L099
3382B904k072l892K326L251j546l584J313L673j012l637N59M446p93m307K5M352
3398B006Q35m456j168M355J648m467k200M230K841l660k978K929L878k785m036
3413c028J952M177j525m182J096M244o64l984L40L921J46l923l01L601O52l858
3429a336r13L850J638m075j927L835K259l500k891L212L761l156l783K143M019
$$ y = [-2885, 1209, 3419, -315, -3471, 140, 3785, 107, -3854, -1131, 3834, 1887, -3721, -2218, 3361, 2306, -2912, -3064, 1911, 3038, -2041, -3599, 914, 2920, -1045, -3658, 230, 2923, -59, -3232, -335, 2504, -150, -3250, -291, 2702, 111, -3585, -1077, 2951, 1109, -3496, -1820, 2790, 2143, -3039, -2899, 2357, 3083, -2216, -3791, 1343, 3254, -932, -3659, -76, 3054, 107, -3425, -195, 2904, 832, -3060, -734, 2517, 971, -2613, -1300, 2373, 1361, -2276, -1717, 2729, 1936, -2371, -2346, 2006, 2841, -1615, -2783, 1572, 3220, -1247, -3447, 783, 3624, -36, -3014, -85, 3793, 1008, -3028, -1076, 3101, 1576, -2606, -1510, 2734, 2070, -1914, -1574, 2347, 2493, -1430, -1731, 1870, 2522, -1336, -2249, 1601, 3239, -836, -2763, 1072, 3331, -169, -3060, 152, 3913, 757, -3026, -883, 3136]
3444C136j523m335R16M479o62m137n3M198L78l926j056L534J369l128j510L235
3460I15J801l202j907K941J843k923k073K510K835k345l320K237L659k324l442
3475b795J161M025q31m319J5M470O10m382j098L914J888l723k098L083K437k649
3491b92k110K052K141j574k888J913K739j363k971J206K929j078l453J162L612
3506B025p90l621L97L758K07l750r51L690K170m100k267L780K621l335k948K809
3522c05L241k107l017R50L467p47l218L60L355q29k489O2L019O5l320M0K905K83
3540A715l226k73L261O97l340j305L722J919l563k350K860L202k744k995J717
3555g03L665j007m021O85L596J60l930l48L421Q97l118p55K454J245k674j207
$$ y = [3136, 1613, -2722, -1806, 2673, 2011, -2126, -2179, 2019, 2397, -1529, -2585, 949, 2318, -810, -2320, 915, 2716, -486, -2393, 548, 2391, -532, -2605, -95, 2740, 395, -2925, -688, 2971, 647, -2795, -1634, 2391, 1560, -2759, -2744, 1726, 2336, -2046, -3144, 770, 2658, -1065, -3163, -80, 2357, -292, -2402, -350, 1791, 217, -2671, -758, 1981, 618, -2353, -1147, 1782, 704, -2749, -1587, 2025, 1235, -2386, -1989, 1769, 1976, -1774, -2725, 965, 3135, -965, -3232, 548, 3169, -166, -3114, -305, 2936, 829, -2188, -1238, 2229, 1482, -1736, -1376, 1979, 1150, -1339, -1277, 1742, 1807, -1513, -1473, 1432, 1715, -1511, -1784, 1477, 2174, -1166, -2471, 1251, 3170, -393, -2743, 117, 3319, 575, -2420, -703, 2962, 1955, -2066, -1381, 2215, 2375, -1555, -1903, 1518, 2415, -703, -1458, 996, 2241, -433, -1640]
3571a640K570J236k619j121K246J569k474j944K725J962k290k700K195K859j394
3586A180l581J421L454q80l727J43L645O51l398j174L209J204k728j801K466J693
3602A777j913k135J741K039j372k041J262K054j423k144J211K433j223k442J084
3617a092K243q05k561L80L244m6l412M6L275O55l427j188K822J922k220k226J759
3634f31K602j541k989J367K592o23k203j0K598K5k365j4J783M41k146o2J807O81
3652A312k309j98K167O02k717r23K586J287k482j795K303K493k035k707J371K916
3668A871j178k765N97K764J73k880m56K687R02k740n88J879J097j609j134J828
3684D48J181j783j304J920J300j672j218J425J722j720j666J370K199j597k136
$$ y = [-1640, 930, 2166, -453, -1574, 672, 2241, -233, -2177, 548, 2510, 220, -2480, -285, 2574, 1180, -2401, -980, 2474, 1594, -2133, -1990, 1655, 2306, -1092, -2266, 943, 2147, -581, -2382, 84, 1777, -136, -2271, -530, 1509, 137, -1904, -642, 1412, -11, -2155, -944, 1489, 266, -2176, -1092, 1151, 346, -2215, -1835, 1409, 1363, -2049, -2003, 1272, 1927, -1500, -2688, 134, 2056, -164, -2390, -631, 1971, 430, -2559, -1192, 1400, 777, -1426, -1436, 1162, 1187, -1178, -1192, 591, 1032, -1114, -1176, 631, 1312, -997, -1195, 972, 1574, -1143, -2066, 520, 1807, -675, -2470, -167, 2326, 291, -2416, -1045, 1871, 693, -2072, -1475, 1289, 1462, -1418, -1874, 813, 1715, -1025, -1613, 266, 1363, -246, -1380, 448, 1629, -154, -1458, 462, 1762, 90, -1128, 297, 2019, 299, -1367, 3, 2202, 605, -1531]
3699a531O39K871m62l012K0L110J36k775o17K407J114k230j358K319J333j690
3715B74j632J343J316q84j761J258J393r11j789J195J668q57k128P71K168q62
3731E62k144P09K305m38k211j59K625M84k572r99K343J430j848j861J924J776
3747A926j421k019J371J682p85j801N51J648k30k069O35J854n51j993O80J921
3763A399l56j997k94K531O8j899p38J986J366k193j473J559J782j574j973J405
3779d01K286r03k331Q46J891k44k489K45K039N38k197j25J888p9j353m72J567
3796G06N67j899l69J775N73j397j141J684J366j857j670J522K035j002k489Q57
3812g39K360l14k538o6K461N25k305n50J769R46j975q43J675Q51j604r35J562
$$ y = [-1531, -892, 1979, 1517, -1495, -1475, 1635, 1771, -1004, -1621, 786, 1900, -330, -1688, 631, 1964, 274, -1358, -15, 1301, 417, -1344, -86, 1307, 396, -1393, -198, 1470, 613, -1515, -744, 1424, 562, -1582, -873, 1432, 994, -1217, -1376, 1249, 1733, -839, -1838, 505, 1935, 87, -1774, 150, 1926, 505, -1514, -143, 1539, 754, -1047, -496, 1152, 922, -1147, -512, 1342, 791, -1202, -522, 1399, 1043, -954, -1248, 1283, 1351, -548, -1286, 700, 2066, -127, -1600, -41, 1741, 167, -1806, -401, 1885, 982, -1349, -503, 1388, 1144, -1345, -1100, 939, 1477, -720, -845, 1043, 964, -389, -861, 706, 1273, -626, -995, 780, 1353, -44, -1185, 499, 1865, 8, -1662, -140, 1895, 893, -1596, -739, 1621, 1307, -1231, -1297, 1164, 1689, -616, -1166, 603, 1549, -426, -1269, 406, 1257, -347, -1282, 280]
3829B80J086j379j048J256J091j391j283J413J438j448j696J153K143r97k524
3844a906K98K863K25k683q12K686R04k707r86J985J741j880j609J594J544j294
3860c7j609J001J438o89j263Q65J279r79j192P56J555n58k262J005J985r08k148
3877a761N64K344M22k786l80K218J273k699j428K170J655j604j979J691J832q84
3893F48k500O13K508l15k321K49J762P3j846J2J803J90j454l80J474M14j534m26
3911a030J729P05k276p30K203Q79j537j998J748K465j586k467J416K363p44k396
3927a256o3K688K59k319r22K404Q40k112o91J645J111j302j287J267J266j320
3943B08q64R04J260j117j593J246J550j045j970J203J939r49k301Q93K156J8l142
$$ y = [280, 1366, -13, -1061, 195, 1286, -105, -1388, 25, 1463, 15, -1681, -528, 1615, 618, -1906, -1608, 1255, 1480, -1203, -2015, 671, 1575, -1132, -2118, -133, 1608, -272, -1881, -287, 1257, -37, -1646, -645, 793, 104, -1159, -294, 985, 6, -1186, -430, 1125, 567, -1695, -690, 1295, 387, -1761, -1197, 1147, 1569, -1217, -1597, 621, 1894, -805, -2233, -63, 1592, -12, -1991, -300, 1532, 648, -1852, -1239, 1269, 954, -1367, -1118, 644, 717, -1129, -1117, 686, 876, -578, -958, 516, 930, -604, -1030, 699, 1404, -872, -1602, 601, 1480, -57, -2055, -307, 2158, 572, -1895, -479, 1884, 1140, -1256, -1319, 1369, 1628, -691, -1613, 791, 1631, -481, -1172, 473, 1584, 282, -1005, 262, 1528, 208, -656, 248, 1508, 391, -1202, 44, 1594, 549, -1421, -218, 1721, 772, -1529, -636, 1520, 1538, -1604]
3960a604K30K518J028k985j023K370J393j958j634J455J958j386j854J155J676
3975A339o45j973Q94J796p23j967Q08J537n69j682J48K217j39k456N1K319J84
3992A139j773p71K287J078k326j652K182J616j588k170J499K175j298k182Q67
4007i17K300m05k152J4K141P2j686n21J840M65j957l09J531O94j586r28K102P31
4025A429j855j305J909J636k028j849J880K316j474k428P40K858p93k530J42K524
4041A172L13k457k91K235P74k239p77J622J065j669q35J424J275j745j067J366
4057A66J402j253j813J306K102j206k295J355J724n60k447L88K662J39k555l44
4073a229K431N72k409p92K012Q01j463j451J528J529j402j678J292J796r80j741
$$ y = [-1604, -1374, 1144, 2172, -813, -1836, 534, 1927, -31, -1665, -210, 1748, 362, -1492, -337, 1339, 694, -1279, -385, 1411, 688, -1279, -471, 1066, 497, -1185, -1037, 1180, 1041, -1415, -1364, 955, 1139, -634, -1405, 882, 1960, -366, -2018, 164, 1780, 192, -1978, -479, 1696, 398, -1784, -917, 1383, 978, -1174, -1160, 981, 1053, -633, -1154, 686, 1151, -806, -1115, 416, 1110, -476, -1404, 698, 1429, -426, -1731, 178, 1814, -214, -2063, -183, 2133, 659, -1769, -1029, 1829, 1036, -1494, -1352, 1172, 1485, -972, -1263, 972, 1746, -493, -1270, 352, 1417, -252, -1087, 337, 1612, -133, -1200, 166, 1568, 315, -1498, -192, 1910, 704, -1591, -236, 1488, 928, -1519, -1131, 1531, 1670, -885, -1229, 1202, 1774, -635, -1427, 585, 1386, -77, -1528, 0, 1529, 127, -1551, -259, 1537, 557, -1184]
4089a184P55J595m85k193R59J889m44k180lK391j16k141m32K590M04k335p27K040
4107C83J345j876j969J962J742j543j847J012K479j070k124M05K186l20j943Q2
4123a096K132J4j990j64J946J63k115J35J662M04j824r20K400P86j960j481K055
4140A47J724j942j965J407K265r08k623P49K580k69k442k82K748k4k101o29K019
4157D54Q30j802m84J162J096j654q39J288J168j577j012J400J505j535j635J266
4173c69K251j433j846P49K230q16k057r0K547O02k949n85K328J161k239r08J838
$$ y = [-1184, -429, 1166, 681, -1512, -553, 1336, 892, -1288, -1291, 1100, 984, -1157, -1589, 1001, 1405, -930, -1657, 383, 1728, -148, -2117, -155, 1587, 44, -1803, -791, 1688, 618, -1506, -1101, 1085, 765, -1178, -1096, 1036, 1050, -940, -1104, 842, 1005, -1110, -975, 687, 1091, -733, -1653, 747, 1533, -427, -1908, 147, 1871, -71, -2036, -629, 1636, 728, -1895, -1146, 1434, 1165, -1277, -1559, 1189, 1165, -936, -1565, 454, 1284, -518, -1002, 160, 1256, -398, -1237, 51, 1219, -358, -1370, 30, 1535, 0, -1635, -369, 1882, 449, -1397, -648, 1582, 766, -1291, -1381, 1166, 1768, -1181, -1766, 562, 1723, -516, -1424, 414]
$$ [...]
8191A1
##END NTUPLES=NMR FID
##END=
