##TITLE=1H_PH-Gly_TFAA
 CDCl3
 64 sc, 
 5.2.2024
##JCAMPDX= 6.0         $$ Bruker NMR JCAMP-DX V2.0
##DATA TYPE= NMR FID
##DATA CLASS= NTUPLES
##ORIGIN= UXNMR, Bruker Analytische Messtechnik GmbH
##OWNER= root
$$ XWIN-NMR		Version 3.5
$$ Mon Feb  5 14:41:49 2024 Russian Standard Time (UT+4h)  she@DPX200
##.OBSERVE FREQUENCY= 200.1313
##.OBSERVE NUCLEUS= ^1H
##.DELAY= (6, 6)
##.ACQUISITION MODE= SIMULTANEOUS
##.ACQUISITION SCHEME= undefined
##.AVERAGES= 64
##.DIGITISER RES= 18
##SPECTROMETER/DATA SYSTEM= spect
##.PULSE SEQUENCE= zg30
##.SOLVENT NAME= D2O
##.SHIFT REFERENCE= (INTERNAL, D2O, 0, 15.7039)
##AUDIT TRAIL= $$ (NUMBER, WHEN, WHO, WHERE, WHAT)
$$ ##TITLE= Audit trail, XWIN-NMR		Version 3.5
$$ ##JCAMPDX= 5.01
$$ ##ORIGIN= Bruker BioSpin GmbH
$$ ##OWNER= she
$$ F:/spectra/data/she/nmr/H-F/1/audita.txt
$$ ##AUDIT TRAIL=  $$ (NUMBER, WHEN, WHO, WHERE, WHAT)
(   1,<2024-02-05 14:40:55.28 +0400>,<she>,<DPX200>,
      <continue with go, POWCHK disabled, PULCHK disabled
       configuration hash MD5:
       00 E9 B6 7A A2 85 ED C7 34 08 36 98 17 FE 4E 26
       data hash MD5: 16K
       5E C0 EE 0D 25 A7 2C 59 10 B6 FD 92 90 8F 48 B4>)
$$ ##END=
$$ 
$$ hash MD5
$$ C5 46 76 45 0B 38 AF 74 7E 04 CF 7A 2E 51 C1 B4
##$RELAX= 
##$RELAX= 
##$RELAX= 
##$RELAX= 
##$RELAX= 
##$RELAX= 
$$ Bruker specific parameters
$$ --------------------------
##$DU= <F:/spectra>
##$EXPNO= 1
##$NAME= <H-F>
##$PROCNO= 1
##$TYPE= <nmr>
##$USER= <she>
##$AMP= (0..31)
100 100 100 100 100 100 100 100 100 100 100 100 100 100 100 100 100 100 
100 100 100 100 100 100 100 100 100 100 100 100 100 100 
##$AQSEQ= 0
##$AQ_mod= 1
##$AUNM= <au_zg>
##$AUTOPOS= <>
##$BF1= 200.13
##$BF2= 200.13
##$BF3= 200.13
##$BF4= 200.13
##$BF5= 200.13
##$BF6= 200.13
##$BF7= 200.13
##$BF8= 200.13
##$BYTORDA= 1
##$CFDGTYP= 0
##$CFRGTYP= 5
##$CHEMSTR= <none>
##$CNST= (0..31)
1 1 145 1 1 1 1 1 1 1 1 1 1 1 1 1 1 1 1 1 1 1 1 1 1 1 1 1 1 1 1 1 
##$CPDPRG= <>
##$CPDPRG1= <>
##$CPDPRG2= <>
##$CPDPRG3= <>
##$CPDPRG4= <mlev>
##$CPDPRG5= <mlev>
##$CPDPRG6= <mlev>
##$CPDPRG7= <mlev>
##$CPDPRG8= <mlev>
##$CPDPRGB= <>
##$CPDPRGT= <>
##$D= (0..31)
0 1.2 0 0 0 0 0 0 0 0.06 0 0.03 0 0 0 0 0.0002 0 0 0 0 0 0 0 0 0 0 0 0 
0 0 0 
##$DATE= 1707129437
##$DBL= (0..7)
120 120 120 120 120 120 120 120 
##$DBP= (0..7)
150 150 150 150 150 150 150 150 
##$DBP07= 0
##$DBPNAM0= <>
##$DBPNAM1= <>
##$DBPNAM2= <>
##$DBPNAM3= <>
##$DBPNAM4= <>
##$DBPNAM5= <>
##$DBPNAM6= <>
##$DBPNAM7= <>
##$DBPOAL= (0..7)
0.5 0.5 0.5 0.5 0.5 0.5 0.5 0.5 
##$DBPOFFS= (0..7)
0 0 0 0 0 0 0 0 
##$DE= 6
##$DECBNUC= <off>
##$DECIM= 32
##$DECNUC= <off>
##$DECSTAT= 4
##$DIGMOD= 1
##$DIGTYP= 9
##$DL= (0..7)
0 120 120 120 120 120 120 120 
##$DP= (0..7)
150 150 150 150 150 150 150 150 
##$DP07= 0
##$DPNAME0= <>
##$DPNAME1= <>
##$DPNAME2= <>
##$DPNAME3= <>
##$DPNAME4= <>
##$DPNAME5= <>
##$DPNAME6= <>
##$DPNAME7= <>
##$DPOAL= (0..7)
0.5 0.5 0.5 0.5 0.5 0.5 0.5 0.5 
##$DPOFFS= (0..7)
0 0 0 0 0 0 0 0 
##$DQDMODE= 0
##$DR= 18
##$DS= 0
##$DSLIST= <SSSSSSSSSSSSSSS>
$$ [...]
##$SUBNAM2= <"">
##$SUBNAM3= <"">
##$SUBNAM4= <"">
##$SUBNAM5= <"">
##$SUBNAM6= <"">
##$SUBNAM7= <"">
##$SUBNAM8= <"">
##$SUBNAM9= <"">
##$SW= 18.0517328524113
##$SWIBOX= (0..15)
0 0 2 0 0 0 0 0 0 0 0 0 0 0 0 0 
##$SW_h= 3612.71676300578
##$TD= 16384
##$TD0= 1
##$TE= 0
##$TE2= 300
##$TE3= 300
##$TEG= 300
##$TL= (0..7)
0 120 120 120 120 120 120 120 
##$TP= (0..7)
150 150 150 150 150 150 150 150 
##$TP07= 0
##$TPNAME0= <>
##$TPNAME1= <>
##$TPNAME2= <>
##$TPNAME3= <>
##$TPNAME4= <>
##$TPNAME5= <>
##$TPNAME6= <>
##$TPNAME7= <>
##$TPOAL= (0..7)
0.5 0.5 0.5 0.5 0.5 0.5 0.5 0.5 
##$TPOFFS= (0..7)
0 0 0 0 0 0 0 0 
##$TUNHIN= 0
##$TUNHOUT= 0
##$TUNXOUT= 0
##$USERA1= <user>
##$USERA2= <user>
##$USERA3= <user>
##$USERA4= <user>
##$USERA5= <user>
##$V9= 5
##$VALIST= <valist>
##$VCLIST= <CCCCCCCCCCCCCCC>
##$VD= 0
##$VDLIST= <DDDDDDDDDDDDDDD>
##$VPLIST= <PPPPPPPPPPPPPPP>
##$VTLIST= <TTTTTTTTTTTTTTT>
##$WBST= 1024
##$WBSW= 4
##$XGAIN= (0..3)
0 0 0 0 
##$XL= 0
##$YL= 0
##$YMAX_a= 303734
##$YMIN_a= -273362
##$ZGOPTNS= <>
##$ZL1= 120
##$ZL2= 120
##$ZL3= 120
##$ZL4= 120
##$ABSF1= 10
##$ABSF2= 0
##$ABSG= 5
##$ABSL= 3
##$ALPHA= 0
##$AQORDER= 0
##$ASSFAC= 0
##$ASSFACI= 0
##$ASSFACX= 0
##$ASSWID= 0
##$AUNMP= <proc_1d>
##$AZFE= 0.1
##$AZFW= 0.1
##$BCFW= 1
##$BC_mod= 2
##$BYTORDP= 1
##$COROFFS= 0
##$CY= 11.3945322036743
##$DATMOD= 1
##$DC= 2
##$DFILT= <>
##$DTYPP= 0
##$F1P= 15.7292609196834
##$F2P= 12.9074282941183
##$FCOR= 0.5
##$FTSIZE= 0
##$FT_mod= 4
##$GAMMA= 1
##$GB= 0.15
##$INTBC= 1
##$INTSCL= 1
##$ISEN= 128
##$LB= 0.24
##$LEV0= 0
##$LPBIN= 0
##$MAXI= 10000
##$MC2= 0
##$MEAN= 0
##$ME_mod= 0
##$MI= 1.114404
##$NCOEF= 0
##$NC_proc= 0
##$NLEV= 6
##$NOISF1= 3.799351
##$NOISF2= 2.8
##$NSP= 1
##$NTH_PI= 0
##$NZP= 0
##$OFFSET= 15.70392
##$PC= 1
##$PHC0= -24594.17
##$PHC1= 11.05268
##$PH_mod= 1
##$PKNL= yes
##$PPARMOD= 0
##$PSCAL= 0
##$PSIGN= 0
##$REVERSE= no
##$SF= 200.130013532006
##$SI= 16384
##$SIGF1= 3
##$SIGF2= 2
##$SINO= 400
##$SIOLD= 16384
##$SREGLST= <1H.CDCl3>
##$SSB= 0
##$STSI= 0
##$STSR= 0
##$SW_p= 3612.71676300578
##$SYMM= 0
##$S_DEV= 0
##$TDeff= 0
##$TDoff= 0
##$TI= <>
##$TILT= no
##$TM1= 0
##$TM2= 0
##$TOPLEV= 0
##$USERP1= <user>
##$USERP2= <user>
##$USERP3= <user>
##$USERP4= <user>
##$USERP5= <user>
##$WDW= 1
##$XDIM= 8192
##$YMAX_p= 0
##$YMIN_p= 0
$$ End of Bruker specific parameters
$$ ---------------------------------
##NTUPLES= NMR FID
##VAR_NAME=  TIME,          FID/REAL,        FID/IMAG
##SYMBOL=    X,             R,               I
##VAR_TYPE=  INDEPENDENT,   DEPENDENT,       DEPENDENT
##VAR_FORM=  AFFN,          ASDF,            ASDF
##VAR_DIM=   8192,          8192,            8192
##UNITS=     SECONDS,       ARBITRARY UNITS, ARBITRARY UNITS
##FACTOR=    0.0002768,     1,               1
##FIRST=     0,             0,               0
##LAST=      2.2672688,     0,               0
##MIN=       0,             -273362,         0
##MAX=       2.2672688,     303734,          0
$$ Real data points
##PAGE= N=1
##DATA TABLE= (X++(R..R)), XYDATA
$$ [...]
2513B404j426k00K27m26j257j49j58j825L45J456m85j42J66P07N34Q31L16j97
$$ 2404 978 778 1005 579 -678 -827 -985 -2810 -2465 -1009 -1494 -1636 -1470 -763 -229 602 918 721
2531G21R46m95O41Nm32j0m87l67q34J79j504K40J98o50PK37N95K98r7J302k3P37
$$ 721 1667 1172 1813 1818 1386 1376 889 522 -312 -133 -1637 -1397 -1199 -1849 -1842 -1605 -1010 -712 -809 493 470 1207
2553A207j48n8P77j50P62q80o28r5o27j024k32m98r7k9M72r33P34R82n28J156
$$ 1207 1059 1001 1778 1628 2390 1510 882 787 160 -864 -1096 -1594 -1691 -1720 -1248 -2181 -1447 -465 -993 163
2573A63P8K42R58K31M24p10L04l88p06O1o66l57J03j243K53L80j176k0j49J798
$$ 163 241 483 1441 1672 2096 1386 1690 1302 596 657 -9 -366 -263 -1506 -1253 -873 -2049 -2069 -2218 -420
2593d20n58J021o19J042O99J031n07K57l85O0p66k75M22j156q20o46R92r10r47
$$ -420 -978 43 -576 466 1165 2196 1689 1946 1561 1621 855 580 1002 -154 -974 -1620 -628 -1538 -2485
2612b485N24N99J19J171m62Q32R9O04J44L86k12P23o72k64o99K6r61m6o82m34
$$ -2485 -1961 -1362 -1243 -72 -534 298 397 1001 1145 1531 1319 2042 1370 1106 407 433 -528 -574 -1256 -1690
2632a690N80k74o49N44M94j27P23K35M99L50N03O09n14l27O03j49p32o41K2l18
$$ -1690 -1110 -1384 -2033 -1489 -995 -1122 -399 -164 335 685 1188 1797 1283 956 1559 1410 678 37 59 -259
2652b59q31L09O0p12p88P50L02J66K20M69J312j57j1K81N53K7k75k63l94m10l96
$$ -259 -1090 -781 -721 -1433 -2221 -1471 -1169 -1003 -783 -314 998 841 830 1111 1664 1691 1416 1153 759 349 -47
2673d7n62P9l73n31q34Q14J12m25J141r1O93J41N16O21R0M4K9k03J01j37q89k07
$$ -47 -609 -530 -903 -1434 -2268 -1454 -1342 -1767 -626 -717 -24 117 633 1254 1344 1388 1417 1214 1315 1178 289 82
2695H2M7p17n65n76J197n68j337L26M01J274K54R16L34j35j71R58M68j148P43
$$ 82 129 -588 -1153 -1729 -532 -1100 -2437 -2111 -1710 -436 -182 734 1068 933 762 1720 2188 1040 1783
2714A783n15j177L04k58r26m03j25k40K06l01K80L78N98k09L89R2J92J515p94
$$ 1783 1268 91 395 137 -789 -1192 -1317 -1557 -1351 -1652 -1372 -994 -396 -605 -216 -124 68 1583 789
2733G89R10m71N51O5j119j33j47r98K51n42J91M7q94l01P83l1L86k44P84P42m27
$$ 789 1699 1228 1779 1844 725 592 445 -553 -302 -844 -653 -606 -1500 -1801 -1018 -1049 -663 -907 -123 619 192
2754A92J730l94K08M83q44l15j9j061K03q07Jj46n06q39J249k83O0R1J280j60
$$ 192 1922 1528 1736 2219 1375 1060 1041 -20 183 -624 -623 -769 -1275 -2114 -865 -1148 -1088 -997 283 123
2774A23K87l14Q26M09j64k14J061o81p17m47l13l38k49J07n86k23j49J00M67N09
$$ 123 410 96 922 1331 1167 953 2014 1333 616 169 -144 -482 -731 -624 -1210 -1433 -1582 -1482 -1015 -506
2794e06j38L09M29L9P08K92j79N77L39q16n98k62K19o24k03K51n47j063L07O70
$$ -506 -644 -335 94 133 841 1133 954 1531 1870 1054 456 194 413 -211 -414 -163 -710 -1773 -1466 -796
2814g96p63m8J234M08o8R07j39M83J37Q0k10K78p24n42J19l37k10j031oJ03L3
$$ -796 -1559 -1607 -373 35 -33 874 735 1218 1355 1435 1225 1503 779 237 356 19 -191 -1222 -1228 -1125 -1092
2835a092o96M89K46R54m49M27N02N73j07m8N35m4L4l57o95k17k18o71j92L05J51
$$ -1092 -1788 -1299 -1053 -99 -548 -121 381 954 847 799 1334 1290 1324 967 272 55 -163 -834 -1026 -721 -570
2856e70j480P85P75r25M60Q21M78o4j22N33M72l39O14K31m63j37q53P0O3j306
$$ -570 -2050 -1265 -490 -1415 -955 -134 344 280 158 691 1163 824 1438 1669 1206 1069 216 286 349 -957
2876i57J26n67l48M08P40n81m3R78j57M92k2N13p2Q37L50o64j01j62k78k93n99
$$ -957 -831 -1398 -1746 -1338 -598 -1179 -1222 -244 -401 91 69 582 510 1347 1697 1033 932 770 492 199 -400
2897d00k34l59p48L33m15O43O72k61k48L94L28P19p3O73K85n34J123p99n75P00
$$ -400 -634 -993 -1741 -1408 -1823 -1180 -508 -769 -1017 -623 -295 424 351 1024 1309 775 1898 1099 524 1224
2917A224j350J044j335m89K03m40o5J7M68j092J458jL57j43J122m07P77j42O51
$$ 1224 -126 918 -417 -906 -703 -1143 -1208 -1191 -723 -1815 -357 -358 -1 -144 978 571 1348 1206 1857
2936A857k08r68J33r18L91j4n67m20j54K77l96n82M61j30L45O01PJ88P06P13P2
$$ 1857 1649 681 814 -104 287 273 -294 -714 -868 -591 -987 -1569 -1108 -1238 -893 -292 -285 -97 609 1322 1394
2957A394J35n98M5N51j104j379J100m34n6k87l69K23o42O18j166J362K43M43J86
$$ 1394 1529 931 976 1527 423 -956 144 -290 -346 -633 -1002 -779 -1421 -803 -1969 -607 -364 79 265
2976B65L86Q19n73K97Q75j102k28K09k18q23r06J03l84J75J04r35P68M38N3K12
$$ 265 651 1470 897 1194 2069 967 739 948 730 -93 -999 -896 -1280 -1105 -1001 -1936 -1168 -730 -677 -465
2996d65M30J206O9j008R98l44Q0M9L1m22N22j042o3L56j253j01l82j97o5K59O3
$$ -465 -35 1171 1240 232 1230 886 966 1015 1046 624 1146 104 41 397 -856 -957 -1339 -1536 -1601 -1342 -1279
3017a279J13J249r33P86L88P23k98K3N27N09p89m79o1j55j092J3m68K44M1m47
$$ -1279 -1166 83 -850 -64 324 1047 749 772 1299 1808 1019 540 479 324 -768 -755 -1223 -979 -938 -1385
3037a385l77O90l2N45R9P28L82o2K15L95K72r47K40m02j92r6k48L97p65r99P1
$$ -1385 -1762 -1072 -1104 -559 -460 268 650 588 803 1198 1470 523 763 361 169 73 -175 222 -543 -1542 -1471
3058a471N98J01l51M90j99Q07j41N96L23N14O77q82K4Lp75l97N60k64j118M16
$$ -1471 -873 -772 -1123 -633 -832 -25 -166 430 753 1267 1944 1062 1086 1089 314 -83 477 213 -905 -489
3078d89l28n20k17N61n22R32j85Q99l00J75L3P85P82n46L95j15k13p89k46J05
$$ -489 -817 -1337 -1554 -993 -1515 -583 -768 131 -169 6 39 824 1606 1060 1455 1340 1127 338 92 197
3098A97p9j70n35m36o69M91R59j72r2O94o95J093L52J58J07M08J19p19K54n51
$$ 197 118 -52 -587 -1023 -1692 -1201 -242 -414 -506 188 -507 586 938 1096 1203 1611 1730 1011 1265 714
3118G14o29M32k05j389M99o69M17l90M11l81P3P68N50K21M00o3J28l6n01P86o65
$$ 714 85 517 312 -1077 -578 -1247 -830 -1220 -809 -1190 -1117 -349 201 422 822 759 887 851 350 1136 471
3139D71j81O49r36L31q43k5j95m66O62l00o54Q34J56K04Q25l41P43p72P07M11
$$ 471 290 939 3 334 -509 -534 -729 -1195 -533 -833 -1487 -653 -497 -293 532 191 934 162 869 1280
3159A280K55K05l20o60p6o10r81n9M93L06p52k99p8J236k70k15N10L95N62k52
$$ 1280 1535 1740 1420 760 684 74 -907 -966 -473 -167 -919 -1218 -1296 -60 -330 -545 -35 360 922 670
3179F70k15O81m27k25k60L97n58J40k59j43p67k2k9N42k35M73l68K49O61l20K57
$$ 670 455 1136 709 484 224 621 63 203 -56 -199 -966 -988 -1017 -475 -710 -237 -605 -356 305 -15 242
3200B42M5L77M77L48p38L69p78k69k28N02q60j07l00N36j78m4j9k88m01J654j032
$$ 242 287 664 1141 1489 751 1120 342 73 -155 347 -513 -620 -920 -384 -562 -606 -625 -913 -1314 340 -692
3221f92Q91R10J62q03Q25k69o7K13m94m50o26K57L24p30k29J40n48J62j12J158
$$ -692 199 1109 1271 468 1293 1024 957 1170 676 226 -400 -143 181 -549 -778 -638 -1186 -1024 -1136 22
3241B2j10K39j6L63J37O09k24m14J43o48K55N04j139M28p50l46n77P50k18N4j21
$$ 22 -88 151 135 498 635 1244 1020 606 749 101 356 860 -279 149 -601 -947 -1524 -774 -992 -938 -1059
3262a059P01L97j178J384j20J283o25j21l3K04L21o17j44o74J39r89N75n14j39
$$ -1059 -358 39 -1139 245 125 1408 783 662 629 833 1154 537 393 -281 -142 -1131 -556 -1070 -1209
3281a209J38O4K00K18j82M29L87j13Q72K81o65L92j05R15m78q11n36j73L82r66
$$ -1209 -1071 -1007 -807 -589 -771 -342 45 -68 804 1085 420 812 707 1622 1144 333 -203 -376 6 -960
3301i60j1L52K9p15M0Q04J50P88j16l3J283p91N55p13l4p8K02q2q84l64J04m1
$$ -960 -971 -619 -590 -1305 -1265 -461 -311 477 361 328 1611 820 1375 662 628 550 752 670 -214 -578 -474 -515
3323e15J7M45q26o4j38N52k75k66J440j81P58r39M99J83P58m88q27K68l5o83Q49
$$ -515 -498 -53 -879 -943 -1081 -529 -804 -1070 370 189 947 8 507 690 1448 960 133 401 366 -317 532
3344E32jj201k23L57n53J05M05m88N59N26m29J054m32K79l51K58R12o00n48P14
$$ 532 531 -670 -893 -536 -1089 -984 -579 -1067 -508 18 -411 643 211 490 139 397 1309 709 161 875
3364H75n03o09n38q1N76n94N7l25Q43k55M77m13K94j39J448k90m59o63J070J7
$$ 875 372 -237 -775 -856 -280 -874 -817 -1142 -299 -554 -77 -490 -196 -335 1113 823 364 -299 771 788
3384G88J2j98j39R2j192MO11p73J76q04N25l50Q33M13L08m70N85j4m1Q19m56M18
$$ 788 800 602 463 555 -637 -633 -22 -795 -619 -1423 -898 -1248 -415 -2 306 -164 421 407 366 1185 729 1147
3406A147j091J575r58j0k89m78j043l01R12q10N60K88j87J25j15Q2O28M34k30
$$ 1147 56 1631 673 663 374 -104 -1147 -1448 -536 -1346 -786 -498 -685 -560 -675 -593 35 469 239
3425B39P47m92L1L72J06n94R6m91m20L79k28r02n24J321m04m23N28M41J152q99
$$ 239 986 494 525 897 1003 409 505 14 -406 -27 -255 -1157 -1681 -360 -764 -1187 -659 -218 934 35
3445C5M58J74n2Q4N32j39p51J444j497J43p28L5k57J71j80n65l81K64J24J016
$$ 35 493 667 615 699 1231 1092 341 1785 288 431 -297 -262 -519 -348 -528 -1093 -1474 -1210 -1086 -70
3465g0pN80l7N14p43Q39k34j78N76q73j94k10m40k24L87n01K20l0k49O93j21J017
$$ -70 -77 503 466 980 237 1076 842 664 1240 367 173 -37 -477 -701 -314 -815 -595 -625 -874 -181 -302 715
3487G15j027J03Q54p73M95N08K40j77L09p56l45jk28O9n70j55K4J29o66K35K24
$$ 715 -312 -209 645 -128 367 875 1115 938 1247 491 146 145 -83 -14 -584 -739 -715 -586 -1252 -1017 -793
3508g93M78j19Q4P68K49m47M39L89o14M86m48M37j24j124N71m38nl86p87M03L64
$$ -793 -315 -434 -350 418 667 220 659 1048 434 920 472 909 785 -339 232 -206 -211 -597 -1384 -981 -617
3529f17K96m31J50N5M84L49n23O05J599j574j75N25j39j96n8n23J83p88Q88Q5
$$ -617 -321 -752 -602 -547 -63 286 -237 368 1967 393 218 743 604 408 350 -173 10 -778 110 195
3549A95p29k91P79r24N76k55Q13o18R61N24Kq72L46J43r7N13o81k80n6n6l52q82
$$ 195 -534 -825 -46 -970 -394 -649 164 -454 507 1031 1033 161 507 650 553 1066 385 105 49 -7 -359 -1241
3571a241J78N2J458j254j40L07O65J17N50k55o1O90n27j35J18n86M75p19m4k10
$$ -1241 -1063 -1011 447 -807 -947 -640 25 142 692 437 376 1066 539 404 522 -64 411 -308 -352 -562
3591e62L92n73K66j36j44Q5N02L53k4n24O20N88j064R24J68n73k05P15j384J020
$$ -562 -170 -743 -477 -613 -757 -672 -170 183 159 -365 255 843 -221 703 871 298 93 808 -576 444
3611D44n3j064L35n04L66o53O12l63J41L35P62j63m43O62l74J191o42k49L84j225
$$ 444 391 -673 -338 -842 -476 -1129 -517 -880 -739 -404 358 195 -248 414 40 1231 589 340 724 -501
3631e01O09n88N67K27j29q74k10j62M58m85M82M24l45L81K83M55J36Q8k02J26
$$ -501 108 -480 87 314 185 -689 -899 -1061 -603 -1088 -606 -182 -527 -146 137 592 728 816 614 740
3651G40k51o73J89N0p45J33p14J040j01n70K05m94J275k30l63J34O26J49N53M06
$$ 740 489 -184 5 55 -690 -557 -1271 -231 -332 -902 -697 -1191 84 -146 -509 -375 251 400 953 1359
3671A359K66p57l84n8j29k11m8N77q49J94p24O4r0J58l79J100p11N65J80J86l49
$$ 1359 1625 868 484 426 297 86 38 615 -234 -40 -764 -700 -790 -632 -1011 89 -622 -57 123 309 -40
3692d0N63l37O33j96j04p93M40J48n45L8M13n00o93J22K89J88M90K60k20j69j
$$ -40 523 186 819 623 519 -274 166 314 -231 -193 220 -280 -973 -851 -562 -374 116 376 156 -13 -14
3713a4J0N92l0J75J60q8O69j147m04J50n69N96K67o38j34l2p10Q28O08n51k4P0
$$ -14 -4 588 558 733 893 805 1474 327 -77 73 -496 100 367 -271 -405 -437 -1147 -319 289 -262 -286 -216
3735b16j29N72P52j31q36P01L69j215J058o56k97l77O5J04l16K07k45l57R35r35
$$ -216 -345 227 979 848 12 713 1082 -133 925 269 -28 -405 -340 -236 -552 -345 -590 -947 -12 -947
3755i47N41J29O35N10r9l55M62p6k28j94J27k40N1j228Q64k82o8m10k30P63m68
$$ -947 -406 -277 358 868 769 414 876 800 572 378 505 265 316 -912 -48 -330 -398 -808 -1038 -275 -743
3776g43m60L66L10Q79l1l66M49q3m3J039q12L8n47nj7q68M0M25o89O19o59L86
$$ -743 -1203 -837 -527 352 321 -45 404 321 278 1317 505 543 -4 -9 -26 -894 -854 -429 -1118 -499 -1158 -772
3798g72N66O95q63K15L76K91K52Lj54j36j047J386p47K65r62N51n63j27O80l19
$$ -772 -206 489 -374 -159 217 508 760 763 609 473 -574 812 65 330 -632 -81 -644 -771 -91 -410
3818d10K62l77k55Q05J47n46Q02m25M87l93N01O83j226N32n83r64K24L55q5m04
$$ -410 -148 -525 -780 25 172 -374 428 3 490 97 598 1281 55 587 4 -960 -736 -381 -466 -870
3838h70L91l08N75j79M03n62J29O78m90L40O15m88N77O9R3n40k67P2m33R2j5J54
$$ -870 -479 -787 -212 -391 12 -550 -421 257 -233 107 722 234 811 880 973 433 166 238 -195 -103 -118 36
3860C6j17o16j59J066p09j41J673j109M05M5l34N02p20J63M57o59Q49n60K4m98
$$ 36 -81 -697 -856 210 -499 -640 1033 -76 329 374 40 542 -178 -15 442 -217 632 72 96 -402
3880d02J20p00P22L41j464J92J149r23Q44N97o05l69J452r28L72K05k53J13M50
$$ -402 -282 -982 -260 81 -1383 -1191 -42 -965 -121 476 -129 -498 954 26 398 603 350 463 913
3899I13j099K90L53o60K01M04p73l40m49K52J375o02M14j74O28o23J63rJ41m88
$$ 913 -186 104 457 -203 -2 402 -371 -711 -1160 -908 467 -135 279 105 733 110 273 264 405 -83
3919h3L02k28J09N44q52L13K64j216N33q55K98K90J01m6N79l74m8J297n5p65k19
$$ -83 219 -9 100 644 -208 105 369 -847 -314 -1169 -871 -581 -480 -526 53 -321 -369 928 873 108 -111
3940a11Q10k75J34j76R1q28O02r2p28J98K72n79k72M40k22J47p0k6N55J004l31
$$ -111 699 424 558 382 473 -355 247 155 -573 -375 -103 -682 -954 -514 -736 -589 -659 -685 -130 874 543
3961E43l21N77l38nO42j247O6M0j62K20p35m12J108n35m57P16k79O64Q14k24o13
$$ 543 222 799 461 456 1098 -149 -83 -43 -205 15 -720 -1132 -24 -559 -1016 -300 -579 85 899 675 62
3982F2k45N22J36L07J66m09o39L41N8o0j50k87Q3J86N72q55j64J69j96K67O0m28
$$ 62 -183 339 475 782 948 539 -100 241 299 239 89 -198 -115 71 643 -212 -376 -207 -403 -136 -76 -504
4004e04J102k19m4M48o87L25N72k78j253M74j14n5L37j64P0o99P28p42N88L79
$$ -504 598 379 335 783 96 421 993 715 -538 -64 -178 -233 104 -60 10 -689 39 -703 -115 264
4024B64l4r99J695o97J14P22j49n20L53o72k42L29j91m33m80O35k24L81o96K87
$$ 264 230 -769 926 229 343 1065 916 396 749 77 -165 164 -27 -460 -940 -305 -529 -148 -844 -557
4044e57O11K29q78L63J179k64l12l5J75L37o15J14j29j01Mm56k41J93n2l0J87
$$ -557 54 283 -595 -232 947 683 371 336 511 848 233 347 218 117 121 -335 -576 -383 -435 -465 -278
4065b78Q5k84K69l33J452m92q1K21K6K66l63J16j193O37N02r44L48P2l18j75j24
$$ -278 -193 -477 -208 -541 911 419 338 559 585 851 488 604 -589 48 550 -394 -46 26 -292 -467 -591
4086e91j29P27j25l97J98L64N89j08N02k94k32k59N87k96j029Q54k83n0k66j64
$$ -591 -720 7 -118 -515 -317 47 636 528 1030 736 504 245 832 536 -493 361 78 28 -238 -402
4106d02J87o53O77j58M35l51K48J3p2O7N89l52o43R31l18K54r77N84pjL47j756
$$ -402 -215 -868 -191 -349 86 -265 -17 -4 -76 -9 580 228 -415 516 198 452 -525 59 52 51 398 -1358
4128a358P19N45M56o99k87Q30m82O93Q7o02O46l76m43R10Q2L15r43R4n65P56m6
$$ -1358 -639 -94 362 -337 -624 206 -276 417 504 -98 548 172 -271 639 721 1036 93 187 -378 378 332
4149C32r58k57J79M45m82O11j0J86l41J042j072Q54K51l37O5K44m2L24j570J009
$$ 332 -626 -883 -704 -259 -741 -130 -140 46 -295 747 -325 529 780 443 508 752 710 1034 -536 473
4169D73N9n81N23r05k70K47J27k60K35R30r71M05L67L0o25N45K81n94M90j35l4
$$ 473 532 -49 474 -431 -701 -454 -327 -587 -352 578 -393 12 379 409 -216 329 610 16 506 371 337
4190C37o64J45Q04j176R66j261R02q99M68Q5M64l52J04M60K55o3N0K43Q3q14J29
$$ 337 -327 -182 622 -554 412 -849 53 -846 -378 -293 171 -181 -77 383 638 575 625 868 951 137 266
4211B66M09j62J24j146O20o40K07J08l65l4O18l23J73K84L6J27Q5Q1K86l5O48
$$ 266 675 513 637 -509 111 -529 -322 -214 -579 -613 5 -318 -145 139 175 302 387 468 754 719 1367
4232A367n14j97j168O10k5j66N53j281P63j015N32n58O49k44N76M6O92l02M38
$$ 1367 853 656 -512 98 73 -93 460 -821 -58 -1073 -541 -1099 -450 -694 -118 -72 620 318 756
4251G56p35L11N90k7p8j238J83M50m85K42l08J41p45P99o6p32L94r5L08Q79n43
$$ 756 21 332 922 895 817 -421 -238 212 -273 -31 -339 -198 -943 -144 -210 -942 -548 -643 -335 544 1
4272AJP75o16L3l7L37o11L01K07k81o39R9j27M49m79J78N39m30J57K30J31N0o39
$$ 1 2 777 161 194 157 494 -117 184 391 110 -529 -430 -557 -108 -587 -409 130 -300 -143 87 218 268 -371
4295c71O55Q32r42k0K62R5n51N18l87m42J0J065j209O87p24k62J38PP90M4k74
$$ -371 284 1116 174 154 416 511 -40 478 91 -351 -341 724 -485 202 -522 -784 -646 -639 151 195 -79
4316g9k94J186l27O44r30L31M1l30k53Q1P27p68o55P40m04j43J08K18J49k69N37
$$ -79 -373 813 486 1130 200 531 572 242 -11 70 797 29 -626 114 -290 -433 -325 -107 42 -227 310
4337C10j39O27p14l9O32L52j73j015O65j95k42k33L16k85l37m5Rk62J06j32J68
$$ 310 171 798 84 45 677 1029 856 -159 506 311 69 -164 152 -133 -470 -515 -506 -768 -662 -794 -626
4358f26J076l7k35N6M49m40k08M36J51q80R7K17p5o39o7P07L00p37o86K6R44L28
$$ -626 450 413 178 234 683 243 35 471 622 -258 -161 56 -19 -658 -725 -18 282 -455 -1141 -1115 -171 157
4380A57k11M36L7o15P36J92N2J04j94P4m91o73O01p09Q67l12r33k6R60l03o84
$$ 157 -54 382 419 -196 540 732 784 888 694 768 277 -396 205 -504 363 51 -882 -908 52 -251 -935
4401i35Q79lL72K25n0l68L38o1J66m49j35J25J2j99k8L4l68k01M47o09L10J019
$$ -935 -56 -59 313 538 488 120 458 397 563 114 -21 104 116 -83 -111 -77 -445 -646 -199 -808 -498 521
4423E21J49p03k32m9J3L27l9M88n2l54N8k13J01J001j428qK06q01P70n26O01m0
$$ 521 670 -33 -265 -314 -301 26 -13 475 423 69 127 -86 15 1016 -412 -420 -214 -1015 -245 -771 -170 -210
4445b10m4l19K74O21p07R41k71j16N32r14L05N09n03q43O89J05j6p84M29k85N14
$$ -210 -254 -573 -299 322 -385 556 285 169 701 -213 92 601 98 -745 -56 49 33 -751 -322 -607 -93
4466i3k81m86N19O1J98n98P90P04j11o00L94m28l09N31K75j31L05j569J100p61
$$ -93 -374 -860 -341 -280 -82 -680 110 814 703 103 497 69 -240 291 566 435 740 -829 271 -490
4486d90M48m55L96k74R7L46n09N00j03Q56n40K96m44K11j66m5L25RK24k2l18m78
$$ -490 -42 -497 -101 -375 -278 68 -441 59 -44 812 272 568 124 335 169 124 449 458 682 660 342 -136
4508a36Rr87O31N20o3o37K72N12M73l89Q1J7L94j088J372l98J59j180O11J34p70
$$ -136 -127 -1114 -483 37 -26 -663 -391 121 594 205 286 303 697 -391 981 583 742 -438 173 307 -463
4529d63q28J218q1r46R37K08m33P59j40n07N90q9p0L09k1J47l08K11j14n16j49
$$ -463 -1291 -73 -154 -1100 -163 45 -388 371 231 -276 314 225 155 464 443 590 282 493 379 -137 -286
4550b86m54M21o99Q07l70M3J02r4N52L60o24O07m11o82N49O86M74l44l01O20r53
$$ -286 -740 -319 -1018 -211 -581 -538 -436 -530 22 382 -242 365 -46 -728 -179 507 981 637 336 956 3
4571Cn05O29l06J6l61K0ok23Q21k43l89N31M41O2J11r42P22m53O29p7m65j27N
$$ 3 -502 127 -179 -163 -524 -504 -510 -733 88 -155 -544 -13 428 490 601 -341 381 -72 557 480 15 -112 -107
4594a07k16O27n13M67m60p64Q68o04kQ34m31J238r60M52n94R93k59l51L54q60
$$ -107 -323 304 -209 258 -202 -966 -98 -702 -704 130 -301 937 -23 429 -165 828 569 218 572 -288
4614b88M33k13l1l15K79l92J55J68l5M78j43n61K93M86L02n44k24L12L90m41R7
$$ -288 145 -68 -99 -414 -135 -527 -372 -204 -239 239 96 -465 -172 314 616 72 -152 160 550 109 206
4635B06m82m1K95M93p63J74L66j57j09o0K4j010O06O98k11j54J96J27l69L75M82
$$ 206 -276 -317 -22 471 -292 -118 248 91 -18 -78 -54 -1064 -458 240 29 -125 71 198 -171 204 686
4656F86m12j82N46o70k00L12k62j35M14m40M20J15N40r36J39m14J52P10o42Q90
$$ 686 274 92 638 -32 -232 80 -182 -317 97 -343 77 192 732 -204 -65 -479 -327 383 -259 631
4676F31k04j00m62O69r19K87J96M28n54n83J90L6K30L91m10o77J274m66m46R12
$$ 631 427 327 -135 534 -385 -98 98 526 -28 -611 -421 -385 -155 236 -174 -851 423 -43 -489 423
4696D23o4K66k79J87M0k15n02R66j088M97j05n17L4L19L5l97l8q9L84n52P84J05
$$ 423 359 625 346 533 573 358 -144 822 -266 231 126 -391 -357 -38 -3 -400 -438 -527 -143 -695 89 194
4718A94o4l34Q62n79K73m0o97Q39n41Qj66l90N74K4m75N21n2j20n69R30j86J25
$$ 194 130 -204 658 79 352 312 -385 454 -87 -79 -245 -635 -61 -37 -512 9 -43 -163 -732 198 12 137
4740A37Q5m96M71J6o30N40P22q20m12P05J9j08j35P0o21M64L68j293O10r6L36
$$ 137 222 -274 197 213 -417 123 845 25 -387 318 337 229 94 164 -457 7 375 -918 -308 -404 -68
4761f8K91J7m10J373j203N5N79r73L30P14l64l27q4O0o93KK87K72l49M06n98L68
$$ -68 223 240 -170 1203 0 55 634 -339 -9 705 341 14 -70 -10 -703 -701 -414 -142 -491 -85 -683 -315
4783c15R26l68k68K02O76M5n99m30P25J24p24J93J09k65J44J4m56n56r5N54M79
$$ -315 611 243 -25 177 853 898 299 -131 594 718 -6 187 296 31 175 189 -267 -823 -918 -364 115
4804A15J64l26M21j19J43j16n48O64m81N14K13j98k96j82J81k75l30J5J148q38
$$ 115 279 -47 374 255 398 282 -266 398 -83 431 644 446 150 -32 149 -126 -456 -441 707 -131
4824a31J96M85l92K71q81O87j99M45L8j15k31K98n25N42k80k21l8L19J82m75K5
$$ -131 65 550 158 429 -452 235 36 481 519 404 173 471 -54 488 208 -13 -51 268 450 -25 0
4845@l59J01L83o03M82O50p77J39j04N55p10P73l96J79N4k01o36J82N72n96K54
$$ 0 -359 -258 125 -478 4 654 -123 16 -88 467 -243 530 134 313 367 166 -470 -288 284 -312 -58
4866e8K58P4q57M49n1L65k4j68n64R15k98O58K86l75m9m91m48nM32P3l62J18k88
$$ -58 200 274 -583 -134 -185 180 156 -12 -576 339 41 699 985 610 561 70 -378 -383 49 122 -240 -122 -410
4889d10q5N87O41r01L61L84K6N41r99K92l84L06O3m24P9L51k18l55O19m55q30
$$ -410 -495 92 733 -168 193 577 603 1144 145 437 53 359 422 -2 77 428 210 -145 474 19 -811
4910h11O54K69m74M50q2o03L75L93n23Q61K77o22L50n06J52J33p26P74q79Q58
$$ -811 -157 112 -362 88 6 -597 -222 171 -352 509 786 164 514 8 160 293 -433 341 -538 320
4930C20p17J99m58L61J90l62P4J94J128j578R12l68n20J805j000l7Q20j112K70
$$ 320 -397 -198 -656 -295 -105 -467 -393 -199 929 -649 263 -105 -625 1180 180 143 963 -149 121
4949A21N67p54L91Q4m22l92R4o59M94j41L85M27N41q07J53K99l85O87q36L34k15
$$ 121 688 -66 325 409 -13 -405 -311 -970 -476 -617 -232 195 736 -71 82 381 -4 683 -153 181 -34
4970c4R6p73J107n88P4J4k15lo1M8K83N24p66l4N79J13j072J336l36o72J288q95
$$ -34 62 -711 396 -192 -118 -104 -319 -322 -383 -335 -52 472 -294 -328 251 364 -708 628 292 -380 908 13
4992A3K71N20j023MM14j7o09L73l61m11J216o20J04J11nJ7N09j72J47q68J015
$$ 13 284 804 -219 -215 199 182 -427 -54 -415 -826 390 -230 -126 -15 -20 -3 506 334 481 -387 628
5013F28N4j452R73N99k36m38o6j38k22N1l80N69O52j300M90L90j8q0M69k44m76
$$ 628 682 -770 203 802 566 128 62 -76 -298 -247 -627 -58 594 -706 -216 174 156 76 545 301 -175
5034a75K46J40N09q0j124K67j96M82m66k93O55j85J87k07K01l10M73k74K12j97
$$ -175 71 211 720 640 -484 -217 -413 69 -397 -690 -35 -220 -33 -240 -39 -349 124 -150 62 -135
5054a35O33k5n81J00O91j204J314n11n41l44Q64j060P80J59l83K76m47J024o66
$$ -135 498 473 -108 -8 683 -521 793 282 -259 -603 261 -799 -19 140 -243 33 -414 610 -56
5073e6M43Ql61n47O92m57P9Q84m93l4j20N10p79k35l32L83M06j51l4J89m11m3
$$ -56 387 395 34 -513 179 -278 -199 685 192 158 38 548 -231 -466 -798 -415 -9 -160 -194 -5 -416 -459
5095d59P06k05k24O82l01L56L2k09n31R2k07p50K97L84K26J65K77j534N48J41
$$ -459 247 42 -182 500 199 555 587 378 -153 -61 -268 -1018 -721 -337 -111 54 331 -1203 -655 -514
5115e14k50O79p05Q43j12o3M30n83J23p1L51K36o39J442q99k28p87Q26j24l6m48
$$ -514 -764 -85 -790 53 -59 -122 308 -275 -152 -223 128 364 -275 1167 268 40 -747 79 -45 -81 -529
5136e29M08L55m91N47J40J03j080J042k28J55K12Q0l30l52M7p1K49m83j98M06
$$ -529 -121 234 -257 290 430 533 -547 495 267 422 634 714 384 32 79 8 257 -226 -424 -18
5156a8k00p9j93o4J08P24m22M40P6o03K35M7P35o3n03p0j60Ll23k94L60j6P7K62
$$ -18 -218 -297 -490 -554 -446 278 -144 296 372 -231 4 51 786 723 220 150 -10 -7 -330 -624 -264 -280 -203 59
5180E9m17l5J90j46J50M5k8O08M5k11L40L2n97K77r65R5R27p10J4k93k68L49P15
$$ 59 -358 -393 -203 -349 -199 -154 -182 426 471 260 600 632 35 312 -653 -558 369 -341 -327 -620 -888 -539 176
5203A76l40M6l49k39P69K87k35J86%j02J38k15k19O94j77p56O58o89N23o10l02
$$ 176 -164 -118 -467 -706 63 350 115 301 301 199 337 122 -97 597 420 -336 322 -367 156 -454 -756
5224g56L46N82p88Q86P37j041l4J85m61K38J78Q9R1K89l15j61M47j031L25j18
$$ -756 -410 172 -616 270 1007 -34 -68 117 -344 -106 72 161 252 541 226 65 512 -519 -194 -312
5244c12P15J82j250Q01J8o78J142l46l43N72r44J082m14J71K91n23l52Q5J49r2
$$ -312 403 585 -665 136 154 -524 618 272 -71 501 -443 639 225 396 687 164 -188 -103 46 -46
5264d6L82o56L96o29P41j350J8J294L09q7n59R95q39Q6J00q81l12Q87N06l31q0
$$ -46 336 -320 76 -553 188 -1162 -1144 150 459 372 -187 808 -31 55 155 -726 -1038 -151 355 24 -56
5285e6P15j340M08l67l3M65M6m08j13R33l07K7nk81R36j33k83L34q01M03R84n63
$$ -56 659 -681 -273 -640 -673 -208 -162 -570 -683 250 -57 -30 -35 -316 620 487 204 538 -263 140 1124 561
5307E61j51m93O95q47O34o11p2m84P81M18r46L05OK53o97J060n15Q66r69N53j075
$$ 561 410 -83 612 -235 399 -212 -284 -768 13 431 -515 -210 -204 49 -648 412 -103 763 -206 347 -728
5328g28J590j177M48m80J55N07j007j07O98K59n23K57K31J10K1m15N55k58o51
$$ -728 862 -315 133 -347 -192 315 -692 -799 -101 158 -365 -108 123 233 254 -161 394 136 -515
5347e15J176j13r75O92j05l1j30k5J00M9K22N81j045m71K58j28j2J76L23j4N00
$$ -515 661 548 -427 265 160 129 -1 -26 74 123 345 926 -119 -590 -332 -460 -472 -296 27 13 513
5368E13L79K69l76j71j60K03k30n60K09m33N10M16p69m20K84J30Q45l62l87N60
$$ 513 892 1161 785 614 454 657 427 -133 76 -357 153 569 -200 -620 -336 -206 639 277 -110 450
5388D50q85J002p67O1Q21m42O9M7l3L39r53J28O37j84p17k4j78P9O24L65k13J73
$$ 450 -435 567 -200 -139 682 240 309 356 323 662 -291 -163 474 290 -427 -451 -629 -550 74 439 226 399
5410C99q29O84K20N6m65P8R4j50q3p41N17O47l35l00J41J31k23O68k41j17k77
$$ 399 -430 254 474 530 65 143 237 87 4 -737 -220 427 92 -208 -67 64 -159 509 268 151 -126
5431a26m76K55l3Q43L26r76K97r8j93P36q38K24%k47J51p9k31o9Q22q62O20J07
$$ -126 -602 -347 -380 463 789 -187 110 12 -181 555 -283 -59 -59 -306 -155 -234 -465 -534 288 -574 46 153
5453A53p74L92M84o3q9J24K23o43k0O75n70O46r53J59k26J301r79n74P09o3J79
$$ 153 -621 -229 255 192 103 227 450 -193 -213 462 -108 538 -415 -256 -482 819 -160 -734 -25 -88 91
5474I1o53P51J73k31J21J92n47O33o40N03J07m15K65R7l96J48o87L07M91l82J00
$$ 91 -562 189 362 131 252 444 -103 530 -110 393 500 85 350 447 51 199 -488 -181 310 -72 28
5495B8l23J030j256R23q40L20j93N68L93m70K87q12J022m59n28j39Q35l40k07
$$ 28 -295 735 -521 402 -438 -118 -311 257 650 180 467 -345 677 218 -310 -449 386 46 -161
5514a61j90N2k8L47n42L06N33n29O9J52k41L2O74l18o25M83q7j81m88O49m90l22
$$ -161 -351 -299 -327 20 -522 -216 317 -212 -143 9 -232 -200 474 156 -469 14 -73 -254 -742 -93 -583 -905
5536i05J127m84J60l40Q10j7k97r0n2k88K18O08J35k96k67k2L42j59n0j57J61
$$ -905 222 -262 -102 -442 368 351 54 -36 -88 -376 -158 450 585 289 22 0 342 183 133 -24 137
5557A37m4k90L15j77m57M6j07Q60n42R47m92m90O98j81l19k0N37k21q2J07j26
$$ 137 93 -197 118 -59 -516 -470 -577 283 -259 688 196 -294 404 223 -96 -116 421 200 118 225 99
5578I9l61n8J1l82J067r76O31k14K24pK3J71j24J29k55K61j65O97q74N4J0l24
$$ 99 -262 -320 -309 -691 376 -600 31 -183 41 34 57 228 104 233 -22 239 74 771 -103 -49 -39 -363
5600c63K25o6N95o03M42l98J62J86p17Q50L7n8j017J000j58k29O97k98K15l94
$$ -363 -138 -204 391 -212 230 -168 -6 180 -537 313 350 292 -725 275 117 -112 585 287 502 108
5620A08q09L44J30m53P13k30R88J11r22L35q55O02K32p67M38N26p54J141o85n54
$$ 108 -701 -357 -227 -680 33 -197 791 902 -20 315 -540 62 294 -473 -35 491 -263 878 193 -361
5640c61L85OO6l03P0l78M15L44o53Q6K34j1N3m47K72j98L26O47N4p95K25p02M32
$$ -361 24 30 96 -207 -137 -515 -100 244 -409 -323 -89 -100 -47 -494 -222 -420 -94 553 607 -188 37 -665 -233
5663b33O88o23L46l05L81l99R0k66j8j3O45m44J46l51P2j67j3J062k99l33N44
$$ -233 455 -168 178 -127 254 -145 -55 -321 -339 -352 293 -151 -5 -356 -284 -451 -464 598 299 -34 510
5684E10j019N41R77q18n13N36k18m87L87j28n9L76k95RL64L24q51rP26K8L29m26
$$ 510 -509 32 1009 191 -322 214 -4 -491 -104 -232 -291 85 -210 -201 163 487 -364 -373 353 381 710 284
5706B84J07p66K70J371j236k72N37l73n75K243j827K46k23K58r8O95n11q6l36
$$ 284 391 -375 -105 1266 30 -242 295 -78 -653 1590 -237 9 -214 44 -54 641 130 44 -292
5725b92J06J22R55j134l59M97J68m77N26J245o99o90m7n76Q45m99M77LQ8m09J323
$$ -292 -186 -64 891 -243 -602 -105 63 -414 112 1357 658 -32 -79 -655 190 -309 168 171 259 -150 1173
5746A173j550R1Q09L37r52K52N39l84m11K19m16o3M11J94o02Q01j074J5M93j69
$$ 1173 -377 -286 523 860 -92 160 699 315 -96 123 -293 -356 55 249 -353 448 -626 -611 -118 -287
5766b87M07J35L64p00q4O87J8k82j5j8j02l09K42o14J400m90k57m10K86J27n42
$$ -287 120 255 619 -81 -165 522 540 258 243 225 123 -186 56 -558 842 352 95 -315 -29 98 -444
5787d44O8Q64j208Q26K83l92l15K88j59M88Q2l39l6L51m54K0P9l8j94n62R44K47
$$ -444 -376 488 -720 106 389 -3 -318 -30 -189 299 381 42 6 357 -97 -77 2 -36 -230 -792 152 399
5809C99p43m04J008j284J091O36j378K65O74p76J215j489K74m2M23K79j81J22
$$ 399 -344 -748 260 -1024 67 703 -675 -410 264 -512 703 -786 -512 -554 -131 148 -33 89
5827H9k94K68o53Q42j94k2k57Q60j165N77n64J97L08j04K04k91J62j15j52J0J30
$$ 89 -205 63 -590 252 58 36 -221 639 -526 51 -513 -316 -8 -112 92 -199 -37 -152 -304 -294 -164
5848a64j97L35K20j61p80N79J75R1N4L40n74J11m0r2O37o8j67J19l90M46m15k31
$$ -164 -361 -26 194 33 -747 -168 7 98 152 492 -82 29 -11 -103 534 466 299 418 28 474 59 -172
5870a72M54q81P62q05N02O40l55R2p74L79J71K82n37r0r0J58N82p1q30L87N82
$$ -172 282 -599 163 -642 -140 500 145 237 -537 -158 13 295 -242 -332 -422 -264 318 247 -583 -196 386
5891C86k89k61l97L01j61L22O6k82Q15j28l07k38M5R24j035Q87l27j91k44o87
$$ 386 97 -164 -561 -260 -421 -99 -33 -315 500 372 65 -173 -128 796 -239 648 321 130 -114 -801
5911h01J37Q24k3n63M95n7m46J03J4P5L70J27o22P74M05o89J062j271k1Q92k68
$$ -801 -664 160 137 -426 69 12 -434 -331 -317 -242 128 255 -367 407 812 123 1185 -86 -107 785 517
5932E17R9n03j97j07L4O56L42n73l61K23K31M57r30k04j64R76q53M07p1J84P65
$$ 517 616 113 -84 -191 -157 499 841 268 -93 130 361 818 -112 -316 -480 496 -357 50 -21 163 928
5953I28j529J282K84j002R6p0N98o57j21m74N7j30L18Q32j026R68k60K2k01R67
$$ 928 -601 681 965 -37 59 -11 587 -70 -191 -665 -608 -738 -420 412 -614 354 94 116 -85 882
5973H82p54j09J91R5o30P42q21N05L1m19J92q48O34M67j36j20K69o63O88P9k96
$$ 882 128 19 210 305 -325 417 -404 101 132 -287 -95 -943 -309 158 22 -98 171 -492 196 275 -21
5994b1L28l24L65m3N1m58R82o48n74N51j7j83n20L29o70J119L35j86q53P22K66
$$ -21 307 -17 348 305 356 -102 880 232 -342 209 192 9 -511 -182 -852 267 602 416 -437 285 551
6015E51n24n17N57m17R12o12L10j30p89L61N2J61q9k6K78n99O23j53O39j78j028
$$ 551 27 -490 67 -350 562 -50 260 130 -659 -298 -246 -85 -174 -200 78 -521 102 -51 588 410 -618
6036f18J33L96K80Mj83Q03l04l92l47M06M83p51L3o63J081q45J75J24K9p3l7J081
$$ -618 -485 -89 191 195 12 815 511 119 -228 178 661 -90 -57 -720 361 -484 -309 -185 -156 -229 -266 815
6058H15r26m1Q41j234RJ205p7k33l78j74K50m2k20L32J53j70k63N32k80n10J9
$$ 815 -111 -152 689 -545 -536 669 592 359 -19 -193 57 15 -205 127 280 110 -153 379 99 -411 -392
6079c92M23L51o45Q33n62K21J35k50j13J47K82j28n16M48l05J6K23J32l31j216
$$ -392 31 382 -263 570 8 229 364 114 1 148 430 302 -214 234 -71 -55 168 300 -31 -1247
6099a247J537p65k12J491p80p0nJ72o5N40l01J60R0j2l44j390K40P88L53o44J96
$$ -1247 290 -475 -687 804 24 -46 -51 121 56 596 295 455 545 533 189 -1201 -961 -173 180 -464 -268
6120b68N7r3J21Q82k96l07l0L33n30J23M6j03L03L28j05n60j49K54k78k47J05
$$ -268 -211 -304 -183 699 403 96 66 399 -131 -8 38 -65 238 566 461 -99 -248 6 -272 -519 -414
6141d14n42M61N18J1j139O48M94M35O34o91l00j94Q94p77K80J0j04n20L97p35
$$ -414 -956 -495 23 34 -1105 -457 37 472 1106 415 115 -79 815 38 318 328 224 -296 101 -634
6161f34N18K97m67P86o28O03n76l22M42m40Q78l53P38k81o0n84j50N51m9k87k21
$$ -634 -116 181 -286 500 -128 475 -101 -423 19 -421 457 104 842 561 501 -83 -233 318 269 -18 -239
6182b39k80k70P26m1k9K26n47L88n7N66p82O51r6Q68j288P44Ln48l88J066o46
$$ -239 -519 -789 -63 -104 -133 93 -454 -66 -123 443 -339 312 216 1084 -204 540 543 -5 -393 673 27
6203B7j17j30N16o50Q5m09M18P78K5o59K55O7n0L26p33M16l10j68q1R35r59J72
$$ 27 -90 -220 296 -354 -269 -678 -260 518 543 -116 139 206 156 482 -251 165 -145 -313 -394 541 -418 -246
6225b46j44K82j86R39q34K41Q2p42M15N0j2L87J02r78Q09K47o60J20P44l93J30
$$ -246 -390 -108 -294 645 -189 52 134 -608 -193 -143 -155 232 334 -644 165 412 -248 -128 616 223 353
6246C53j84q16J94M18k95k50k99M66N26K32p78N29J24L5K58n42O55l47m46N43
$$ 353 169 -647 -453 -35 -330 -580 -879 -413 113 345 -433 96 220 255 513 -29 626 279 -167 376
6266C76p37K14M60J24q80N84K95o23M01M06p12p93J092L47l16j23l3L45n15K00
$$ 376 -361 -147 313 437 -443 141 436 -187 214 620 -92 -885 207 554 238 115 82 427 -88 112
6286A12k3M97L5r43L17m18J317l03m96r1j8J69m03k84K41L81M52q53J35j43J33
$$ 112 89 586 621 -322 -5 -423 894 591 95 4 -14 155 -248 -532 -291 90 542 -311 -176 -319 -186
6307a86K11k1k88N97l28J69k92N55q58L28O34j007J016J52m96j33j8R2m43MJ20
$$ -186 25 4 -284 313 -15 154 -138 417 -441 -113 521 -486 530 682 186 53 35 127 -316 -312 -192
6328a92K85N17k72j155P34L04P0r45J222m66o58L89O60r50O06j62j5k25K45R0
$$ -192 93 610 338 -817 -83 221 291 -654 568 102 -556 -167 493 -457 149 -13 -28 -253 -8 82
6348H2k57M40O71m83n06N31m39k14j31k12O6M29l02J41j93o9P25o1J12j169L03
$$ 82 -175 265 936 453 -53 478 39 -175 -306 -518 -452 -23 -325 -184 -377 -446 279 218 330 -839 -536
6369e36L90m5L5M29q9L74o4R0j101R89K8m26l66K37L70m44J86k43k07j94N96K1
$$ -536 -146 -191 -156 273 184 558 494 584 -517 472 500 74 -292 -55 315 -129 57 -186 -393 -587 9 30
6391C0M63n6l28j32J94R4K81j95Q3p34J077p68k6l25P20p69N0o7M22l71M34l48
$$ 30 493 437 109 -23 171 265 546 351 434 -300 777 9 -17 -342 378 -391 -341 -408 14 -357 77 -271
6413b71N48k6r62O69J35Q74q93J08j95p26J223J61k57L82p52O88m90m48M13p9
$$ -271 277 251 -711 -42 93 967 74 182 -13 -739 484 645 388 770 18 706 216 -232 181 102
6433A02m20N74j24pj71L98o3m37M35j27N0l73N44k39q54R57p7R9r38P84n51M93
$$ 102 -318 256 132 125 -46 352 289 -148 287 160 210 -163 381 142 -712 245 168 267 -671 113 -438 55
6455E5P5O89n18n2n28O93l61m6L59k40J72k25k65O88m37M77m10l2m44J71K5k59
$$ 55 130 819 301 249 -279 414 53 7 366 126 298 73 -192 496 59 536 126 94 -350 -179 -154 -413
6477d13K07J44N83m89K38J65l18P02j245P39j49nK01p58L84R9o39K81R91j182
$$ -413 -206 -62 521 32 270 435 117 819 -426 313 164 159 360 -398 -14 85 -554 -273 718 -464
6497d64P89l77j61n0L29j68o41P42k40R73r97P04o8L60n81k52l46M2L66j76N2
$$ -464 325 -52 -213 -263 66 -102 -743 -1 -241 732 -265 439 371 731 150 -102 -448 -406 -40 -216 -164
6518a64O7j62k78O94m72KK67k97P91m66k31L14J7J62K58p19N16k45lJ99k22K70
$$ -164 -97 -259 -537 157 -315 -313 -46 -343 448 -18 -249 65 82 244 502 -217 299 54 51 250 28 298
6540B98j69n55J258p67o62N71k64L14l18n16P35J487j278n19O91N79o74o80J176
$$ 298 129 -426 832 65 -597 -26 -290 24 -294 -810 -75 1412 134 -385 306 885 211 -469 707
6559G07j095K76O6L09L3p53N78p32M63l65R21k35l26Q6j60P92p00O52o97P45k19
$$ 707 -388 -112 -46 263 296 -457 121 -611 -148 -513 408 173 -153 -67 -227 565 -135 517 -180 565 346
6580C46n44P24m87m97P37q05P86Q7m21o4M5P9K97o85J95M83K4r39R23j42m77J7
$$ 346 -198 526 39 -458 279 -526 260 347 -74 -138 -93 -14 283 -402 -207 276 300 -639 284 142 -335 -318
6602c18O67p44O81K2j061M20J71q14J319p42J84K82K31l84K31n9l45O22k19L1
$$ -318 349 -395 286 308 -753 -333 -162 -976 343 -399 -215 67 298 -86 145 86 -259 363 144 175
6622A75K62O5m69q3m70N52M86o22J35M71p74j03j55Q36J76j072L71N02R5n17J00
$$ 175 437 502 33 -50 -520 32 518 -104 31 502 -272 -375 -530 306 482 -590 -219 283 378 -139 -39
6643c9j56N99o85p6J84R33p51j85l28L16J28m05J22L69l60P01p76M30P0L68J18
$$ -39 -195 404 -281 -357 -173 760 9 -176 -504 -188 -60 -465 -343 26 -334 367 -409 21 91 459 577
6664E77j054Q43n73l00p1N37O34l64P46r55m52O96j17j17o01N92j36j30P5M02
$$ 577 -477 366 -207 -507 -578 -41 593 229 975 20 -432 264 147 30 -571 21 -115 -245 -170 232
6684B32j7K51l15P00r37R9M68j92m5k79l73K64m99J38L93K07m46k56L81o2l11
$$ 232 215 466 151 851 -86 13 481 289 244 -35 -408 -144 -643 -505 -112 95 -351 -607 -226 -288 -599
6705e99N78m86R21j50m69N06m36l82K92M59J63l4r6n68l6l40R61J79q54l75O90
$$ -599 -21 -507 414 264 -205 301 -135 -517 -225 234 397 363 267 -301 -337 -677 284 463 -391 -766 -76
6726g6P99r53j75O25J25o92J70j09M04J83p36Q58j58j48J82M25j270N36q2L07
$$ -76 723 -230 -405 220 345 -347 -177 -286 118 301 -435 423 265 117 299 724 -546 -10 -92 215
6746B15j97Q6k46O64o33r7l44L85l2K46o7K78M56l53N5m08o6k75J13L55k97R15
$$ 215 18 104 -142 522 -111 -208 -552 -167 -199 47 -20 258 714 361 416 8 -58 -333 -220 135 -162 753
6768G53q94N43l05K0k02n8M36p56K88K3n72J153N55j056k00L0O58l14p7J3k19
$$ 753 -141 402 97 117 -85 -143 293 -463 -175 -152 -724 429 984 -72 -272 -242 416 102 25 38 -181
6789a81N31l87q34O29J69K87n6k48k95J79N41l46Q9l23L68n35P27J10m81M71o87
$$ -181 350 -37 -871 -242 -73 214 158 -90 -385 -206 335 -11 78 -245 123 -412 315 425 -56 415 -272
6810b72K30m70J180p97nL27n67N37j40k62O66J85o21O3k25k75Q39R31j335m74
$$ -272 -42 -512 668 -129 -134 193 -374 163 23 -239 427 612 -9 54 -171 -446 393 1324 -11 -485
6830d85L30J80J2Q9qk88N41p78M19P8J9M99l21n9l34j6K67p04L90K81MJ23r28
$$ -485 -155 25 37 126 118 -170 371 -407 12 90 109 608 287 228 -106 -122 145 -559 -169 112 116 239 -689
6853f89R19k43l12J17K19p34J32P27o8n57K80l00P02r3J22n03M36P5N92j250L66
$$ -689 230 -13 -325 -208 11 -723 -591 136 68 -489 -209 -509 193 100 222 -281 155 230 822 -428 -62
6874f2L42K20q69P19q97O43j55k67o3K43Q07Oo74J98M4o68N15j054Q30R4q1P43
$$ -62 280 500 -369 350 -547 96 -59 -326 -389 -146 661 667 -7 191 235 -433 82 -972 -142 -48 -129 614
6896F14l90k43o11M22l59M7N64L37j88m65N29j46K7m01M57j64K19M73l78l70n1
$$ 614 224 -19 -630 -208 -567 -520 44 381 193 -272 257 111 138 -263 194 30 249 722 344 -26 -77
6917g7J98K06k56P4L3n7J10k32k59P7N40k52l68J01q9P44m88m90J054o32J0kM41
$$ -77 121 327 71 145 178 121 231 -1 -260 -183 357 105 -263 -162 -251 493 5 -485 569 -63 -53 -55 386
6940C86p71QK52M60n50J52j040J058l16N93L44p43j61O91o17N28L94n74O51p35
$$ 386 -385 -377 -125 335 -215 -63 -1103 -45 -361 232 576 -167 -328 363 -254 274 668 94 745 10
6960A0l02J32l65O80K08l71Q74j572J59L49L85o14K26K86o5o07J19p1R67J60k44
$$ 10 -292 -160 -525 155 363 -8 866 -706 -547 -198 187 -427 -201 85 20 -587 -468 -539 428 588 344
6981C44k14j09O1p8j80o22O54k46k44K8K35P15p96Q17j18n12J47Q5Q73K0r18N04
$$ 344 130 21 82 4 -176 -798 -144 -390 -634 -606 -371 344 -452 365 247 -265 -118 -33 840 860 -58 446
7003D46j25J13p7o6o42M15J64j019J140l01l36k63J354j682P10J00J5O01l0k02
$$ 446 321 434 357 291 -351 64 228 -791 349 48 -288 -551 803 -879 -169 -69 -54 547 517 315
7023C15j78o13J69M21L11o28m38J074r24k89M23k28K19N32J86n65J35L6n29J03
$$ 315 137 -476 -307 114 425 -203 -641 433 -491 -780 -357 -585 -366 166 352 -213 -78 -42 -571 -468
7043d68J082m70k00L93N3J4r9j567R11L23m4K16p08k11N37m9J33l44j41J207k14
$$ -468 614 144 -56 337 390 404 305 -1262 -351 -28 -72 144 -564 -775 -238 -287 -154 -498 -639 568 354
7064C54q87J13L72o37R58l9N00n45p70J280j475N05O58k95j12o01M11j274Q55
$$ 354 -533 -420 -48 -685 273 234 734 189 -581 699 -776 -271 387 92 -20 -621 -210 -1484 -629
7083f29N73q55N50n40N82O20j05K9k87j44K01N92o26K05j18J70k13J26p94K66
$$ -629 -56 -911 -361 -901 -319 301 196 225 -62 -206 -5 587 -39 166 48 218 5 131 -663 -397
7103c97N00K37o1p3r80J248l38o97L90P70p14NQ84q14K0K81r5J06n05o1J62r7
$$ -397 103 340 279 206 -774 474 136 -561 -171 599 -115 -110 774 -40 -20 261 166 272 -233 -294 -132 -229
7125b29K67n2J8J08lJ93n91J22p9M96L8m55m60J155k66K31q88O43p0n40j24j58
$$ -229 38 -14 4 112 109 302 -289 -167 -246 250 288 -167 -627 528 262 493 -395 248 178 -362 -486 -644
7147f44O65l62J023l48o0k14p88Q26M94j049O03J0j59n6o5r1P20q80O80n56K69
$$ -644 21 -341 682 334 274 60 -728 98 592 -457 146 156 -3 -59 -124 -215 505 -375 305 -251 18
7168A8j96l30P07J87o6n55L55K19p09R46n17L79o10J20j62P98j85p38M41m4k19
$$ 18 -178 -508 199 386 320 -235 120 339 -370 576 59 438 -172 -52 -214 584 399 -339 102 58 -161
7189a61n99Q53l36P88q44J31k72N76j72l92N56k39N38n22P3N37Q1p49J4m3j1K57
$$ -161 -760 93 -243 545 -299 -168 -440 136 -36 -428 128 -111 427 -95 -22 515 596 -153 -139 -182 -193 64
7211F4j63k17K00k61J03N04M23o35J40l32P3J26m89O53K42l28J0L41r70J79K92
$$ 64 -99 -316 -116 -377 -274 230 653 18 158 -174 -101 25 -464 189 431 103 113 454 -516 -337 -45
7232d5l1n3N50p19m79R96p2P3m53K80o01L60P01J72o54O35o68M58p49L94Q02j536
$$ -45 -76 -129 421 -298 -777 219 147 220 -233 47 -554 -194 507 679 25 660 -8 450 -299 95 897 -639
7254f39Q17k2J08n98J02OMk34k57P82j61l58J4L48Q16q11Q21m1n46m2l10n04P55
$$ -639 178 156 264 -334 -232 -226 -222 -456 -713 69 -92 -450 -436 -88 728 -83 738 697 151 109 -201 -705 50
7277E0o01M47o95N97M9N95k54n01L10j78O93j066P55J2N7n78L51j66M81R6R2p28
$$ 50 -551 -104 -799 -202 -153 442 188 -313 -3 -181 512 -554 201 213 270 -308 43 -123 358 454 546 -182
7299a82M11p0m66M32q08O54M67K22r9n46m67P54J01m98k86Q65L65j290J30R39
$$ -182 229 159 -307 125 -683 -29 438 660 561 15 -452 302 403 -95 -381 484 849 -441 -311 628
7319F28K6m83n16M49K47o69M47k19J41j47J38K41L19oj004j03Q82L16p27o67Q77
$$ 628 654 171 -345 104 351 -318 129 -90 51 -96 42 283 602 596 -408 -511 371 687 -40 -707 170
7340A70j23J92J98q90Q7j84J74j66J16L89o95O24Kk17PM99L24j095O00L71K18
$$ 170 47 239 437 -453 -366 -550 -376 -542 -426 -37 -732 -108 -106 -323 -316 183 507 -588 12 383 601
7361F01o90N38j41o22N21k46J60n53l14O68m50Q86k46k18p42L29L25J36K0O85
$$ 601 -89 449 308 -314 207 -39 121 -432 -746 -78 -528 358 112 -106 -848 -519 -194 -58 -38 647
7381F47m03j46J26m62p2R5j02K24j72R0P0j29k56q3J03O96m25L56m51k98o3R94
$$ 647 244 98 224 -238 -310 -215 -317 -93 -265 -175 -105 -234 -490 -573 -470 226 -199 157 -294 -592 -655 339
7403C39K10R1o68L18p84j57O87j07l95K14N21m51r7M55L76q52O73M47j071M60
$$ 339 549 640 -28 290 -494 -651 36 -71 -466 -252 269 -182 -279 176 552 -300 373 820 -251 209
7423B09l51R69l56o47L38K54k32p1J46j77o36J054m51l30j42N37m53M18K33r04
$$ 209 -142 827 471 -176 162 416 184 113 259 82 -554 500 49 -281 -423 114 -339 79 312 -592
7443e92M68L83l11N11m68r7L62l26l35K17M00N7j08l32M3k5P08p47j83J78k0K41
$$ -592 -124 259 -52 459 -9 -106 256 -70 -405 -188 212 269 161 -171 -128 -153 555 -192 -375 -197 -217 24
7465B4J074j585Q83k85p4J18J30m14R08r00j07j7L88J87l6J32q26L39o03L43o40
$$ 24 1098 -487 396 111 37 155 285 -129 779 -121 -228 -245 143 330 294 426 -400 -61 -664 -321 -961
7486i61J178l75N68m78J10n22K12k9O76k2J66k69r74M1K63O68m48k79L08K77N21
$$ -961 217 -158 410 -68 42 -480 -268 -297 379 357 523 254 -720 -679 -416 252 -196 -475 -167 110 631
7507F31j74n22J26k51N89n95l40J35O68p28O44M36r33M94N37j246R56l79k71N78
$$ 631 457 -65 61 -190 399 -196 -536 -401 267 -461 183 619 -314 180 717 -529 427 48 -223 355
7527C55l77R8J81n62l70J047k45L35m78L07l8M60k43n52j02L08p6j99j29Q84j200
$$ 355 -22 76 257 -305 -675 372 127 462 -16 291 253 713 470 -82 -184 124 48 -151 -280 604 -596
7548e96K20O24l13K64o0j011J576o00M90j119P44M35j38m03n5p32J232K1K8p87
$$ -596 -376 248 -65 199 139 -872 704 104 594 -525 219 654 516 113 58 -674 558 579 607 -180
7568a80l46J557o01o10Q0J219j012k8m52k1M84M59k8m58l80k38O22M29j139Q05
$$ -180 -526 1031 430 -180 -100 1119 107 79 -373 -394 90 549 521 63 -317 -555 67 496 -643 162
7588A62l72J187j637J96K16M14l26l74m9L78j16O38k66p0J10N2J29n11J26J18
$$ 162 -210 977 -660 -464 -248 166 -160 -534 -583 -205 -321 317 51 -19 91 143 272 -239 -113 5
7608Ej95M25k9m37L35r37Q03o6J48O9j29P24m89o75P32J55p02L49p2l95J182j403
$$ 5 -190 235 206 -231 104 -833 -30 -96 52 121 -8 716 227 -448 284 439 -263 86 14 -381 801 -602
7630f02O93p5P30j145J035p46l62K1L3M13J3M0m60K38m0O43m93l72O95J42j287
$$ -602 91 16 746 -399 636 -110 -472 -451 -418 -5 8 48 -412 -174 -214 429 -64 -436 259 401 -886
7651h86J422r92M29j44J87j96L47k98Q3n82Q23n72L82K51p63M35P28l21m11l31
$$ -886 536 -456 -27 -171 16 -180 167 -131 -48 -630 193 -379 3 254 -509 -74 654 333 -78 -409
7671d09q7R04k67k56P05m07J74M15j060K21m9p83N87J5K55q9N54m57J99J50nq59
$$ -409 -496 408 141 -115 590 183 357 772 -288 -67 -116 -899 -312 -297 -42 -131 423 -34 165 315 310 -549
7693e49O48J01j48K17P2o52Q0L86m47k08N70J19P00m12j15k33L68k68k14k35O44
$$ -549 99 200 52 269 341 -311 -231 155 -292 -500 70 189 889 477 362 129 497 229 15 -220 424
7714D24rl20O02j166L27J150j142l01m8L14J34N1p88R87k16K82q71Q07j11l7J51
$$ 424 415 95 697 -469 -142 1008 -134 -435 -483 -169 -35 16 -772 215 -1 281 -590 217 106 69 220
7735B20j07O86j220J135m70l18Q4M44j19mn20j65Q68o01m89N10K66l45M37j191
$$ 220 113 799 -421 714 244 -74 10 454 335 331 -189 -354 514 -87 -576 -66 200 -145 292 -899
7755h99J344n70k07j05K84M26j78R6r4J59L13j84o44J51J22Q5n6J86p09O28n74
$$ -899 445 -125 -332 -437 -153 273 95 191 97 256 569 385 -259 -108 14 99 43 229 -480 148 -426
7776d26J73J5Q1M50p06O30n12Q98k52l51q7l25J91M75K29k72m13L33o26M90J95
$$ -426 -253 -238 -157 293 -413 217 -295 603 351 0 -87 -412 -221 254 483 211 -202 131 -495 -5 190
7797A90p06J02O80m35Q5m63J4O24p53L09O27J44k94L29n22j23M89k76Km6m58O26
$$ 190 -516 -414 266 -169 -84 -547 -533 91 -662 -353 274 418 124 453 -69 -192 297 21 23 -23 -481 145
7819A45m49L66P28r64L37j46j92K99l01R73o17qm21K82m00J104m87l65K05L30
$$ 145 -304 62 790 -174 163 17 -175 124 -177 796 179 171 -250 32 -368 736 249 -116 89 419
7839D19j91n61k14Q39m12q5J15j59L85N49n72r0r7K76j35j34J40m55l4J016p86
$$ 419 228 -333 -547 292 -120 -205 -90 -249 136 685 113 23 -74 202 67 -67 73 -382 -416 600 -186
7860a86L81p92J327p32o1J67j66j50p37J399k41j77K51N24m17J33J29n01L54m14
$$ -186 195 -597 730 -2 -63 104 -62 -212 -949 450 209 32 283 807 390 523 652 151 505 91
7880I1L58Q52j691K79q0J22J58k68m36N80j86P17l22Qo33P60J86m21L69o04R3
$$ 91 449 1301 -390 -111 -191 -69 89 -179 -615 -35 -221 496 174 182 -451 309 495 74 443 -161 -68
7901f8J75k62P02l67p79L50n77R13p88O04n42L15O64M59p54N07l22J4l41j77N51
$$ -68 107 -155 547 180 -599 -249 -826 87 -701 -97 -639 -324 340 799 45 552 230 244 -97 -274 277
7922B77l79J54p5OK3L95m0m63q7k60J97o28J155m13K53O45j277O45l96J27K31
$$ 277 -102 52 -23 -17 6 401 361 -102 -189 -449 -252 -880 275 -138 115 760 -517 128 -268 -141 90
7943I0M82n03N48o44J2j09l4j68Q08o09M22K95j136N28K10J50o24k25L14J06l48
$$ 90 572 69 617 -27 -15 -124 -158 -326 482 -127 295 590 -546 -18 192 342 -282 -507 -193 -87 -435
7964d35L71K47J09k76o8N13k98j38L27o03l27O25k24K68m24O7P51n64P92L63l30
$$ -435 -64 183 292 16 -52 461 163 25 352 -251 -578 47 -177 91 -333 -266 485 -79 713 1076 746
7985G46m62k22M33p91P96k01p7p63M35j08O63l22l57M9o96R03l61J14P22K04M05
$$ 746 284 62 495 -296 500 299 222 -541 -106 -214 449 127 -230 -181 -877 26 -335 -221 501 705 1110
8006A110j642L82P77r76j52J74o9P95n0j46K98l21m00R07j455J147j79l07J74
$$ 1110 -532 -150 627 -349 -501 -327 -396 399 349 203 501 180 -220 687 -768 379 200 -107 67
8025F7l02N79m90m33Q94j29M26k25r54J65O83n52M33j12pr2j120J451l13n45J115
$$ 67 -235 344 -146 -579 315 186 612 387 -567 -402 281 -271 162 50 43 -49 -1169 282 -31 -576 539
8046E39j018Q54m87N95o32J75K6j72J40J88r44P02j85l04M32l20N16n00Q01Ln65
$$ 539 -479 375 -112 483 -149 26 52 -120 20 208 -736 -34 -219 -523 -91 -411 105 -395 406 409 -156
8067a56o93J613j039L52l75J62O12m37l08L77k66P74o36N67p29N11j36o77K37
$$ -156 -849 764 -275 77 -298 -136 476 39 -269 108 -158 616 -20 547 -182 329 193 -484 -247
8086b47J67n66J083m89l58K55K33j06q6K42r40O94O46o75N55l54l04K36k14J17
$$ -247 -80 -646 437 -52 -410 -155 78 -28 -114 128 -812 -118 528 -147 408 54 -250 -14 -228 -111
8106a11k51k94P63l70M99k96Q7M01j11k28l30N21j44P00q56l51M43K82l07n17
$$ -111 -362 -656 107 -263 236 -60 27 428 317 89 -241 280 136 836 -20 -371 72 354 47 -470
8126d70k52J231o84R55p54J75k06K10Q7K3J8r0m0m0lm8K57M09p72k76M4M16m73
$$ -470 -722 509 -175 780 26 201 -5 205 292 315 333 243 203 163 160 112 369 778 6 -270 -226 190 -283
8149b83K39j5Pm57L03kO94o15L40J03k22K5Q25p73Nk6m61J09M31j50l4L42n21
$$ -283 -44 -59 -52 -509 -206 -208 486 -129 211 314 92 117 942 169 174 148 -313 -204 227 77 43 385 -136
8172a36LK07m16J23O35m2m39L55k10m02J089m47pm40L29l37j70Q03n00
$$ -136 -133 74 -342 -219 416 374 -65 290 80 -322 767 320 313 -127 202 -135 -305 498 -2
8191b
$$ Imaginary data points
##PAGE= N=2
##DATA TABLE= (X++(I..I)), XYDATA
0@%%%%%%%%%%%%%%%%%oP0j28J28j28J28j31J95k56K57l21L84m15M79n55O20p05
$$ 0 0 0 0 0 0 0 0 0 0 0 0 0 0 0 0 0 0 -6 64 -64 64 -64 64 -67 128 -128 129 -192 192 -223 256 -299 321 -384
34c84Q15r08J007j130J273j424J585j763J959k169K404k659K927l232L569l932
$$ -384 431 -477 530 -600 673 -751 834 -929 1030 -1139 1265 -1394 1533 -1699 1870 -2062
50b062M334m773N261n800O401p084P855q733R754j0948J2366j4090J6232j8990
$$ -2062 2272 -2501 2760 -3040 3361 -3723 4132 -4601 5153 -5795 6571 -7519 8713 -10277
64a0277K2683k7919L5972n0146Q2499l26174J03605M73491k21733k99706K1182
$$ -10277 12406 -15513 20459 -29687 52812 -273362 -169757 303734 82001 -217705 -196523
75a96523K81436M0067j02351n9531Q1504J2609n0670O797J15443l9345j69876
$$ -196523 84913 124980 22629 -36902 44602 57211 6541 13338 128781 89436 -80440
86h0440j2775J85618j926j92007j8055J73429k3671j78300L9204K10759k8654
$$ -80440 -93215 92403 90477 -101530 -119585 53844 30173 -148127 -108923 101836 73182
97G3182k05192J0808K16578M6692j51600o1313J03541O3950n9614n0088M5345
$$ 73182 -132010 -121202 95376 142068 -9532 -70845 32696 96646 37032 -13056 32289
108C2289J7605r0858l4203J20892L8628j73489p5796J88445R4698j80054q9373
$$ 32289 49894 -40964 -75167 45725 84353 -89136 -164932 23513 118211 -61843 -151216
119a51216J74879R3418j38552o9428J29501P9813r7747q0666P4161Q5194o0267
$$ -151216 23663 117081 -21471 -90899 38602 118415 20668 -59998 14163 99357 39090
130C9090j02686L6520Q9562n1196j03811M9918J00423o8070j11129Q2116J27620
$$ 39090 -63596 -27076 62486 11290 -92521 -42603 57820 -10250 -121379 -39263 88357
141H8357p4015j19139Q1669J29803n6923j08046N3345R8337m1834q8789K6007
$$ 88357 14342 -104797 -23128 106675 49752 -58294 -4949 93388 51554 -37235 -11228
152a1228P3023k6101q8743J372Q6569l893j07353q454J18383J1027j22074J52
$$ -11228 61795 35694 -53049 -51677 34892 30999 -76354 -84808 33575 44602 -77472 -77320
164g7320J37624M485j21384J1587J26282k402j10215O3R5428P464r1142l0619
$$ -77320 60304 64789 -56595 -45008 81274 78872 -31343 -31280 64148 71612 -19530 -50149
176e0149P0255L0520p7006n1179O6554N1791p3066n4355Q3325O2244q0970n1939
$$ -50149 20106 50626 -26380 -77559 -11005 40786 -32280 -86635 -3310 58934 -22036 -73975
188g3975R7016O2803q7360n1456Q9988N1299q2723m9949O6612L9210o4865n1466
$$ -73975 23041 85844 -1516 -52972 37016 88315 5592 -44357 22255 61465 -3400 -54866
200e4866M2568M7852m3989o3685L2989P4852k9107p7979L6721R4271l0355q3509
$$ -54866 -12298 35554 -8435 -72120 -39131 35721 6614 -71365 -34644 59627 29272 -54237
212e4237M6144Q9883m3313q2203M6910P4471m6432p7114K7951O2460k6506o9100
$$ -54237 -8093 81790 38477 -43726 3184 77655 31223 -45891 -17940 44520 18014 -51086
224e1086M723O1600O82o5943n858P3781J6515p1951p450Q7479J7912q3166o491
$$ -51086 -46363 15237 15919 -50024 -55882 17899 34414 -37537 -44987 42492 60404 -22762 -29253
237b9253Q6109P089q3969p317P3379k079p6756r341N8782O957o1810k0365N3758
$$ -29253 56856 63945 -20024 -27341 46038 43959 -32797 -42138 16644 23601 -38209 -58574 -4816
250d816L0742m8208l3330N5079M8109m7248m1941O0943N0689n9665m6032O2285
$$ -4816 25926 -22282 -55612 -533 47576 328 -41613 19330 70019 10354 -35678 26607
262B6607M0244o5997m4758N4058L2230n6771l9789M0444L4318l5604l7832K9903
$$ 26607 66851 854 -43904 10154 42384 -14387 -54176 -13732 20586 -15018 -52850 -22947
274b2947M7829j8928m5810K5673O2901j7032o0351K4235O7743k6272o9291K4436
$$ -22947 24882 5954 -39856 -14183 48718 31686 -28665 -4430 63313 37041 -32250 -7814
286g814O1155l3489o4853K2515N1656k8615n1732J8008M6331q245m2727P883N0331
$$ -7814 53341 19852 -45001 -22486 29170 555 -51177 -33169 13162 4917 -37810 -29927 20404
299B0404Q140m5448m470N7150J4183n6872j2932N9729Q747o6651j2613N7676R04
$$ 20404 28544 -16904 -21374 35776 49959 -6913 -19845 39884 48631 -18020 -30633 27043 27947
312B7947o3159p755N2052K950m7824o460M4945J6138l4218j3761L9573K8436l1304
$$ 27947 -35212 -42967 9085 12035 -35789 -42249 2696 18834 -15384 -29145 10428 38864 7560
325G560k8886L9510L5742m1780m0944M1163L5466n0228m2327M2345L0765m7644
$$ 7560 -21326 18184 53926 12146 -28798 12365 47831 -2397 -44724 -2379 28386 -19258
337a9258l2182M0834K9259l3722k5557L3645L3210j8106k8758K0633M0052j1562
$$ -19258 -51440 -10606 18653 -15069 -40626 -6981 26229 8123 -20635 -2 40050 28488
349B8488m0712J1534M4182j6564n2288J2148M7265k3823n4077J6639M7621k0662
$$ 28488 -12224 -690 43492 26928 -25360 -13212 34053 10230 -43847 -27208 20413 -249
361b49m5994J8965M3523r754l2759J2040L7331K317l0203n40L4659Q765l9240
$$ -249 -46243 -27278 16245 6491 -26268 -14228 23103 25420 -4783 -5323 29336 38101 -1139
374a139j3533L8925Q019m8982j6035M4235N341n0016p989M7308N319m3072j256
$$ -1139 -14672 24253 32272 -16710 -32745 11490 16831 -33185 -41174 6134 11453 -31619 -32875
387c2875M4962J0534l2831n197L4608J5978k6052j7314K3904K1402k9191k9996
$$ -32875 12087 22621 -10210 -15407 19201 35179 9127 -8187 15717 37119 7928 -22068
399b2068K4236K5134l5919l3825L2670L0652l9051k9909L9544L1210l2434k1496
$$ -22068 2168 27302 -8617 -42442 -9772 20880 -18171 -48080 -8536 22674 -9760 -31256
411c1256L3141K9567k0630k2525J9889K5918j1455k8970M243K7253r002l7145
$$ -31256 1885 31452 10822 -11703 8186 34104 22649 -6321 -2078 25175 16173 -20972
423b0972K811L2287j2953m0006J3789L9026j5396l7106K0425M2296j3467l1244
$$ -20972 -18161 14126 1173 -38833 -25044 13982 -1414 -38520 -18095 24201 10734 -20510
435b0510J7596L4881q402k7810M148K6776j326k9210r965K4288M580l3019j3568
$$ -20510 -2914 31967 23565 -4245 -97 26679 25353 -3857 -13822 10466 15046 -17973 -31541
448c1541L1612Q524l7732o436M2584R943m0864j362M6574Q835l5271l469L2772
$$ -31541 71 8595 -29137 -35573 7011 16954 -23910 -25272 21302 30137 -5134 -8603 24169
461B4169P631k6184j2063J8542J0682k2961k1357J5032J7975k1779k4709J9330
$$ 24169 31800 5616 -6447 12095 22777 -184 -21541 -6509 11466 -10313 -35022 -15692
473a5692K5594k1941j9917K9487K5549k7143j6380L4680K3807k7843k1943K4706
$$ -15692 9902 -12039 -31956 -2469 23080 -4063 -20443 14237 38044 10201 -11742 12964
485A2964K0381k1079k3542Q092J7387j1924k5048M922K1293p930k6713Q718L4334
$$ 12964 33345 12266 -11276 -3184 14203 2279 -22769 -17847 3446 -4484 -31197 -22479 11855
498A1855o614l2117J5679L8955r434l1314J4379L2750j1850k9636O788K4017q357
$$ 11855 5241 -26876 -11197 27758 18324 -12990 1389 34139 22289 -7347 -559 23458 15101
511A5101k6623m682J8060K420k2840q352K0131Q720k1607l877L1244Q506k8069
$$ 15101 -11522 -16204 1856 4276 -18564 -26916 -6785 1935 -19672 -23549 7695 16201 -11868
524a1868L93L6404N103l3024k647L1763R81l0878n591K0635J121k4920r606J6786
$$ -11868 -11475 24929 30032 -2992 -5639 26124 27105 -3773 -9364 11271 12392 -12528 -22134 -5348
538e348R549j8007j5094J7554K2218j5049j8909K2840K6373j8963k0373K6039
$$ -5348 4201 -13806 -28900 -11346 10872 -4177 -23086 -246 26127 7164 -13209 12830
550A2830K2181k5992k1292K2127J6317k3274k0144J1868J2097j1316j6379N760
$$ 12830 35011 9019 -12273 9854 26171 2897 -17247 -5379 6718 -4598 -20977 -15217
562a5217J3882k468j6583P726K3771l136k2034J0962L0342q359k7353R991K7807
$$ -15217 -1335 -3803 -20386 -12660 11111 7975 -14059 -3097 27245 18886 -8467 1524 29331
575B9331j2730k8629P016K2029j4065k4477O126J8169n960j8656J996K0630M560
$$ 29331 16601 -12028 -5012 17017 2952 -21525 -15399 2770 -3190 -21846 -19850 780 5340
588E340j6637j269K3959R678k1247o552K8145Q031k8809r720K6556L437k9982
$$ 5340 -11297 -12566 11393 21071 -176 -6728 21417 29448 639 -9081 17475 20912 -9070
601i070q853K0867K033k0935o574J6103P260j3021o349J4527J4502r019r869J5087
$$ -9070 -17923 2944 4977 -15958 -22532 -6429 831 -12190 -18539 -4012 10490 1471 -8398 6689
615F689J8228j4634j5530J7677J5596k1645j9792J7893J3502k2713j8648J4903
$$ 6689 24917 10283 -5247 12430 28026 6381 -13411 4482 17984 -4729 -23377 -8474
627h474J3602j6062j3425J4296J4141p991j0503J0235J8600j823j7119M621K2626
$$ -8474 5128 -10934 -24359 -10063 4078 -3913 -14416 -4181 14419 12596 -4523 98 22724
640B2724l100k4091K528K2116q641k7088M405K1130r599k4750P902J8823l221
$$ 22724 19624 -4467 -1939 20177 11536 -15552 -11147 9983 384 -24366 -16464 2359 -862
653h62j6733M417J7762L825j1435k48J5955P110j5346o560J6764O799k1782r853
$$ -862 -17595 -13178 4584 8409 -3026 -3274 12681 19791 4445 -2115 14649 21448 -334 -10187
667a0187J7360L398k3888p271K0551J495k0184l410K1630O183j6237j717J7816
$$ -10187 7173 10571 -13317 -20588 -37 1458 -18726 -22136 -506 5677 -10560 -12277 5539
680E539R705j0063p086J2105J1266r988j5220Q856J3532j4319k0251R547J4708
$$ 5539 15244 5181 -1905 10200 21466 11478 -3742 5114 18646 4327 -15924 -6377 8331
693H331j5795j6854J3485J4143j3789q973J5985J3059r854p453J1035J4809l750
$$ 8331 -7464 -24318 -10833 3310 -10479 -19452 -3467 9592 -262 -7715 3320 18129 14379
706A4379j2367Q60J4150j602j7734k609J3659m347j9740j93J7499m629j8932N877
$$ 14379 2012 2872 17022 15420 -2314 -4923 8736 4389 -15351 -15544 1955 -2674 -21606 -15729
720a5729J9178k543j5129P882J8137k315j1094L436J4901N56j3883m879J1540
$$ -15729 3449 906 -14223 -6341 11796 9481 -1613 1823 16724 17280 3397 -1482 10058
733A0058N425j7134j2690J2650P172j6416r864J5635O686j5354k968K0136N206
$$ 10058 15483 -1651 -14341 -1691 5481 -10935 -20799 -5164 1522 -13832 -16800 3336 8542
746H542j3168j630J6822O726j0756o302Q858P493p964j2792M130Q882j0127j4871
$$ 8542 -4626 -6256 10566 17292 6536 234 9092 16585 8621 -4171 -41 8841 -1286 -16157
760a6157N442J2449q854j3552R865J5037p486r611J2656J3199q078p482J1520
$$ -16157 -10715 1734 -7120 -20672 -10807 4230 -3256 -12867 -211 12988 4910 -2572 8948
773H948Q889q180j0095L882R555n049j4425k542R869j93j5501k211J4931Q67j3465
$$ 8948 17837 9657 -438 3444 12999 7950 -6475 -9017 852 659 -14842 -17053 -2122 -1255 -14720
788a4720K219J8543r77j2374O545J6055j540j2666L565J0488k339j1891l397O611
$$ -14720 -12501 6042 5065 -7309 -764 15291 13751 1085 4650 15138 12799 908 -2489 4122
802D122J641j2148p983Q240O854j1569p608J3011R564j0896m291J5271Q468j0150
$$ 4122 5763 -6385 -14368 -6128 726 -10843 -18451 -5440 4124 -6772 -11063 4208 12676 2526
816B526m227J3764M159j0478m503P297R97j0277o611N482L886q810j0269N497
$$ 2526 -1701 12063 16222 5744 1241 8538 9535 -742 -7353 -1871 2015 -6795 -17064 -11567
830a1567J1079l593j0624O167J4639k433r583R193J2344p415q793Q988P810r538
$$ -11567 -488 -4081 -14705 -8538 6101 3668 -5915 3278 15622 8207 -586 8402 16212 6674
844F674r945M754M601o520r216K68O358k015q565N62J2572J585j0620J650J6118
$$ 6674 -3271 1483 6084 -436 -9652 -9384 -3026 -5041 -13606 -13044 -472 1113 -9507 -7857 8261
859H261K931j1479N63J4742p42j2794R0R253k976j2118j566O032r06q540m053
$$ 8261 11192 -287 276 15018 14276 1482 1572 10825 7849 -4269 -5835 197 -709 -9249 -13302
874a3302O343N023m886n203R219Q215n445m160J1578P599r642n580J0699M204
$$ -13302 -6959 -1936 -6822 -12025 -2806 5409 -36 -4196 7382 14981 5339 -241 10458 14662
888A4662j0976n848N987R65r517m806M015J864m707l912L837O669j138m472N544
$$ 14662 3686 -2162 3825 4790 -4727 -9533 -5518 -3654 -8361 -12273 -8436 -1767 -2905 -7377 -1833
903a833J0162j912q657Q414J0178p219j0116N357Q561q859j2031L899O104n473
$$ -1833 8329 6417 -2240 6174 16352 9133 -983 4374 12935 4076 -7955 -4056 2048 -3425
917c425q301J232N651r02l178J290O558M044l748Q65R153K306q274j079J0896
$$ -3425 -11726 -10494 -4843 -5745 -8923 -7633 -1075 2969 -779 86 9239 11545 3271 2192 13088
932A3088j092j2935p15Q562l389j2625n32O057k17o483l05M958K389n88N60N356
$$ 13088 11996 -939 -1654 6908 3519 -9106 -9638 -3581 -3798 -10281 -10586 -5628 -3239 -3827 -3267 2089
948B089M556l050j866P274M055p871n226Q567K758j1857p134O839L085r791m940
$$ 2089 6645 3595 1729 9003 13058 5187 -39 8528 11286 -571 -7705 -866 2219 -7572 -12512
963a2512O043L722l903k684M235O128Q24j847K990N010j21l790J716O076n704
$$ -12512 -6469 -2747 -6650 -9334 -5099 1029 1853 6 2996 8006 7885 4095 5811 11887 6183
978F183p634K590N268o707j0099L422N613m375o322L634N172o04j052L996M273
$$ 6183 -1451 1139 6407 -300 -10399 -6977 -1364 -5739 -12061 -8427 -3255 -3859 -4911 -915 3358
993C358J227k544K268N268M95o094q95N421j557j0330j522N999j340j1042Q94
$$ 3358 4585 2041 4309 9577 10072 3978 3083 8504 6947 -3383 -4905 1094 -246 -11288 -10394
1008a0394P237n43o212J854P545J643j979M64N913K405j770j675K733L183n893
$$ -10394 -3157 -3700 -9912 -8058 -513 1130 -849 -385 5528 7933 6163 4488 7221 10404 4511
1023D511o282L682L237p924o160M909K531p775k815Q149L322n222L66O597L419
$$ 4511 -1771 1911 5148 -2776 -8936 -4027 -1496 -9271 -12086 -3937 -615 -5837 -5471 1126 4545
1038D545j212n78K644K711n32l663P46K101l524o651K62M141m006q420L301O474
$$ 4545 3333 2755 5399 8110 7578 3915 4661 6762 3238 -3413 -3151 990 -3016 -11436 -8135 -1661
1054a661l559m563N498P123k676k988N979N054j705k150J155K718j185m348k666
$$ -1661 -5220 -9783 -4285 2838 162 -2826 3153 8207 6502 4352 5507 8225 7040 2692 26
1069B6K127l61o489l152M858L0p084K36O758R56m356L168P623k77l058L188N059
$$ 26 2153 1792 -4697 -7849 -2991 -2961 -10045 -9809 -3051 -2095 -6451 -3283 4340 4063 1005 4193 9252
1086I252j006m261p74K022M05n673l394P95K394n295l892M280K643m854j860P509
$$ 9252 8246 3985 3211 5233 5638 -35 -3429 -2634 -240 -5535 -9427 -5147 -2504 -7358 -9218 -1709
1102a709N301m561j352Q241K983l987j460L285J266l608k522L18J86m376m689
$$ -1709 3592 -969 -2321 5920 8903 4916 3456 6741 8007 4399 1877 2195 2381 -1995 -6684
1117f684M44L292j411o008K690N976j240l282M770O775k028j896M967L673l093
$$ -6684 -6240 -2948 -4359 -10367 -7677 -1701 -2941 -6223 -1453 5322 3294 1398 6365 10038 6945
1132F945l533J538J943l393m151k113R89q59m515j171L529N09m748J402P616J275
$$ 6945 3412 4950 6893 3500 -651 -2764 -1775 -2634 -7149 -8320 -4791 -4282 -9030 -7628 -12 1263
1148A263m565K235Q134J161n414K064M212j394n405r54K531k350m893j542M77
$$ 1263 -3302 -1067 7067 8228 2814 4878 9090 7696 2291 1337 3868 1518 -3375 -4917 -4440
1163d440J298l594l050L931M417j641k777O230M989l098k051O430K217m603j568
$$ -4440 -3142 -6736 -9786 -5855 -1438 -3079 -5856 374 5363 2265 214 6644 8861 4258 2690
1178B690L532j95n204l082J816r22k959j658j051L194q29j965K556M819n87k742
$$ 2690 6222 6027 823 -2259 -443 -1365 -4324 -5982 -7033 -3839 -4668 -6633 -4077 742 155 -2587
1194b587N185N501j423n056M024M112l272o079P04K654m459m151n7J553q55l148
$$ -2587 2598 8099 6676 1620 5644 9756 6484 405 1109 3763 -696 -4847 -4904 -3351 -4206 -7354
1210g354k2K732J519m97J220L880K816j686j1N816L37n530j132N317k002o868
$$ -7354 -7376 -4644 -3125 -3622 -2402 1478 4294 2608 2597 8413 8750 3220 2088 7405 5403 -1465
1226a465m14K251k592n238N11K275J99k523L96L923K898n05p32M001L786j888
$$ -1465 -1879 372 -2220 -7458 -6947 -4672 -4473 -6996 -6600 -2677 221 -284 -1016 2985 6771 4883
1242D883k154M112J692m835l513M318m45o495l619K783P93l830j683K649K448
$$ 4883 2729 6841 8533 3698 185 4503 4058 -2437 -6056 -3273 -2480 -6310 -7993 -5344 -2896
1257b896J93k026L266L848J225j775J443L973N7l630o6L029l584n551J628J845
$$ -2896 -2703 -4729 -1463 2385 3610 1835 3278 7251 7308 3678 3612 6641 3057 -2494 -866 979
1273I79m271m556J995K133j700j179K638K715J532p60L09N753J370l188j700N233
$$ 979 -3292 -7848 -5853 -3720 -5420 -6599 -3961 -1246 286 -474 -165 5588 6958 3770 2070 7303
1289G303P22n388k489K560r35o523k09K780j232l537n0M147P84j325J2L975J804
$$ 7303 8025 2637 148 2708 1773 -4750 -4959 -2179 -3411 -6948 -6998 -2851 -2067 -3392 -3380 595 2399
1306B399k97M70J966L192k081l268J762J541m561l693K142R11m695k638J959J481
$$ 2399 2102 2572 4538 7730 5649 2381 4143 5684 1123 -2570 -428 483 -4212 -6850 -4891 -3410
1322c410k738o29L882K885j607P83K658K671Q29k176O85K454p35m068m11K926
$$ -3410 -6148 -6777 -2895 -10 -1617 -834 1824 4495 5324 3148 3833 6287 5552 1484 1073 3999
1338C999l254n957J17L283j476m618J509M054l26j002K058K264J410N19J115J937
$$ 3999 745 -5212 -5095 -1812 -3288 -7906 -6397 -2343 -2669 -3671 -1613 651 2061 2580 3695 5632
1354E632L94j333j062J080O1l877k682J062N99n004j830L837M82m088K16M724
$$ 5632 6026 4693 3631 4711 4772 895 -1787 -725 -126 -5130 -6960 -3123 -2641 -6729 -6513 -1789
1370a789K046p09K07L223K110j018K16J153K41j750k763J25J521k851m775P18
$$ -1789 257 -452 -245 2978 5088 4070 4286 5439 5680 3930 1167 1292 2813 -38 -4813 -4095
1386d095K072k581k910K396L420j094j496M072K846m23J4K182K103o75k134j049
$$ -4095 -2023 -4604 -7514 -5118 -1698 -2792 -4288 -216 2630 2207 2221 4403 6506 5831 3697 2648
1402B648P65p38k058k219J636j955m715O73L225r56l190J137O084p7j934K673
$$ 2648 3413 2675 617 -1602 34 -1921 -6636 -5963 -2738 -3694 -6884 -5747 337 260 -1674 999
1418I99M359l53j777Q18J580n17k406j557M13M43l763j557J78l6k885j075L551
$$ 999 5358 5005 3228 4046 5626 5109 2703 1146 1559 2002 -1761 -3318 -3140 -3176 -6061 -7136 -3585
1435c585J905k161J1M597K580j438j52K757P61K92j112j360q6m63k106j684R6
$$ -3585 -1680 -3841 -3830 767 3347 1909 1757 4514 5275 5567 4455 3095 3009 2546 440 -1244 -1148
1452a148k054k094j69K475m98k570K228L944o49r34L371L038j212j362K198J253
$$ -1148 -3202 -5296 -5465 -2990 -3488 -6058 -3830 114 -535 -1469 1902 4940 3728 2366 4564 5817
1468E817j943k020j01k72j297k805k19j174Q19j861N1K422L02j262J345L428J884
$$ 5817 3874 1854 1753 1481 184 -2621 -2840 -4014 -3195 -5056 -5005 -2583 -2281 -3543 -2198 1230 3114
1485C114k642K890K233J7k269k43J280j065k761j043o70p37j585j728P69O89J30
$$ 3114 472 3362 5595 5612 3343 3100 4380 3315 554 -489 -1159 -1896 -3481 -5209 -4440 -3751 -3621
1502c621r79J697K809P1k13K649K347j932J165J761n77k570p50O73j638k015j458
$$ -3621 -4600 -2903 -94 -23 -236 2413 4760 2828 3993 5754 5177 2607 1857 2530 892 -1123 -2581
1519b581j227J188j632j082L42K239P54j447J912L254N68J2P05K017r21j064J351
$$ -2581 -3808 -2620 -4252 -5334 -4992 -2753 -1999 -3446 -1534 1720 2288 2300 3005 5022 4101 3037 4388
1536D388j38k391k652M56R6k594j344k17M08J86J49j83J697K906j046L44K697
$$ 4388 4250 1859 -793 -337 -241 -2835 -4179 -4396 -3988 -3802 -3653 -3836 -2139 767 -279 65 2762
1553B762J705m97N15J446j195k382J07q23j835j673j28n43l72k292J20J574O74
$$ 2762 4467 3970 4485 5931 4736 2354 2461 1638 -197 -1870 -1998 -2541 -2913 -5205 -5085 -3511 -2837
1570b837Q77M52M90K230J325K41J243J183j220j313J516l88k959q41o17p94j837
$$ -2837 -1960 -1508 -1018 1212 2537 2778 4021 5204 3984 2671 4187 3799 840 -1 -618 -1412 -3249
1587c249q73P83q13p40J046J712J208J510p74J106K545J468j145j45M34L33j258
$$ -3249 -4122 -3339 -4152 -4892 -3846 -2134 -926 584 -190 916 3461 4929 3784 3639 4073 4406 3148
1604C148j093p2l347r13Q54o26j930j139J157J224K8N14J547P04R07O55O34J704
$$ 3148 2055 1983 -1364 -2277 -1423 -2049 -3979 -5118 -3961 -2737 -2709 -2195 -648 56 963 1618 2252 3956
1622C956R48j511n29J160q91k540p66j121p57k439N48J147j325o97J593J881j34
$$ 3956 4904 3393 2864 4024 3133 593 -173 -1294 -2051 -4490 -3942 -2795 -4120 -4817 -3224 -1343 -1477
1639a477R64K56J080K211N70j33k46N52k18j398j48o55k988r33K23Q7k305n65
$$ -1477 -513 -257 823 3034 3604 3471 3225 3777 3559 2161 2013 1358 -1630 -2563 -2340 -2253 -4558 -5123
1657e123J764O65p70J594K396J09N30J587Q17P27m48j011P87J13j136k433r24
$$ -5123 -3359 -2694 -3464 -1870 526 635 1165 2752 3569 4296 3848 2837 3624 3737 2601 168 -756
1674g56l48q20j282o2m04r11%J917J937j189R13K800J539n22J040q2kK62m60j555
$$ -756 -1104 -1924 -3206 -3268 -3672 -4583 -4583 -2666 -729 -1918 -1005 1795 3334 2812 3852 3770 3768 4030 3570 2015
1694B015J21r36k467j999J381n53j930P81J589o75n07K423J508K72R3J811J447
$$ 2015 2136 1200 -1267 -3266 -1885 -2438 -4368 -3587 -1998 -2673 -3180 -757 751 1023 1116 2927 4374
1711D374p18J89n05m49o57r39j409k18n57j775j197P11L13p80K61P76J642o71
$$ 4374 3656 3845 3340 2891 2234 1295 -114 -332 -889 -2664 -3861 -3150 -2837 -3617 -3356 -2580 -938 -1609
1729a609J607J353J121m6J176J727j459N3j948K55j232o84k298r37M06n67j433
$$ -1609 -2 1351 2472 2426 3602 5329 3870 3923 1975 2230 998 314 -1984 -2921 -2515 -3082 -4515
1746d515P14R76k45k02K878J413P3O54J466J000j494Q17Q36n47k229j208n4j248
$$ -4515 -3801 -2825 -3070 -3272 -394 1019 1092 1746 3212 4212 2718 3535 4371 3824 1595 387 333 -915
1764i15j027o54j108R66L27j390R57J964L83n58J207J977J339j266J222J211j983
$$ -915 -1942 -2596 -3704 -2738 -2411 -3801 -2844 -880 -497 -1055 152 2129 3468 2202 3424 4635 2652
1781B652r81O24k67j484j460o48p52j108L93j92L25N27j161J531J994J980j612
$$ 2652 1671 2295 2028 544 -916 -1564 -2316 -3424 -3031 -3223 -2898 -2371 -3532 -2001 -7 1973 361
1798C61N87K680O96j451n97P52p70p67j225J66j293k078k9m66P6Q47o10O01J424
$$ 361 948 3628 4324 2873 2276 3028 2258 1491 266 432 -861 -2939 -2968 -3434 -3358 -2511 -3121 -2520 -1096
1817a096L62K94J394K128k63l58J742J62j621q55K06m59j284j511j71j159m15
$$ -1096 -734 -440 954 3082 2819 2461 4203 4365 2744 1889 2095 1636 352 -1159 -1330 -2489 -2904
1834b904o1n60R16l97O44P37K354J06l96J717K044K66k151O12J433k318j466J00
$$ -2904 -2965 -3525 -2609 -3006 -2362 -1625 729 835 439 2156 4200 4466 2315 2927 4360 2042 576 676
1852F76j659p2p84j112N2L57m67J61J111M63O51O39J120J426l76l14K371q17q02
$$ 676 -983 -1055 -1839 -2951 -2899 -2542 -3009 -2848 -1737 -1274 -623 16 1136 2562 2186 1872 4243 3426 2624
1871B624r51J49k73j557k382M87j61j863L78R20k1J09N25J345J292J239j016J896
$$ 2624 1673 1822 1549 -8 -2390 -1903 -2064 -3927 -3549 -2629 -2650 -2541 -2016 -671 621 1860 844 2740
1889B740M71Q11j955M38Q55j557j384n89M45j155j542o67r7n96n72J827N92R93
$$ 2740 3211 4022 2067 2505 3360 1803 419 -170 275 -880 -2422 -3089 -3186 -3782 -4354 -2527 -1935 -942
1907i42K0J276J256J269q66R48R23M11j692j021K75n83k244j6Q6j370r04L02O45
$$ -942 -922 354 1610 2879 2013 2961 3884 4295 2603 1582 1857 1274 -970 -986 -900 -2270 -3174 -2872 -2227
1926b227k1J26L56J523R81K57K5J022J185j97q32P34l37j347k089M32k87j596
$$ -2227 -2248 -2122 -1766 -243 738 995 1020 2042 3227 3030 2198 2932 2595 1248 -841 -409 -696 -2292
1944b292r47J034l69l82J77P20j08J652k96J755Q68M95J98N97J127m21k401P7
$$ -2292 -3239 -2205 -2574 -2956 -2779 -2059 -2167 -515 -811 944 1812 2307 2505 3102 4229 3808 1407 1484
1962A484J69j487j151j86k98j45j421L71J82N27p53K027Q83L12Q89M68N27P57
$$ 1484 1653 166 -985 -1171 -1469 -1614 -3035 -2664 -2482 -1955 -2708 -681 202 514 1403 1871 2398 3155
1980C155o8o39j64J89j322j943L31q9j247j164Q5k22o89L12K013m7J168O27J076
$$ 3155 3087 2448 2284 2473 1151 -792 -461 -550 -1797 -2961 -2876 -3098 -3787 -3475 -1462 -1509 -341 286 1362
1999A362K25O92M45L9J322q12j478j1p4j456j943q31O82k52j210P08O50j007R92
$$ 1362 1587 2279 2724 2763 4085 3273 1795 1784 1710 254 -1689 -2520 -1838 -2090 -3300 -2592 -1942 -2949 -1957
2018a957R97J047P20P85K17J303Q2q54j37j96J53k46j944k70o02j607n70Q27r89
$$ -1957 -960 87 807 1592 1809 3112 3194 2340 2203 2007 2160 1914 -30 -300 -902 -2509 -3079 -2252 -3241
2037c241K69J195N19O22m20J611M57J058m08Q07k02Q44r29j111J54l33p75j588
$$ -3241 -2972 -1777 -1258 -636 -1056 555 1012 2070 1662 2469 2267 3111 2182 1071 1225 892 117 -1471
2055a471M38r65j157N6J02N38M9P47O50J196M21J216P64L81l64n28N07k22o48
$$ -1471 -1033 -1998 -3155 -3099 -2997 -2459 -2410 -1663 -1013 183 604 1820 2584 2965 2601 2073 2580 2358 1710
2074A710j391q36j70o60n49j148R23j53l37L10R81j51J413J181P3K12P08O99O65
$$ 1710 319 -517 -687 -1347 -1896 -3044 -2121 -2274 -2611 -2301 -1320 -1471 -58 1123 1196 1408 2116 2815 3480
2093C480j476J00k55n25j389j069n45o07L64m06o11n6Q25L00P40J314K6Q5J894
$$ 3480 2004 2104 1849 1324 -65 -1134 -1679 -2286 -1922 -2328 -2939 -2995 -2170 -1870 -1130 184 210 295 2189
2112B189N92k64q6Q70p88q70r67k94r25m53q88l94K38K22J86p01J15K193J44n61
$$ 2189 2781 2517 2431 3301 2513 1643 676 382 -543 -996 -1884 -2278 -2040 -1818 -1632 -2333 -2218 -25 119 -442
2132d42J408P51L78K04L54j61n54J73r96n66j60j275J15p82k93j175M25nP74M28
$$ -442 966 1717 2095 2299 2653 2492 1938 2111 1115 549 389 -886 -771 -1553 -1846 -3021 -2596 -2601 -1827 -1399
2152a399J1J577J168k20N98O94m25P07k48Q9j170m61r04k45j626j25J84o97r4
$$ -1399 -1388 189 1357 1137 1735 2429 2004 2711 2463 2552 1382 921 17 -228 -1854 -1979 -1795 -2492 -2586
2171b586Q9L06O12P60N18M41K70J044J05K13P32N85j194K70q45j300j93o21n83
$$ -2586 -2497 -2191 -1579 -819 -301 140 410 1454 1559 1772 2504 3089 1895 2165 1320 20 -173 -794 -1377
2190a377p07r3r13O99k50M86J151P47J77R20N32L22R90j82k1J22j062K5Kk093
$$ -1377 -2084 -2177 -3090 -2391 -2641 -2155 -1004 -257 -80 840 1372 1694 2684 2502 2481 2603 1541 1566 1568 -525
2210e25Q7r42m9m72o05K07P25m43J11J472N14K38J542J111p84N67L52q15j092
$$ -525 -438 -1380 -1429 -1901 -2506 -2299 -1574 -2017 -1906 -434 80 318 1860 2971 2187 2754 3106 2291 1199
2229A199K79o51j012M4l4j883Q5N1m30o7J00J487N61K12k01Q13P65P43N29q99
$$ 1199 1478 827 -185 -141 -175 -2058 -1973 -1922 -2352 -2419 -2319 -832 -271 -59 -260 553 1318 2061 2590 1691
2249A691L20N52p16q50r50m23p80M76j266j33j72J37P75p29R06Q80Q05N63P47
$$ 1691 2011 2563 1847 997 47 -376 -1156 -680 -1946 -2079 -2251 -2114 -1339 -2068 -1162 -282 523 1086 1833
2268A833N88r75J223p6o44m19q49J14j522p01J128j665q98J037o66J90K56M3J222
$$ 1833 2421 1446 2669 2593 1949 1530 681 795 -727 -1428 -300 -1965 -2863 -1826 -2492 -2302 -2046 -2003 -781
2287g81l7N09J634j62R49P66o11n50L80o31j223N64j403j283l63M18n17K63q11
$$ -781 -818 -309 1325 1163 2112 2878 2267 1717 2097 1466 243 807 -596 -1879 -2242 -1824 -2341 -2078 -2889
2306b889J438Q96O5o26J656Q7M46N24k0J331j053k17l35K50q83j410J33m02n35
$$ -2889 -1451 -555 -490 -1116 540 627 1073 1597 1577 2908 1855 1638 1303 1553 670 -740 -607 -1009 -1544
2325a544j283M68N51l21J447qN47l94P79J680n30M60J112k80j019n08j3l25q18
$$ -1544 -2827 -2359 -1808 -2129 -682 -690 -143 -537 242 1922 1392 1852 2964 2684 1665 1157 1144 819 1
2344Al26r26q30L4L52j008K93P13O45l21J194N37M65P16L68N69m39k38K3l7n31
$$ 1 -325 -1251 -2081 -2047 -1695 -2703 -2410 -1697 -1052 -1373 -179 358 823 1539 1907 2476 2037 1799 1822 1785 1254
2365A254j470m62m51K0q05rK84o69L09Q82N88l05J080R4J229K81j042R63L53n02
$$ 1254 -216 -678 -1129 -1109 -1914 -1923 -1639 -2308 -1999 -1117 -529 -834 246 340 1569 1850 808 1771 2124 1622
2385A622n9K19j328o44l90o28j028nm28M48K74N99N98k27J780k40N60l95J374
$$ 1622 1563 1782 454 -190 -580 -1208 -2236 -2241 -2669 -2221 -1947 -1348 -750 -977 803 563 1123 728 2102
2404B102K80m65k33l74k02o09J15r91j087K62j36j035J67J12Q54n8J175k18l6
$$ 2102 2382 1917 1684 1310 1108 499 614 -377 -1464 -1202 -1338 -2373 -2206 -2094 -1240 -1298 -123 -341 -377
2423c77Q95Q38J95J62j05N06m12j240K55o52o95l62j67q27r3Q18p64Q8N93N30
$$ -377 518 1356 1551 1713 1608 2114 1702 462 717 65 -630 -992 -1159 -1986 -2079 -1261 -2025 -1937 -1344 -814
2443h14M80N96M44Q4R15J67Q7o03J27R4q27j383P22j387J34n83k64J56L00L52
$$ -814 -334 262 706 790 1705 1872 1959 1356 1483 1577 750 -633 89 -1298 -1164 -1747 -2011 -1855 -1555 -1203
2463a203m04J408k3M76L93j47M90O01K58K23l36R1j330L22m61j371K9l96p9l71
$$ -1203 -1607 -199 -222 254 647 500 990 1591 1849 2072 1736 1827 497 819 358 -1013 -984 -1380 -1459 -1830
2483a830o1l10J46J324J67j02M36J413n37O44Q02L35o26r32N13q00m94l61p10
$$ -1830 -1891 -2201 -2055 -731 -564 -666 -230 1183 646 1290 2092 2427 1801 869 1382 582 88 -273 -983
2502i83Q18k040J16M47L11j86n5P61J034L21L58l17K13N72Q51o24j35o11n74l0
$$ -983 -165 -2205 -2089 -1642 -1331 -1517 -1572 -811 223 544 902 585 798 1370 2221 1597 1462 851 277 247
2522B47o22K51j260J82k26j322L47J040L09J000p8L77J439n01J64J59j88J534
$$ 247 -375 -124 -1384 -1202 -1428 -2750 -2403 -1363 -1054 -54 -132 245 1684 1183 1347 1506 1318 2852
2540B852j579o38L4j63j040J17k36n81p85L55L35k55N40k39L30Q61M27P22K91
$$ 2852 1273 635 669 506 -534 -417 -653 -1234 -2019 -1664 -1329 -1584 -1044 -1283 -953 -92 335 1057 1348
2559A348r8P52p83Q23n44j03j137m05K76m20j086j63J39p30N14M64O50O49k41
$$ 1348 1250 2002 1219 2042 1498 1395 258 -147 129 -291 -1377 -1540 -1401 -2131 -1617 -1153 -503 146 -95
2578i5L82P55N37l1J07m79N06k69m07M65j337o10m60M69j332k38M06k62Q0O48
$$ -95 287 1042 1579 1548 1655 1176 1682 1413 1006 1471 134 -476 -936 -467 -1799 -2037 -1631 -1893 -1813 -1165
2598a165N12j12K94P49K43R09q3O34K80r55Q2l36k99j90j129l55j32o45J92j93
$$ -1165 -653 -765 -471 278 521 1430 1347 1981 2261 1306 1388 1052 753 563 -566 -921 -1053 -1698 -1506 -1699
2618a699Q89j90l91Q75R79lO04M73j038O85M77m45j84m83K15Pr55j420K80o01
$$ -1699 -810 -1000 -1391 -516 463 460 1064 1537 499 1184 1661 1216 1032 549 764 771 -184 -1604 -1324 -1925
2638a925M85n23R31j207R06P57j62J198q4J14O22M23K75m31l14j04r54O75r67
$$ -1925 -1440 -1963 -1032 -2239 -1333 -576 -738 460 376 490 1112 1535 1810 1379 1065 961 7 682 -285
2657b85M75j377j54M2j39o3J8K04l74J558O73K06rN54n77J314o03j70r13k93J329
$$ -285 190 -1187 -1341 -1299 -1438 -1501 -1483 -1279 -1653 -95 578 784 775 1329 752 2066 1463 1293 380 87 1416
2678A416q82q29n65q57J40N43p56M31k01L13M99R79M75R8l14J231m45Q72o68j03
$$ 1416 534 -295 -860 -1717 -1577 -1034 -1790 -1359 -1560 -1247 -748 231 706 804 490 1721 1276 2148 1480 1377
2698A377n79L08j515N22k74r57n39m41N87j22O88k23J178J14k44N70j47J215l56
$$ 1377 798 1106 -409 113 -161 -1118 -1657 -2098 -1511 -1633 -945 -1168 10 124 -120 450 303 1518 1162
2717A162L93o6M94j047j74p56m25j51l54K06m08n10l6l9p62J781N36L8O11J87
$$ 1162 1555 1489 1983 936 762 6 -419 -570 -924 -718 -1126 -1636 -1672 -1711 -2473 -692 -156 -118 493 680
2737F80J353j151L97k2M17j218Q66o33j045j51n53k62O83n12j092J188l06j79
$$ 680 2033 882 1279 1257 1674 456 1322 689 -356 -507 -1060 -1322 -639 -1151 -2243 -1055 -1361 -1540
2755a540M66P18O58L52L24j8P16N71q43l41j04q00K15j91q32n93O0k08K82j56
$$ -1540 -1074 -356 302 654 978 960 1676 2247 1404 1063 959 159 374 183 -649 -1242 -1182 -1390 -1108 -1264
2775a264n87P62O06K89P33J25R0O83l80M27O4l01j34m94l13l42k90o67L40o88
$$ -1264 -1851 -1089 -483 -194 539 664 754 1437 1057 1484 1548 1247 1113 619 306 -36 -326 -993 -653 -1341
2795a341j30l86M33M6N49K69j07J219J94L40L52N38m35l47lo77J63r82n14q4q47
$$ -1341 -1471 -1857 -1424 -1378 -829 -560 -667 552 746 1086 1438 1976 1541 1194 1191 514 677 -305 -819 -903 -1750
2816a750O28J64l50n00O9J630o11N97M63k23N51J593q63j09M32n42j19j227K05
$$ -1750 -1122 -958 -1308 -1808 -1739 -109 -720 -123 340 117 668 2261 1398 1289 1721 1179 1060 -167 38
2835C8l01K55m07r4j823J119j56o18J172O23j68N68o3O95n45Q88P43p74j41j99
$$ 38 -263 -8 -415 -509 -2332 -1213 -1369 -1987 -815 -192 -360 208 145 840 295 1183 1926 1152 1011 812
2855H12K28l79n06Q8p16r14P92m99kk97L30R37l68J056j98L95J35JM33J19m88
$$ 812 1040 661 155 243 -473 -1387 -595 -1094 -1096 -1393 -1063 -126 -494 562 364 759 894 895 1328 1447 959
2876I59M56j239M76o39l17k37O5k37k19j234N49L93K99L13J96J031n28J196j75
$$ 959 1415 176 652 13 -304 -541 -476 -713 -932 -2166 -1617 -1224 -925 -612 -416 615 87 1283 1108
2895A108j96N07r52L97L6l74l03n75M03q48Nn34L09J99n46Q87J2K30k86J558l93
$$ 1108 912 1419 467 864 900 526 223 -352 51 -797 -792 -1326 -1017 -818 -1364 -477 -465 -235 -521 1037 644
2916F44K07j21J92J133n49k74n6p34k00p65ol45l55l63j75O33L01j56L4J141K47
$$ 644 851 730 922 2055 1506 1232 1176 442 242 -523 -529 -874 -1229 -1592 -1767 -1134 -833 -989 -955 186 433
2937D33j50P64k73J63M01o5K39j20j121p7m97k06O00q81j134P58j18k35J190N0
$$ 433 283 1047 774 937 1338 1273 1512 1392 271 194 -303 -509 91 -790 -1924 -1166 -1284 -1519 -329 -279
2957b79k84J180j37L54P21l12L58k76m40k40l10n16M9o06L14l91j06l83Q34j51
$$ -279 -563 617 480 834 1555 1243 1601 1325 885 645 335 -181 -132 -738 -424 -815 -921 -1304 -470 -621
2977f21N46r55N10M60J28J034l33P16l11N2j11m38j110QQ24o64j18p53l8p22N91
$$ -621 -75 -1030 -520 -60 68 1102 769 1485 1174 1226 1115 677 -433 -425 399 -265 -383 -1136 -1174 -1896 -1305
2998a305M15m51N77L82O0O79O39Q64j159O27k71K81q12K2J89m51j54j110l25O25
$$ -1305 -890 -1341 -764 -382 -322 357 996 1860 701 1328 1057 1338 526 548 737 286 132 -978 -1303 -678
3018f78J30m46n33K50O70O66n05P42K9P3L10L00K03k81L83l72r04N97o07m95l81
$$ -678 -548 -994 -1527 -1277 -607 59 -446 296 325 398 708 1008 1211 930 1313 941 37 634 27 -468 -849
3039h49p30K07j02P23l38J05N78L93m96P74K81K91Kl22P03j39p39J190j016m50
$$ -849 -1579 -1372 -1474 -751 -1089 -984 -406 -13 -509 265 546 837 839 517 1220 1081 342 1532 516 66
3059F6m02J70r96L81M19j190O22R30m51j9O11m4M32K01O28l95j35L05q36M41o25
$$ 66 -336 -166 -1162 -781 -362 -1552 -930 0 -451 -470 141 97 529 730 1358 963 828 1133 297 738 113
3080A13j80k44j015J035q08j2n1K80p77Q21N50O59o1L14M57p25Q31k89L56l82
$$ 113 -67 -311 -1326 -291 -1099 -1111 -1162 -882 -1659 -838 -288 371 310 624 1081 356 1187 898 1254 872
3100H72No8o60n10K06k67n11O19q88O5N24M4k19O78K33N29J95j02L02O9L54p27
$$ 872 877 809 149 -361 -155 -422 -933 -314 -1202 -1137 -613 -569 -788 -110 123 652 847 745 1047 1116 1470 743
3122G43N82j040K79p47j55k01R0n38o7l60O66K7J90l54J290j117P83R11p94J460
$$ 743 1325 285 564 -183 -338 -539 -449 -987 -1054 -1414 -748 -721 -531 -885 405 -712 71 982 188 1648
3142A648j363J240l34o00M23k09j123m14R94j943K49P43j42j6j55K75P63j89P33
$$ 1648 285 1525 1191 591 1014 805 -318 -732 262 -1681 -1432 -689 -831 -847 -1002 -727 36 -153 580
3161E80n29N16J581j761J004n44m22k51l83J75j02r56L25L32p67O41r09M33n6
$$ 580 51 567 2148 387 1391 847 425 174 -209 -34 -136 -1092 -767 -435 -1202 -561 -1470 -1037 -1093
3180a093J058M0O70m38L45K76k67K82l64R26l48j018l5m25Q6o79p8M36n77L49
$$ -1093 -35 5 675 237 582 858 591 873 509 1435 1087 69 34 -391 -305 -984 -1062 -626 -1203 -854
3200h54J71M93o88O63Q58k34p72N63P20NP0k43k26k03j043M45J89m81k79K22n84
$$ -854 -683 -190 -878 -215 643 409 -363 200 920 925 995 752 526 323 -720 -275 -86 -567 -846 -624 -1208
3221a208L12J5J086j289N83N58R22o26K7M73M24m26o50M89o62j58J02k40p95Q00
$$ -1208 -896 -881 205 -1084 -501 57 979 353 380 853 1277 851 201 690 28 -130 -28 -268 -1063 -263
3241b63o54o6L1j34Q8K20K95N48N4l28J007L14K69k51J44n88j068O48m11j53n04
$$ -263 -917 -983 -952 -1086 -998 -778 -483 65 119 -209 798 1112 1381 1130 1274 686 -382 266 -145 -298 -802
3262h02M96q08K39J04j63j68M75R2J200j123J48J502m84p7K17k65K93L95q31Q4
$$ -802 -306 -1114 -875 -771 -934 -1102 -627 -535 665 -458 -310 1192 708 631 848 583 876 1271 440 524
3282E24k11j390M31m56k74M07k95J14J416L00j43M4j45N52k1O79J93r92J2R2l41
$$ 524 313 -1077 -646 -1102 -1376 -969 -1264 -1150 266 566 423 467 322 874 853 1532 1725 733 745 837 496
3303D96j73p98n9j87m05P4l7N22k54L30k91J81J37R53n2L20O56o08K22R4j111
$$ 496 323 -475 -534 -721 -1126 -1052 -1089 -567 -821 -491 -782 -601 -464 489 437 757 1413 805 1027 1121 10
3324A0P18k64q41j8r08J038k26K62m68P1k92O13j79J269l61L10l26J178k63o26
$$ 10 728 464 -377 -395 -1303 -265 -491 -229 -697 -626 -918 -305 -484 785 424 734 408 1586 1323 697
3344F97N98j356N68j95n11k49n2R1Nl46o10Q24K39k37j40J59P18j30N18L23J90
$$ 697 1295 -61 507 312 -199 -448 -500 -409 -404 -750 -1360 -536 -297 -534 -674 -515 203 73 591 914 1104
3365A104o14P55k01k83o73P92o60j299K65j49m52M26J03k16j92J098J68K67j31
$$ 1104 490 1245 1044 761 88 880 220 -1079 -814 -963 -1415 -989 -886 -1102 -1294 -196 -28 239 108
3384A08K61Q95k58L17l26j3o79j28n3j39o80Ll60J155q73L05N25k44o40L77N97
$$ 108 369 1264 1006 1323 997 984 305 177 124 -15 -695 -692 -1052 103 -770 -465 60 -184 -824 -447 150
3405A50J33l78J128K75n7l1j142Q74l1l77n27K32k40q8m19o63M96J64PM85o19
$$ 150 283 -95 1033 1308 1251 1220 78 952 921 544 17 249 9 -79 -498 -1161 -665 -501 -494 -9 -628
3426f28K80J262r7m24O38j82j83K80P0j038K81R5m98l51N19k6p11M49q76j74P94
$$ -628 -348 914 817 393 1031 849 666 946 1016 -22 259 354 -144 -495 24 -2 -713 -264 -1140 -1314 -520
3447e20J37O63q67R96J1M37l24O92q58M11l38j30j55o1p7p8j054K73K88j78jk6
$$ -520 -383 280 -587 409 420 857 533 1225 367 778 440 310 155 94 17 -61 -1115 -842 -554 -732 -733 -759
3469g59J49N07K87K48N84j13K58l07K44o13m5M21o56o95P5J69o45J30j39P55q30
$$ -759 -610 -103 184 432 1016 903 1161 854 1098 485 440 861 205 -490 -415 -246 -891 -761 -900 -145 -975
3490i75o2O41L23q8P76m82j74J170q54j2J449j185L39r36J128r37n26m93M21j36
$$ -975 -1037 -396 -73 -161 615 133 -41 1129 275 263 1712 527 866 -70 1058 121 -405 -898 -477 -613
3510f13LO10p54J16k47J114N8l82M01L0L13k8l82J73K54p32K35l64J99J5Qr13
$$ -613 -610 0 -754 -638 -885 229 287 -95 306 336 649 621 239 412 666 -66 169 -195 4 19 27 -886
3532h86P47j021l12J408r03O49M85kj41J145o2J92p09O77m33k73j55o03L49j43
$$ -886 -139 -1160 -1472 -64 -967 -318 167 165 24 1169 1107 1299 590 1267 834 561 406 -197 152 9
3552Ij85k00l67O4K80j34l42K07O40N42n41J241n71N22j26l08J97j51j50n09P9
$$ 9 -176 -376 -743 -679 -399 -533 -875 -668 -28 514 -27 1214 643 1165 1039 731 928 777 627 118 197
3573A97l24j72j06Q8l09K71k17P79l41M39k19k63P51k34O4M59L65n10j58l11k23
$$ 197 -127 -299 -405 -317 -626 -355 -572 207 -134 305 86 -177 574 340 404 863 1228 718 560 249 26
3594B6N99p45K04j121N08j10p45R51l2O05o49K58j70P57K16M09l01N01j882J828
$$ 26 625 -120 84 -1037 -529 -639 -1384 -433 -465 140 -509 -251 -421 336 552 961 660 1161 -721 1107
3614A107r29O9J30k89l70o95P21j94k23p37O05N45J84L5kQ47l90n9N11o50k15
$$ 1107 178 247 377 88 -282 -977 -256 -450 -673 -1410 -805 -260 -76 -41 -43 804 414 355 866 216 1
3635AP52o46j4L03k06m96j36K06l78m13N62k87N42m79L41J146m87j30r7M9K8P58
$$ 1 753 107 93 396 190 -306 -442 -236 -614 -1027 -465 -752 -210 -689 -348 798 311 181 84 133 161 919
3657I19m9k32m83J5m26O51p9n13l84l64L2J62m14J027M74m1l41K67L15M2M12K37
$$ 919 870 638 155 170 -256 395 316 -197 -581 -945 -913 -751 -1165 -138 336 295 -46 221 536 578 990 1227
3679A227o98n32O28n19k40l16R04q91k12n62K76K55J73Q7k93P29O98m20K78j77
$$ 1227 529 -3 625 106 -134 -450 454 -437 -649 -1211 -935 -680 -507 -420 -713 16 714 294 572 395
3699C95L3J011j249M64l44j72Ml23K36n75k43n74R71k55K24q67J390k55j35J000
$$ 395 428 1439 190 654 310 138 142 -181 55 -520 -763 -1337 -366 -621 -397 -1264 126 -129 -264 736
3719G36l34M31q05N13j01n12O50j038R75j325l85J001k09K52l86r48J379q89M33
$$ 736 402 833 28 541 440 -72 578 -460 515 -810 -1195 -194 -403 -151 -537 -1485 -106 -995 -562
3738e62o49J294P6M19J74P8l31j42n6m92K47L33o63q7L7k40M7l03K90n42J535
$$ -562 -1211 83 159 578 752 830 499 357 301 -191 56 389 -274 -361 -324 -564 -517 -820 -530 -1072 463
3759D63j422J236p56j04P41R1oM86l43L93j05K84p8j058k5m23K30L07r28N41n58
$$ 463 -959 277 -479 -583 158 249 243 729 386 779 674 958 880 -178 -203 -626 -396 -89 -1017 -476 -1034
3780a034N15J14M8O00Q15K2q04j32J99N47o07l52L68K93Rj094K20L79r98R50n16
$$ -1034 -519 -405 -357 243 1058 1080 276 144 343 890 283 -69 299 592 601 -493 -273 106 -892 58 -458
3801d58kQ06n94q0j74l14J408n03J36M34r9M1p4L40p29J63J24p1j180R3k41K08
$$ -458 -460 346 -248 -328 -502 -816 592 89 225 659 560 601 527 867 138 301 425 354 -826 -733 -974 -766
3823g66L65n28M70K66L51r41N91j97J152j81nP6KK44q26j15J51j010K58J68k0
$$ -766 -401 -929 -459 -193 158 -783 -192 -389 763 582 577 653 655 899 73 -42 109 -901 -643 -475 -495
3844d95M63j382L60J90R58j515Q49N53L12L4p71J113K22q09M45m87N27k98k23
$$ -495 -32 -1414 -1054 -864 94 -1421 -572 -19 293 327 -444 669 891 82 527 40 567 269 46
3863D6j11N2l04m7n93P55L28q83L03k90M44J000k43L52m72J93P3J38J43n34K22
$$ 46 -65 -13 -317 -364 -957 -202 126 -757 -454 -744 -300 700 457 809 337 530 603 741 884 350 572
3884E72q56k88L12Mj41m96J15Q19l25K70L8J93l96Q64j72j80M24j99K31l29j55
$$ 572 -284 -572 -260 -256 -397 -893 -778 41 -284 -14 24 217 -179 685 513 333 757 558 789 460 305
3905C05n52N10J4l74n49L32o26N33m99J24k5P43k8O73j024Q49j78j9j93J222l31
$$ 305 -247 263 277 -97 -646 -314 -940 -407 -906 -782 -807 -64 -92 581 -443 406 228 209 16 1238 907
3926I07m84k71p8M01j154K13j01n38Q57j62k69O79Ol75J402j51j205L87O76m23
$$ 907 423 152 74 475 -679 -466 -567 -1105 -248 -410 -679 0 6 -369 1033 882 -323 64 740 317
3946C17K2j40m05N72l32m36p8j97J43M39l13L31n36L89j038R44M66k37J37J246
$$ 317 339 199 -206 366 34 -402 -480 -677 -534 -95 -408 -77 -613 -224 -1262 -318 148 -89 48 1294
3966A294j243O34L96q52J51l37K80n46k37M6N30q32J42k35N11J209j380L27J167
$$ 1294 51 685 1081 229 380 43 323 -223 -460 -414 116 -716 -574 -809 -298 911 -469 -142 1025
3985A025n46n38Q16k65M13q32O02n78J92L74j02r00N41J82j660M81Q40m94k68
$$ 1025 479 -59 757 492 905 73 675 97 289 663 561 -339 202 384 -1276 -795 45 -449 -717
4004g17L35J99m01Q28l16K78K26J87p79J8N06J03l19L2j56j36o10J00k20m18J382
$$ -717 -382 -183 -584 244 -72 206 432 619 -160 -142 364 467 148 180 24 -112 -722 -622 -842 -1260 122
4025A22l87m61P70k39o31N51Q09n73M47O72j049J48k32P01Lk81q20J02K9N84p35
$$ 122 -265 -726 44 -195 -826 -275 534 -39 408 1080 31 179 -53 648 651 370 -450 -348 -319 265 -470
4046d70o4J73l97O63m25K45j96O54K00j124J638p9J13j028K04P7J40J36j185P51
$$ -470 -534 -361 -758 -95 -520 -275 -471 183 383 -741 897 818 931 -97 107 184 324 460 -725 26
4066B6m6n67j54q1P49J91j39k10N02l27L76l87L40J025r31j04L81k28n7l24O57
$$ 26 -20 -587 -741 -822 -73 118 -21 -231 271 -56 320 -67 273 1298 367 263 644 416 359 35 692
4087F92q50k57j96L92k7n45O56n59P21o32N0O63O0j12J448q58l80m0L49O8n62
$$ 692 -158 -415 -611 -219 -246 -791 -135 -694 27 -605 -555 108 168 56 1504 646 266 226 575 643 81
4108H1p40M24P8m70m38L10P33p4p1m73j47Q91L0n46J030n09P84l29j41m85M78
$$ 81 -659 -235 -157 -627 -1065 -755 -22 -96 -167 -640 -787 104 134 -412 618 109 893 564 423 -62 416
4129D16k06j86m72k6L15o15J48J07o5Q35P33o56k54k97N2J181m22n41K43L94l49
$$ 416 210 24 -448 -474 -159 -774 -626 -519 -584 251 984 328 74 -223 -171 1010 588 47 290 684 335
4150C35K08m42n60N54J60n76l49N49n69L17k60P45l86J89k08N62m2M40k93J03
$$ 335 543 101 -459 95 255 -321 -670 -121 -690 -373 -633 112 -274 -85 -293 269 227 667 374 477
4170D77R78r49m20Pl21K59J35J88r88m49L14L56j57k41R75p06K34J78J04R18m34
$$ 477 1455 506 86 93 -228 31 166 354 -634 -1083 -769 -413 -570 -811 164 -542 -308 -130 -26 892 458
4191D58M15k15r04J99K62j82o01J54K00k25O4N28m95R6M16j38j004Q09M51K40
$$ 458 873 658 -246 -47 215 33 -568 -414 -214 -439 -375 153 -342 -246 170 32 -972 -163 288 528
4211E28n5M19m72Q0n26M55L16m87Kn33K55l72n76J074q15j2K14J0J72K38L33o77
$$ 528 473 892 420 500 -26 429 745 258 260 -273 -18 -390 -966 108 -707 -719 -505 -495 -323 -85 248 -429
4233d29O7N90j63N94k77L46m50l53l18L26P51j583J289r00p7j65O12K71J45o69
$$ -429 -362 228 65 659 382 728 278 -75 -393 -67 684 -899 390 -510 -587 -752 -140 131 276 -393
4253c93N04M24l64P30m84j81k22M45k71m92K39R6k44J54m3M5M93p19R19j052Q5
$$ -393 111 535 171 901 417 236 14 459 188 -304 -65 31 -213 -59 -102 -57 436 -283 636 -416 -331
4274c31M01o8m07M50LK71N6l48K67N52o52n62m15N95P6m68M0K91m59K73R4k99
$$ -331 70 2 -405 45 48 319 375 27 294 846 194 -368 -783 -188 -112 -580 -540 -249 -708 -435 -341 -640
4296f40Q3J054n86N04o0P0k36K92K81j06l94p34Q47m41Q1m64l72j22O35l49K09
$$ -640 -557 497 -89 415 355 425 189 481 762 656 262 -472 375 -66 15 -449 -821 -943 -308 -657 -448
4317d48J88N92m49P84q62Q9L80Q4l93Q33O1p02N11m98J92L82j047K51r86J92L85
$$ -448 -260 332 -117 667 -195 -106 274 358 -35 798 859 157 668 170 362 744 -303 -52 -1038 -846 -461
4338d61M77p11K88Q57p36K64n78N46M83k09j3k10M59m90j97n10Q60l97L28j62
$$ -461 16 -695 -407 450 -286 -22 -600 -54 429 220 207 -3 456 -34 -231 -741 119 -278 50 -112
4358a12n99J02R80j57p51L13j71O42m2j88J030P6o81J1r91J576q46m1r04K63K44
$$ -112 -711 -609 371 214 -537 -224 -395 247 205 17 1047 1123 442 453 -538 1038 192 151 -753 -490 -246
4379b46L12j54q62L40J89Q90r27O48q6P49r25J53N54k22O26l30n98n60M48K01
$$ -246 66 -88 -950 -610 -421 469 -458 190 104 853 -72 81 635 413 1039 709 111 -449 -1 200
4399B00N27j131J17P13q95M26j97j74j0m3N51q30R79m7l56k8N33O91q07O06j044
$$ 200 727 -404 -287 426 -469 -43 -240 -414 -424 -467 84 -746 233 186 -170 -198 335 1026 219 825 -219
4420b19k08J83l67%K19o44J324l97L82n32L85k97J52K84N64j300N49O78L11j042
$$ -219 -427 -244 -611 -611 -392 -1036 288 -109 273 -259 126 -171 -19 265 829 -471 78 756 1067 25
4440B5l7N27o45k02Q78q84m7q4k23J77N30j4l7M83o84J31K76Q41j104J350r15
$$ 25 -12 515 -130 -332 546 -338 -385 -469 -692 -515 15 1 -36 447 -237 -106 170 1011 -93 1257 342
4461C42K68m60l11M19m92J31J52j43k0r8o02L58RP1M82n64Q39l22J139j127M01
$$ 342 610 150 -161 258 -234 -103 49 -94 -114 -212 -814 -456 -447 -376 106 -458 381 59 1198 71 472
4482D72P64m69k38k40k32Q8m50K2N05k97k53n9l08N40k28K74K01l51J90J26K39
$$ 472 1236 767 529 289 57 145 -305 -283 222 -75 -328 -387 -695 -155 -383 -109 92 -259 -69 57 296
4503B96p03L44Q41p66J51O04J86p16o24O01p03p24M88Q95k88L40l40m32M22N00
$$ 296 -407 -63 778 12 163 767 953 237 -387 214 -489 -1213 -725 170 -118 222 -118 -550 -128 372
4523C72K32p05N1JJ97k76O24r29R1N36k28P5L95j389M33M04k03L57l05O42q6L16
$$ 372 604 -101 -50 -49 148 -128 496 -433 -342 194 -34 41 436 -953 -520 -116 -319 38 -267 375 289 605
4545F05K9n58N38M29j049k49P8J3P63n97J09l25j32k8q58J039N5J1l97L71M4L2
$$ 605 634 76 614 1043 -6 -255 -177 -164 599 2 111 -214 -346 -374 -1232 -193 -138 -127 -524 -153 -109 -77
4567g7J39n10Q02L32p67J81K23K55l06l9k13n71j12rO47j73J53J80q58L22J047
$$ -77 62 -448 354 686 -81 100 323 578 272 233 20 -551 -663 -672 -25 -198 -45 135 -723 -401 646
4588F46k66J0p72N21P63r66O38n06o32J604j279L58L22j042M52r96J196o35K2
$$ 646 380 390 -382 139 902 -64 574 68 -564 1040 -239 119 441 -601 -149 -1145 51 -584 -562
4607e62P88j22j70p33L09Q78m93M53l9K31r9O17r93K14p18Q2k5o6K81o01O89m60
$$ -562 226 104 -66 -799 -490 388 -105 348 309 540 441 1058 65 279 -439 -357 -382 -448 -167 -768 -79 -539
4629e39K72J09J8K63L24J46j71K09o43P17m32o74O45n46L79J4l72k99Q54j11p73
$$ -539 -267 -158 -140 123 447 593 422 631 -12 705 273 -401 244 -302 77 91 -281 -580 274 163 -610
4650f10N59l35J24N57L79j74n74L31N7M9M92p25k47N69o95O98n24k20O5M80K40
$$ -610 -51 -386 -262 295 674 500 -74 257 314 363 855 130 -117 452 -243 455 -69 -289 -224 256 496
4671D96o52M79m04J49p37M31j75L01j99N06OK08j15j33j72J95n28J26M91p54k50
$$ 496 -156 323 -81 68 -669 -238 -413 -112 -311 195 201 409 294 161 -11 184 -344 -218 273 -481 -731
4692g31L18L74J07l78N01%m49l75P43Q09m15K3L5O4O9p78k02N70l9n16N19m61
$$ -731 -413 -39 68 -310 191 191 -258 -633 110 919 504 527 562 626 695 -83 -285 285 246 -270 249 -212
4714b12k7M30k58N7l60L11J56n97J238j051O73J07n17O1J95P29m97l33N3l15J78
$$ -212 -239 191 -67 -10 -370 -59 97 -500 738 -313 360 467 -50 11 206 935 438 105 158 -157 21
4735B1m39j86O36k89M11r77J250j24k49K79J19M8n9k42O14o84o5J76k5J55p83
$$ 21 -418 -604 32 -257 154 -823 427 303 54 333 452 500 441 199 813 129 64 240 215 370 -413
4756d13O9n9K10n4K17m95l52Q84M60R6J14j45o99n0O2N04k11M56r59J91N70j10
$$ -413 -344 -403 -193 -247 -30 -525 -877 7 467 563 677 532 -167 -217 -155 349 138 594 -365 -174 396 286
4778B86K30m62m01l85R83n69n0J28K01J22K78o48Q35k80QJ02l88K83j05k54O19
$$ 286 516 54 -347 -732 251 -318 -368 -240 -39 83 361 -287 548 268 276 378 -10 273 168 -86 533
4799E33N4n94N12p94j0k36K8K85L1K43j89M33pp11Q81R5l79N8N45j179R46o14
$$ 533 587 -7 505 -289 -299 -535 -507 -222 -191 52 -137 296 289 -422 459 554 175 233 778 -401 545 -69
4821f9K31m29J57n80N58j168J482K8q63N40l04l7mK93r2P16j48j99K04j51KJ76
$$ -69 162 -267 -110 -690 -132 -1300 182 210 -653 -113 -417 -454 -458 -165 -257 459 311 112 316 165 167 343
4843C43p75K18L17m69l83M54jl36j57N86J39J78O40j104L79l52M37K53m45PM51
$$ 343 -432 -214 103 -366 -749 -295 -296 -632 -789 -203 -64 114 754 -350 29 -323 114 367 -78 -71 380
4864C80j53L46o78l22P06K04j063N88n88O89m71L45o60j21R30j8k8K88N05p81
$$ 380 227 573 -105 -427 279 483 -580 8 -580 109 -362 -17 -677 -798 132 114 86 374 879 98
4884I8Q2Q08m73N27j050k27k8o39Q04K56j58m82O47k71J95m75J87Q66n62NM88
$$ 98 180 988 515 1042 -8 -235 -263 -902 -98 158 0 -482 165 -106 89 -386 -199 667 105 110 598
4905E98k74k1l54M6K3k90K42p87P03K42J94k16j36o45K19N21J56o88P15Q6J76
$$ 598 324 303 -51 -5 18 -272 -30 -817 -114 128 322 106 -30 -675 -456 65 221 -467 248 334 510
4926E10k39K05N3J07j914J776N50j453O77j147Q09J42k46K34L1n40k11N62m22
$$ 510 271 476 529 636 -1278 498 1048 -405 272 -875 -66 76 -170 64 95 -445 -656 -94 -516
4945e16R97l41l06j61Q82l75K94q4O7l62k73M26n55L69q18M11K85p80J150j19
$$ -516 481 140 -166 -327 555 180 474 390 457 95 -178 248 -307 62 -756 -345 -60 -840 310 191
4965A91j82M80J13Jj136Q18q26N07N59l10o1m27J80K20o20P72L13j379Q85K52
$$ 191 9 489 602 603 -533 285 -541 -34 525 215 154 -273 -93 127 -493 279 592 -787 98 350
4985C50q04J50N98k40K35m60N58j69o06J95L81L70k18m56J73k99P2N90j088M98
$$ 350 -454 -304 294 54 289 -171 387 218 -388 -193 188 558 340 -116 57 -242 -170 420 -668 -170
5005a70j05K39l19K68m81O33N49l89j23k1j61N28Rl08k13M03L0m97P29j418K15
$$ -170 -275 -36 -355 -87 -568 65 614 225 102 81 -80 448 457 149 -64 339 369 -128 601 -817 -602
5026f02R7Q74k96j079P38O13j072N80K99j44p23J254m03j6M28m22L76o71M36p86
$$ -602 -505 369 73 -1006 -268 345 -727 -147 152 8 -715 539 136 120 548 126 502 -169 267 -519
5046e19P45l86L6n45J57J148p71p41O78N39k58N04k57n39m8Q64J23p22J77m44
$$ -519 226 -160 -124 -669 -512 636 -135 -876 -198 341 83 587 330 -209 -257 607 730 8 185 -259
5066b59M27J99k92m22j49k9M01l4j74k14j28k02O76J10Q92j195O32Q60j276P06
$$ -259 168 367 75 -347 -496 -525 -124 -158 -332 -546 -674 -876 -200 -90 802 -393 239 1099 -177 529
$$ [...]
8191H6
##END NTUPLES=NMR FID
##END=
