##TITLE=1H_PH-Glu_TFAA
 CDCl3
 64 sc, 
 5.2.2024
##JCAMPDX= 6.0         $$ Bruker NMR JCAMP-DX V2.0
##DATA TYPE= NMR FID
##DATA CLASS= NTUPLES
##ORIGIN= UXNMR, Bruker Analytische Messtechnik GmbH
##OWNER= root
$$ XWIN-NMR		Version 3.5
$$ Mon Feb  5 14:27:19 2024 Russian Standard Time (UT+4h)  she@DPX200
##.OBSERVE FREQUENCY= 200.1313
##.OBSERVE NUCLEUS= ^1H
##.DELAY= (6, 6)
##.ACQUISITION MODE= SIMULTANEOUS
##.ACQUISITION SCHEME= undefined
##.AVERAGES= 64
##.DIGITISER RES= 18
##SPECTROMETER/DATA SYSTEM= spect
##.PULSE SEQUENCE= zg30
##.SOLVENT NAME= D2O
##.SHIFT REFERENCE= (INTERNAL, D2O, 0, 15.7039)
##AUDIT TRAIL= $$ (NUMBER, WHEN, WHO, WHERE, WHAT)
$$ ##TITLE= Audit trail, XWIN-NMR		Version 3.5
$$ ##JCAMPDX= 5.01
$$ ##ORIGIN= Bruker BioSpin GmbH
$$ ##OWNER= she
$$ F:/spectra/data/she/nmr/H-F/1/audita.txt
$$ ##AUDIT TRAIL=  $$ (NUMBER, WHEN, WHO, WHERE, WHAT)
(   1,<2024-02-05 14:26:19.07 +0400>,<she>,<DPX200>,
      <continue with go, POWCHK disabled, PULCHK disabled
       configuration hash MD5:
       00 E9 B6 7A A2 85 ED C7 34 08 36 98 17 FE 4E 26
       data hash MD5: 16K
       AD 65 10 33 83 2D E1 41 A7 36 0C C2 44 22 49 D6>)
$$ ##END=
$$ 
$$ hash MD5
$$ 36 A5 60 D4 DD 3B 2E 16 63 E7 04 E4 F1 D9 B8 55
##$RELAX= 
##$RELAX= 
##$RELAX= 
##$RELAX= 
##$RELAX= 
##$RELAX= 
$$ Bruker specific parameters
$$ --------------------------
##$DU= <F:/spectra>
##$EXPNO= 1
##$NAME= <H-F>
##$PROCNO= 1
##$TYPE= <nmr>
##$USER= <she>
##$AMP= (0..31)
100 100 100 100 100 100 100 100 100 100 100 100 100 100 100 100 100 100 
100 100 100 100 100 100 100 100 100 100 100 100 100 100 
##$AQSEQ= 0
##$AQ_mod= 1
##$AUNM= <au_zg>
##$AUTOPOS= <>
##$BF1= 200.13
##$BF2= 200.13
##$BF3= 200.13
##$BF4= 200.13
##$BF5= 200.13
##$BF6= 200.13
##$BF7= 200.13
##$BF8= 200.13
##$BYTORDA= 1
##$CFDGTYP= 0
##$CFRGTYP= 5
##$CHEMSTR= <none>
##$CNST= (0..31)
1 1 145 1 1 1 1 1 1 1 1 1 1 1 1 1 1 1 1 1 1 1 1 1 1 1 1 1 1 1 1 1 
##$CPDPRG= <>
##$CPDPRG1= <>
##$CPDPRG2= <>
##$CPDPRG3= <>
##$CPDPRG4= <mlev>
##$CPDPRG5= <mlev>
##$CPDPRG6= <mlev>
##$CPDPRG7= <mlev>
##$CPDPRG8= <mlev>
##$CPDPRGB= <>
##$CPDPRGT= <>
##$D= (0..31)
0 1.2 0 0 0 0 0 0 0 0.06 0 0.03 0 0 0 0 0.0002 0 0 0 0 0 0 0 0 0 0 0 0 
0 0 0 
##$DATE= 1707128518
##$DBL= (0..7)
120 120 120 120 120 120 120 120 
##$DBP= (0..7)
150 150 150 150 150 150 150 150 
##$DBP07= 0
##$DBPNAM0= <>
##$DBPNAM1= <>
##$DBPNAM2= <>
##$DBPNAM3= <>
##$DBPNAM4= <>
##$DBPNAM5= <>
##$DBPNAM6= <>
##$DBPNAM7= <>
##$DBPOAL= (0..7)
0.5 0.5 0.5 0.5 0.5 0.5 0.5 0.5 
##$DBPOFFS= (0..7)
0 0 0 0 0 0 0 0 
##$DE= 6
##$DECBNUC= <off>
##$DECIM= 32
##$DECNUC= <off>
##$DECSTAT= 4
##$DIGMOD= 1
##$DIGTYP= 9
##$DL= (0..7)
0 120 120 120 120 120 120 120 
##$DP= (0..7)
150 150 150 150 150 150 150 150 
##$DP07= 0
##$DPNAME0= <>
##$DPNAME1= <>
##$DPNAME2= <>
##$DPNAME3= <>
##$DPNAME4= <>
##$DPNAME5= <>
##$DPNAME6= <>
##$DPNAME7= <>
##$DPOAL= (0..7)
0.5 0.5 0.5 0.5 0.5 0.5 0.5 0.5 
##$DPOFFS= (0..7)
0 0 0 0 0 0 0 0 
##$DQDMODE= 0
##$DR= 18
##$DS= 0
##$DSLIST= <SSSSSSSSSSSSSSS>
$$ [...]
##$SUBNAM2= <"">
##$SUBNAM3= <"">
##$SUBNAM4= <"">
##$SUBNAM5= <"">
##$SUBNAM6= <"">
##$SUBNAM7= <"">
##$SUBNAM8= <"">
##$SUBNAM9= <"">
##$SW= 18.0517328524113
##$SWIBOX= (0..15)
0 0 2 0 0 0 0 0 0 0 0 0 0 0 0 0 
##$SW_h= 3612.71676300578
##$TD= 16384
##$TD0= 1
##$TE= 0
##$TE2= 300
##$TE3= 300
##$TEG= 300
##$TL= (0..7)
0 120 120 120 120 120 120 120 
##$TP= (0..7)
150 150 150 150 150 150 150 150 
##$TP07= 0
##$TPNAME0= <>
##$TPNAME1= <>
##$TPNAME2= <>
##$TPNAME3= <>
##$TPNAME4= <>
##$TPNAME5= <>
##$TPNAME6= <>
##$TPNAME7= <>
##$TPOAL= (0..7)
0.5 0.5 0.5 0.5 0.5 0.5 0.5 0.5 
##$TPOFFS= (0..7)
0 0 0 0 0 0 0 0 
##$TUNHIN= 0
##$TUNHOUT= 0
##$TUNXOUT= 0
##$USERA1= <user>
##$USERA2= <user>
##$USERA3= <user>
##$USERA4= <user>
##$USERA5= <user>
##$V9= 5
##$VALIST= <valist>
##$VCLIST= <CCCCCCCCCCCCCCC>
##$VD= 0
##$VDLIST= <DDDDDDDDDDDDDDD>
##$VPLIST= <PPPPPPPPPPPPPPP>
##$VTLIST= <TTTTTTTTTTTTTTT>
##$WBST= 1024
##$WBSW= 4
##$XGAIN= (0..3)
0 0 0 0 
##$XL= 0
##$YL= 0
##$YMAX_a= 711088
##$YMIN_a= -541258
##$ZGOPTNS= <>
##$ZL1= 120
##$ZL2= 120
##$ZL3= 120
##$ZL4= 120
##$ABSF1= 10
##$ABSF2= 0
##$ABSG= 5
##$ABSL= 3
##$ALPHA= 0
##$AQORDER= 0
##$ASSFAC= 0
##$ASSFACI= 0
##$ASSFACX= 0
##$ASSWID= 0
##$AUNMP= <proc_1d>
##$AZFE= 0.1
##$AZFW= 0.1
##$BCFW= 1
##$BC_mod= 2
##$BYTORDP= 1
##$COROFFS= 0
##$CY= 11.3945322036743
##$DATMOD= 1
##$DC= 2
##$DFILT= <>
##$DTYPP= 0
##$F1P= 15.7292609196834
##$F2P= 12.9074282941183
##$FCOR= 0.5
##$FTSIZE= 0
##$FT_mod= 4
##$GAMMA= 1
##$GB= 0.15
##$INTBC= 1
##$INTSCL= 1
##$ISEN= 128
##$LB= 0.24
##$LEV0= 0
##$LPBIN= 0
##$MAXI= 10000
##$MC2= 0
##$MEAN= 0
##$ME_mod= 0
##$MI= 1.114404
##$NCOEF= 0
##$NC_proc= 0
##$NLEV= 6
##$NOISF1= 3.799351
##$NOISF2= 2.8
##$NSP= 1
##$NTH_PI= 0
##$NZP= 0
##$OFFSET= 15.70392
##$PC= 1
##$PHC0= -24592.05
##$PHC1= 7.45268
##$PH_mod= 1
##$PKNL= yes
##$PPARMOD= 0
##$PSCAL= 0
##$PSIGN= 0
##$REVERSE= no
##$SF= 200.130013532006
##$SI= 16384
##$SIGF1= 3
##$SIGF2= 2
##$SINO= 400
##$SIOLD= 16384
##$SREGLST= <1H.CDCl3>
##$SSB= 0
##$STSI= 0
##$STSR= 0
##$SW_p= 3612.71676300578
##$SYMM= 0
##$S_DEV= 0
##$TDeff= 0
##$TDoff= 0
##$TI= <>
##$TILT= no
##$TM1= 0
##$TM2= 0
##$TOPLEV= 0
##$USERP1= <user>
##$USERP2= <user>
##$USERP3= <user>
##$USERP4= <user>
##$USERP5= <user>
##$WDW= 1
##$XDIM= 8192
##$YMAX_p= 0
##$YMIN_p= 0
$$ End of Bruker specific parameters
$$ ---------------------------------
##NTUPLES= NMR FID
##VAR_NAME=  TIME,          FID/REAL,        FID/IMAG
##SYMBOL=    X,             R,               I
##VAR_TYPE=  INDEPENDENT,   DEPENDENT,       DEPENDENT
##VAR_FORM=  AFFN,          ASDF,            ASDF
##VAR_DIM=   8192,          8192,            8192
##UNITS=     SECONDS,       ARBITRARY UNITS, ARBITRARY UNITS
##FACTOR=    0.0002768,     1,               1
##FIRST=     0,             0,               0
##LAST=      2.2672688,     0,               0
##MIN=       0,             -541258,         0
##MAX=       2.2672688,     711088,          0
$$ Real data points
##PAGE= N=1
##DATA TABLE= (X++(R..R)), XYDATA
0@%%%%%%%%%%%%%%%%%%%%%l0R4j28J28j28J28j28J49k11K54k56K85l47L85m21
$$ 0 0 0 0 0 0 0 0 0 0 0 0 0 0 0 0 0 0 0 0 0 0 -30 64 -64 64 -64 64 -64 85 -126 128 -128 157 -190 195 -226
36b26M81n43O10o76P56q42R28j034J153j278J409j551J708j885K073k277K513
$$ -226 255 -288 322 -354 402 -440 488 -546 607 -671 738 -813 895 -990 1083 -1194 1319
53A319k775L062l382L747m169M644n202N872o668P656q912J0564j2874J6338k2193
$$ 1319 -1456 1606 -1776 1971 -2198 2446 -2756 3116 -3552 4104 -4808 5756 -7118 9220 -12973
68a2973L4775j07475N8298j5871q5550L82151N003n48225l6539O50123J1396o20600
$$ -12973 21802 -85673 -27375 -43246 -128796 253355 258358 -289867 -326406 323717 335113 -285487
80b85487L1555N58014j56239m76849K70257L96220m02327l10858N02918K46632
$$ -285487 -253932 304082 147843 -329006 -58749 337471 -64856 -375714 127204 373836
90C73836n74692j76040N95719J25983n45439l1165M59153q6670l63056K34390
$$ 373836 -200856 -376896 218823 344806 -200633 -231798 227355 140685 -222371 12019
100A2019K81928l72250k42072M51396J94119m81606j43252M48165M5991l97992
$$ 12019 293947 -78303 -320375 131021 325140 -156466 -299718 148447 194438 -203554
110b03554O9516L51135j85290k94773K97223K55926l69757j97314M25598J46875
$$ -203554 -134038 217097 31807 -262966 34257 290183 -79574 -276888 148710 295585
120B95585m38249q2968M14520j596l74364R2560L11575k09465k71414K97962K24395
$$ 295585 -142664 -225632 188888 187292 -187072 -94512 217063 7598 -263816 34146 258541
131B58541l63253j80589L91070J22205l81567l6998L66348m6589l24666J46138
$$ 258541 -104712 -285301 105769 227974 -153593 -190591 175757 129168 -195498 -49360
141d9360K90084k25942k46157K93829J93891l41199j46834L51448P6284l50498
$$ -49360 240724 14782 -231375 62454 256345 -84854 -231688 119760 196044 -154454
151a54454p461L18192p9912k86953J62751K55587k27787k12932K79449J73917
$$ -154454 -161915 156277 76365 -210588 -47837 207750 -20037 -232969 46480 220397
161B20397k94406j09658L03777M2365k92615L5240K74068j14467k57041J77882
$$ 220397 -74009 -183667 120110 162475 -130140 -94900 179168 64701 -192340 -14458
171a4458K22165k40619j89062K70558J40141k90345q2232K92732J7038k79627
$$ -14458 207707 -32912 -221974 48584 188725 -101620 -183852 108880 125918 -153709
181a53709O1950K68904j24179k41348J87012K16054k26674j73594K49660J18627
$$ -153709 -91759 177145 52966 -188382 -1370 214684 -11990 -185584 64076 182703
191A82703k63857o0209K57358j3123k54529P4695K34942j36844k11975J84764
$$ 182703 -81154 -141363 115995 102872 -151657 -76962 157980 21136 -190839 -6075
201f075J80255k12799j32155K36781Q4966k38484k0466K42219l8905k32332R6021
$$ -6075 174180 -38619 -170774 66007 150973 -87511 -107977 134242 95337 -136995 -40974
212d0974K15417j47655j95341J79063J54837k10096j14083K20797N7887k29417
$$ -40974 174443 26788 -168553 10510 165347 -44749 -158832 61965 119852 -109565
222a09565m07K30516n2705k20004J09081K07197j44468j75025J80631J39121k01250
$$ -109565 -109972 120544 67839 -152165 -43084 164113 19645 -155380 25251 164372 -36878
233c6878r1150K13109L6823k23555J2690K14562o7315k08443J06624J82477j43855
$$ -36878 -128028 85081 121904 -101651 -88961 125601 58286 -150157 -43533 138944 -4911
244d911j49221J71947J10052j87978n9163K04795J5314k03568L6405J99065p6029
$$ -4911 -154132 17815 127867 -60111 -119274 85521 100835 -102733 -66328 132737 56708
255E6708j81905J13194J53961j49210j24095J69739P9639j91848m1393J97560
$$ 56708 -125197 -12003 141958 -7252 -131347 38392 118031 -73817 -115210 82350
265H2350l814k00101M7044J91794q1690j69801J21396J47920j46207j09958J72243
$$ 82350 78536 -121565 -74521 117273 35583 -134218 -12822 135098 -11109 -121067 51176
276E1176P3743j84145l3554J88164j1212j87989M8320J69834r0223j54151J19892
$$ 51176 124919 -59226 -92780 95384 84172 -103817 -55497 114337 24114 -130037 -10145
287a0145J23588j47183q9989J65958N4769j71496r506J76363k5675j65875O8544
$$ -10145 113443 -33740 -123729 42229 96998 -74498 -84004 92359 66684 -99191 -30647
298c0647J53527j00377j32209J26504J03537j51428p4201J60625L2435j70063
$$ -30647 122880 22503 -109706 16798 120335 -31093 -105294 55331 87766 -82297
308h2297J210J66611l9911j59386P5187J45080j01063j18496J29448R5727j44030
$$ -82297 -81087 85524 45613 -113773 -38586 106494 5431 -113065 16383 112110 -31920
319c1920n9230J57632K6809j60986P291J56605m5052j49180P3191J25554j03909
$$ -31920 -91150 66482 93291 -67695 -60404 96201 51149 -98031 -24840 100714 -3195
330c195j05803J23845P4588j40787m1482J51408Q483j49558K9059J47898n5131
$$ -3195 -108998 14847 89435 -51352 -92834 58574 67057 -82501 -53442 94456 39325
341C9325j31818Q7818J13005j10376q8195J27841N6420j43303k9988J45269n659
$$ 39325 -92493 -4675 108330 -2046 -90241 37600 94020 -49283 -79271 65998 60339
352F0339j48151L3806J36139o2891j21977R0505J03384j07336p5673J26377N3035
$$ 60339 -87812 -54006 82133 19242 -102735 -12230 91154 -16182 -91855 34522 87557
363H7557j33425j9816J39335q354j36953L7792J24835o7575j12620Q7167Q7759
$$ 87557 -45868 -65684 73651 65297 -71656 -33864 90971 23396 -89224 -2057 85702
374H5702j09499o7345J21346L7913j29472q223J31410j7714j22101M9447J14767
$$ 85702 -23797 -91142 30204 68117 -61355 -69578 61832 44118 -77983 -28536 86231
385H6231p1913r3683R6600P4294j14103m9624J23512K0463j30423J688J24537
$$ 86231 14318 -79365 17235 91529 -22574 -72198 51314 71777 -58646 -56958 67579
396F7579l2233j19922N5852J04730q0131q6108R9624O7048j09295m0774J21931
$$ 67579 35346 -84576 -28724 76006 -4125 -90233 9391 76439 -32856 -73630 48301
407D8301K0066j21109P893J19253l2127j09888N5544R3997q0221p9765R3017N6041
$$ 48301 68367 -52742 -44849 74404 42277 -67611 -12067 81930 1709 -78056 14961 71002
419G1002j09104l6202J13279R213j11700J7086J09071l9574r6073O7051Q4564
$$ 71002 -38102 -74304 38975 48188 -63512 -46426 62645 23071 -73002 -5951 78613
430G8613q2464o4308J00232M4373j08849k1917J09883m771j11223K6023J00559
$$ 78613 -3851 -68159 32073 76446 -32403 -54320 55563 50792 -60431 -34408 66151
441F6151n4317r0937P1199P5426q8076n7643J01748L8394j02907j3383J08696
$$ 66151 11834 -79103 -7904 67522 -20554 -78197 23551 61945 -40962 -54345 54351
452E4351p842j00753L2568R5611n3128q5926P1087O6862q5972n3562R2780K7836
$$ 54351 46509 -54244 -21676 73935 20807 -65119 5968 72830 -13142 -66704 26076 53912
464E3912r9009r065R7354j4969r3158L9337Q7272n6349p2623P6539O0618q5288
$$ 53912 -45097 -54162 43192 28223 -64935 -25598 61674 5325 -67298 9241 69859 -15429
476a5429l8820R3589J9096r6087J820R2970k7580r0102M5555P6655o6728o7235
$$ -15429 -54249 39340 58436 -37651 -35831 57139 29559 -60543 -14988 61667 -5061 -72296
488g2296P9814M8718q8651k9351R5551J2300r3944J1444R4535k8972q3232M8565
$$ -72296 7518 56236 -32415 -61766 33785 46085 -47859 -36415 58120 29148 -54084 -5519
500e519P3327o3596o0251P3567M0362q2729k5247Q3905J595q7249J6599Q2500
$$ -5519 67808 4212 -56039 17528 57890 -24839 -50086 33819 35414 -51835 -35236 47264
512D7264l5048p5481N2250O7444o2996m9414P5524L5328p8969j3298Q4155p892
$$ 47264 12216 -63265 -11015 56429 -6567 -55981 19543 54871 -24098 -37396 46759 38867
524C8867q2081K4032P7324m4931p2106N6549N7508p1376m4228P6870K6105q1353
$$ 38867 -43214 -19182 58142 13211 -58895 -2346 55162 -16214 -60442 16428 42533 -38820
536c8820n227Q4184j1966p9853L3380P7581m5809o5828O0516N4009o9780m0420
$$ -38820 -44047 40137 28171 -51682 -18302 59279 13470 -52358 8158 62167 -7613 -48033
548d8033P4176K1170p8607p267P4298j3254p3104K8923O4006m2455n3545N5922
$$ -48033 26143 47313 -31294 -38561 35737 22483 -50621 -21698 42308 -147 -53692 2230
560B230M2456o1629k3734P1685R972p2799R728P3471k6333p0390L8507O0802n2967
$$ 2230 44686 -16943 -40677 31008 40980 -31819 -22091 51380 25047 -45343 -6836 53966 999
573I99n3061O0457L4215o9008k1704P4857K417p5424J5274P5557k6277o7012M1603
$$ 999 -52062 8395 42610 -26398 -48102 26755 29172 -46252 -30978 44579 18302 -48710 -7107
586g107O2053n0371m7125N8697L2980o4843j6480O5464l098o7949J3999O3589
$$ -7107 54946 4575 -42550 16147 49127 -15716 -32196 33268 30170 -37779 -23780 39809
598C9809l0658n9057M0321M8055m8102l5907N7883K3501o0620m420O5502p149
$$ 39809 9151 -49906 -9585 38470 -9632 -45539 12344 35845 -24775 -29195 36307 29158
610B9158o3735K2965O0803l4391n4897M4009M0547n5542k9649N8952J3249o6875
$$ 29158 -34577 -11612 49191 14800 -40097 3912 44459 -11083 -40732 18220 31469 -35406
622c5406j208O8552j2046o6483K5732O3144l4604n0322M6433M1779n1832k6445
$$ -35406 -36614 31938 19892 -46591 -20859 42285 7681 -42641 3792 45571 -6261 -32706
634c2706N7967J2765o1742n77N9454j4703n8381K3175M8711l5059m2243M3974
$$ -32706 25261 38026 -23716 -24293 35161 20458 -37923 -14748 33963 -1096 -43339 635
646F35K9675m9823j6114N6480M888n5810J0359N8664j9475n3021L1657M6276m1882
$$ 635 30310 -19513 -35627 20853 25741 -30069 -19710 38954 19479 -33542 -1885 44391 2509
659B509l7503M7754K4480n6390j5138N7145M48n9611R935N7094k0971n1347L2860
$$ 2509 -34994 12760 37240 -19150 -34288 22857 23305 -36306 -26371 30723 9752 -41595 -8735
672h735M5758l9348l2794M9109K3509n1121j0720N4000r96n5024J1590M8826k3943
$$ -8735 37023 -2325 -35119 13990 37499 -13622 -24342 29658 28662 -26362 -14772 34054 10111
685A0111m5351K9928L5189l9594k6714M4494J5116m7185k043N0491n988m7598
$$ 10111 -35240 -5312 29877 -9717 -36431 8063 23179 -24006 -26049 24442 18454 -29144
697b9144J9644M6562k7237l8288L5396L1017m3447k2790M7237J0097n2513k085
$$ -29144 -9500 37062 9825 -28463 6933 37950 -5497 -28287 18950 29047 -23466 -25551
709b5551M9007r701m9767J9149M5476k8386l7892L8451L1274m0805j9685M7618
$$ -25551 23456 13755 -36012 -16863 28613 227 -37665 786 32060 -8745 -28430 19188
721A9188J1739m7122j487M7980r676m5551J8055L7748k9316l3165L3888K2338
$$ 19188 30927 -16195 -17682 30298 20622 -24929 -6874 30874 1558 -31607 2281 24619
733B4619m0978j4152M3829L616m3624Q058M3555j4933l7377K5851L4968l2003
$$ 24619 -16359 -30511 13318 16934 -26690 -18632 24923 9990 -27387 -1536 33432 1429
745A429k5498L8139J7843m4135r588M3455q36m6748P200M2693j8030l9827K4806
$$ 1429 -24069 14070 31913 -12222 -21810 21645 20809 -25939 -18739 23954 5924 -33903 -9097
758i097L4488l1624k5389L7913K1001m1003q110M4030J100m2258R809L9297j7563
$$ -9097 25391 -6233 -31622 6291 27292 -13711 -21821 22209 23309 -18949 -9140 30157 12594
771A2594l6885K3569K7875l2833k2150L5568J0399l9195k612L9999n179l7702
$$ 12594 -24291 -722 27153 -5680 -27830 7738 18137 -21058 -23670 16329 11150 -26552
783b6552J5503L6055k1128k8703K9993K4452l4045j5210L8005O765l9255j234
$$ -26552 -11049 25006 3878 -24825 5168 29620 -4425 -19635 18370 25135 -14120 -15354
795a5354L8059j0427l8345J6060L1439k3339k8340K8551K3055l2453j4763L7578
$$ -15354 22705 12278 -26067 -10007 21432 -1907 -30247 -1696 21359 -11094 -25857 11721
807A1721R418l6286J142L7460p818l3160J6053K9697k3707k5893K6527J8280l3772
$$ 11721 21139 -15147 -14005 23455 15637 -17523 -1470 28227 4520 -21373 5154 23434 -10338
820a0338j2753L3725L053l5419M266L4513j2653k9129K0036K6846k3979j7842
$$ -10338 -23091 10634 13687 -21732 -17466 17047 4394 -24735 -4699 22147 -1832 -19674
832a9674L0427J3792l3215m350L3754k535l5044P235L2663j6882l1643K0808K4802
$$ -19674 10753 24545 -8670 -13020 20734 18199 -16845 -9610 23053 6171 -25472 -4664 20138
845B0138k7118j9739K9587J4171l1408m877L3466J161l2202Q591L2051j3149k7001
$$ 20138 -6980 -26719 2868 17039 -14369 -19246 14220 15381 -16821 -8230 23821 10672 -16329
858a6329J9126K1518k4444j7588K6542Q858l1354l968K9502m656k9686J1340K6513
$$ -16329 2797 24315 -129 -17717 8825 17683 -13671 -17639 11863 7207 -22479 -11139 15374
871A5374j6467k0829K3399J7573k4707j0047L0010M886k9974J539K9804p553l0689
$$ 15374 -1093 -21922 1477 19050 -5657 -15704 14306 19192 -10782 -9243 20561 13008 -17681
884a7681J3019K5207k0733k2052K2351J6308k7044j1444K9280N180k8123J399
$$ -17681 -4662 20545 -188 -22240 111 16419 -10625 -22069 7211 12391 -15732 -14333
896a4333L0302n832k5593J3327K4289j7855j8032K1117J2964k4460j0018K5513
$$ -14333 15969 10137 -15456 -2129 22160 4305 -13727 7390 20354 -4106 -14124 11389
908A1389J209k7602K093K5904j0719k3756J5617K0126j8908j4029K3903J0939
$$ 11389 12598 -15004 -12911 12993 2274 -21482 -5865 14261 -4647 -18676 5227 16166
920A6166k4555l140K8465k041k6157O795K5813j4417k3162J7237J7004k1688j5772
$$ 16166 -8389 -11529 16936 14895 -11262 -4467 21346 6929 -16233 1004 18008 -3680 -19452
933a9452K3292Q792k6503l917K7383r87k5515P814K5109j0506k0151J6429J8502
$$ -19452 3840 12632 -13871 -17788 9595 8608 -16907 -9093 16016 5510 -14641 1788 20290
946B0290j8650j3192K0806P119k2820k622K1369m887k3605Q755J9406j4423j6934
$$ 20290 1640 -11552 9254 16373 -6447 -9069 12300 7413 -16192 -7437 11969 -2454 -19388
959a9388J7384J4574k0734q283K4483N181k2998K463K4002n622k2629J1525J9130
$$ -19388 -2004 12570 -8164 -16447 8036 13217 -9781 -7318 16684 11062 -11567 -42 19088
972A9088j5667j8437J7964J1708k1854r767K1932M081k4121R46K3754n415j9710
$$ 19088 3421 -15016 2948 14656 -7198 -16965 4967 9048 -15073 -14127 9627 4212 -15498
985a5498J1824J8200j2873j3696J7511J1277j9040o389K0622L79k1493K014J9730
$$ -15498 -3674 14526 1653 -12043 5468 16745 -2295 -8684 11938 12317 -9176 -7162 12568
998A2568r688j9184J1628J5101j5069j3526J8845Q548j7452m107K2194o68j9384
$$ 12568 2880 -16304 -4676 10425 -4644 -18170 675 9223 -8229 -12336 9858 9190 -10194
1011a0194O836J9731r643j8179J3676J5564j7646j3347J7708P304k0748m422J9990
$$ -10194 -3358 16373 6730 -11449 2227 17791 145 -13202 4506 11810 -8938 -13360 6630
1024F630k513j9173O822J8381j0591j5004J5234J5110j5061j0448J8240P500j8355
$$ 6630 4117 -15056 -8234 10147 -444 -15448 -214 14896 -165 -10613 7627 15127 -3228
1037c228k064J7107k088j8750N202J5325j1279j3857J1941Q909j4174o637J7169
$$ -3228 -5292 11815 9727 -9023 -3821 11504 225 -13632 -1691 7218 -6956 -13593 3576
1050C576L014j6809L921J7540n419j5140R569J5525j2664j2218J5066Q748j7906
$$ 3576 6590 -10219 -6298 11242 5823 -9317 252 15777 3113 -9105 5961 14709 -3197
1063c197o760J7595J55j9440J602J8584o192j8164R655J6215r592j4028J5065
$$ -3197 -9957 7638 7793 -11647 -10045 8539 2347 -15817 -6162 10053 461 -13567 1498
1076A498R700j3156m306J5765J50j4305L262J3049o779j4616Q649J1617j3167
$$ 1498 11198 -1958 -6264 9501 9651 -4654 -1392 11657 4878 -9738 -1089 10528 -2639
1089b639r640J2993N197j5072j671J6309j020j4806O086J5248o874j3225J2187
$$ -2639 -12279 714 5911 -9161 -10832 5477 4457 -10349 -4263 10985 4111 -9114 3073
1102C073J0845j2950q025J4597M735j7038k585J5341k547j8182N667J4817r267
$$ 3073 13918 968 -7057 7540 12275 -4763 -7348 7993 5446 -12736 -7069 7748 -1519
1115a519j2859J1256J2496j2723p466J4785O102j4098n77J5544k684j3638M363
$$ -1519 -14378 -3122 9374 -3349 -10815 3970 10072 -4026 -4603 10941 8257 -5381 -1018
1128a018J2037q078j0776Q508O793j2119n452J2447R99j2993K412J3125m036j2055
$$ -1018 11019 2941 -7835 673 7466 -4653 -10105 2342 3341 -9652 -7240 5885 1849 -10206
1142a0206Q799J2819r265j0350J2974P965j3592m999J3703J923j6817Q78J4170
$$ -10206 -1407 11412 2147 -8203 4771 12736 -856 -5855 7848 9771 -7046 -6168 8002
1155H002n675j3993O145J2316j0335r420J2273P255j1146l764J4802Q94j1693
$$ 8002 2327 -11666 -5521 6795 -3540 -12960 -687 6568 -4578 -8342 6460 7354 -4339
1168d339L081J2281m749j2206P195Q927r576p415R778L041j2308j510J1770k570
$$ -4339 -1258 11023 6274 -5932 1263 10190 614 -6801 2977 6018 -6290 -7800 3970 1400
1182A400j1654M563J2073n990q582Q517R062r278n987J2300M066j2432j189J2546
$$ 1400 -10254 -5691 6382 392 -8190 327 9389 111 -5876 6424 10490 -1942 -3131 9415
1196I415k959j3059K527J1279p115j0548P873Q366j0258o303J2053L869j0623
$$ 9415 6456 -6603 -4076 7203 88 -10460 -2587 5779 -4479 -10782 1271 5140 -5483
1209e483p96J2829n34j0552L863J0999n790q486O692N333r563m678J0178K68j1762
$$ -5483 -6279 6550 6016 -4536 -673 10326 4536 -3950 2742 8075 -1488 -6166 4012 4280 -7482
1224g482J469R602l899r693N709J0245p527n914J0408N047r915k723J3086J43
$$ -7482 -6013 3589 -310 -10003 -4294 5951 -1576 -7490 2918 7965 -1950 -4673 8413 8556
1238H556j1345J262R800l069j1672M265Q320q003q049Q794N484j0207k982J1140
$$ 8556 -2789 -1527 8273 5204 -6468 -2203 6117 -1886 -9935 -1141 4343 -5864 -8846 2294
1252B294J597j0372K510J0802k504q476N894O864o737n681Q897J127r304j902
$$ 2294 3891 -6481 -3971 6831 4327 -4149 1745 8609 1872 -3809 5088 6215 -3089 -4991
1266d991Q850j697r512J905R378n958p198Q093O126q490k725J0773K109j0101
$$ -4991 3859 2162 -7350 -5445 3933 -2025 -9223 -1130 4996 -3494 -6219 4554 6663 -3438
1280c438J104J0563j732r671K775Q067n516r198O456O748r463n353Q564L891r832
$$ -3438 -2334 8229 6497 -3174 -399 7668 2152 -7046 -590 6158 -3305 -8658 -94 3797 -6035
1295f035j159R653M62p703L925P417m095o168P017M853p641l358Q829q90q675
$$ -6035 -7194 2459 2921 -4782 -857 6560 2465 -3703 3314 8167 526 -2832 5997 5107 -3568
1310c568R89P016m003p564M544O023o222n833Q903L246o917n12R066K40q313K054
$$ -3568 -2579 4437 434 -7130 -2586 3437 -2785 -8618 285 3531 -3386 -3898 5168 5408 -2905 -851
1326h51R194k729q485L766O965o923o508O138L735q969k759Q531K47p528J35Q387
$$ -851 8343 5614 -2871 895 7860 937 -5571 567 4302 -4667 -7426 1105 1352 -6176 -6041 2346
1342B346j346o006N068O132m219m579O596L069p130k585Q489k278p696J395O615
$$ 2346 1000 -5006 62 6194 1975 -2604 3992 7061 -69 -2654 5835 3557 -4139 -2744 3871
1357C871m498p232N735M698o805k771P848K605o990M99Q249r48p004L321P844
$$ 3871 -627 -7859 -2124 2574 -4231 -7002 846 3451 -3539 -3040 5209 4261 -2743 578 8422
1372H422n503n913N574M263p971l717N910K130q293j217P169K82p492K508P001
$$ 8422 2919 -2994 2580 6843 -1128 -4845 1065 3195 -5098 -6315 854 1136 -6356 -3848 3153
1387C153k813m850M655N554m136l216M857K850o121n63M911k492m903K409L253
$$ 3153 340 -4510 145 5699 1563 -1653 3204 6054 -67 -630 4281 1789 -3114 -705 2548
1402B548o291l857P510K049p335k16P892m07o097K335P318j765n992M213N058
$$ 2548 -3743 -7600 -90 1959 -5376 -5592 2300 1893 -4204 -1869 5449 3684 -2308 1905 6963
1417F963m916m663N414K900q024j745N641J77o566J84N434j305m774K721N558
$$ 6963 2047 -2616 2798 5698 -2326 -4071 1570 1747 -4819 -4635 799 -506 -5280 -2559 2999
1432B999l627l373O803J720l638j306N069j95n827J533M569m042n307L758M202
$$ 2999 -628 -4001 2802 4522 884 -422 4647 4452 -1375 158 4727 685 -4622 -864 3338
1447C338o355l202N877J959o580l12P176m28n201M118M887k290n322N759L700
$$ 3338 -3017 -6219 -342 1617 -4963 -5275 1901 1473 -3728 390 5277 2987 -2335 3424 7124
1462G124o322l128N940N52o550j648N630r22o235J494N565l498l337M304M283
$$ 7124 802 -2326 3614 4166 -2384 -4032 1598 676 -5559 -4065 1500 -1998 -5335 -1031 3252
1477C252l852k212N265J529l967m1M790j319n096K750L234l950l532L059K139
$$ 3252 -600 -2812 2453 3982 15 -26 4764 3445 -1651 1099 4333 383 -3149 -90 2049
1492B049n448o85M734p08n273K657N858j777n502M431M543l021l721N650K350
$$ 2049 -3399 -4084 650 -58 -5331 -2674 3184 1407 -4095 336 4879 1858 -1863 3787 6137
1507F137o249q57M281l24n939M08M988l143m346K145M329l422l080M655K973l614
$$ 6137 -112 -969 3312 2988 -2951 -2543 2445 -698 -5044 -2899 1430 -1992 -5072 -417 2556 -1058
1523a058j286M537J247l301J30M387k517k829K153K602m322k747L112Q63m523
$$ -1058 -2344 2193 3440 139 269 4656 2139 -690 1463 4065 -257 -3004 108 971 -3552
1538c552M39L217p05m416K603M788j919l614M347L894n178j648N511J004n621
$$ -3552 -3113 104 -601 -5017 -2414 2374 455 -3159 1188 5082 -96 -1744 3767 4771 -850
1553h50q5M955j860n464J380L014j371l896K584K215k724j623M103J281l418Q85
$$ -850 -935 4020 2160 -3304 -1924 1090 -281 -4177 -1593 622 -2102 -3725 378 1659 -1759 -874
1569h74L545K37l141J511K137j852k986K911J826m952o71K960r63m315Q17M740
$$ -874 2671 2908 -233 1278 3415 1563 -1423 1488 3314 -1638 -2309 651 -312 -4627 -3810 930
1585I30q10m670L433L034k112k396M737J437l143q01M409J84n238P28L691k096
$$ 930 120 -4550 -1117 1917 -195 -2591 2146 3583 440 -361 4048 4232 -1006 -278 3413 1317
1601A317m832J968L091l794k545L646J161l222P00L747O86l795J531L313j25k064
$$ 1317 -3515 -1547 1544 -2250 -4795 -1149 12 -3210 -2510 1237 1923 -1872 -341 2972 2847 783
1617G83J475J424k738j795K963L10m584J35K659p70l718J203L112k103k291L988
$$ 783 2258 3682 944 -851 2112 2422 -2162 -2027 632 -138 -3856 -2653 459 -1644 -3935 53
1633E3K504l573j308M938J042m274l36M944j019m428R21L673k463m028K891J539
$$ 53 2557 -1016 -2324 2614 3656 -618 -954 3990 2971 -1457 -536 3137 674 -3354 -463 1076
1649A076k915j927K799O03k340R87K379j44j667K256K742l065q50K826J307l458
$$ 1076 -1839 -3766 -967 -364 -2704 -1717 662 518 -1149 1107 3849 784 -66 2760 4067 609
1665F09n86J769R9l968n34L260k227k531K708J531k027j634L590K163k609p51
$$ 609 23 1792 1891 -2077 -2611 649 -1578 -4109 -1401 130 -1897 -3531 59 2222 -387 -1138
1681a138M499L13m037R96L404j324l630J547K504l127l104K172J315k992j200
$$ -1138 3361 3674 -363 633 4037 2713 -917 630 3134 7 -3097 -925 390 -2602 -3802
1696c802K568J329k373K43K859p74r11J662J964j054j465K559r0k705l43K217
$$ -3802 -1234 95 -2278 -2035 824 50 -861 801 2765 1711 246 2805 2715 10 -333 1884
1712A884j600k342J088J634k187k603K446K234l163k15L921J240l242Q7L657j96
$$ 1884 284 -2058 -970 664 -1523 -4126 -1680 554 -2609 -2824 1097 2337 -905 -818 2839 2643
1728B643k667P19L295k158l938K781J447k712k950L687N60m407M87L064l22j859
$$ 2643 -24 695 3990 1832 -2106 675 2122 -590 -3540 147 707 -3700 -3213 -149 -471 -2330
1744b330K63L074l97j375K022J639j377q46J828j313j167N15J839k819k021J776
$$ -2330 -2067 1007 610 -765 1257 2896 1519 673 2501 1188 21 536 2375 -444 -2465 -689
1760f89R55l608k86K729J068k682K30L287Q68l276J488L006n23l343K116J239
$$ -689 266 -3342 -3628 -899 169 -2513 -2283 1004 1872 -1404 84 3090 2567 -776 1340 2579
1776B579j517k243K563L91l456j167K454N35l489Q97J938k68j306J168J768j289
$$ 2579 1062 -1181 1382 1773 -1683 -2850 -396 139 -3350 -2453 -515 -783 -2089 -921 847 -442
1792d42q9K149P11j222N57J301j063k277L63J317k120j751J783P11k490o95K612
$$ -442 -531 1618 2329 1107 1664 2965 1902 -375 -12 1305 -815 -2566 -783 -72 -2562 -3257 -645
1809f45M04k287O74L334k13k441J925K989j722k296J594K535k552k342K036m8
$$ -645 -241 -2528 -1854 1480 1267 -1174 751 3740 2018 -278 1316 3851 1299 -1043 993 945
1825I45k519q23K091j61k269J82J893j383J57K088J288j451M55J551N4j876J069
$$ 945 -1574 -2397 -306 -467 -2736 -2554 -661 -2044 -1887 201 1489 38 493 2044 2098 222 1291
1842A291J662j978j442K96J321k789p27J635P04k972k10L017l30j369J221J918
$$ 1291 2953 975 -467 -171 1150 -1639 -2366 -731 -27 -2999 -3209 -192 -522 -1891 -670 1248
1858A248p30j567J866K157j692p96J051J016j664j692J536K42k771l76J842j079
$$ 1248 518 -1049 817 2974 1282 486 1537 2553 889 -803 733 975 -1796 -2172 -330 -1409
1874a409l04r54K800p47m84P32Q92k54J54J450Q2j043R05P29k380n99J429m80
$$ -1409 -1713 -2667 133 -614 -1098 -366 526 272 426 1876 1958 915 1820 2549 169 -430 999 519
1892E19k327k14J531O0j840o19L133p17j680J617K004q64j513K458Q04j516j008
$$ 519 -1808 -2022 -491 -431 -2271 -2890 243 -474 -2154 -537 1467 603 -910 1548 2352 836 -172
1909a72K085K15k039l64J290n42j743r07J414o00r36J574k5j18o83J858K79l21
$$ -172 1913 2128 89 -275 1015 473 -1270 -2177 -763 -1363 -2299 -725 -750 -868 -1551 307 586 265
1927B65P39J274k70j456R20N61j088r26J702j595j575l25K137r60j728K35K734
$$ 265 1004 2278 2008 552 1472 2033 945 19 1721 126 -1449 -1774 363 -597 -2325 -2090 644
1944F44j543j209K284J223o82j020J391J646j202j693K030M83k591n74J903p89
$$ 644 -899 -2108 176 1399 717 -303 1088 2734 1532 -161 1869 2352 -239 -813 1090 301
1960C01j901n16J034l04q78J029J009p89l91J936J21l6J062P61r82m63R55J81
$$ 301 -1600 -2116 -1082 -1386 -2264 -1235 -226 -1015 -1406 530 651 615 1677 2438 1456 993 1948 2129
1978B129k744J9J984j070j323j128J221m89j247J082J307m53j090K343J171j499
$$ 2129 -615 -596 1388 318 -1005 -2133 -912 -1401 -2648 -1566 -259 -712 -1802 541 1712 213
1994B13q74K381N31j755P36R21j256l16p19O78r3j981l42J423j218n55J651O0
$$ 213 -661 1720 2251 496 1232 2153 897 581 -138 540 447 -1534 -1876 -453 -1671 -2226 -575 -515
2012e15l15L39J630j016L51P94O47r56K28R05n88j827l3O46r31j450M91J579j248
$$ -515 -830 -491 1139 123 474 1268 1915 959 1187 2092 1504 -323 -356 290 -641 -2091 -1600 -21 -1269
2031a269o76Q31J741j855m61J951J395j042n8J050N02j706M15P92m09j611j08
$$ -1269 -1945 -1114 627 -1228 -1689 262 1657 615 557 1607 2109 403 818 1610 1201 -410 -518
2048e18P14l48k189J056L66k48n44J341l59l24R04R63o57N19M43R62j258N85j61
$$ -518 196 -152 -2341 -1285 -919 -1167 -1711 -370 -729 -1053 -149 814 157 676 1119 2081 823 1408 1247
2067A247k19j227K14J90q24j010p0J531j110j330J377J445j364N91Q63P01l2n31
$$ 1247 1028 -199 15 205 -619 -1629 -1699 -168 -1278 -2608 -1231 214 -1150 -559 304 1005 973 442
2085D42J437M3j502M84J228j687j565J461J49j795L87K36j35n75j22O35K13J24
$$ 442 1879 1922 420 904 2132 445 -1120 341 490 -1305 -918 -682 -817 -1392 -1514 -879 -666 -542
2103e42M46K84R83J04Q12n79r14j88J393j093j555J125P13j162j497Q49k6l75
$$ -542 -96 188 1171 1275 2087 1508 594 406 1799 706 -849 276 989 -173 -1670 -821 -847 -1222
2121a222j278J603R52j084R32O95M72n04j21J265k46j858J245O01j156o35J03
$$ -1222 -2500 -897 55 -1029 -97 598 1070 566 445 1710 1464 -394 851 1452 296 -339 -236
2138b36N3L23q27j277J013l66P51j08K53m70J335P38j093R90O8K43m75p40J733
$$ -236 -183 140 -687 -1964 -951 -1317 -566 -674 -421 -891 444 1182 89 1079 1147 1390 915 175 1908
2157A908j230j488L1N31p08j37k28O27k15o05J011M61j239N77J817j81o33J38
$$ 1908 678 -810 -779 -248 -956 -1093 -1321 -694 -909 -1514 -503 -42 -1281 -704 1113 932 299 437
2175D37J210l73J49m76K85p66r42M38K64o41j203R45m26j87Q85L36o92j31J187
$$ 437 1647 1274 1423 947 1232 466 -476 -38 226 -415 -1618 -673 -1099 -1286 -401 -65 -757 -888 299
2194B99J39K15O95j26L53j033j29J72j76r80P6N74j370p65J947n74j018O13Q12
$$ 299 438 653 1348 1222 1575 542 413 585 409 -571 -495 79 -1291 -2056 -109 -683 -1701 -1088 -276
2213b76R76o25p42J964Jr87q3J183o75l82O73J05o14p42O69r56r99L38N7M63k00
$$ -276 700 75 -667 1297 1298 311 228 1411 736 354 1027 1132 518 -224 445 -511 -1510 -1172 -1115 -652 -852
2234h52o17Q64Q78k1L07K80j387J338N46N75j477Q12J9j311p78Q52m25l5j512
$$ -852 -1469 -605 273 252 559 839 -548 790 1336 1911 434 1246 1265 -46 -824 28 -397 -432 -1944
2253a944J682m80j214M55J470J96l93J063l06J60J27j01R74o56l29O7M03j299
$$ -1944 -262 -742 -1956 -1501 -31 165 -228 835 529 689 816 715 1689 1033 704 771 1174 -125
2271a25o40P31l79m96J79L07j003P82k77o2P77O29N55p22K94J076o43K82p59J054
$$ -125 -765 -34 -413 -909 -730 -423 -1426 -644 -921 -983 -206 423 978 256 550 1626 983 1265 506 1560
2291A560p92p21l92M11j66j933M70J600q21j091P66R79L74j279J285P79p05o71
$$ 1560 768 47 -345 66 -100 -2033 -1563 37 -784 -1875 -1109 -130 244 -1035 250 1029 324 -347
2309c47J198K98K51p25N17r52l14m85N8K05n54q3K81q05R99M1l22K86L63J096
$$ -347 851 1149 1400 675 1192 240 -74 -559 -501 -296 -850 -933 -652 -1457 -458 -417 -739 -453 -90 1006
2329A006p29K02O63P34m41j289J225r51j05j020J184n15j479M85L17K08j169J46
$$ 1006 277 479 1142 1876 1435 146 1371 420 315 -705 479 -36 -1515 -1030 -713 -505 -1674 -1528
2347a528J273Q69j460Q69Q06m61L78Q90q66m26P2M95m54q50j80N93p78L13r42
$$ -1528 -255 614 -846 23 829 368 746 1636 770 344 416 911 457 -393 -573 20 -758 -445 -1387
2366a387J7j69J180Q45m56k97P10J551j271J60J016j43j695M80M29r12k51j43
$$ -1387 -1370 -1539 -359 486 30 -267 443 1994 723 883 1899 1756 61 541 970 58 -193 -336
2384c36J21M2r67k63Q35m77M59j1O69j13L2P37K34K50m07l02L10J42m85K33p15
$$ -336 -215 -173 -1140 -1403 -568 -1045 -586 -597 72 -41 -9 728 962 1212 805 503 813 955 470 703 -12
2405a2K24o08j03o39Rl17K96L58J12k85J086o38J125L6j00P73P85q36j223R9J147
$$ -12 212 -396 -499 -1138 -1129 -1446 -1150 -792 -680 -965 121 -517 608 644 544 1317 2102 1266 43 142 1289
2426A289k46j816O83J63o69j393J201Q90j099q2J035j0R1n96R46N86k22J36j79
$$ 1289 1043 -773 -90 73 -596 -1989 -788 102 -997 -1079 -44 -54 37 -559 387 973 751 887 708
2445G08K65n59k18K99n87p75L52n15N40q82P76m75J80O49k54L5L69J034N52p82
$$ 708 973 414 196 495 -92 -867 -515 -1030 -490 -1372 -596 -1071 -891 -242 -496 -461 -92 942 1494 712
2465G12N61k57P6q23L39N51m12j593M14O91j164n94N30L78m74P6J044nm77N00
$$ 712 1273 1016 1092 269 608 1159 747 -846 -432 259 -905 -1499 -969 -591 -1065 -989 55 50 -427 73
2485G3J017J42m22o70P27K96l41J95r44N93j365L18J0p53N74p58N37j27J32M52
$$ 73 1090 1232 810 140 867 1163 822 1017 73 666 -699 -381 -371 -1124 -550 -1308 -771 -898 -766 -314
2505c14P58k31N37J001m25P4j44l47j43p59J295j081m09j19p5k23l41L13n9Q38
$$ -314 444 213 750 1751 1326 1400 1256 909 766 7 1302 221 -188 -307 -382 -605 -946 -633 -692 146
2525A46j213R19J86n49N40Q84J47m15j88r2J60J95l28p14N98j747L18P21m67N33
$$ 146 -1067 -148 38 -511 29 913 1060 645 457 365 525 720 392 -322 276 -1471 -1153 -432 -899 -366
2545c66k27K79K24k51Lm4R82K81k23m00K03J490j459O2J44O23j869m13K42M63
$$ -366 -593 -314 -90 -341 -338 -382 600 881 658 258 461 1951 492 554 698 1321 -548 -961 -719 -256
2565b56j0j220L17K86K47l12Q71Q09n00N91J61k92j32M63o86Q94o40n00j67o40
$$ -256 -266 -1486 -1169 -883 -636 -948 -77 732 232 823 984 692 560 1023 337 1231 591 91 -76 -716
2585g16q9j6J92n78O39n78N94j56R43j90j63P79K01K0p34J042l3j441R60l0l80
$$ -716 -805 -821 -629 -1207 -568 -1146 -552 -708 235 45 -118 661 862 882 148 1190 1157 -284 676 646 266
2606B66m65j310J232k0j71j145R74J26n39J068l96k9j21N20J224j00o83N44J21
$$ 266 -199 -1509 -277 -297 -468 -1613 -639 -513 -1052 16 -380 -409 -530 -10 1214 1114 431 975 1096
2625A096n09j51J68q86K70j41o48K61j42k26L64J29m64R88l90m4L65O36k32M12
$$ 1096 587 436 604 -282 -12 -153 -801 -540 -682 -908 -544 -415 -879 109 -281 -325 40 676 444 856
2645H56M60m88p59J73L40l15n23j30O4n42l4K62j19L74l98M43o8J095p78o23J166
$$ 856 1316 828 69 242 582 267 -256 -386 -322 -864 -898 -636 -755 -381 -779 -336 -404 691 -87 -710 456
2666D56L67o49M94M63j019N01o00p0o34k50L00l53K70L44q28K94O28j70N96l02
$$ 456 823 174 668 1131 112 613 13 -57 -691 -941 -641 -994 -724 -380 -1208 -914 -286 -456 140 -162
2686a62O11N44l52n2N64o67l60r7M54L07j371j55R13o68l12j01NM74O2k4l52J305
$$ -162 449 993 641 589 1153 486 126 29 483 790 -581 -736 177 -491 -803 -904 -899 -425 -363 -387 -739 566
2708E66m46L98m13O93L39o15J23K23K04j401J56n34O90m72J48L23q27J73r48J500
$$ 566 120 518 105 798 1137 522 645 868 1072 -329 -173 -707 -17 -489 -341 -18 -845 -672 -1620 -120
2728a20n3k3j91J420J74q42m42J51P16m79n76Q61m86k14P06r08l17r05M80O27
$$ -120 -173 -196 -387 1033 1207 365 -77 74 790 311 -265 596 110 -104 602 -306 -623 -1528 -1048 -421
2748d21j8Q29k26J02L60n25M05N43l66M1r19K60L52r0m60P2n04K8k17L17k38j10
$$ -421 -439 390 164 266 626 101 506 1049 683 724 -195 65 417 327 -133 -61 -565 -537 -754 -437 -675 -785
2770g85Q3J66M78N49M2m55J023k63j94L50k62l17k66r63N22O29n79l81o0N46q38
$$ -785 -702 -536 -58 491 533 78 1101 838 644 994 732 415 149 -814 -292 337 -242 -623 -683 -137 -975
2791i75N13M17q57l85R26P59k07O09q55J357j16p93R83j427K5M91l31p23L14k27
$$ -975 -462 -45 -902 -1287 -361 398 191 800 -55 1302 1186 393 1376 -51 -26 465 134 -589 -275 -502
2811e02k33K79m21O3P74j152L08Q63L64l52K16O25l41k62M44k14m0j1j60k59J72
$$ -502 -735 -456 -877 -814 -40 -1192 -884 -21 343 -9 207 832 491 229 673 459 419 408 248 -11 161
2832A61j019N71q26Q17l99M83K36r48J039n66Q37J35O81q58M74K57j72k71l4n10
$$ 161 -858 -287 -1113 -296 -695 -212 24 -924 115 -451 386 521 1202 344 818 1075 903 632 598 88
2852H8M06l85r38n6j95L59M69m61n93Q78J093m94o06O91Q4P05k65L46l13m19P2
$$ 88 494 109 -829 -885 -1080 -721 -252 -713 -1306 -428 665 171 -435 256 340 1045 780 1126 813 394 466
2873D66o29M59o9j054N57l50n61K71K60M94n40L01l61J790l28j87K51J67o52K06
$$ 466 -163 296 227 -827 -270 -620 -1181 -910 -650 -156 -696 -395 -756 1034 706 519 770 937 285 491
2893D91j67j19J48J19r67M19m73N10r03o68R23k52J069p29K61JM16n8Q59j95J52
$$ 491 324 205 353 472 -495 -76 -549 -39 -942 -1610 -687 -939 130 -599 -338 -337 79 21 880 685 837
2914H37l01M79N20j632K67q22J053j145m27R44k72j31p3J47L74j61O33J17L56
$$ 837 536 1015 1535 -97 170 -652 401 -744 -1171 -227 -499 -630 -703 -556 -182 -343 290 407 763
2933G63J30m28Q87j077L95N3n47K65M19q08m95r0l16J69j18M40N18m41M39k82
$$ 763 893 465 1352 275 670 723 176 441 860 52 -443 -533 -849 -680 -798 -358 160 -281 158 -124
2953a24M74m66N84K02K76o94J37L95m70k26o19M3L8l31R41o17j05L66o64O70m35
$$ -124 350 -116 468 670 946 252 389 784 314 88 -531 -488 -450 -781 160 -457 -562 -196 -860 -190 -625
2974f25K66P25k16L63K01J01mo79M99p1K1p52J9o54M49k76k73R61j823J696l54
$$ -625 -359 366 150 513 714 815 811 132 631 560 581 -171 -152 -806 -357 -633 -906 55 -1768 -72 -426
2995d26J102j066O27J383j460J247m80l77n94M27M85k10m04m26J81K6r36O20k14
$$ -426 676 -390 237 1620 160 1407 927 550 -44 383 868 658 254 -172 9 35 -901 -281 -495
3014d95J43k84P6K04m8QP66j11K54l01O10n60l9J52l40n8J36q01m09M72J56r4
$$ -495 -352 -636 -560 -356 -404 -396 370 259 513 212 822 262 223 375 35 -23 113 -688 -1097 -625 -469 -563
3036e63p38J191m56P09m00K64l4M20N1K08k89J8l35J13p2k76l69J94M43p44J03
$$ -563 -1301 -110 -566 143 -257 7 -27 393 444 652 363 381 46 159 87 -189 -558 -364 79 -665 -562
3057e62O78N1o45L13J8o2n2o27M45J013j65K79j03k11L03R6o5o71n50O09M1l39
$$ -562 116 167 -478 -165 -147 -209 -261 -888 -443 570 405 684 581 370 673 769 704 33 -517 92 133 -206
3079b06p77N03L5J67M2J94r60M63R21O70l5q1j4r9p45R9L21l03N26q55j26k10
$$ -206 -983 -480 -445 -278 -236 -42 -1002 -539 382 1052 1017 936 922 823 78 177 498 195 721 -134 -260 -470
3101d70n02P97m24r6K1R50m23o2O96N66q05j04M52m06O09n74J28J91p72l16j10
$$ -470 -972 -175 -599 -695 -674 276 -147 -209 487 1053 248 144 596 190 799 225 353 544 -228 -544 -654
3122f54O24j05M78r48M03k63o64N91k69O82O00o85P87N84m49mj18L31p18m92P47
$$ -654 -30 -135 343 -605 -202 -465 -1129 -538 -807 -125 475 -210 577 1161 712 708 590 921 203 -289 458
3143D58m61Jj57k07m9N32j42j214Q18j43M77K06L66K78j59R1j49k02K19p12K67
$$ 458 -3 -2 -159 -366 -415 117 -25 -1239 -421 -564 -87 119 485 763 604 695 546 344 563 -149 118
3164A18l46j68n4l53J208j012L49P2j89J01j2l31J88Q47m2m64J528j299o3L61
$$ 118 -228 -396 -450 -803 405 -607 -258 -186 -375 -274 -286 -617 -429 418 376 -88 1440 141 78 439
3184D39m8q7o3O50j153j64m15l6K45K57n04M02Q15R3n37L29K13J64N2k7J09P1
$$ 439 391 304 241 891 -262 -426 -841 -877 -632 -375 -879 -477 338 431 -106 223 436 600 652 625 734 805
3206H05l43K60j039R1P62j208P2Q9l75N70l50O48m25R14m67J55l85P99q70P09
$$ 805 462 722 -317 -226 536 -672 -600 -511 -886 -316 -666 -18 -443 471 4 159 -226 573 -297 412
3226D12L40J5q60M82k80o50Q26p28J97L41j220J044J09q90J54P53j08n46Q84m67
$$ 412 752 767 -93 389 109 -541 285 -443 -246 95 -1125 -81 28 -862 -708 45 -63 -609 275 -192
3246a92J99K18l73L91J78l65J83j4l03k94k84J202j384N29k47o80J671m61k05
$$ -192 7 225 -148 243 421 56 239 225 -78 -372 -656 546 -838 -309 -556 -1236 435 -26 -231
3265b31j35R06Q53j334J18Q33n04L56j67M99j025m35Q8N6n40JJ49J93n05J50L9
$$ -231 -366 540 1393 59 177 1010 506 862 695 1194 169 -266 -178 -122 -662 -661 -512 -319 -824 -674 -635
3286f35L64M31j50J83j45m3O7K9K37R1r2j9j26q26L14j45k12N3k17K85J87L90
$$ -635 -271 160 10 193 48 5 72 101 338 429 337 318 192 -634 -320 -465 -677 -624 -841 -556 -369 21
3308B1j67k61L80O0K77l54K14L86o36J49J52J80J30l30j322R91ml77k63P20k55
$$ 21 -146 -407 -27 33 310 -44 170 556 -80 69 221 401 531 201 -1121 -130 -134 -511 -774 -54 -309
3329c09k04O48l46J21P76R6p86L96j47M01l55M91o27M09r9n88K3m40K36l22L1
$$ -309 -513 135 -211 -90 686 782 -4 392 245 646 291 782 155 564 465 -123 -100 -540 -304 -626 -595
3350e95n68M88L38J70l7O69q36O90l63O51l04M7K42k52n63N28n21o56Q19l25r0
$$ -595 -1163 -675 -337 -167 -204 465 -371 319 -44 607 303 350 592 340 -223 305 -216 -872 -53 -378 -468
3371d68j94M11Q4J3l01O76L10p2j69J92n40J041m02j8jr14m14J332r15J50L0j85
$$ -468 -662 -251 -167 -154 -455 221 531 459 290 482 -58 983 581 563 562 -352 -766 566 -349 -199 -169 -354
3393c54M4Q5l05J86M78r46O64K23R4J00l88R08n97L19j98j47j0J65k67j099Q51
$$ -354 -310 -225 -530 -344 134 -812 -148 75 169 269 -119 789 192 511 313 166 156 321 54 -1045 -194
3414a94J51l53o10N78K26m56P46m35O70k24J08N79l54m84M50r8M93m66J71l11
$$ -194 -43 -396 -1006 -428 -202 -658 88 -347 323 99 207 786 432 -52 398 300 793 327 498 187
3434A87K10p75o14k87K14Q95m27R59j127J24L81N54q2L03J17q28K74k16o56N53
$$ 187 397 -378 -992 -1279 -1065 -170 -597 362 -765 -641 -260 294 212 515 632 -196 78 -138 -794 -241
3454b41L31J14L83o00J98m84n05L76k06L25j96J153n65M5L3L88j37K58L83o00
$$ -241 90 204 587 -13 185 -299 -804 -428 -634 -309 -505 648 83 128 161 549 412 670 1053 453
3474D53J7l93R9j38M39L5o83n27L46M92m78RP27j75l00P95o52Q3J43J69j23o63
$$ 453 470 77 176 38 477 512 -171 -698 -352 140 -338 -329 398 223 -77 718 66 149 292 461 338 -325
3496c25O57m23L67l46j25o98R22l88k52N05k19M5K23J1o76J487K4o83L68n9q4
$$ -325 332 -91 276 -70 -195 -893 29 -359 -611 -106 -325 -280 -57 -46 -722 765 789 106 474 415 331
3517C31L85l54M2n05J30k05j88O5p33J32J457j239R19l96m13K19O1M08O76p21
$$ 331 716 362 404 -101 29 -176 -364 -299 -1032 -900 557 -682 237 -159 -572 -353 -292 116 792 71
3537G1Q44k41m37Q16m37k51k25J4m00j15J86l84K30mp18J251q61L87O87K9K08
$$ 71 915 674 237 1053 616 365 140 154 -246 -361 -175 -559 -329 -333 -1051 200 -661 -274 413 442 650
3558F50o29k79R49k21k39l3o59O68p24J099j369L18N80j051N13J80J09k60J60
$$ 650 21 -258 691 470 231 198 -461 207 -517 582 -787 -469 111 -940 -427 -247 -138 -398 -238
3577b38K87L05n58J99L59j79p20K49M55l14N14r88R79j90q51O60L28p27k79J27
$$ -238 49 354 -204 -5 354 175 -545 -296 159 -155 359 -629 350 160 -691 -31 297 -430 -709 -582
3597e82J075j34o30L2J038J36j034Q01q05L24j6M81l95o4l93l56M50l99K29j72
$$ -582 493 359 -271 -239 799 935 -99 702 -103 221 205 686 291 227 -166 -522 -72 -471 -242 -414
3617d14K16p30J216j183M74K32K71N11j049N48L77q7k24n0m43j75M14n58k3J81
$$ -414 -198 -928 288 -895 -421 -189 82 593 -456 92 469 382 158 108 -335 -510 -96 -654 -677 -496
3637d96l26L14N68j35n13N08Ol11R72k19l90J37j47j89J087q21o86Q92l18N09
$$ -496 -822 -508 60 -75 -588 -80 -74 -385 587 368 -22 115 -32 -221 866 45 -641 251 -67 442
3657D42j405L90J53J58k84K70O40m72j01K08N57k95J02Q7j14M57m59l77Q0j96
$$ 442 -963 -573 -420 -262 -546 -276 364 -108 -209 -1 556 261 363 450 336 793 334 -43 37 -159
3677a59O59l22o2p9k69J11K2K4R82r46K14O53j200J41R54M28j270R26k27o98K04
$$ -159 500 178 116 37 -232 -121 -99 -75 907 -39 175 828 -372 -231 723 1151 -119 807 580 -118 86
3698H6k0N39j079Q27r46O0K09K21J04j91R68l08M35o98n52N58k71L55N46k76j71
$$ 86 66 605 -474 353 -593 -533 -324 -103 1 -190 778 470 905 207 -345 213 -58 297 843 567 396
3719C96N85j89m16q78Q50N6j040P47n31N0n63L23J06N66m38O88o14Q20j002N64
$$ 396 981 792 376 -502 348 404 -636 111 -420 -370 -933 -610 -504 62 -376 312 -302 518 -484 80
3739H0K79l39J07l13M33o37K11Q9m89M73l53M5K61L69k65n31M33L96L2J4m87O55
$$ 80 359 20 127 -186 247 -390 -179 -90 -579 -106 -459 -414 -153 216 -49 -580 -147 249 281 295 -192 463
3761D63n9M59k07l45m9r9j69R50j563K05N53J8K82j384Q26q49J138m82n5M12p63
$$ 463 404 863 656 311 262 163 -6 944 -619 -414 139 157 439 -945 -119 -968 170 -312 -367 45 -718
3782g18J114n53J12P09j190N72J70m55J52k04k5l11K49L80k67K3N81j53j29l55
$$ -718 396 -157 -45 664 -526 46 216 -239 -87 -291 -316 -627 -378 2 -265 -242 339 186 57 -298
3802b98P55k83o08J002m30j29l41N45m93J61J48n8M23o59l90K09L83p00R14l11
$$ -298 457 174 -434 568 138 9 -332 213 -280 -119 29 -29 394 -265 -655 -446 -63 -763 151 -160
3822a60q6P0P23j109m1N17L52L54p25Q42m32P4p35O70J07p34M15P1n1n7o08O73
$$ -160 -246 -176 547 -562 -603 -86 266 620 -105 737 305 379 -356 314 421 -313 102 173 122 65 -543 130
3844A30J31m8j26l0m63R66m90q2l46J57J047j074J50J87q20N00l45l97O63J50
$$ 130 261 213 87 57 -406 560 70 -12 -358 -201 846 -228 -78 109 -711 -211 -556 -953 -290 -140
3864a40j55P0O0k06j13L12P72nm13m25K79k38j03k87Q48j97J051j463J6M30j44
$$ -140 -295 -225 -165 -371 -484 -172 600 595 182 -243 36 -202 -305 -592 256 59 1110 -353 -337 93 -51
3885e1o76J94N9Q43o43m35O81N20J5J38r99P62J38q3n60O71o86n30L24K62m24
$$ -51 -727 -533 -474 369 -274 -709 -28 492 507 645 -354 408 546 463 -97 574 -112 -642 -318 -56 -480
3906d80M34k51k32P64p49M5K50J4N97l21M51m5k84p6L71p01j55O49p5o20J7J24
$$ -480 -46 -297 -529 235 -514 -469 -219 -205 392 71 522 477 193 117 488 -213 -368 281 206 -414 -397 -273
3928b73J22j90l53J95K03m19o3R13m01Q98m27K74j60l77k06N99q77k84M41k68
$$ -273 -151 -341 -694 -499 -296 -715 -778 135 -266 632 205 479 319 -58 -264 335 -542 -826 -385 -653
3948f53O66j06L60j319K60L69N67n95O22l09J08K14M99p53k86O80K05J04m20j86
$$ -653 13 -93 267 -1052 -792 -423 144 -451 171 -138 -30 184 683 -70 -356 324 529 633 213 27
3968B7n0m0Q60j010k72O84m3m96K67l36N73K37j363J504K33j71r47N17k23M26
$$ 27 -23 -63 797 -213 -485 199 156 -340 -73 -409 164 401 -962 542 775 604 -343 174 -49 377
3988C77j20j86l1m95m13M51L77q72O45Q52l57j401J107O56q91J68J34O09J56o60
$$ 377 257 71 40 -455 -868 -417 -40 -912 -267 585 228 -1173 -66 590 -301 -133 1 610 766 106
4008A06k7O8p5J06M61p21m38r7N64J52l55J00l87K91J120j556K42M96P34r76j50
$$ 106 79 147 72 178 639 -82 -520 -617 -53 99 -256 -156 -543 -252 868 -688 -446 50 784 -192 -342
4029c42L66J01l46M49q80J146K88r29o3K86k45l19L22L76L20n49Q5n6k36O46j88
$$ -342 24 125 -221 228 -652 494 782 -147 -210 76 -169 -488 -166 210 530 -19 66 10 -226 420 232
4050B32K5N4j33M15q60K4k32k20O07J46l04N96m42k19J5j74J89J126q09m14L48
$$ 232 257 311 178 593 -267 -243 -475 -695 -88 58 -246 350 -92 -311 -296 -470 -281 845 36 -378 -30
4071c0M36k24Q1l42K73N69k86n70R3m41K49r5o3N64n97j03L8j38N26Q72q23K20
$$ -30 406 182 263 -79 194 763 477 -93 0 -441 -192 -287 -350 214 -383 -486 -448 -586 -60 812 -11 209
4093B09n33O98p20M54J91j63L02l6K50q9j09r1m57k98n5N60k62j39L69K35K90
$$ 209 -324 374 -346 108 299 136 438 402 652 563 454 363 -94 -392 -447 113 -149 -288 81 316 606
4114F06n29n0Q1L99r85J92L45k27J66j46N84o43N26q6r30L58L20M69r81L5J097
$$ 606 77 27 108 507 -478 -286 59 -168 -2 -148 436 -207 319 233 -697 -339 -19 450 -531 -496 601
4135F01p85l73M94L93l31M3K41n48O39m55j16p22O82Nm12N41M5K40l45k88M65
$$ 601 -184 -557 -63 330 -1 42 283 -265 374 -81 -197 -919 -237 -232 -644 -103 -58 182 -163 -451 14
4156A4K99l17k57N78l38R48q23J68j92j87O77n66n01L25K54m76J27L3O56m73m80
$$ 14 313 -4 -261 317 -21 927 104 272 80 -107 570 4 -497 -172 82 -394 -267 -234 422 -51 -531
4177e31R68J19p69j26n2N43J51m77O9q1Q23q49P14n44l27Q16k74r7p14R96p71
$$ -531 437 556 -213 -339 -391 152 303 -174 -105 -186 637 -212 502 -42 -369 447 173 76 -638 358 -413
4198d13K87l53K40p26R68K98N8j00k93L39r4k81j23J2J33K31K05l89M99j281J23
$$ -413 -126 -479 -239 -965 3 301 359 259 -34 305 211 -70 -193 -181 -48 183 388 -1 498 -783 -660
4219f60n12J442m53K55P2l27K4R15j296QO06m88N92q26J073m35k5m43N56k44l04
$$ -660 -1172 270 -183 72 144 -183 -159 756 -540 -532 74 -414 178 -648 425 -10 -35 -478 78 -166 -470
4240d70J61n80M10J005p88K61J88l93K56J40L4m56o29R98o0P98p86o51P30q73
$$ -470 -309 -889 -479 526 -262 -1 187 -206 50 190 224 -232 -861 137 77 875 89 -562 168 -705
4260g05J033m70m09J326j546P88m4P77n54k50j36Jo5O70L4J37p34o2J088r28j97
$$ -705 328 -142 -551 775 -771 17 -27 750 196 -54 -190 -189 -254 416 450 587 -147 -209 879 -49 -246
4281b46M21l42J39j06R4Rm5k7n05R06o03R37n81K76J5j78M69l51k33k47M68L93
$$ -246 175 -167 -28 -134 -40 -31 -76 -103 -608 298 -305 632 51 327 342 164 633 282 49 -198 270 663
4303F63j085K72l64M23P7j83L49O0q6M64p25M75k00l8K42J46o76L97m03k89K71
$$ 663 -422 -150 -514 -91 -14 -197 152 212 126 590 -135 340 140 102 344 490 -186 211 -192 -481 -210
4324b10K81l32N08r89P27j55o9J25J15n4K48O26r37L11P43j340Q75j036J439j09
$$ -210 71 -261 247 -742 -15 -170 -239 -114 1 -53 195 821 -116 195 938 -402 473 -563 876 767
4344G67o65R3k13L18l67o5j86J3K88m77J72KJ0j39k77J030J22j78m60M83n57L47
$$ 767 102 195 -18 300 -67 -132 -318 -305 -17 -494 -322 -320 -310 -449 -726 304 426 248 -212 271 -286 61
4366F1q7P68j374m99J479r69O75K43r8p04M7L36j1k06K62M43o17N38k76K57K01
$$ 61 -26 742 -632 -1131 348 -621 54 297 199 -505 -458 -122 -133 -339 -77 366 -251 287 11 268 469
4387D69m28q9N37o08L85n47J23j44N46K1P0r3k03L9K16o5p2p71Q57M01r57K47
$$ 469 41 -48 489 -119 266 -281 -158 -302 244 265 335 242 39 78 294 229 157 -614 243 644 -313 -66
4409f6N48n36p08K47O94o57Q93q83k64J055k22k22N03j139P08L21P7j50m00O44
$$ -66 482 -54 -762 -515 179 -478 415 -468 -732 323 101 -121 382 -757 -49 272 349 199 -201 443
4429D43j14o53J6L60j86K49q0k27J50l33N87k73N82q69j72l33N5N90K39J97n40
$$ 443 329 -324 -308 52 -134 115 35 -192 -42 -375 212 -61 521 -348 -520 -853 -798 -208 31 228 -312
4450c12Q08j17R1m34P33q07o10P72J94q63m34R58q80J618p70Q31q10M64o16J21
$$ -312 496 379 470 36 769 -38 -648 124 318 -545 -979 -21 -901 717 -53 778 -32 432 -184 -63
4470f3j52K91m87N68j15k31N84m97K62j71N09n43j56k67M19M45n00J07m17P72
$$ -63 -215 76 -411 157 42 -189 395 -102 160 -11 498 -45 -201 -468 -49 396 -104 3 -414 358
4490C58o50L68j18J74l13P85k30o19L7N14j74n04J41o82N59M34l07M29q20j25
$$ 358 -292 76 -42 132 -181 604 374 -245 -208 306 132 -372 -231 -913 -354 80 -227 202 -618 -743
4510g43R68o41k93M39P80j08j14J37j42Q8p04M94M85p10j07K54l16k34O47J78
$$ -743 225 -416 -709 -270 510 402 288 425 283 371 -333 161 646 -64 -171 83 -233 -467 180 358
4530C58r76J107k25o32m28J106j272J009l5ML68p41K81j21q8L15n84Q12j02n78
$$ 358 -618 489 264 -368 -796 310 -962 47 12 16 384 -357 -76 -197 -285 30 -554 258 156 -422
4550d22J15K65K5m28P80j47j97j66L73J87l53P14m66n8n1n68k53N52J7J37j88
$$ -422 -307 -42 -17 -445 335 188 -9 -175 198 385 32 746 280 222 171 -397 -650 -98 -81 56 -132
4571a32Q69j385M75q7m93J203m88Q17j59j87m68q83rJ148q75R83r48M09K00L41
$$ -132 737 -648 -173 -260 -753 450 -38 779 620 433 -35 -918 -927 221 -654 329 -619 -210 -10 331
4591C31m62n66L61Q98p48M21l34J1J78q19J612r30n47Q25j40j95K56K63l49ll6
$$ 331 -131 -697 -336 562 -186 235 -99 -88 90 -729 883 -47 -594 231 91 -104 152 415 66 63 27
4612B7P1l20J20n51J103o78j02J51l66Q40J86m0n96j99J91M15k67M3M59o25M15
$$ 27 98 -222 -102 -653 450 -228 -330 -179 -545 295 481 441 -155 -354 -163 252 -15 28 487 -138 277
4633B77k71k26nL32Krm08q8m94J339k36n31KL29m06q6J013p65Q9l30P64K34J56
$$ 277 6 -220 -225 107 109 100 -308 -396 -890 449 213 -318 -316 13 -393 -479 534 -231 -142 -472 292 526 682
4656F82p36m31Q09k91j11K07o24J23J12j94l92P67J25J07J86q90N63J89k8j24
$$ 682 -54 -485 324 33 -78 129 -495 -372 -260 -454 -846 -79 46 153 339 -551 12 201 173 49
4676D9K92o14L39k79R18j393R35k09m21J96O32m46k03K46l97k02L74n26M39K9
$$ 49 341 -273 66 -213 705 -688 247 38 -383 -187 445 -1 -204 42 -355 -557 -183 -709 -270 -241
4696b41J74K82m38P22j536J279m52L29L58k09p06L56Q86r65j34P5p8j76Q15j73
$$ -241 -67 215 -223 499 -1037 242 -210 119 477 268 -438 -82 804 -161 -295 -220 -298 -474 341 168
4716A68k90l09M1l21J166m48l7o12J413P36j604J52o48M86Q5j35l1j59N36n82
$$ 168 -122 -431 -390 -711 455 7 -30 -642 771 1507 -97 55 -593 -107 -22 -157 -188 -347 189 -393
4736c93N58J91o58K68l25N22p11Q29K30r47J58P24q75M80l21O70p38M94Q5j9J76
$$ -393 165 356 -302 -34 -359 163 -548 281 511 -436 -278 446 -429 51 -270 400 -338 156 241 222 398
4757C98k54K34j98K36j12L18o96o30Q75o50R60o44J10J50n11M61n51N59k00k79
$$ 398 144 378 180 416 304 622 -74 -704 171 -479 481 -163 -53 97 -414 47 -504 55 -145 -424
4777d24O22j19k46J01j86j23M14m53J71M64K4p86R05m13n96M48M53M0k06L76r49
$$ -424 198 79 -167 -66 -252 -375 39 -414 -243 221 245 -541 364 -49 -645 -197 256 296 90 466 -483
4798d83R22k12q99J007k01Jl66j87k3N10k18K97n98P08o92N42R5p92R48l99j74
$$ -483 439 227 -672 335 134 135 -231 -418 -441 69 -149 148 -450 258 -434 108 203 -589 359 -40 -214
4819b14k11R38n70K92o26n65K67N01J99k47m90R18K7K07J02j61j92Nl17p1J35
$$ -214 -425 513 -57 235 -391 -956 -689 -188 11 -236 -726 192 219 426 528 367 175 180 -137 -208 -73
4840g3J59L01q98R96l76m9m97K76O59n70j18R76o19o2Pj49N7O74l89m4n52M71
$$ -73 86 387 -511 485 109 60 -437 -161 498 -72 -190 786 167 105 112 -37 20 694 305 261 -291 180
4862A80N68j421J094n0j19q96K47M41r3J52J05j50r2N12K96o74m13k11Q21o20
$$ 180 748 -673 421 371 252 -644 -397 44 -49 103 208 58 -34 478 774 100 -313 -524 297 -323
4882c23P47r8m70l98K41J94k13J08J19J28j11K40l94J241p55l44K64K87n45n90
$$ -323 424 326 -144 -542 -301 -107 -320 -212 -93 35 -76 164 -230 1011 256 -88 176 463 -82 -672
4902f72L89Q84l93p33N82j48Q0k08nQJ3r8Q32j39q12M78K43r12M73o3N12l65J71
$$ -672 -283 601 208 -525 57 -91 -11 -219 -224 -216 -203 -301 531 392 -420 58 301 -611 -138 -201 311 -54 117
4925A17n43L21K53q9j88N32o29j86L81L6qm96q8Q89p2P6j32n10Q2L91J71n2o24
$$ 117 -426 -105 148 59 -129 403 -226 -412 -31 5 -3 -499 -587 302 230 306 174 -336 -254 137 308 256 -368
4948c68M54m38l72Q53l60Q0J19J36k49k8k6j29M79J56K66o8l63k01K77k67m66
$$ -368 86 -352 -724 129 -231 -151 -32 104 -145 -173 -199 -328 151 307 573 505 142 -59 218 -49 -515
4969e15P3N12k25j42N85J37o57K0L12k71L19J05m62R94j111J21P07j115J048l5
$$ -515 -442 70 -155 -297 288 425 -232 -212 100 -171 148 253 -209 785 -326 -205 502 -613 435 400
4989D00J8o60J85J08J42j89J28m84j73k81R14K60n08J95p77J109q71M18K11m10
$$ 400 418 -242 -57 51 193 4 132 -352 -525 -806 108 368 -140 55 -722 387 -484 -66 145 -265
5009b65L40j87O5M13o95J17M03m91n8M38j84J40p8K88K2p44K72O35o17M12k3q18
$$ -265 75 -112 -47 366 -329 -212 191 -300 -358 80 -104 36 -42 246 268 -476 -204 431 -186 226 203 -615
5031f15Q94l51M1j1J2L15l46N55o01r9M48P2m49K69R7o8j09K99p40N32K91l99
$$ -615 279 -72 -31 -42 -30 285 -61 494 -107 -206 242 314 -135 134 231 163 54 353 -387 145 436 37
5053C7j43P67j134L60k25k80L33k50Q66n89N33l31k51L29j30K59J71p06J495r98
$$ 37 -106 661 -473 -113 -338 -618 -285 -535 331 -258 275 -56 -307 22 -108 151 322 -384 1111 113
5073A13m04M71J4j97r0O31q38M17l92N47n94r4Q46J08o30L93k35k10j45O12k44
$$ 113 -291 180 194 -3 -93 538 -300 117 -275 272 -322 -416 430 538 -92 301 66 -144 -289 323 79
5094G9j48N88r3R1j080P66n55M32M97n94l74J66M41o89J46K80l46M64k5OJ70k76
$$ 79 -69 519 426 517 -563 203 -352 80 577 -17 -391 -225 216 -473 -327 -47 -393 71 46 52 222 -54
5116e4k06k75R2L41lK90L98n18k41l2J36j87N62k87L00R0m94M74r61M05j25L78
$$ -54 -260 -535 -443 -102 -105 185 583 65 -176 -208 -72 -259 303 16 316 406 -88 386 -575 -170 -295 83
5138H3o0N29o13M6p4K47M92p14l17M80M66o27j3j11N71j104O14O0k4R4J79p10
$$ 83 23 552 -61 -15 -89 158 650 -64 -381 99 565 -62 -75 -186 385 -719 -105 -45 -69 25 204 -506
5160e06J048o66L35L46q20M11m21J046l67j57k17M17j97p2n96m18J299q05L61
$$ -506 542 -124 211 557 -263 148 -273 773 406 249 32 449 252 180 -416 -834 465 -340 21
5179B1L53p6o16p1p9L47J03K69j08l84k70R11j286J061P2o1n39O42l28n89o0O18
$$ 21 374 298 -318 -389 -468 -121 -18 251 143 -241 -511 400 -886 175 247 186 -353 289 -39 -628 -688 -70
5201g0J08p29Q98Oj63k69M19p4L14O9l09m2j57K1L17k72J64N7l70j84M83J041
$$ -70 38 -691 207 213 50 -219 200 126 440 509 200 158 1 22 339 67 231 288 -82 -266 217 1258
5223A258j639L60j08J81q8J53n35M14n84L10m0o3J53K10K3K13q72K92L32m19R51
$$ 1258 -381 -21 -129 52 -36 117 -418 -4 -588 -278 -318 -381 -228 -18 5 218 -654 -362 -30 -449 502
5244E02o64L8j91Q36k84j20m94M93o66J236mr89J91N02J30k51m10l5K06q75m8
$$ 502 -162 -124 -315 521 237 117 -377 116 -550 686 682 -307 -116 386 516 265 -145 -180 26 -849 -897
5265h97J526o17p18J145q32M02M02J79k3n2q88M68L9q05L18J90L21j57P63n12
$$ -897 629 12 -706 439 -393 9 411 590 567 515 -373 95 134 -671 -353 -163 158 1 764 252
5285B52k00k87O18o01l85P61l28r7M82K66k00j62k37k05j40L5P33N7p60O41%k89
$$ 252 52 -235 383 -218 -603 158 -170 -267 215 481 281 119 -118 -323 -463 -428 305 362 -398 243 243 -46
5307d6P88o90J86k86L19K05j003R74j51L37j076K33N75m79n12O76J48j71J6j80
$$ -46 742 52 238 -48 271 476 -527 447 296 633 -443 -210 365 -114 -626 50 198 27 43 -137
5327a37N58k92j2K46O1m31J29P9k61k64L77m09k65r8J234p98M5K04n36J77M73
$$ -137 421 129 117 363 424 -7 122 201 -60 -324 53 -356 -621 -719 515 -283 -238 -34 -570 -393 80
5348H0k81k42L35k26M81q60J057r79N68j91O93m61o55Q30k14N81q9K73p36k97
$$ 80 -201 -443 -108 -334 147 -713 344 -635 -67 -258 435 -26 -681 149 -65 516 427 700 -36 -333
5368c33N38l27P07o92ml46O52l44k10M28p26O44L32j82J58N07q34P33m36L66m06
$$ -333 205 -122 585 -107 -111 -457 195 -149 -359 69 -657 -13 319 137 295 802 -32 701 265 631 225
5389B25K9p72P08l96k42L61L55r40J82L07j6J23M17L44n50m07N03o8n1J56n24
$$ 225 254 -518 190 -206 -448 -87 268 -672 -490 -183 -199 -76 341 685 135 -272 231 163 112 268 -256
5410b56M09n4j04O15o91j4R9P1m03J009r91J56N26m2l12m60L02N71k99n86M52
$$ -256 153 99 -5 610 -81 -95 4 75 -328 681 -310 -154 372 330 18 -442 -140 431 132 -454 -2
5431bQ9j21K5j2J28m59N98l96K7J44l82N88m13P68j91n13q09R63k52O91j35l75
$$ -2 87 -34 -9 -21 107 -352 246 -150 -123 21 -361 227 -186 582 391 -122 -931 32 -220 471 336 -39
5453c9l95L4N04k64L46p06k86J153o27J44j66j24O50r64P93M39o41j71K21M75
$$ -39 -434 -400 104 -160 186 -520 -806 347 -280 -136 -302 -426 224 -740 53 492 -149 -320 -99 376
5473C76N12n17K70j081M33k46o5L32N46o62J58J28k12j31n99Q75J31K72m27L5
$$ 376 888 371 641 -440 -7 -253 -318 14 560 -102 56 184 -28 -159 -758 117 248 520 93 128
5493A28k10K8N27n84K27j61k67R2M8q0N07r2k33lj90P2M38l70N21K34p68K90j123
$$ 128 -82 -54 473 -111 116 -45 -312 -220 -172 -252 255 163 -70 -73 -263 -191 247 -123 398 632 -136 154 -969
5516i69J098J56m29L43j14l48N92l13J09o92J022l70J70m45m09Q11J44N16o32
$$ -969 129 285 -144 199 85 -263 329 16 125 -567 455 85 255 -190 -599 212 356 872 240
5535B40q46J295k86j12N6K1m92M15M8m81N06j71m29N35m7l02J13N9j72m61O20
$$ 240 -606 689 403 291 347 368 -124 291 339 -142 364 193 -236 299 252 -50 63 122 -50 -511 109
5556A09q7l35P1J60l42O55k84P65q55N7Q13j52p70J28O1M5J46M3l54m8P81q56
$$ 109 22 -313 -242 -82 -424 231 -53 712 -143 -86 727 575 -195 -67 -6 39 185 228 -126 -174 607 -249
5578b49n67Q39N99j11m24j23l01M77J64K98k17l50L26m26J116j251l5J4j54J4
$$ -249 -816 23 622 511 87 -36 -337 140 304 602 385 35 361 -65 1051 -200 -235 -221 -375 -361
5598c61O08J61q33K31P65q33P08ml25l98M11J22r40J198m83j16r0K75M64r23R90
$$ -361 247 408 -425 -194 571 -262 446 442 117 -281 130 252 -688 510 27 -89 -179 96 560 -363 627
5619F27q36K65K42L39l78o08M09L18m67Q86j291L71M30m18k1J9k61P64k73l3J80
$$ 627 -209 56 298 637 259 -349 60 378 -89 797 -494 -123 307 -111 -132 -113 -374 390 117 84 264
5640B64J1K9l50m78P18j43J72p58k54N78J83j62m16P33J39J82j077O00J23n93
$$ 264 275 304 -46 -524 194 51 223 -535 -789 -211 -28 -190 -606 127 266 448 -629 -29 94 -499
5660d99M72K60j39K54M1p10J86K54o69J50J86J17M98o40M90k67K12L53q84M65
$$ -499 -27 233 94 348 389 -321 -135 119 -550 -400 -214 -97 401 -239 251 -16 196 549 -335 130
5680A30N1m80L84J87p22O57o86Q09O00j442J272n17r95R87m27Q7L41L14k44p45
$$ 130 181 -299 85 272 -450 207 -479 330 930 -512 760 243 -752 235 -192 -105 236 550 306 -439
5700d39o14J531Q2j350P9L31j16K75R77p99jN86j78n63j06M77m12J34O79j240
$$ -439 -1053 478 560 -790 -711 -380 -496 -221 756 -43 -44 542 364 -199 -305 172 -240 -106 573 -667
5720f67O05K10k01l93PL36m01N32k64L77p5k23k98J115M45q23m75N85k0K40l50
$$ -667 -62 148 -53 -446 -439 -103 -504 28 -236 141 66 -157 -455 660 1105 282 -193 392 372 612 262
5741B62n46O44k63j21n99M79N83p94M30o24J05j11M05Q4J45k43O47r54L76N08
$$ 262 -284 360 97 -24 -623 -144 439 -355 75 -549 -444 -555 -150 -66 79 -164 483 -471 -95 413
5761D13p23K19o0J31M12j41k66K18o33K86p9m27Q0N60l07P78k64m37O66l06J08
$$ 413 -310 -91 -151 -20 392 251 -15 203 -430 -144 -223 -650 -570 -10 -317 461 197 -240 426 120 228
5782B28N27r76N38K01o88K34l9j20R0m05J306r53m7k08K43J10R4n51O84k76j34
$$ 228 755 -221 317 518 -170 64 25 -95 -5 -410 896 -57 -104 -312 -69 41 135 -416 268 -8 -142
5803a42K29N8p98P57P25j026O2j04J57l32J89P43m35r0J14j90K43N04k35j004
$$ -142 87 145 -653 104 829 -197 -135 -239 -82 -414 -225 518 83 -7 107 -83 160 664 429 -575
5823e75M72N4J68j98L8p8Q6J46j23J2M40k49l28L28l32l14L13J85J23K0j23l59
$$ -575 -103 -49 119 -79 -41 -119 -33 113 -10 2 442 193 -135 193 -139 -453 -140 45 168 188 65 -294
5845b94K43N38j0l05k42L52n62M55J05j49j3K28J78p33O80K6J08q61R4m67J100
$$ -294 -51 487 477 172 -70 282 -280 175 280 131 118 346 524 -209 471 497 605 -256 -162 -629 471
5866D71o6p93j9P59j31J98p11J29O30p06P90k27l46j51L51K64j44o2l75N2O47
$$ 471 405 -388 -407 352 221 419 -292 -163 467 -239 551 324 -22 -173 178 442 298 236 -139 -87 560
5887E60p74k24L34M82j58j62K65n74j12O48l81M27o78N34J15n02L35p8l34j91
$$ 560 -214 -438 -104 378 220 58 323 -251 -363 285 -96 331 -347 187 302 -200 135 57 -277 -468
5907d68M95m98N44N67j325K27J95O40L21m80ML74j237M82m85K84J9M3l46N10L06
$$ -468 27 -471 73 640 -685 -458 -263 377 698 218 222 596 -641 -159 -644 -360 -341 -298 -644 -134 172
5928A72K29k68o1j73M10n08J55L32m34j3K92j89P7J11k13m26N01m69Q01P38j667
$$ 172 401 133 72 -101 309 -199 -44 288 -146 -159 133 -56 21 132 -81 -507 -6 -475 326 1064 -603
5949f03O50k98L95m05O37n06J79K69J8K1o30M45j98R2j38K34p66O71nk60k79J191
$$ -603 47 -251 144 -261 376 -130 49 318 336 357 -273 172 -26 66 -72 162 -604 67 62 -198 -477 714
5971G14k68n69N70o51j58R7J73k34J20m28R47o07L6pO32r09N26M88n38J47n35
$$ 714 446 -123 447 -204 -362 -265 -92 -326 -206 -634 313 -294 -258 -265 367 -542 -16 472 -66 81 -454
5992d54P71j00p0o68P25p90R55J18o26J87k9r4O22j220Q27J70k66J65o84J051
$$ -454 317 217 147 -521 204 -586 369 487 -139 48 19 -75 547 -673 154 324 58 223 -461 590
6012E90m30j83O76q04O4N59p57p0Q92q77R20j30q34R07q94O23m21L20K10j20q47
$$ 590 160 -23 653 -151 -87 472 -285 -355 537 -340 580 450 -384 523 -371 252 -169 151 361 241 -606
6033f06J156r53l3Q77n84O0m18R65m34p68R41O4m93jOL24r5L35j83j0Jr4N7M17
$$ -606 550 -403 -436 441 -143 -83 -501 464 30 -738 203 267 -226 -227 -221 103 8 343 160 150 151 57 114 531
6057E31n27J72m40K89J40K93m13N66r20K63o78P55l8J12j46J26K14J17k37l38
$$ 531 4 176 -264 25 165 458 45 611 -309 -46 -724 31 -7 105 -41 85 299 416 179 -159
6077a59N61k65J41k90J32n78J94J38K02m46O17p17L11J66k68P74M5n79J49k26
$$ -159 402 137 278 -12 120 -458 -264 -126 76 -370 247 -470 -159 7 -261 513 558 -21 128 -98
6097i8K29Q2k61L77m48j55O29n8l48Q65j764J097q48J591o14r2r19M30M89q4K98
$$ -98 131 213 -48 329 -119 -274 355 297 -51 814 -950 147 -701 890 276 184 -735 -305 184 100 398
6118C98o42O27j38O51r02J00p87J476l86k91k04P09r16L19n3M46j020J43K35n23
$$ 398 -244 383 245 896 -6 94 -693 783 397 106 -98 611 -305 14 -39 407 -613 -470 -235 -758
6138g58J009j02J85m48K2k71q2O05l65o4J69l91O77j04j2L03n95M36q58N27o3
$$ -758 251 149 334 -114 -92 -363 -445 160 -205 -269 -100 -491 186 82 70 373 -222 214 -644 -117 -180
6159a80Q4J64N3J26k0o02M99N1l28L03l94J99N01p48m2J219o27O1l78k03k07O20
$$ -180 -96 68 121 247 227 -375 124 175 -153 150 -244 -45 456 -292 -334 885 258 319 -59 -262 -469 151
6181A51N7M5o31O15J99l57k59O93p15L05k6l8l98n11J049q2M34j129P33o43Q28
$$ 151 208 253 -378 237 436 79 -180 513 -202 103 77 39 -359 -870 179 97 531 -598 135 -508 320
6202C20J86q13m9J83P39l45l30K56k70m1M31o1J4p5j90p30J8J053o02j49n9N47
$$ 320 506 -307 -356 -173 566 221 -109 147 -123 -164 267 206 220 145 -45 -775 -757 296 -306 -455 -514 33
6224C3l7n38L66N71q90m1Q71j84n52l14Q41l74K16l56J0N49J90J53j279N95K10
$$ 33 -4 -542 -176 395 -495 -536 335 151 -401 -715 126 -248 -32 -388 -378 171 361 514 -765 -170 40
6245D0k04K13p2n75P0Q70o56K54j42J21n5J67k68N33J0n76O90j193J20J116n97
$$ 40 -164 49 -23 -598 -528 342 -314 -60 -202 -81 -136 31 -237 296 306 -270 420 -773 -653 463 -134
6266a34Q79o56M04o35N95j11o25p5K1P54r8K07q23l22K27L25N97l45m49K59n61
$$ -134 745 89 493 -142 453 342 -283 -358 -337 417 319 526 -297 -619 -392 -67 530 185 -264 -5 -566
6287e66l17M71J116o83L50j162J313r47P49k86j73O87p85J0M49l96m98N23N4K76
$$ -566 -883 -412 704 21 371 -791 522 -425 324 38 -135 552 -233 -223 226 -170 -668 -145 -91 185
6307A85K72p10q2jO01k05N85n28l98K66J83m54O19k50k84K74j80K00OK2k5n94
$$ 185 457 -253 -335 -336 265 60 645 117 -281 -15 168 -286 333 83 -201 73 -107 93 99 121 96 -498
6329d98L6N59L5n81L62J22K37J81n02K54n05J78L9J80k77O95l93L1m70L35L84
$$ -498 -462 97 132 -449 -87 35 272 453 -49 205 -300 -122 -83 97 -180 515 122 153 -317 18 402
6350D02p95O16j40l20N7M71p63K14K00j88N6J561j612K03m77N99m06K98M06n64
$$ 402 -393 223 83 -237 -180 291 -472 -258 -58 -246 -190 1371 -241 -38 -515 84 -322 -24 382 -182
6370a82l42R09l73M90l61j012R60k59L73k2qk7jr0N61p12l06L07L54J0k67L11
$$ -182 -524 385 12 502 141 -871 89 -170 203 181 173 146 145 55 616 -96 -402 -95 259 269 2 313
6392C13k07J81k84K58n1J55l86n43J002n77p1M57j80J19q51L10M69k33l75L02
$$ 313 106 287 3 261 210 365 -21 -564 438 -139 -210 247 67 186 -665 -355 114 -119 -494 -192
6412a92J073o39K11o02L13m0n23J02P5m00m1M60L48oK4m96K92N64q69N27K58K54
$$ -192 881 242 453 -149 164 124 -399 -297 -222 -622 -663 -203 145 139 163 -333 -41 523 -346 181 439 693
6434F93l41k32k87K58m19O29l35j20O64o88m80R39p26Q70j72k27L38r43P74o08
$$ 693 352 120 -167 91 -328 301 -34 -154 510 -178 -658 281 -445 425 253 26 364 -579 195 -413
6454d13J247q01Q7j66j51j06J50L15L6n73M31J79m98k36J83R30o62o59J346p20
$$ -413 834 33 120 -46 -197 -303 -153 162 198 -375 56 235 -263 -499 -316 614 -48 -707 639 -81
6474h1N73j046M01K80K28k38m14K36L79L35r20M04o07N05k6P10n2k48N84p76q71
$$ -81 492 -554 -153 127 355 117 -297 -61 318 653 -267 137 -470 35 9 719 667 419 1003 227 -644
6495f44o29O33L95o12P37O11n55k85K84k16J122n48J12p91oN6L88l10N34j48j05
$$ -644 -1273 -640 -245 -857 -120 491 -64 -349 -65 -281 841 293 405 -386 -392 -336 52 -258 276 128 23
6516B3NJ34r1j21l7%m21P43Q4m48J29l02L86q5M16n19m14R87m01o0n56N20L10
$$ 23 28 162 71 -50 -87 -87 -508 235 319 -129 0 -302 84 -1 415 -104 -518 469 68 8 -548 -28 282
6539B82l76k16K52O54o38Rk25J21p58P19L47m48q50O77pJ85O90r24N29O06m43
$$ 282 -94 -310 -58 596 -42 -33 -258 -137 -895 -176 171 -277 -1127 -450 -457 -272 418 -506 23 629 186
6560A86m15L14k67J42N52q66N4K72N33n59k88M78K14l89k63l04J348j037j13K3
$$ 186 -229 85 -182 -40 512 -354 -300 -28 505 -54 -342 136 350 -39 -302 -606 742 -295 -408 -385
6580c85O84K50m82K14j4m7p06R89l30N06o68Q3o76J67J6M30j26J28L99k17j88
$$ -385 299 549 67 281 267 220 -486 503 173 679 11 94 -582 -415 -399 31 -95 33 432 215 27
6601B7j41m82M87m0L72n68K83Mq8R51q93J058q46K66k69o33O98J43l27J25Q1n87
$$ 27 -114 -596 -109 -149 223 -345 -62 -58 -146 805 -88 970 124 390 121 -512 186 329 2 127 208 -379
6623c79N18o80j1J0R2j97M87k4M72p1j87n08R49l84k83M44p66M66O10o81K67j94
$$ -379 139 -541 -552 -542 -450 -647 -160 -184 288 217 30 -478 471 87 -196 248 -518 -52 558 -123 144 -50
6645e0Q7L10n16K08J5j62K20p55J022K4n7j25J04k59q87M76O59o62N56m88k84
$$ -50 37 347 -169 39 54 -108 112 -643 379 403 346 221 325 66 -821 -345 314 -348 208 -280 -564
6666e64O14K66k79p11O67N8M08J65q62J19l77L03N95J2j87p68P94m33L03M97q71
$$ -564 50 316 37 -674 -7 51 459 624 -238 -119 -496 -193 402 414 227 -541 253 -180 123 620 -251
6687b51k64L28P39j023K81L31j319R90M01l24l00K94P23j211P46m42J009p08j1
$$ -251 -515 -187 552 -471 -190 141 -1178 -188 213 -111 -411 -117 606 -605 141 -301 708 0 -11
6706a1L64q22k11N63n58L95M8J75l88R35l50m04J77M2n93N41L68k76k05m08K18
$$ -11 353 -469 -680 -117 -675 -280 -232 -57 -445 490 140 -264 -87 -45 -638 -97 271 -5 -210 -618 -400
6727d00Q68o76J95O48q06M43p92M02j17N41k75j43j73O80J71p25L51M82j377P44
$$ -400 468 -208 -13 635 -171 272 -520 -118 -235 306 31 -112 -285 395 566 -159 192 674 -703 41
6747D1P6O94n02j05m34K06n89P95j1n6L17l06J7o56O62P3M48m42l35j99L33o2
$$ 41 117 811 309 204 -230 -24 -613 182 171 115 432 126 143 -513 149 222 670 228 -107 -306 27 -35
6769c5m18M1O19n00P22m16k26J36K31P13o57n69k68N86j76J51n83M98K6L14K71
$$ -35 -453 -412 207 -293 429 13 -213 -77 154 867 210 -359 -627 -41 -217 -66 -649 -151 -125 189 460
6790D60L39j160K29P05n93q33J90N04L07m04M85l70l80k03J028L16m06k75j66
$$ 460 799 -361 -132 573 -20 -853 -663 -159 148 -256 229 -141 -521 -724 304 620 214 -61 -227
6809b27J017p26j99J8J28m9k93o35R14Q6M28n96j01l1M82J74LL89r96M32m26R6
$$ -227 790 64 -135 -117 11 -38 -331 -966 -52 34 462 -134 -235 -266 216 390 393 782 -214 218 -208 -112
6831a12J34N68m81J52n40L41j2O02q85P33j86j89P2n82R53q45M83K81k95K74o34
$$ -112 22 590 109 261 -279 62 50 652 -233 500 314 125 197 -385 568 -277 206 487 192 466 -168
6852a68Q2L42n1N00o68J7o89K35j40O1J001j066L03N25n15L80J79l66j00j59K24
$$ -168 -86 256 205 705 37 54 -635 -400 -540 -479 522 -544 -241 284 -231 149 328 -38 -138 -297 -73
6873g3J58m89l32K71L35R21q97k91N42P9j42m92M45l36N79l20j01L44L1l30K11
$$ -73 85 -404 -736 -465 -130 791 -106 -397 145 224 82 -410 35 -301 278 -42 -143 201 232 -98 113
6894A13k55N52p00p72J286q53Q12j14K73k70m4m94J233p57k90J92K23o50N82K88
$$ 113 -142 410 -290 -1062 224 -629 183 69 342 72 28 -466 767 10 -280 -88 135 -515 67 355
6914C55l06l79K25j43K28k82L45m01L14L78p63O09K25K05m61p92N74k45M43K45
$$ 355 49 -330 -105 -248 -20 -302 43 -358 -44 334 -429 180 405 610 149 -643 -69 -314 129 374
6934C74r56J98l52M77J24K66m27J24m51M98k78M60L54n60Ln88J264q75K31O48
$$ 374 -582 -384 -736 -259 -135 131 -296 -172 -623 -125 -403 57 411 -149 -146 -734 530 -345 -114 534
6954E34l62o19M17Q32n46j22M42r05L94L9O84n69k42j61j43J129k27n50J13r3
$$ 534 172 -447 -30 802 256 134 576 -329 65 104 788 219 -23 -184 -327 802 575 25 138 45
6974D5L36j449J076PK01m25J44p45J58O9N02m66l6R75n29J99l84LJ64O02m2k30
$$ 45 381 -1068 8 15 216 -209 -65 -810 -652 -583 -81 -547 -583 392 -137 62 -322 -319 -155 447 405 175
6996A75K46l9k59p34M32J35J25O7L59q25N65J00l50l37R38j000k36P48k74J11
$$ 175 421 382 123 -611 -179 -44 81 148 507 -318 247 347 -3 -340 598 -402 -638 110 -164 -53
7016e3m2K82m89J75r8O10j42l18k27N35n81k9M31p44R67R7m30K6L95K8l40l92
$$ -53 -95 187 -302 -127 -225 385 243 -75 -302 233 -348 -377 54 -690 277 374 -56 -30 365 393 53 -339
7038c39L80R5M9j75K18k54l63j20N48J3r9L18q5J98j025K02O21k01J51n2M5k75
$$ -339 41 136 185 10 228 -26 -389 -509 39 52 -47 271 186 384 -641 -439 182 -19 132 80 125 -150
7060a50k96M04N1N23l54J68p90O31j053P22n19L47N74j19k13j77L8N69n10l12
$$ -150 -446 -42 9 532 178 346 -444 187 -866 -144 -663 -316 258 139 -74 -251 -213 356 -154 -466
7080d66J64RO22m44O93o7m24J52o17M46j02P78n31M70n82k84Rk14J020j11l64
$$ -466 -302 -293 329 -115 578 511 87 239 -378 68 -34 744 213 683 101 -183 -174 -388 632 521 157
7101A57K10j98K37J87n86o4N60K61q45l0L33k44j56R85n05j5m08l25Q93l35Kj37
$$ 157 367 169 406 593 7 -57 503 764 -81 -111 222 -22 -178 807 302 287 -121 -446 447 112 114 -23
7123b3L92p8K62r23L01N7J29m17j03M92p19K87M64K16K18j086J22K92L68j037
$$ -23 369 291 553 -370 -69 -12 117 -300 -403 89 -630 -343 121 337 555 -531 -409 -117 251 -786
7143g86J022J25k04K8k48J39K40j97J67l59j77L9K66K1l26o2O7m40P61K08J27
$$ -786 236 361 157 185 -63 76 316 119 286 -73 -250 -211 55 76 -250 -312 -245 -685 76 284 411
7164D11J36j041J65R28p06N80n62L76l41N5L33J21p70L54l53L98m32L56k14M51
$$ 411 547 -494 -329 599 -107 473 -89 287 -54 1 334 455 -315 39 -314 84 -348 8 -206 245
7184B45j6n08M92J53o02j67M88j06m23L51N46p63K42n2P5J7K31k43k16L56m71
$$ 245 229 -279 213 366 -236 -403 85 -21 -444 -93 453 -310 -68 -120 -45 -28 203 -40 -256 100 -371
7205c71k06R75r26L99R0J06q1R2J25n6J91J60l74J93N48p02O61q44K84K31K88
$$ -371 -577 398 -528 -129 -39 67 -14 78 203 147 338 498 124 317 865 163 824 -20 264 495 783
7226G83n15J20r42P01O09q36J73M67o63L95L1M41n70j87K93l72K34l54K72O91
$$ 783 268 388 -554 147 756 -80 93 560 -103 292 323 764 194 7 300 -72 162 -192 80 771
7246G71r80k28K60l85O51k39j81L07K53J72r21J94k28M6L70Q0m16Q33j19O4o29
$$ 771 -209 -437 -177 -562 89 -150 -331 -24 229 401 -520 -326 -554 -508 -138 -58 -474 359 240 304 -325
7267c25N42J09o64M4K54O44j414O07o29P50j27K91j05J015q77l06o7K33M71m20
$$ -325 217 326 -338 -294 -40 604 -810 -203 -832 -82 -209 82 -23 992 115 -191 -258 -25 446 26
7287B6O67q59j80L73l49N86N84o10j173K96Q27k20J70L20k46J73K17j27q7l34
$$ 26 693 -166 -346 27 -322 264 848 238 -935 -639 188 -32 138 458 212 385 602 475 388 54
7307E4R2m15L09r1L36n18n27Q94j39r8K13k04l4J82j27j58j94Q67n99k19P72l3
$$ 54 146 -269 40 -51 285 -233 -760 134 -5 -103 110 -94 -128 54 -73 -231 -425 442 -157 -376 396 363
7329C63m56L04p95R22n75L6N09N44m95o99P49l91n87O32q94L75M97k93P33k66
$$ 363 -93 211 -584 338 -237 -201 308 852 357 -342 407 16 -571 61 -833 -458 39 -254 479 213
7349B13n88M48o6N82m95l4n45M63k04N14o78k6K16j66J025j327K61L07N3k95Q44
$$ 213 -375 73 7 589 94 60 -485 -22 -226 288 -390 -416 -200 -366 659 -668 -407 -100 -47 -342 502
7370E02k85l37n82P80K83o9j48O4j38p14O93p5O16j334R73J35j04O9q96N24l39
$$ 502 217 -120 -702 78 361 292 144 208 70 -644 49 -26 590 -744 229 364 260 329 -567 -43 -382
7391c82N67l05M23j45K3j52lj48m45R51n7p12O01r7P0o55j56P18n45P77q25M17
$$ -382 185 -120 303 158 181 29 26 -122 -567 384 327 -385 216 119 189 -466 -622 96 -449 328 -497 -80
7413h0K69m08M56k70l69K77j36N42j13n50r30J832r39M75p4r53L62j09J080j64
$$ -80 189 -219 237 -33 -402 -125 -261 281 168 -382 -1312 520 -419 56 -18 -971 -609 -718 362 198
7433A98r3M49m73P4q4R2K11n47j81L0n9J34K1k00J64O56p3j7J69p04k31K21N32
$$ 198 105 554 81 155 71 163 374 -173 -354 -324 -383 -249 -228 -428 -264 392 319 302 471 -233 -464 -243 289
7456B89m77L03q1m80N98o15M90o14M23L05k64k31L18k12N39k87o29Q52q37L84
$$ 289 -188 115 34 -446 152 -463 27 -587 -164 141 -123 -354 -36 -248 291 4 -625 227 -610 -226
7476b26J68M80m76J66J24j081J408l23k56l37L65K2k43M62n72K94j72n1L76K42
$$ -226 -58 422 -54 112 236 -845 563 240 -16 -353 12 34 -209 253 -319 -25 -197 -248 128 370
7496C70o0r94L05L25K41N64o36j058Q98O88k038R75K03l55R23l54P96r56n5n67
$$ 370 310 -684 -379 -54 187 751 115 -943 -45 643 -1395 -420 -217 -572 351 -3 793 -163 -218 -785
7516g85M82N24m59N83J36q48N75k28l60M67q42P68L16k25K77k82L6k36j91K73
$$ -785 -303 221 -238 345 481 -367 208 -20 -380 87 -755 13 329 104 381 99 135 -101 -292 -19
7536a9j38j28L33N68p72Kj132J984r03m77M80k96J341j208N98j26n45P14K17n96
$$ -19 -157 -285 48 616 -156 -154 -1286 698 -205 -682 -202 -498 843 -365 233 107 -438 276 493 -103
7556a03O6j25J43q9k45M92M80o89l12J14J97k54J24o91J147R0k79Q6J37n69jP6
$$ -103 -37 -162 -19 -108 -353 139 619 -70 -382 -268 -71 -325 -201 -892 255 345 66 152 289 -280 -281 -205
7578b05m91J306j096N62M17m27k39j36J0k81M50k06K91J53M05l55j7L64j9o99
$$ -205 -696 610 -486 76 493 66 -173 -309 -299 -580 -130 -336 -45 108 513 158 141 505 486 -213
7598b13n31O39O3J59j87j74J08K34L96J84p89L98Q58j586N10l31k35J66K21L25
$$ -213 -744 -105 -42 117 -70 -244 -136 98 494 678 -111 287 1145 -441 69 -262 -497 -331 -110 215
7618B15p90J318r82K10PJ049q80j17n71O44L98r40L45p03J203k44O4K33l39R5
$$ 215 -575 743 -239 -29 -22 1027 147 30 -541 103 501 -439 -94 -797 406 162 226 459 120 215
7638B15k67j56N71m19K4m96R72p03L01J85J56k25p61L69j97k67Q84k30L6N9j95
$$ 215 -52 -208 363 -56 -32 -528 444 -259 42 227 383 158 -603 -234 -431 -698 186 -44 -8 51 -144
7659a44k1r9N4p7L46K07p30J24L68M77n99l30N06m50L91J20O45p65k71P7O38o78
$$ -144 -165 -264 -210 -287 59 266 -464 -340 28 505 -94 -424 82 -368 23 143 788 23 -248 -171 467 -211
7681b11R86k57l64L53l32m26N87K32m98L44m42l48m0P98Q6p69J185q61L22Q7j42
$$ -211 775 518 154 507 175 -251 336 568 70 414 -28 -376 -416 382 468 -301 884 23 345 432 290
7702B90p84J021p20n34M54K54l79K05M56n76O48k01l57M80L99p03K59K92j95o38
$$ 290 -494 527 -193 -727 -273 -19 -398 -193 263 -313 335 134 -223 257 656 -47 212 504 309 -329
7722c29N72j02J87j05m67P88p52N10J42qn02O31q76M57m06r5J001r33r7ON76q85
$$ -329 243 141 328 223 -244 544 -208 302 444 436 -66 565 -311 146 -260 -355 646 -287 -384 -378 198 -687
7744f87J045m53J83K3L19J38m86l22L99n23L39l36L87l73O83r83J059m18K23j48
$$ -687 358 -95 88 111 430 568 82 -240 159 -364 -25 -361 26 -347 336 -647 412 -6 217 69
7764F9m79N56J45j21N68o85K72k99m29m7N27J5n80L83o7Q24r42K75L28l49m82
$$ 69 -410 146 291 170 738 53 325 26 -403 -450 77 92 -488 -105 -172 652 -290 -15 313 -36 -518
7785e18Q85j11m57N69L6l71M4O03q68N99k62o27L85K20k4q60O43K38j72m6K03
$$ -518 367 256 -201 368 404 33 77 680 -188 411 149 -478 -93 127 103 -757 -114 124 -48 -94 109
7806A09O45j172O20o22M90j39K32L2l74N00K76p03Q6n59M68Q09q16N7M6K34J35
$$ 109 754 -418 202 -420 70 -69 163 195 -179 321 597 -106 -20 -579 -111 698 -118 -61 -15 219 354
7827C54l64K86L52q58j57L36N06n22l10J33O08R2l33l77n35J450l42m29j34N74
$$ 354 -10 276 628 -230 -387 -51 455 -67 -377 -244 364 456 123 -254 -789 661 319 -110 -244 330
7847C30q41k09N70K76n66NJ65k6l83K41P2n7Q80J36l77m10Q53n24j95M31l09m34
$$ 330 -511 -720 -150 126 -440 -435 -270 -296 -679 -438 -366 -423 457 593 216 -194 659 135 -60 371 62 -372
7869c72m4O82k59r2O44o74j84J55L3j52N01j28r10J403k78l24j85M97m3m19k3
$$ -372 -416 266 7 -85 559 -115 -299 -144 -111 -263 238 110 -800 603 325 1 -184 313 270 -149 -172
7890a72J28J79o31P37o35L29P36q41m7K9J39L42j29o7j75Q6K80j5L7M3O4k14J68
$$ -172 -44 135 -496 241 -394 -65 671 -170 -217 -188 -49 293 164 97 -78 8 288 273 310 353 417 203 371
7913C71n56K46K91q01L85k60k06N93L41q67j84J321o53k62Q53j251L36j53m6N98
$$ 371 -185 61 352 -449 -64 -324 -530 63 404 -463 -647 674 21 -241 612 -639 -303 -456 -502 96
7933I6J84k80L50n32k22K10J86l40J19J61l92P61n19k19O47M39q34%J66Lp6j8
$$ 96 280 0 350 -182 -404 -194 -8 -348 -229 -68 -460 301 -218 -437 210 649 -185 -185 -19 -16 -92 -110
7955a10L92m54l7L57m99P32j56p65M78j78j60J177J30j142P22p47L21O68j566
$$ -110 282 -172 -209 148 -351 381 225 -540 -62 -240 -400 777 907 -235 487 -260 61 729 -837
7974h37J174L38q24k49K75n4j50L51M84m83J00n49P12p19O56n37J45N99K55j189
$$ -837 337 675 -149 -398 -123 -177 -327 24 508 25 125 -424 288 -431 225 -312 -167 432 687 -502
7994e02p2Q76o80M28L66N7o31N13k58l97Q92N0J08n69m53N05k39k53n41Q52m57
$$ -502 -574 302 -378 50 416 473 -158 355 97 -300 592 642 750 181 -272 233 -6 -259 -800 52 -405
8015d05J16P48k08M76o76q0k09M85o61O89o57J34O30r3L81j478O14N3q17J15R78
$$ -405 -289 459 251 727 51 -29 -238 247 -414 275 -382 -248 382 289 670 -808 -194 -141 -958 -843 135
8036A35j76j16J48N3Q74j41r22K13m01Q8M62j91l68m8L51o8N32o00j189K006J25
$$ 135 -41 -157 -9 44 918 777 -145 68 -333 -245 217 26 -342 -390 -39 -107 425 -175 -1364 642 767
8057G67j005L54j78o21L93O25n19Q5Q34j071N48J14M57l42k45L2J17l15j54o09
$$ 767 -238 116 -62 -683 -290 335 -184 -99 735 -336 212 326 783 441 196 228 345 30 -124 -733
8077g33R67l12L39m63N66J71K29l66r80J375p17l25N97r66O07M9J04l31L26J76
$$ -733 234 -78 261 -202 364 535 764 398 -582 793 76 -249 348 -618 -11 38 142 -189 137 313
8097C13r44M60P77r35M34k0L05rm09m80J33P47k64n6N75r77J73M12L51q52J34
$$ 313 -631 -171 606 -329 105 85 390 381 -28 -508 -375 372 108 52 627 -350 -177 235 586 -266 -132
8118a32l75L43r7O66k79o11Q04m65K79j0m35L80M8R1o0l54N56J18j30M27l82J0
$$ -132 -507 -164 -261 405 126 -485 319 -146 133 123 -312 68 116 207 147 -207 349 467 337 764 382 392
8140C92m44Q37p95J19j44N06o46P44M5p42M65o15K17J114r66j49N37m29k85k4
$$ 392 -52 785 -10 109 -35 471 -175 569 614 -128 337 -278 -61 1053 87 -62 475 46 -239 -263
8160b63l55Q28m3M3j7l19K65J50j51l60J80o06R01m78M9J10n6M22n86k8J79K56
$$ -263 -618 210 167 210 193 -126 139 289 138 -222 -42 -648 253 -225 -176 -66 -122 300 -286 -314 -135 121
8182A21k52k24l4M36K08n94J110j010J06
$$ 121 -131 -355 -389 47 255 -339 771 -239 -133
8191a33
$$ Imaginary data points
##PAGE= N=2
##DATA TABLE= (X++(I..I)), XYDATA
0@%%%%%%%%%%%%%%%o4J28j28J28j28J56k20K56k79L43l87M51n67O31p04Q32r60
$$ 0 0 0 0 0 0 0 0 0 0 0 0 0 0 0 0 -64 64 -64 64 -64 92 -128 128 -151 192 -195 256 -311 320 -384 448 -512
32e12J088j216J366j556J754j959K193k450K728l038L378l738M136m572N048n569
$$ -512 576 -640 726 -830 924 -1035 1158 -1292 1436 -1602 1776 -1962 2174 -2398 2650 -2919
48b919O138o767P456q212R049r977J1020j2197J3523j5038J6797j8855K1300k4280
$$ -2919 3219 -3548 3908 -4304 4745 -5232 5788 -6409 7114 -7924 8873 -9982 11318 -12962
62a2962K7999l2779L9183m8274O2292q6901J42571n23755J94149R49565o06850
$$ -12962 15037 -17742 21441 -26833 35459 -51442 91129 -432626 -238477 711088 104238
73A04238o45496L83985N55313m17479k30638M05949Q3637m94563J08201M88947
$$ 104238 -541258 -157273 398040 -19439 -250077 155872 239509 -255054 -146853 342094
83C42094j77502n00863K63265M04296k99840l31064L34749J68119l60886k6083
$$ 342094 164592 -336271 -73006 331290 31450 -299614 35135 203254 -157632 -183715
93a83715M11513j31262m49584K32859M93709k81133m53824L04720L82944l19794
$$ -183715 227798 96536 -353048 -120189 373520 92387 -361437 -56717 326227 6433
103F433k38150L58788R7264m20683K3008M62293j15938m87237J70524M48778k27409
$$ 6433 -231717 127071 224335 -196348 -173340 288953 173015 -314222 -143698 305080 77671
114G7671l86922K71163K90587l10578j75652L54834O3702l80950N1290M13013
$$ 77671 -309251 -38088 252499 -58079 -233731 121103 184805 -196145 -144855 268158
124B68158j29143m10088J86972L77790k26594l10403K59256K06268l06961j12432
$$ 268158 139015 -271073 -84101 293689 67095 -243308 15948 222216 -84745 -197177
134a97177L41205J5463l72796N8289L77796j19986l54451J79362L12206k18227
$$ -197177 144028 159491 -213305 -155016 222780 102794 -251657 -72295 239911 21684
144B1684k38282K65498J62171k97757p3608L27968q365l50063P2525L39881j34673
$$ 21684 -216598 48900 211071 -86686 -160294 167674 159309 -190754 -118229 221652 86979
155H6979l15359J76723K55764k28477j89821K73721J17447l09143m3177L36276
$$ 86979 -228380 -51657 204107 -24370 -214191 59530 176977 -132166 -175343 160933
165A60933j3987l30850P6860L15670j25278k72477J73690K16750k19199j54476
$$ 160933 146946 -183904 -107044 208626 83348 -189129 -15439 201311 -17888 -172364
175a72364K50130Q1990k85837k4489K93400l7033k89135Q5173K64490j31412k17518
$$ -172364 77766 159756 -126081 -150570 142830 105797 -183338 -98165 166325 34913 -182605
186a82605J82596J69580k18603j08873K58516N8572k76583l962K81631m8020k71131
$$ -182605 -9 169571 -49032 -157905 100611 159183 -117400 -121362 160269 112249 -158882
197a58882R1977K37028j44718k01415J82693J48964k23702r9338K51384M9000
$$ -158882 -66905 170123 25405 -176010 6683 155647 -68055 -167393 83991 132991
207A32991k62931N581K65370m9957k38932J02888K10991j45643j67158J88354
$$ 132991 -129940 -124359 141011 91054 -147878 -44990 166001 20358 -146800 41554
217D1554J19295k21838p7084K37523K4949k47868J7331K32633o7646k11536J12358
$$ 41554 160849 -60989 -138073 99450 124399 -123469 -106138 126495 58849 -152687 -40329
228d0329J78476j50896j35845J89591R9049k09224m9829K26393Q687k22977L6578
$$ -40329 138147 -12749 -148594 40997 140046 -69178 -119007 107386 116073 -106904 -70326
239g0326K10560q3912j90327J22187J56277j65405j26264J88930Q2987k09816
$$ -70326 140234 56322 -134005 -11818 144459 -20946 -147210 41720 124707 -85109
249h5109m1738K16806j069k11050N1486K01809r0518j73830J32542J48430j59955
$$ -85109 -126847 89959 88890 -122160 -70674 131135 40617 -133213 -671 147759 -12196
260a2196j11741J82065O9274j96219k9555J95010k0306j92550N7830J73081j00937
$$ -12196 -123937 58128 127402 -68817 -98372 96638 76332 -116218 -58388 114693 13756
271A3756j49907J33151J19700j56856q0980J79382M7175j85003j062J88326l4321
$$ 13756 -136151 -3000 116700 -40156 -121136 58246 105421 -79582 -80644 107682 73361
282G3361j78561P4117J60068j10974j37655J34697J02882j62928p2042J74026
$$ 73361 -105200 -31083 128985 18011 -119644 15053 117935 -44993 -117035 56991
292E6991L1499j82456M669J81511l9669j66713P7537J52285j06348j20117J36136
$$ 56991 88490 -93966 -89297 92214 52545 -114168 -36631 115654 9306 -110811 25325
303B5325R3063j54364n7615J67434J8850j72515J4669J60797n3764j51553Q3496
$$ 25325 118388 -35976 -93591 73843 92693 -79822 -65153 95644 41880 -109673 -26177
314b6177J27296j15424j00784J37812P1649j51056l5190J62703M752j57808L4289
$$ -26177 101119 -14305 -115089 22723 94372 -56684 -91874 70829 75581 -82227 -47938
325d7938J53710o6443j35075R4893J13825j21720r1760J36707N7655j52358l0521
$$ -47938 105772 39329 -95746 -853 112972 -8748 -100508 36199 93854 -58504 -89025
336h9025J53309m960j51055L6251J43670o6812j23856R7494J06693j15483p6454
$$ -89025 64284 59324 -91731 -55480 88190 21378 -102478 -4984 101709 -13774 -90228
347i0228J34474N0274j41485j8406J42730j5687j41754M5151J24889p8024j10748
$$ -90228 44246 94520 -46965 -65371 77359 61672 -80082 -34931 89958 11934 -98814
358i8814R8723Q6799j20572o0560J33042L2855j36672J470J39948k7593j29019
$$ -98814 -91 86708 -33864 -94424 38618 71473 -65199 -63729 76219 48626 -80393
369h0393N9591J18420q2796r8863J04294P3450j21638n0578J27530J8399j35196
$$ -80393 -20802 97618 14822 -84041 20253 93703 -27935 -78513 49017 67416 -67780
380f7780N808J31524l6470j24775O2393J11979q2496q9904J02836P1237j11767
$$ -67780 -61972 69552 33082 -91693 -29300 82679 183 -89721 13115 84352 -27415
391b7415m1353J23291J5078j23811J2419J20421m1333j14513O2714R5158q6547
$$ -27415 -68768 54523 69601 -54210 -41791 78630 37297 -77216 -14502 80656 -5891
402e891p9481R8822N4013j13233k6317J19500Q22j17257K9769J15767n0249j01351
$$ -5891 -85372 13450 67463 -45770 -72087 47413 48235 -69022 -39253 76514 26265 -75086
414g5086P4343Q8374r1207o6427J03715M0292j14723j8859J16413j0742j17708
$$ -75086 -743 87631 -3576 -70003 33712 74004 -40719 -59578 56835 46093 -71615
425g1615L0507J08720n5454r5903P3894Q0431q6266n7138J02188L6628j05563
$$ -71615 -41108 67612 12158 -83745 -9851 70580 -15686 -72824 29364 65992 -39571
436c9571r650J11808j3813j07097L4828R9035n7828q7040P0990O5577q8897m8468
$$ -39571 -49221 62587 48774 -58323 -23495 75540 17712 -69328 1662 67239 -21658 -70126
448g0126R8290K1618j04147J56J07372k0946j00052M5457R2554o1008p3692Q1662
$$ -70126 28164 49782 -54365 -54209 53163 32217 -67835 -22378 70176 9168 -64524 17138
460A7138N5960r1860l5688J00408J0324j06409P660J01264l0568r7630M6631Q2810
$$ 17138 73098 -18762 -54450 45958 56282 -50127 -42467 58797 28229 -69401 -22770 60040
472F0040o5567o6176Q1267M7746q9377k5025R9204R004r7432J3983R7168l2554
$$ 60040 -5527 -71703 9564 57310 -32067 -57092 42112 51116 -46316 -32333 64835 32281
484C2281q6967M7383P3519o5149o0129P5093L7842q7501k1329R0828j269r1312
$$ 32281 -54686 -7303 66216 1067 -59062 16031 53873 -33628 -54957 35871 34602 -56710
496e6710K1467Q7786l7718p5910N9351O4461p0227m6056Q4216L0306r0856j1468
$$ -56710 -35243 52543 14825 -61085 -1734 62727 -7500 -53556 30660 60966 -29890 -41358
508d1358R1288r148r0956K4715Q0507m6842p1382N9556N5609p3811m0428Q4678
$$ -41358 49930 40782 -50174 -25459 55048 8206 -63176 -3620 51989 -21822 -62250 22428
520B2428K4604q5687n068Q9800r304q2411K9661P4568m3757o2295N6166M7940
$$ 22428 47032 -38655 -43723 46077 36773 -45638 -15977 58591 14834 -47461 8705 56645
532E6645p1767l5221P6941J6151q3478k631Q1027j6669p4888L3566O5767m5255
$$ 56645 -15122 -50343 26598 42749 -40729 -43360 37667 20998 -53890 -20324 45443 188
544A88n1725O2725L9979p0473k1011Q0116N696q1924J1280P8492l0266p5661M2375
$$ 188 -51537 11188 51167 -19306 -40317 39799 45495 -36429 -25149 53343 23077 -52584 -10209
557a0209O2724n8460n3953O8149L8145p5993k2085P9405P360p4982J1196P3968
$$ -10209 52515 -5945 -59898 8251 46396 -29597 -51682 27723 35083 -39899 -28703 45265
569D5265k3786o3751M1077N4480n2652m2650O1942K8066o9669j7307O8578j618
$$ 45265 21479 -42272 -1195 53285 633 -42017 19925 47991 -21678 -38985 29593 27975
581B7975o8919J4944O0950l0931n2928M6490M4550n6279l2017O9395K2152p0204
$$ 27975 -40944 -26000 34950 4019 -48909 -2419 42131 -14148 -46165 23230 45382 -24822
593b4822o911P2784p420o9262K1676O1484l9140n4934M9192M1449o1662l2783
$$ -24822 -31733 41051 33631 -35631 -13955 47529 8389 -46545 2647 44096 -17566 -50349
605e0349O7019J8032o9325l499P0024q889o3557K6884N8905l7098m6888M9173
$$ -50349 16670 34702 -34623 -38122 31902 23013 -40544 -13660 45245 8147 -38741 10432
617A0432L8990n6803k7354N9704J1226o2554p60N7532j6821n4364K7712M7593
$$ 10432 49422 -7381 -34735 24969 36195 -26359 -27119 30413 13592 -40772 -13060 34533
629C4533m1501l8499N1986L1136n7364j5740O3450N174o0720J0385N9486k3264
$$ 34533 -6968 -45467 6519 37655 -19709 -35449 28001 33175 -27545 -17160 42326 19062
641A9062n5137L5131M6878m8180m1028N3214K8140o0340j8628O0348M163n9280
$$ 19062 -36075 -944 45934 -2246 -43274 9940 38080 -22260 -40888 19460 23623 -35657
653c5657J0960N6280k0945m8820L5825M3860m2273l1993N0795K1121n3989r574
$$ -35657 -24697 31583 10638 -38182 -2357 41503 -770 -32763 18032 39153 -14836 -24410
665b4410N3539n209n3023J3563M6397k8254m2951L7144L4058m5339k4503N1130
$$ -24410 29129 23920 -29103 -15540 30857 2603 -40348 -3204 30854 -14485 -38988 12142
677A2142J6385n1804k489N5515o971n1020K1415M7468l1721m1522L9353L1776
$$ 12142 28527 -23277 -25766 29749 22778 -28242 -6827 40641 8920 -32602 6751 38527
689C8527m8495k5241N0507J2946n5772l238N3194q757m9487K1114M6540k8985
$$ 38527 -9968 -35209 15298 28244 -27528 -30766 22428 13671 -35816 -14702 31838 2853
701B853l7142L9429L1063m2860j8370M6976P631m7459J647M6107j4988m4382K2262
$$ 2853 -34289 5140 36203 -6657 -25027 21949 29580 -17879 -16232 29875 14887 -29495 -7233
714g233L6555l3679l1296L8416K1125m2337j0771M5781K952m5033J1368M5555
$$ -7233 29322 -4357 -35653 2763 23888 -18449 -29220 16561 19513 -25520 -14152 31403
726C1403j8654l9989K9414L5888l5869l0449M0833J9274m6577j2978M5920P37
$$ 31403 12749 -27240 2174 38062 2193 -28256 12577 31851 -14726 -27704 18216 18953
738A8953m8002P598M5372j7970m0127K7417L5628l2045k4454L8455J8182m0148
$$ 18953 -29049 -21451 23921 5951 -34176 -6759 28869 -3176 -27630 10825 29007 -11141
750a1141o741M3120k875m2480J1807L7502k3299l3609K6753K6197l6393j8490
$$ -11141 -17882 25238 22363 -20117 -8310 29192 5893 -27716 -963 25234 -11159 -29649
762b9649L8090R255m0664J835M1493p898l8822J9855L6555k3840l0516L2236K4335
$$ -29649 8441 17696 -22968 -21133 20360 12462 -26360 -6505 30050 6210 -24306 7930 32265
775C2265l6600j8205L8001Q196m2889n58L9090r041l9116J6557L4859k4344k9192
$$ 32265 -4335 -22540 15461 23657 -19232 -19790 19300 10259 -28857 -12300 22559 -1785 -30977
788c0977L1821K2821l3218j3140L8341Q233l7883K751L6958j0210l5706J7495
$$ -30977 844 23665 -9553 -22693 15648 23881 -14002 -11251 25707 15497 -20209 -2714
800b714K9226k6836k4914K9536J5317l4913q821L6041P10l6074Q041L6743j4322
$$ -2714 26512 -324 -25238 4298 19615 -15298 -24119 11922 12632 -23442 -15401 21342 7020
813G020l0534K2988K8898k7552k0255L1751J4475l5302p878L5071k265l6893P339
$$ 7020 -23514 -526 28372 820 -19435 12316 26791 -8511 -16389 18682 16417 -20476 -13137
826a3137L3176j6621l1344K1122K6197k6932j8727L1891J4738l1725m838L4015
$$ -13137 20039 3418 -27926 -6804 19393 -7539 -26266 5625 20363 -11362 -16200 17815
838A7815m0l1679R041L0276j7384k5929K0758J9850k8580j5580K9920O835l2578
$$ 17815 17775 -13904 -4863 25413 8029 -17900 2858 22708 -5872 -21452 8468 15303 -17275
851a7275j364L2442p177k9447J4440K8140j8228k2487K6341J8945k9035j0669
$$ -17275 -18639 13803 6626 -22821 -8381 19759 1531 -20956 5385 24330 -4705 -15374
863a5374L1731M640l2494m5L1214q972l1844J3050K5745k0090k2359K2425J8846
$$ -15374 16357 20997 -11497 -11542 19672 10700 -21144 -8094 17651 -2439 -24798 -2373 16473
876A6473k6404j0889K9432P018k8271K439K9363p367k5069J3213K2065j8946j8835
$$ 16473 -9931 -20820 8612 15630 -12641 -10202 19161 11794 -13275 -62 22003 3057 -15778
889a5778K2506J1634k8120p519K7343j184k8318O455K7455j3933k3162J9649K2080
$$ -15778 6728 18362 -9758 -17277 10066 8882 -19436 -12981 14474 541 -22621 -2972 19108
902A9108k1781j5478K7287J1291k7359m155K8974j936k9181O981K5807j4844k4476
$$ 19108 -2673 -18151 9136 20427 -6932 -11087 17887 15951 -13230 -6249 19558 4714 -19762
915a9762J6521J8507k1536j5555K3586J0547k4856l172K6571p52k4026Q728K3946
$$ -19762 -3241 15266 -6270 -21825 1761 12308 -12548 -15720 10851 10099 -13927 -5199 18747
928A8747j1751j9925J7131J5539k0383j2322K2208M678k5758p50K3204o030k4098
$$ 18747 6996 -12929 4202 19741 -642 -12964 9244 13922 -11836 -12586 10618 4588 -19510
941a9510J1005K1175j4829j7215K1226J4642k2890p644K6767M124k6021J438K5870
$$ -19510 -8505 12670 -2159 -19374 1852 16494 -6396 -14040 12727 16851 -9170 -7732 18138
954A8138o189k5067J0790J9356j6063j8779J8158J1123k0224q459K2112L170k1884
$$ 18138 11949 -13118 -2328 17028 965 -17814 344 11467 -8757 -17216 4896 8066 -13818
967a3818J984K4303n363k0079J2287J8204j4007j3581J7514Q902j9372o346J9507
$$ -13818 -11834 12469 7106 -12973 -686 17518 3511 -10070 7444 16346 -3026 -9372 10135
980A0135m55k3316N561J9670j0970j9718J4362J6667j7643j1684K1465J0106k1198
$$ 10135 9680 -13636 -8075 11595 625 -19093 -4731 11936 -5707 -17391 4074 14180 -7018
993g018l012K3227o25k1670O259J9961j0130j8267J2464J3562j8026j2015J8447
$$ -7018 -10030 13197 12572 -9098 -2839 17122 6992 -11275 1189 14751 -3275 -15290 3157
1006C157O575k0948l341K0734j67j9959O581J9217q651j4232J4165J1502j5220
$$ 3157 9732 -11216 -14557 6177 6010 -13949 -7368 11849 3198 -11034 3131 14633 -587
1019e87q323J8690L706k0678o54J9284m853j9985O789J5713j1628j2498J3544
$$ -587 -8910 9780 13486 -7192 -7846 11438 6585 -13400 -6611 9102 -2526 -15024 -1480
1032a480R652j5751n546K0379K527j8934L302K1120o482j8386J0560J5352j3889
$$ -1480 8172 -7579 -13125 7254 9781 -9153 -5851 15269 8787 -9599 961 16313 2424
1045B424j3799J5115Q902j8369q065J8636K948k0115P54J8109l937j5384Q881
$$ 2424 -11375 3740 12642 -5727 -13792 4844 7792 -12323 -11569 6540 2603 -12781 -3900
1058c900J5374j0545j0962J4623Q859j4653m387J6349l37j6362K146J4076q527
$$ -3900 11474 929 -10033 4590 13449 -1204 -5591 10758 10421 -5941 -3795 10281 1754
1071A754j3600R946J0052j3721r576J7523N045j7340j291J9773l55j6950M432
$$ 1754 -11846 -1900 8152 -5569 -15145 2378 7423 -9917 -11208 8565 8210 -8740 -4308
1084d308J7386p526j3549J0780J1042j3449j0203J5088M813j7731l050J6769k779
$$ -4308 13078 5552 -7997 2783 13825 376 -9827 5261 10074 -7657 -10707 6062 3283
1097C283j6083N498J4680p843j1853J1276J1028j1394o324J4868M729j5901P59
$$ 3283 -12800 -7302 7378 -465 -12318 -1042 9986 -1408 -7732 7136 11865 -4036 -3277
1110c277J3604k908j4151M931J1669j1062r280R803O960j4054m387J5215K191
$$ -3277 10327 7419 -6732 -1801 9868 -1194 -10474 -671 6289 -7765 -12152 3063 5254
1123E254j3989K246J5425m281j2812Q401J3132j0887r809J3387P289j4982o708
$$ 5254 -8735 -6489 8936 4655 -8157 244 13376 2489 -7320 6067 13356 -1626 -8334
1136h334J4459J962j5880q24J4862n209j3014P375J1556r413p538J1968O294j1387
$$ -8334 6125 8087 -7793 -8617 6245 1036 -11978 -4603 6953 -2460 -9998 1970 8264 -3123
1150c123k795J3763J262j3022L755J0417p075j0269P686P275j0722p129J1032
$$ -3123 -5918 7845 9107 -3915 -160 10257 3182 -7087 599 7874 -2848 -9977 1055
1163A055M100j3180k090J4395j437j1982N686J1979o271r625J0328R099j1189
$$ 1055 5155 -8025 -10115 4280 2843 -9139 -3453 8526 2255 -7370 2958 12057 868
1176H68p501J3116M058j3629l463J3191k396j2899K278J1825p236r653Q990P790
$$ 868 -6633 6483 10541 -3088 -6551 6640 4244 -8655 -6377 5448 -1788 -11441 -2451 5339
1190E339r258m495J1917M325j0765k41J1354j869j0054M653R064q327q055Q631
$$ 5339 -3919 -8414 3503 7828 -2937 -3178 8176 6307 -3747 906 9970 1643 -6412 2219
1204B219M316j0912m601J1484M10j2446K738J2021m001j0739P294J1430q539p615
$$ 2219 6535 -4377 -8978 2506 2916 -9530 -6792 5229 1228 -9511 -2217 9213 674 -6941
1218f941J1881N845j0917l795J1104P98j2523J51J1165m707j0758M196R055o774
$$ -6941 4940 10785 -132 -3927 7177 7975 -4548 -4397 6768 2061 -8697 -4501 4554 -2220
1232b220p922Q629N996q444k470J0405J443r199L449R210m749p990P149N878r065
$$ -2220 -10142 -1513 4483 -3961 -6431 3974 5417 -3782 -333 8877 4128 -3862 3287 9165 100
1247A00n872R212J768j0792n79Q097r16j0228M734R380n454q257R148P180q012
$$ 100 -5772 3440 5208 -5584 -6163 1934 1018 -9210 -4476 4904 -550 -8807 341 7521 -491
1262d91n028J1010M099j0690j796J0290j243j0844K071R408o867r038O084P207
$$ -491 -5519 5491 9590 -1100 -2896 7394 6151 -4693 -2622 6786 -81 -9119 -3035 4172
1276D172q115n184R251L108q140q77J1929k074q326N021P893n706n828O199L815
$$ 4172 -3943 -9127 124 3232 -4908 -5785 6144 4070 -4256 765 8658 2952 -2876 3323 7138
1291G138p978l266P650k21r745J598P958l897q476N781Q139p098n139R032N848
$$ 7138 -840 -4106 3544 3323 -6422 -4824 3134 -763 -9239 -3458 4681 -2417 -7556 1476 7324
1306G324q330k062R724J53r016J433Q859l943r685L400P710o372o935O123M594
$$ 7324 -1006 -3068 6656 6809 -2207 -774 8085 4142 -5543 -2143 5567 -805 -7740 -1617 2977
1321B977p341l185Q455J010p499K540P914k250o515O144M847n898l371O848J093
$$ 2977 -4364 -7549 906 1916 -5583 -3043 4871 2621 -3894 2250 7097 1199 -2172 4676 5769
1336E769q310m75P562k803q971L805O357n117o698P406N105o822k787R005L282
$$ 5769 -2541 -3016 4546 1743 -7228 -3423 2934 -2183 -8881 -1475 3630 -3192 -5979 3026 6308
1351F308q416j23Q436q12q271K421P119m171p346M726M480p122l856O660J799
$$ 6308 -2108 -2231 6205 5393 -2878 -457 6662 2491 -4855 -129 4351 -2771 -6627 33 1832
1366A832p063k88P921j181o122L552O645l932m251N496L790n898j328N697q02
$$ 1832 -5231 -5519 2402 1221 -4901 -1349 5296 1364 -2887 2609 6399 501 -827 4870 4068
1381D068o593P67N495l263p153M198N264n731l633O065L475p539L05P956M83p231
$$ 4068 -2525 -1758 3737 474 -6679 -2481 2783 -2948 -6581 -516 2959 -4580 -4275 3681 4164 -3067
1397c067K243P491k937o898M953M480n022n421M816L205o665l072O134N24o029
$$ -3067 -824 6667 3730 -3168 1785 6265 1243 -4178 638 3843 -2822 -5894 240 764 -5265
1412e265N38O719k023m334M505M357l529k162M701J899n909j70N850k720n998
$$ -5265 -4727 1992 -31 -4365 140 4497 968 -1194 3507 5406 -503 -673 5177 2457 -3541
1427c541J930M830n168m790N296L289o076j641O771J600o757Q13P874q37n630
$$ -3541 -1611 3219 -1949 -6739 -1443 1846 -4230 -5871 900 2500 -4257 -3444 4430 3593 -2037
1442b037K617N869l256n298L411L871m826m252N497R77o564j281O301j302n494
$$ -2037 580 6449 3193 -2105 1306 5177 351 -3901 1596 2573 -3991 -5272 1029 -273 -5767
1457e767K826M547j754l102L987L591m641k11N196k81n087J09M987k710n258K854
$$ -5767 -2941 1606 -148 -3250 737 4328 -313 -524 4672 4391 -696 -587 4400 1690 -3568 -714
1473g14L993m844l216L838J930n408j573O445K050o334J167P569j876m962L615
$$ -714 3279 -1565 -4781 -943 987 -4421 -5994 451 2501 -3833 -2666 4903 3027 -1935 1680
1488A680M671m006l800L847K900o116k599N352l10o208R33M340j126l887J851
$$ 1680 6351 2345 -1455 2392 5292 -824 -3423 1929 1619 -4589 -3656 684 -442 -4329 -2478
1503b478M092k972j574N214R91m074R23M532n72n175K222L210k150n426L048K391
$$ -2478 1614 -1358 -2932 2282 3273 -801 122 4654 4082 -1093 1129 4339 2189 -3237 -189 2202
1519B202m691j974M680J228n869m38O252j047l874K930N269k799l031M146K822
$$ 2202 -2489 -4463 217 1445 -4424 -4862 1390 343 -3531 -601 4668 1869 -1162 2984 5806
1534E806n215o80L536L32m777k499N784j584n076J260L680k536k039K107L400
$$ 5806 591 -89 3447 3779 -998 -3497 2287 703 -4373 -3113 567 -1969 -4008 -1901 1499
1549A499l126m87M308R14k939j26L806j650k757K193K723m077l412M662N47n142
$$ 1499 -1627 -2114 2194 3108 169 43 3849 2199 -558 1635 4358 281 -3131 1531 2078 -3064
1565c064j597N007k67n071J856M891j707l310L114M268k907k012M140K302m985
$$ -3064 -4661 346 79 -4992 -3136 1755 48 -3262 -148 4120 1213 -799 3341 5643 658
1580F58j923M088K08m841J01L253k137m518K955K185k806j549L542K338l099M92
$$ 658 -1265 2823 3031 -1810 -1709 1544 -593 -5111 -2156 29 -2777 -4326 -784 1554 -1545 -1053
1596a053L574l5k658J249L465j923l704K860J690l526j941J907J400n289R6M003
$$ -1053 2521 2486 -172 1077 4542 2619 -1085 1775 3465 -61 -2002 -95 1305 -3984 -3888 115
1612A15o38l742K443M764l491k319L524L782l413j177L321J517m268q42K895p75
$$ 115 -523 -4265 -1822 2942 -549 -2868 656 4438 1025 -152 3169 4686 418 -424 2471 1696
1628A696m358J219K829k277l064J844L164l836j65L285j90j874J383L238j187
$$ 1696 -2662 -1443 1386 -891 -3955 -2111 1053 -2783 -2948 337 147 -1727 -344 2894 1707
1643A707j619J692K266k353k386L293k86l596o01L130j451l371L88M059j552l842
$$ 1707 88 1780 4046 1693 -693 2600 2314 -1282 -1883 1247 -204 -3575 -3187 872 -680 -4522
1659d522L694J440o32k206L314K227l067k05L343j87l204J18K339q02l173r2K871
$$ -4522 -828 612 -20 -2226 1088 3315 248 43 3386 3199 -5 113 2452 1650 -1523 -1615 1256
1676A256k977k071K499J451k638K40K738ok242J351K691j00k731K160K566l541
$$ 1256 -1721 -3792 -1293 158 -2480 -2240 498 492 -1750 -399 2292 2192 -539 1621 4187 646
$$ [...]
8191b93
##END NTUPLES=NMR FID
##END=
