##TITLE=1H_PATFAA
 CDCl3
 8 sc, 
 19.4.2023
##JCAMPDX= 6.0         $$ Bruker NMR JCAMP-DX V2.0
##DATA TYPE= NMR FID
##DATA CLASS= NTUPLES
##ORIGIN= UXNMR, Bruker Analytische Messtechnik GmbH
##OWNER= root
$$ XWIN-NMR		Version 3.5
$$ Wed Apr 19 13:40:48 2023 Russian Standard Time (UT+4h)  she@DPX200
##.OBSERVE FREQUENCY= 200.13135
##.OBSERVE NUCLEUS= ^1H
##.DELAY= (6, 6)
##.ACQUISITION MODE= SIMULTANEOUS
##.ACQUISITION SCHEME= undefined
##.AVERAGES= 8
##.DIGITISER RES= 18
##SPECTROMETER/DATA SYSTEM= spect
##.PULSE SEQUENCE= zg30
##.SOLVENT NAME= CDCl3
##.SHIFT REFERENCE= (INTERNAL, CDCl3, 0, 15.7039)
##AUDIT TRAIL= $$ (NUMBER, WHEN, WHO, WHERE, WHAT)
$$ ##TITLE= Audit trail, XWIN-NMR		Version 3.5
$$ ##JCAMPDX= 5.01
$$ ##ORIGIN= Bruker BioSpin GmbH
$$ ##OWNER= she
$$ F:/spectra/data/she/nmr/H-F/1/audita.txt
$$ ##AUDIT TRAIL=  $$ (NUMBER, WHEN, WHO, WHERE, WHAT)
(   1,<2023-04-19 13:39:33.01 +0400>,<she>,<DPX200>,
      <created by zg, POWCHK disabled, PULCHK disabled
       configuration hash MD5:
       00 E9 B6 7A A2 85 ED C7 34 08 36 98 17 FE 4E 26
       data hash MD5: 16K
       82 D3 8F D6 88 A4 E3 9F 87 E3 A7 57 7A 1E D2 C0>)
$$ ##END=
$$ 
$$ hash MD5
$$ D1 B6 79 76 67 2B C9 31 38 C0 DA 20 67 7D F9 DE
##$RELAX= 
##$RELAX= 
##$RELAX= 
##$RELAX= 
##$RELAX= 
##$RELAX= 
$$ Bruker specific parameters
$$ --------------------------
##$DU= <F:/spectra>
##$EXPNO= 1
##$NAME= <H-F>
##$PROCNO= 1
##$TYPE= <nmr>
##$USER= <she>
##$AMP= (0..31)
100 100 100 100 100 100 100 100 100 100 100 100 100 100 100 100 100 100 
100 100 100 100 100 100 100 100 100 100 100 100 100 100 
##$AQSEQ= 0
##$AQ_mod= 1
##$AUNM= <au_zg>
##$AUTOPOS= <>
##$BF1= 200.13
##$BF2= 200.13
##$BF3= 200.13
##$BF4= 200.13
##$BF5= 200.13
##$BF6= 200.13
##$BF7= 200.13
##$BF8= 200.13
##$BYTORDA= 1
##$CFDGTYP= 0
##$CFRGTYP= 5
##$CHEMSTR= <none>
##$CNST= (0..31)
1 1 145 1 1 1 1 1 1 1 1 1 1 1 1 1 1 1 1 1 1 1 1 1 1 1 1 1 1 1 1 1 
##$CPDPRG= <>
##$CPDPRG1= <>
##$CPDPRG2= <>
##$CPDPRG3= <>
##$CPDPRG4= <mlev>
##$CPDPRG5= <mlev>
##$CPDPRG6= <mlev>
##$CPDPRG7= <mlev>
##$CPDPRG8= <mlev>
##$CPDPRGB= <>
##$CPDPRGT= <>
##$D= (0..31)
0 1.2 0 0 0 0 0 0 0 0.06 0 0.03 0 0 0 0 0.0002 0 0 0 0 0 0 0 0 0 0 0 0 
0 0 0 
##$DATE= 1681897172
##$DBL= (0..7)
120 120 120 120 120 120 120 120 
##$DBP= (0..7)
150 150 150 150 150 150 150 150 
##$DBP07= 0
##$DBPNAM0= <>
##$DBPNAM1= <>
##$DBPNAM2= <>
##$DBPNAM3= <>
##$DBPNAM4= <>
##$DBPNAM5= <>
##$DBPNAM6= <>
##$DBPNAM7= <>
##$DBPOAL= (0..7)
0.5 0.5 0.5 0.5 0.5 0.5 0.5 0.5 
##$DBPOFFS= (0..7)
0 0 0 0 0 0 0 0 
##$DE= 6
##$DECBNUC= <off>
##$DECIM= 32
##$DECNUC= <off>
##$DECSTAT= 4
##$DIGMOD= 1
##$DIGTYP= 9
##$DL= (0..7)
0 120 120 120 120 120 120 120 
##$DP= (0..7)
150 150 150 150 150 150 150 150 
##$DP07= 0
##$DPNAME0= <>
##$DPNAME1= <>
##$DPNAME2= <>
##$DPNAME3= <>
##$DPNAME4= <>
##$DPNAME5= <>
##$DPNAME6= <>
##$DPNAME7= <>
##$DPOAL= (0..7)
0.5 0.5 0.5 0.5 0.5 0.5 0.5 0.5 
##$DPOFFS= (0..7)
0 0 0 0 0 0 0 0 
##$DQDMODE= 0
##$DR= 18
##$DS= 0
##$DSLIST= <SSSSSSSSSSSSSSS>
$$ [...]
##$SUBNAM2= <"">
##$SUBNAM3= <"">
##$SUBNAM4= <"">
##$SUBNAM5= <"">
##$SUBNAM6= <"">
##$SUBNAM7= <"">
##$SUBNAM8= <"">
##$SUBNAM9= <"">
##$SW= 18.05172834244
##$SWIBOX= (0..15)
0 0 2 0 0 0 0 0 0 0 0 0 0 0 0 0 
##$SW_h= 3612.71676300578
##$TD= 16384
##$TD0= 1
##$TE= 0
##$TE2= 300
##$TE3= 300
##$TEG= 300
##$TL= (0..7)
0 120 120 120 120 120 120 120 
##$TP= (0..7)
150 150 150 150 150 150 150 150 
##$TP07= 0
##$TPNAME0= <>
##$TPNAME1= <>
##$TPNAME2= <>
##$TPNAME3= <>
##$TPNAME4= <>
##$TPNAME5= <>
##$TPNAME6= <>
##$TPNAME7= <>
##$TPOAL= (0..7)
0.5 0.5 0.5 0.5 0.5 0.5 0.5 0.5 
##$TPOFFS= (0..7)
0 0 0 0 0 0 0 0 
##$TUNHIN= 0
##$TUNHOUT= 0
##$TUNXOUT= 0
##$USERA1= <user>
##$USERA2= <user>
##$USERA3= <user>
##$USERA4= <user>
##$USERA5= <user>
##$V9= 5
##$VALIST= <valist>
##$VCLIST= <CCCCCCCCCCCCCCC>
##$VD= 0
##$VDLIST= <DDDDDDDDDDDDDDD>
##$VPLIST= <PPPPPPPPPPPPPPP>
##$VTLIST= <TTTTTTTTTTTTTTT>
##$WBST= 1024
##$WBSW= 4
##$XGAIN= (0..3)
0 0 0 0 
##$XL= 0
##$YL= 0
##$YMAX_a= 306186
##$YMIN_a= -520911
##$ZGOPTNS= <>
##$ZL1= 120
##$ZL2= 120
##$ZL3= 120
##$ZL4= 120
##$ABSF1= 10
##$ABSF2= 0
##$ABSG= 5
##$ABSL= 3
##$ALPHA= 0
##$AQORDER= 0
##$ASSFAC= 0
##$ASSFACI= 0
##$ASSFACX= 0
##$ASSWID= 0
##$AUNMP= <proc_1d>
##$AZFE= 0.1
##$AZFW= 0.1
##$BCFW= 1
##$BC_mod= 2
##$BYTORDP= 1
##$COROFFS= 0
##$CY= 11.3945322036743
##$DATMOD= 1
##$DC= 2
##$DFILT= <>
##$DTYPP= 0
##$F1P= 15.7292609196834
##$F2P= 12.9074282941183
##$FCOR= 0.5
##$FTSIZE= 0
##$FT_mod= 4
##$GAMMA= 1
##$GB= 0.15
##$INTBC= 1
##$INTSCL= 1
##$ISEN= 128
##$LB= 0.24
##$LEV0= 0
##$LPBIN= 0
##$MAXI= 10000
##$MC2= 0
##$MEAN= 0
##$ME_mod= 0
##$MI= 1.114404
##$NCOEF= 0
##$NC_proc= 0
##$NLEV= 6
##$NOISF1= 3.799351
##$NOISF2= 2.8
##$NSP= 1
##$NTH_PI= 0
##$NZP= 0
##$OFFSET= 15.70392
##$PC= 1
##$PHC0= -19827.83
##$PHC1= 7.80081
##$PH_mod= 1
##$PKNL= yes
##$PPARMOD= 0
##$PSCAL= 0
##$PSIGN= 0
##$REVERSE= no
##$SF= 200.130013532006
##$SI= 16384
##$SIGF1= 3
##$SIGF2= 2
##$SINO= 400
##$SIOLD= 16384
##$SREGLST= <1H.CDCl3>
##$SSB= 0
##$STSI= 0
##$STSR= 0
##$SW_p= 3612.71676300578
##$SYMM= 0
##$S_DEV= 0
##$TDeff= 0
##$TDoff= 0
##$TI= <>
##$TILT= no
##$TM1= 0
##$TM2= 0
##$TOPLEV= 0
##$USERP1= <user>
##$USERP2= <user>
##$USERP3= <user>
##$USERP4= <user>
##$USERP5= <user>
##$WDW= 1
##$XDIM= 8192
##$YMAX_p= 0
##$YMIN_p= 0
$$ End of Bruker specific parameters
$$ ---------------------------------
##NTUPLES= NMR FID
##VAR_NAME=  TIME,          FID/REAL,        FID/IMAG
##SYMBOL=    X,             R,               I
##VAR_TYPE=  INDEPENDENT,   DEPENDENT,       DEPENDENT
##VAR_FORM=  AFFN,          ASDF,            ASDF
##VAR_DIM=   8192,          8192,            8192
##UNITS=     SECONDS,       ARBITRARY UNITS, ARBITRARY UNITS
##FACTOR=    0.0002768,     1,               1
##FIRST=     0,             0,               0
##LAST=      2.2672688,     0,               0
##MIN=       0,             -520911,         0
##MAX=       2.2672688,     306186,          0
$$ Real data points
##PAGE= N=1
##DATA TABLE= (X++(R..R)), XYDATA
0 0 0 0 0 0 0 0 0 0 0 0 -8 8 -8 16 -16 24 -31 32 -40 48 -64 72 -86 101 -120 137 -161 185 -214 246 -281 321
32 321 -363 411 -465 523 -587 656 -735 822 -912 1016 -1125 1247 -1379 1523 -1680 1854 -2041
49 -2041 2250 -2478 2728 -3009 3321 -3671 4062 -4512 5025 -5624 6328 -7175 8216 -9527
63 -9527 11238 -13578 16978 -22396 32379 -56812 244648 105942 -520911 -77109 306186
74 306186 45043 -165824 121092 55099 -218420 -51149 202750 -76798 -194607 169185
84 169185 209616 -241663 -227521 190604 167148 -130442 -26758 112773 -87621 -144634 117376
95 117376 141629 -53001 -37342 25518 -97860 -48715 181223 113649 -137959 -87024 60145
106 60145 -15713 -27273 118159 38752 -137173 -18634 95124 -84303 -89750 184219 122062
117 122062 -214101 -136801 154448 48785 -115005 81348 128408 -171252 -161789 170462 129104
128 129104 -131925 -12406 147814 -87038 -186912 124923 200322 -92546 -120000 84590
138 84590 7186 -125304 54563 153129 -57932 -118294 51070 27282 -90066 34340 132830
149 132830 -36159 -116519 20472 33751 -45487 45675 95167 -74234 -114377 59446 63278
160 63278 -60471 20883 97740 -74754 -127171 85874 108886 -81263 -33778 108836 -39399
171 -39399 -152810 70568 163966 -70835 -112951 88488 34980 -137598 14323 175352 -23524
182 -23524 -154892 36513 87990 -86839 -36256 138967 19224 -148358 -12068 102520
192 102520 -28353 -52160 87421 33091 -114991 -27036 94002 1604 -48942 51452 23117
203 23117 -92458 -17366 90000 3862 -52420 38033 17498 -85971 -4476 104079 -2393
214 -2393 -78773 31283 37242 -82372 -14338 117796 4043 -114571 16052 80719 -62101
225 -62101 -51375 108798 37848 -124043 -19280 107052 -20667 -81324 72978 68441 -104768
236 -104768 -55395 104776 25143 -86541 24333 74029 -68441 -67655 84436 49039 -76717
247 -76717 -9627 65079 -39105 -63606 66315 55713 -67724 -26535 57625 -19620 -55740
258 -55740 56147 54936 -65137 -34780 59953 -5461 -55748 47842 57292 -68253 -44543 71279
270 71279 12638 -69360 28942 70085 -59731 -63643 72817 39046 -77731 -2443 80199 -34493
282 -34493 -80876 56416 66158 -68202 -36008 74530 -1663 -80474 31181 77219 -47532
293 -47532 -55261 58733 21890 -69064 10792 75387 -30170 -63441 43693 36286 -56482 -4089
305 -4089 67548 -19882 -66015 34859 46346 -49397 -18524 61246 -8748 -66464 27124 54237
317 54237 -44120 -31151 58466 4099 -68482 18900 65354 -37250 -47232 55254 23431 -69078
329 -69078 1405 74443 -21305 -64009 41335 43837 -59346 -20128 71296 -1910 -70467 22128
341 22128 56638 -43823 -37404 59623 15597 -66941 4311 59875 -27094 -45507 47322 26964
353 26964 -61391 -8161 63159 -11783 -52876 33912 37849 -51196 -19180 60766 1074 -56392
365 -56392 20562 45066 -40601 -28892 55159 11397 -58319 8738 50612 -31877 -39686 49051
377 49051 23519 -58440 -5376 55825 -18802 -48763 40002 36788 -54674 -21401 58399 1024
389 1024 -53412 23306 45494 -41892 -31953 53405 15622 -53861 7428 50112 -28335 -40519
401 -40519 44045 27051 -49848 -6657 49286 -16884 -45673 34927 35880 -46286 -21265 47582
413 47582 -2458 -47851 22800 42209 -38017 -31552 43257 11306 -44023 13111 43643 -31277
425 -31277 -36138 43659 22916 -46539 -211 49579 -19036 -45848 33542 34859 -41390 -14367
437 -14367 47116 -8727 -51484 24292 46121 -35802 -32254 41635 8952 -49322 9558 50394
449 50394 -22377 -41344 30701 21448 -39404 1053 48075 -15771 -46345 26316 34671 -34097
461 -34097 -14175 43286 -2390 -45760 14414 37266 -25189 -19948 36740 1723 -46059 9231
473 9231 42509 -19921 -28101 31910 9501 -45281 4395 50223 -12152 -39278 23625 21142 -37884
486 -37884 -2549 50668 -8684 -50365 18883 37908 -33564 -23254 46643 10897 -51419 -1642
498 -1642 40233 -15923 -26416 35204 14651 -48915 -7909 48060 -1708 -34780 20768 24172
510 24172 -35660 -15101 42463 8125 -33228 9470 22423 -28752 -15580 40091 9946 -38128
522 -38128 530 25672 -21324 -19058 35762 11961 -40983 -4611 31216 -15074 -23056 34983
534 34983 18765 -44632 -12342 42355 -1697 -32322 26162 30841 -40002 -25724 44386 17025
546 17025 -35738 6481 32789 -28327 -32939 37954 27958 -36700 -13222 30009 -11921 -32970
558 -32970 25420 30730 -30060 -22305 25237 236 -27296 17735 30473 -23761 -24522 22758 8399
571 8399 -21193 14339 28236 -22956 -26717 24156 14818 -20630 8504 25786 -24909 -29909 29073
584 29073 23062 -28006 -4553 29596 -17452 -37220 26409 34884 -29253 -22102 30173 -358 -39561
597 -39561 14395 43575 -19019 -35308 21854 15307 -30434 3815 43074 -9018 -41930 11768
609 11768 28472 -16209 -7554 29863 -2829 -36083 6272 29027 -10993 -13572 21332 215
621 215 -32543 2228 28489 -6316 -15220 15245 -653 -29152 6606 33474 -7538 -23190 14067
634 14067 6620 -26955 4999 37347 -8366 -33982 13432 20124 -25189 -6809 39145 2140
646 2140 -41596 2174 31293 -13026 -17498 29551 10192 -39819 -7678 35891 -822 -25079
658 -25079 15825 16072 -30808 -14267 33085 9713 -24812 3650 15266 -20746 -12339 30154 11147
671 11147 -26503 -3009 17769 -12095 -12882 24347 11624 -25067 -5688 18332 -8208 -12709 23451
684 23451 12363 -28756 -9353 24658 -2273 -18052 18598 16441 -29640 -15459 29955 8165
696 8165 -24218 7083 21252 -22695 -21458 28181 17111 -26654 -6055 22801 -10346 -23601
708 -23601 20405 22356 -21783 -13101 20722 -1332 -21324 14738 23893 -18329 -18954 18106 6768
721 6768 -18126 7598 21311 -15499 -20284 17006 11605 -17433 1466 20378 -12013 -22343 14943
734 14943 16238 -16062 -4649 18310 -8199 -21952 15330 20668 -17787 -11751 20568 117 -24348
747 -24348 9359 25933 -13077 -19455 16432 8212 -20956 2697 25138 -9283 -23594 13112
759 13112 15398 -17908 -5464 22672 -2670 -23851 7403 17966 -13639 -9337 19538 803
771 803 -23823 4770 22293 -9373 -14706 15716 6667 -21222 148 23347 -4642 -18377 10729
784 10729 10564 -16956 -2776 21851 -3057 -21161 8481 15798 -15274 -9250 19818 2700 -21073
797 -21073 3316 17492 -11656 -12406 18484 7235 -22975 -2412 21732 -3924 -16853 11662
809 11662 11137 -17312 -4883 20342 -667 -18154 8128 14601 -14473 -9459 18898 4088 -19355
822 -19355 2656 16557 -10160 -12767 15524 7482 -18627 -1893 17672 -6052 -15654 12526 11639
835 11639 -16289 -6751 17005 -529 -15055 8548 12431 -14344 -8028 18167 2808 -17996 4332
848 4332 16253 -10888 -12635 16055 7394 -18349 -888 17994 -6432 -16125 12001 11972 -16272
861 -16272 -6641 17179 -838 -17096 7030 14749 -12194 -10365 15289 4101 -15902 2903 15619
874 15619 -8637 -12737 12969 8145 -14831 -1645 15301 -4300 -14188 9099 10481 -12190 -5082
887 -5082 13623 -1552 -13830 6882 11219 -11574 -7340 13681 1233 -14557 4971 13902 -10091
900 -10091 -10382 13710 5154 -15945 1335 17265 -6315 -14978 11036 10693 -14510 -4560 17132
913 17132 -1064 -17781 5760 14596 -10084 -9634 13649 3628 -16208 1623 15419 -6429 -12573
926 -12573 10369 7586 -13613 -3042 13997 -1428 -12087 6124 7765 -10563 -3604 13379 401
939 401 -12227 3926 8831 -7780 -3725 12144 5 -12666 4134 10608 -8883 -6516 13370
952 13370 2472 -16157 802 14490 -6137 -11599 11723 7453 -17065 -5317 17490 655
964 655 -15410 5053 12061 -11841 -9279 15564 6704 -14850 -1035 13181 -5235 -11005 11301
977 11301 10229 -12052 -5983 10891 277 -9528 6348 9061 -9180 -7521 7808 1839 -7002
990 -7002 4307 6299 -8730 -6887 7889 2266 -6405 4164 5205 -10741 -5707 12751 3788 -11163
1004 -11163 2708 10424 -9388 -10169 14127 9791 -13413 -3699 13340 -4019 -14466 10733 15602
1017 15602 -12266 -12864 11862 5211 -13247 2155 16155 -6378 -16463 6416 11017 -8284 -3701
1030 -3701 11550 -1955 -15084 1929 12820 -2304 -6444 4920 426 -8671 1381 9661 -429
1043 -429 -3724 2506 -2092 -6462 5078 9031 -3359 -4356 4050 -2902 -7598 8311 11569 -9151
1057 -9151 -10449 8181 2769 -12114 3029 16144 -6487 -18452 5264 12644 -8611 -5287 14466
1070 14466 710 -19091 593 17920 -1509 -10987 8013 7116 -13650 -5320 16931 6231 -11507
1083 -11507 -1263 6755 -5739 -5085 10757 6992 -9119 -6040 3431 -898 -1539 6022 2211 -7469
1097 -7469 -3840 1500 -1080 2440 7280 -2684 -10021 1601 6858 -3326 -570 11180 -302 -15097
1111 -15097 281 14671 -1238 -8786 8266 5634 -15718 -6459 17582 6151 -14538 -1556
1123 -1556 9707 -8165 -10516 13307 11472 -13396 -9769 9600 1974 -9435 5680 12126 -7159
1136 -7159 -12301 5163 7650 -3185 597 6428 -3799 -8784 2481 6717 555 142 626 -5037
1150 -5037 -4023 4052 3234 -965 2704 -326 -9724 -2805 11172 4068 -8543 74 6206 -7421
1164 -7421 -7186 12509 9710 -11621 -6768 9761 -336 -10919 7256 14664 -8654 -14840 7285
1177 7285 8914 -8074 -1179 11649 -3004 -15428 2311 12936 -2300 -6376 5744 1242 -10467
1190 -10467 -841 11420 2069 -6835 -426 1544 -4093 -97 6694 1456 -3696 -815 -1634 -2612 4416
1205 4416 6374 -2663 -4635 1609 -1158 -4349 5906 8784 -6912 -10020 5174 5509 -6796 -262
1219 -262 10802 -2768 -13820 2770 11565 -3843 -6422 8063 2734 -12507 -1895 13677 1554
1232 1554 -10008 2323 6113 -7190 -4672 10629 5241 -8540 -2960 5080 -1878 -4155 6204
1245 6204 4736 -6676 -4807 3007 880 -1274 3657 1513 -5454 -2319 3169 173 -291 4184 -736
1260 -736 -7071 263 6783 -1282 -3710 5418 2224 -8731 -1758 9816 1260 -7646 2385 5566
1274 5566 -7122 -5216 9787 4834 -9662 -2972 7556 -1756 -7133 5903 7268 -7369 -6431 6248
1288 6248 2456 -5630 2317 6489 -4847 -6954 4799 5040 -4164 -968 4802 -1654 -5329 2679 4337
1303 4337 -2435 -1113 2621 -2105 -4099 3565 3889 -3526 -1514 3039 -2165 -3826 4777 3995 -5439
1318 -5439 -2801 5086 -493 -5610 3423 6369 -5148 -5685 5490 3181 -6049 214 7322 -2359 -7321
1333 -7321 3829 5437 -4456 -2358 6250 -152 -7505 1605 6715 -2822 -4624 3832 1314 -5552 21
1348 21 5964 -1307 -5036 2016 2571 -4051 -692 4738 -513 -4308 1724 2562 -3114 -389 4830 -919
1364 -919 -4723 1990 3284 -3406 -1111 5458 -363 -6025 1894 5554 -2900 -3649 4584 1644 -6391
1379 -6391 -386 6513 -1432 -5643 2991 3820 -5130 -2425 5874 993 -5610 1035 4494 -3337 -3241 5321
1395 5321 2238 -5472 -630 4760 -1279 -3282 3708 2792 -4831 -1870 4673 333 -3713 1536 2366
1410 2366 -3481 -1577 3823 125 -3526 1809 2779 -3781 -2102 4510 1003 -4163 945 3632 -3253
1425 -3253 -2947 5067 2274 -5253 -592 4847 -1482 -4385 3783 3920 -4610 -2726 4336 283 -4119
1440 -4119 2081 4088 -4020 -3665 4214 1967 -4122 501 4374 -2311 -4408 3295 3343 -3528 -1048 3723
1456 3723 -778 -3891 2253 3557 -2492 -1682 2843 -376 -3309 1970 3645 -2264 -2263 2289 -59 -3188
1472 -3188 2279 4024 -3298 -3583 3317 1866 -4023 317 4771 -2096 -4587 2693 3579 -3251 -1147
1487 -1147 4508 -695 -5034 1571 4785 -1847 -2236 3457 611 -5057 464 5228 -780 -3906 1513
1502 1513 1506 -3612 -605 4638 -353 -4384 396 2208 -2163 -1238 3729 53 -3912 58 2253 -1101
1518 -1101 -364 3211 -177 -3669 540 3113 -949 -803 3359 -130 -5101 361 4694 -677 -3312
1533 -3312 2189 1129 -4750 -866 5518 490 -4674 474 2692 -3306 -2076 4947 2011 -4919 -1584
1548 -1584 3245 -953 -2090 3934 3023 -4198 -2729 3530 1206 -1691 1935 2392 -3234 -2981 2606 2091
1564 2091 -1124 175 527 -2531 -1819 2467 1515 -1389 254 282 -3076 -1167 3887 1594 -2802 1
1580 1 1589 -2707 -1467 5120 2917 -4566 -2020 3290 -481 -2627 3871 3958 -4472 -4363 3451 2234
1596 2234 -2915 938 3649 -3093 -5265 2266 4345 -1981 -1546 2275 -1398 -4525 1264 4776 -387
1611 -387 -2853 489 135 -2122 943 3583 381 -2115 -637 -486 -340 2612 2314 -1481 -2256 286
1627 286 -471 -723 3137 2521 -3573 -3526 2002 1488 -2324 1429 3754 -3199 -5360 2187 4260 -1820 -1314
1644 -1314 3374 -712 -5622 1079 6014 -124 -3698 1350 1307 -3759 -315 6007 1718 -4671 -1486
1659 -1486 2254 -726 -920 3170 1545 -3820 -2626 1507 1099 129 969 35 -2413 -1510 754 1155 1296
1676 1296 977 -1928 -2875 893 2435 -36 117 1993 -1880 -4486 1170 5195 0 -2997 1422 724
1692 724 -4063 -487 5748 1210 -5144 -1118 2724 -2014 -2305 4348 2800 -4771 -3243 2992 1370
1707 1370 -1917 1761 2837 -3149 -4113 2391 3512 -794 -680 1151 -1291 -2546 944 3175 408
1722 408 -1266 -944 -1262 -312 1912 1092 -433 -348 -1181 -2291 447 3794 844 -2872 -522 1206 -1975
1739 -1975 -980 4165 1990 -4340 -2585 2960 504 -2245 2386 3348 -3631 -4076 2813 3296 -1867 -488
1755 -488 2994 -1546 -4488 1423 4637 -790 -2753 964 206 -2794 239 3919 497 -3363 -904
1770 -904 575 -333 156 1891 339 -1823 -1217 -12 714 1847 1158 -1640 -1319 729 12 -322 1994
1787 1994 1838 -2875 -2885 1949 1863 -1657 247 2486 -1610 -4016 1293 3777 -1210 -2119 1864 169
1803 169 -3715 -209 4580 309 -3704 275 1942 -1656 -886 3396 1296 -3219 -1091 2250 308
1818 308 -1042 1579 1285 -2098 -1987 1281 1501 -7 119 -302 -1423 -592 1081 312 74 457 -1094
1835 -1094 -1886 560 2047 -399 -800 1177 -5 -2451 302 3446 228 -2712 516 1888 -1894
1850 -1894 -900 3345 1377 -3267 -1080 2469 -162 -1684 1849 1921 -2706 -2068 2156 1023 -1753 452
1866 452 1700 -1536 -2360 1441 2297 -926 -764 734 -376 -1107 1213 1546 -475 -660 33 -211 -208 1359
1884 1359 674 -1006 -209 304 -844 -435 1712 408 -2149 -752 1655 -184 -1711 1410 1791 -1998
1900 -1998 -1658 1930 890 -1501 307 1963 -1271 -2179 1776 2123 -1313 -904 1719 86 -2140 655
1916 655 2194 -763 -1600 943 719 -1650 -136 1582 -56 -1702 -160 875 -453 -348 761 -124
1932 -124 -958 235 386 -379 583 1103 -627 -1205 993 704 -907 141 1441 -647 -1649 1015 1654
1949 1654 -1184 -924 1425 353 -2128 85 2097 -547 -1963 813 844 -1530 -509 2013 -20 -2116
1965 -2116 197 1448 -940 -980 1521 586 -1776 -454 1592 -34 -1015 886 941 -1134 -621 1219 298
1982 298 -633 170 327 -810 -162 788 4 -668 534 286 -1052 138 1320 -373 -1377 506 814
1999 814 -1350 -598 1728 472 -1787 -127 1583 -412 -1086 1382 1162 -1616 -508 1514 21 -1429
2015 -1429 970 1207 -1092 -1179 1364 600 -1356 84 1289 -747 -1324 951 1122 -872 -610 943 44
2032 44 -1068 219 892 -365 -531 306 87 -294 635 620 -822 -273 712 -305 -786 828 739 -918 -708
2051 -708 1014 130 -1231 513 1111 -1154 -1528 1143 1014 -1148 -477 1278 -368 -1511 496 1625
2067 1625 -845 -828 1068 542 -1483 -114 1667 -275 -1381 481 891 -922 -431 1279 437 -1265
2083 -1265 -308 750 -76 -361 490 -188 -887 -11 590 -154 152 444 -453 -867 628 620 -489 22 1041
2102 1041 -502 -1264 618 1498 -531 -935 810 188 -1316 27 1862 -29 -1482 369 820 -917
2118 -917 -556 1744 334 -1873 -487 1440 -90 -969 924 1021 -1465 -920 1238 1005 -900 53 699
2135 699 -572 -868 435 895 8 -403 -355 -259 126 534 218 -159 -71 -414 -1010 397 1099 -228 -1243
2154 -1243 274 369 -969 -2 1724 263 -1909 -37 1314 -137 -867 1279 929 -1830 -1128 1710
2170 1710 918 -1196 365 1200 -974 -1651 1097 1496 -802 -1039 875 15 -1335 220 1532 114
2186 114 -1449 -365 464 -73 291 521 -14 -739 -545 198 669 716 -57 -779 16 446 -483 50 1235
2205 1235 434 -1580 -472 1348 343 -711 231 1047 -1255 -1500 1344 1256 -938 -863 964 -241 -1646
2222 -1646 595 1681 -430 -1606 463 807 -1070 -166 1566 289 -1665 -376 1356 341 -635 620
2238 620 633 -1168 -705 663 604 -39 -414 80 -349 13 54 304 536 -62 -1047 -441 1099 598 -452 -21
2258 -21 501 -663 -1181 1011 1505 -496 -1073 556 379 -1114 330 1684 126 -1565 -116 1361 -447
2275 -447 -623 1241 882 -1817 -699 1449 560 -1035 260 876 -1033 -1284 956 1157 -728 -632 443
2292 443 -86 -554 269 828 195 -586 -398 202 233 307 45 -194 144 -263 -480 459 966 -519 -1139 286
2312 286 661 -513 -154 1081 240 -1307 -374 1156 399 -716 527 893 -1161 -986 1423 952 -830
2329 -830 -320 769 -371 -1066 628 1259 -501 -1131 416 418 -786 -207 790 92 -882 -687 585 -69
2347 -69 -215 180 61 -359 -437 79 337 412 -74 -507 45 409 -169 -247 430 434 -611 -642 1018 746 -612
2368 -612 -307 631 -307 -927 605 947 -631 -719 631 160 -1125 76 1181 -110 -1187 223 540
2385 540 -507 -457 809 381 -778 -345 764 135 -490 155 141 -490 -128 286 279 -289 -142 -205 -174 92 35
2406 35 -162 -343 222 -228 -367 236 360 -94 -202 412 153 -512 92 729 -296 -899 32 639 -295 -207
2426 -207 870 256 -826 -263 717 -5 -495 297 142 -539 -447 561 186 -441 96 481 -325 -651 557
2445 557 435 -255 -309 178 -156 -382 77 309 -288 -158 267 51 -69 255 175 -246 -3 422 -220 -190 362
2466 362 211 -478 -73 577 71 -459 2 352 -618 -462 338 185 -471 -16 358 -246 -414 399 571 -476
2486 -476 -104 495 -24 -297 263 564 -475 -319 372 242 -172 71 399 -81 -357 76 145 -107 148 265
2506 265 -200 -432 188 312 -170 124 223 -180 -468 351 292 -367 -22 397 -175 -305 192 448 -88 -320 489
2527 489 137 -501 -74 491 -127 -256 308 131 -447 -135 447 2 -752 -155 634 -62 -216 407 -49 -535
2547 -535 -93 420 -84 -248 -132 192 -131 -166 572 317 52 49 75 -155 161 422 2 -256 252 55 -479
2568 -479 18 752 77 -732 -24 347 -390 -191 549 -24 -637 103 296 14 -146 341 191 -451 -152 379
2588 379 173 -128 215 277 -342 -354 468 177 -193 -115 253 -305 -455 325 560 -210 -244 54 9 -15 295 442
2610 442 -158 -295 -223 110 -34 277 104 -385 -92 195 -206 90 534 126 -456 -186 376 198 -243 194
2630 194 337 -361 -463 360 659 -570 -254 266 -429 -462 456 525 -251 -340 324 -29 -350 311 767 -144 -605
2651 -605 132 450 43 -7 475 281 -702 -161 349 395 4 -1 -150 -380 -49 121 248 203 -108 -613 -282 456
2673 456 190 -145 34 165 -590 -572 738 491 -315 -358 196 -93 -293 513 917 -203 -918 143 507 -209
2693 -209 -87 653 37 -751 -350 771 272 -96 244 205 -554 -461 639 505 -333 -612 -178 -175 -22 120 595
2714 595 -32 -531 -379 232 338 388 -131 -200 -377 -634 -54 629 600 -386 -612 -133 -67 -208 161 575 -324
2735 -324 -1234 4 519 -107 -121 476 87 -923 -208 690 498 -471 -64 169 -580 -580 657 965 -528 -753
2755 -753 157 385 -338 139 677 -137 -751 -384 292 261 149 -98 32 -333 -521 184 817 309 -288 -445
2775 -445 -128 -21 -21 455 598 -237 -787 -276 724 474 -230 335 77 -574 -289 873 766 -326 -363 91
2795 91 -108 -502 613 911 -487 -769 -38 260 -334 65 562 -126 -886 -224 489 429 -71 -19 190 -497
2815 -497 -306 512 509 27 -408 -168 -82 10 281 305 230 -212 -647 132 636 371 -156 -224 29 -407 -56 527
2837 527 631 -472 -654 -50 -6 -245 307 700 -113 -873 -23 657 -275 -260 359 165 -548 -207 454 196
2857 196 -494 -60 132 -349 -474 355 360 -108 -226 -173 107 -254 102 366 18 -408 -316 71 324 249 158 -99
2879 -99 -62 -160 -242 454 461 -291 -403 111 154 -251 148 428 -309 -693 -245 394 168 -77 73 192 -377 -303 492
2902 492 297 -238 -201 142 -105 -188 392 402 -116 -439 22 246 -132 192 521 -70 -248 -85 216 340 -59
2923 -59 -187 -184 -191 -122 -73 65 -68 -134 -453 -83 85 1 -55 27 -185 -293 -111 417 433 -283 -96 54 -226 -213
2947 -213 435 355 -101 -376 218 98 -184 185 466 -7 -430 3 -72 -12 151 189 98 -456 -61 193 -87 -277
2969 -277 -8 -13 -142 -91 61 155 -67 -36 90 -129 214 205 103 229 162 12 -125 73 29 -41 -185 -102 -229 -161
2993 -161 259 276 -181 -166 202 5 120 174 125 35 -161 207 91 162 -21 311 -61 -168 -56 298 178 -391
3015 -391 -191 82 44 -248 70 79 -259 -310 -106 -35 -143 -9 184 42 -96 -57 41 174 407 -22 -105 -37 55
3038 55 82 36 163 100 -118 -141 234 19 106 119 23 -46 -153 79 143 -168 -127 -101 -84 -173 102 80 -48 -291 -74
3063 -74 14 -53 173 131 -371 -3 0 103 -38 62 220 -236 3 73 156 73 263 123 -24 -171 -30 53 48 98
3087 98 -183 -319 -99 19 -10 -54 -109 -7 -196 -442 8 233 -84 -172 3 -85 -16 16 365 54 -119 67 -30
3110 -30 -93 44 126 -136 -288 -5 183 9 -14 -38 177 -435 -177 205 53 30 -50 21 -178 -62 17 149 131
3133 131 55 -177 4 121 207 -30 -77 -70 -170 228 198 -79 93 -301 -177 -308 65 40 50 -184 -229 -26 110
3156 110 248 -22 211 -117 -236 -49 349 436 -76 3 215 -147 -304 193 399 -2 -230 138 -26 -179 0
3177 0 305 11 -477 -256 139 146 -70 -94 -106 25 -184 18 326 275 -48 -97 123 -33 202 383 219 -206 -357
3200 -357 67 293 -13 60 48 14 -346 94 210 329 -188 -121 -39 -219 -54 286 194 -112 -432 -166 155 -65
3222 -65 144 308 -219 -562 39 254 180 -130 27 90 -231 -252 343 290 75 -158 -291 -14 -276 -91 350 -5
3244 -5 -357 -137 69 308 -24 -84 26 -16 -130 103 339 189 -318 46 66 -214 -11 383 115 -32 -461 137
3266 137 259 -66 -48 75 -283 -386 -99 207 -18 -189 -237 60 -199 -180 369 520 -355 -372 -16 -33 26 -68
3288 -68 350 -43 -385 -134 271 279 383 -103 19 100 -66 224 374 33 -213 -117 237 -57 41 300 214 -298
3310 -298 -304 16 314 168 -5 12 37 -507 -89 497 30 -322 -168 70 -34 -165 532 288 -67 -327 -17
3331 -17 -30 233 -166 287 -158 -296 -157 156 317 12 79 -67 -266 -263 129 48 -14 -420 -44 8 293 54 15
3354 15 32 -257 -209 9 364 116 57 -41 80 -274 177 407 147 -140 -144 126 -20 -69 137 308 -376 -400 -56
3377 -56 58 70 34 155 -95 -312 -69 331 171 -240 -261 -17 -111 -54 188 302 131 -373 49 107 172 114 285
3400 285 108 -91 -363 115 324 28 -136 116 49 -140 -70 138 228 -341 -153 179 111 -13 182 108 -34 -306
3422 -306 81 206 148 184 -112 -52 -147 -51 302 -113 -258 46 -223 -21 8 -28 11 -259 -98 28 156 247 -17
3445 -17 -2 21 -102 -16 271 244 -168 -120 -96 187 -107 -24 0 169 6 -90 292 110 75 124 35 -229 72 43 91
3470 91 166 -215 13 -90 -203 -17 170 69 -366 45 4 76 -76 -29 138 -130 52 -17 28 140 163 42 -24
3493 -24 -9 290 165 187 -150 -17 31 3 115 -131 45 90 -24 -182 144 -122 19 105 62 -126 -143 -80 91
3516 91 -19 -22 -148 124 -166 -105 216 27 131 -46 63 157 -40 158 159 50 -51 105 268 -142 -9 -128
3538 -128 -3 -118 -2 201 -215 -35 -197 -1 -24 -204 -156 194 -117 -194 70 38 44 63 69 0 37 -35 28 134
3562 134 -51 122 8 4 -36 -206 -35 26 -144 -129 83 137 -43 -145 71 -163 -180 -122 94 -32 -176 57 24
3585 24 -185 162 63 61 -18 -35 58 -55 137 63 -60 -37 -87 -3 121 -12 -11 171 60 -85 -140 149 145 164 -25 -136
3611 -136 -12 88 86 86 -26 -61 -6 134 107 53 5 107 -52 120 22 23 244 -242 -132 188 12 -232 151 -21
3635 -21 -316 -98 70 185 -142 -92 109 -62 37 -82 84 -44 -150 56 -115 -127 -229 3 224 -92 -2 200
3657 200 -38 91 31 -26 181 198 -7 -95 -35 195 -34 32 -20 63 35 302 3 -22 -6 -59 -14 100 -23 140
3681 140 -242 -45 -149 156 243 49 199 -146 -112 260 145 51 63 187 21 -35 -115 167 22 -200 -28 106
3703 106 57 144 53 26 183 -52 -137 -86 72 -222 -135 26 23 -225 131 -52 86 112 120 41 0 17 -61 16 -230 -150
3729 -150 19 16 -102 -91 -38 -92 -134 -154 -50 186 -68 -60 89 -120 87 151 -89 131 -118 34 88 -201 -55 257
3753 257 -179 -144 99 72 -126 -27 -183 -25 -7 8 -63 -92 -104 -161 -221 66 81 163 39 1 -130 -40 -48 44 91 -94
3779 -94 118 -106 4 -54 131 34 -179 -43 247 -47 -51 -79 123 -228 -100 331 -99 29 5 -36 -60 -282 45
3802 45 226 -22 -151 -104 108 -218 40 148 -121 -45 -108 -89 163 126 132 -175 92 -72 64 70 102 -22 -6 46
3826 46 -169 171 31 149 -40 -82 -18 84 51 123 70 -31 -33 7 -91 15 -131 42 225 22 -132 174 115 82
3850 82 214 -23 115 115 -132 116 105 -275 -154 -88 19 -47 97 44 140 -184 -89 36 124 -46 99 -42 -32 43
3874 43 9 180 -22 -152 -137 244 -27 -188 31 17 -10 -240 52 -33 -173 -62 -163 10 51 41 332 136 -48
3897 -48 -128 55 -3 -204 160 190 -147 -72 26 56 -104 -258 65 -68 -101 102 241 62 -20 -13 11 89 3 18 46
3922 46 137 -178 84 118 171 1 -170 -95 -222 26 17 195 -2 -10 -4 -78 -194 4 52 51 -74 124 185 88 -21 -169
3948 -169 62 119 -207 38 30 5 103 -22 -8 56 114 70 128 29 -15 -44 157 -258 237 137 76 -208 25 180 87
3973 87 12 -24 84 21 26 14 180 34 100 -172 -75 -63 111 -46 -154 45 -219 48 -2 125 -26 85 -87 -131
3997 -131 107 -19 -98 -209 82 22 75 76 255 -9 -251 -104 22 84 0 -21 0 51 -74 86 8 -15 -242 -9
4021 -9 21 53 -9 -15 45 18 220 -107 -113 -48 -114 -57 32 -154 122 -181 0 -55 -143 -25 -99 343 141 -158 76 -82
4047 -82 181 -33 -64 14 -39 -71 -79 41 109 221 79 -99 -10 2 -119 25 -9 227 11 78 80 -219 78 -103 -91
4072 -91 95 -31 -120 -51 -3 131 65 24 -25 -240 -171 52 187 73 -235 28 49 -12 -11 -145 9 -102 23 -25
4096 -25 -22 19 -9 -111 174 41 56 94 116 -246 221 28 -66 18 66 50 -46 -18 -183 103 66 -143 -136 43 23 156
4122 156 126 -115 -57 14 -52 86 125 262 1 103 111 -101 -132 46 93 53 -40 110 -18 15 -48 -87 147 169 -187
4147 -187 73 -54 -97 47 -10 170 149 -13 9 -129 173 157 -193 -100 -114 77 100 128 89 46 -14 49 -88 -225
4171 -225 -68 -23 50 74 73 -168 -40 -178 23 4 4 -54 28 48 -118 -66 -13 49 -58 104 -44 -19 -108 66 -93
4196 -93 -72 113 -198 -30 107 -3 -164 92 -1 -4 73 45 -17 -6 -84 -75 164 -107 -33 -70 109 -197 -196 91 56 -77
4222 -77 14 -62 -1 -26 -18 143 -91 -129 -18 -134 -72 65 48 -98 12 -34 95 -62 194 33 -28 -171 146 -39
4246 -39 171 178 144 -84 75 -167 86 304 126 -96 -123 65 109 -14 -73 49 -157 -85 -104 42 225 -91 44
4269 44 -68 -185 14 213 -105 -26 14 -179 62 134 90 -87 -43 49 -76 -152 66 251 46 -40 -206 -35 -14
4292 -14 75 169 -31 -146 188 -24 117 -71 -4 24 49 -28 96 101 5 29 -182 74 19 -26 139 -51 -226 -34
4316 -34 153 0 -8 74 -266 -29 -215 10 -7 223 -1 -125 -96 -49 162 87 57 -81 -40 65 -114 -110 46 194
4340 194 135 160 -62 83 -80 171 -82 -227 -69 21 75 20 -8 -71 -103 27 -122 52 -201 -284 -41 200 137
4363 137 -97 106 128 -237 -12 -24 44 153 -75 -17 83 -126 -194 -33 77 -1 63 2 65 154 -45 48 -8 -94
4387 -94 -104 36 170 -214 146 -16 139 -151 92 -2 204 -190 197 -6 18 -8 64 101 11 12 -152 89 -24
4410 -24 -11 50 191 -61 165 -12 113 -52 91 2 -96 -101 171 -82 -39 10 161 23 -81 148 45 -158 53
4433 53 -29 22 -51 136 42 -110 19 8 137 85 -25 81 17 -76 44 22 -98 86 -116 207 10 -25 -69 43
4457 43 -374 -109 -137 -8 -52 28 -105 68 -36 34 80 86 76 64 -50 -103 183 -46 20 -54 -43 -122 60 -50 242
4482 242 90 10 -73 42 -207 -61 -35 141 -148 -96 -118 -177 23 -21 -152 -13 -142 -152 34 5 90 -168 57
4505 57 34 -113 115 42 -184 -73 -209 106 -126 37 60 -28 -112 -114 134 -81 89 64 167 -113 -97 63 -53
4528 -53 -170 -119 37 252 -117 33 34 -236 -45 3 -67 190 16 -9 76 -135 42 -29 124 -46 -58 55 41 -66
4552 -66 -13 19 41 81 19 76 191 66 72 -29 -9 -154 -108 33 -1 87 244 -13 -217 153 -4 127 19 6 60
4577 60 20 98 15 -26 47 -117 -225 73 13 -125 112 -106 23 44 180 -88 86 55 53 -54 -57 -30 -131 92 -146
4602 -146 -13 4 -33 -62 111 -143 -42 59 -7 71 -113 88 -100 -35 45 -95 46 15 -20 1 -147 62 150 99
4626 99 66 -105 176 -61 187 -46 60 -38 22 96 -35 67 35 22 234 -102 2 -115 40 10 -7 -154 -169
4649 -169 64 52 295 172 41 25 96 -19 3 88 37 70 -24 -116 -80 157 101 56 30 -43 102 173 153 134 74 -130
4675 -130 -46 -135 -34 73 35 -162 44 173 -70 -74 -23 -154 -101 -73 3 62 -117 -142 -161 -111 -60 74 130 5 -66
4700 -66 -171 -81 107 9 86 68 17 54 11 166 -60 -93 247 -44 -12 -9 -42 -55 -71 76 -134 81 148 177 -122 180
4726 180 -31 188 11 -73 -117 -137 79 -7 -11 -94 -98 -173 -30 59 200 227 19 -8 -183 29 -23 -182 18 -173 5
4751 5 131 -135 -27 -149 33 45 -16 -65 -158 226 -34 184 150 -58 93 -90 -18 -4 38 -44 15 -78 -57 -83 -154
4776 -154 -17 -136 -50 113 -10 -34 -43 20 124 -66 63 -17 56 -64 54 42 88 110 7 138 -18 -62 -164 132
4800 132 97 -36 45 -34 -152 -142 -29 208 102 308 80 233 -130 19 -72 -84 -26 38 43 -188 154 48 57 59 -35
4825 -35 7 -118 117 157 110 -32 90 77 95 84 2 -57 0 81 -35 227 37 143 -254 144 -82 -37 -158 34
4849 34 150 -65 -109 -44 82 -132 4 106 -150 -53 -122 62 27 8 95 -101 -59 37 139 -13 18 14 54 15 57
4874 57 -242 33 -77 51 -57 95 23 -4 25 153 120 94 59 -46 -23 -49 -56 -43 12 61 -160 -22 -95 -180 -1
4899 -1 -113 36 -25 -41 -170 17 -84 -118 232 124 -112 58 -75 -8 160 -127 -73 -114 5 -131 167 150 -18
4922 -18 -221 -229 -119 41 -100 -113 88 99 -17 220 60 -27 -65 -51 -73 151 139 -184 -78 -196 -198 30 -62 130
4946 130 -93 -11 -15 -46 142 39 157 11 -316 -12 -79 -85 -109 -4 -9 -8 -54 176 24 -49 -228 -60 102 -20 130
4971 130 70 99 -32 -53 -41 14 18 -9 60 100 144 5 68 121 -22 -159 113 -2 -19 -195 -58 -26 -62 27 -52 83
4997 83 88 -95 -39 -69 -14 -38 213 -24 -27 108 -35 -94 -36 81 -165 159 -65 -53 94 -112 59 -55 -108 -109 2
5022 2 92 -85 -53 12 -30 111 58 36 -121 -11 79 -232 38 -148 -13 150 -1 251 -123 -57 -107 -57 5 144
5046 144 30 -29 67 87 16 -143 -32 -101 94 -102 128 126 79 -170 -69 -15 83 10 51 2 -40 137 -13 -229 65
5071 65 -108 -27 91 77 176 -101 -45 -218 94 2 -21 -77 66 -58 80 -200 209 -16 -91 82 94 -56 57
5094 57 63 17 -96 13 152 -103 -48 45 -36 -127 53 117 -84 31 -41 60 -70 -49 -27 231 54 91 -17 -109 -5
5119 -5 -5 44 -161 -154 -170 -168 -83 -92 54 -163 133 -3 5 -201 0 224 62 8 90 -40 55 -46 51 157 -77 -53 -70
5146 -70 -55 -56 160 15 -137 137 -58 2 -96 43 118 -255 18 47 40 0 -218 40 -64 6 -74 -14 -29 -7 89 -34
5172 -34 78 178 -17 58 106 132 45 119 86 2 37 98 -93 -150 -13 -159 -16 -45 -86 76 58 -76 -278 81 -68
5197 -68 -55 16 32 -27 88 -16 -116 163 -13 13 -114 -67 2 -61 50 127 161 -13 -132 -186 -100 -39 6 83 78 23
5223 23 162 -18 15 -167 -6 -163 60 -45 65 -110 -76 -23 -62 45 -74 45 2 21 143 114 52 -51 -138
5246 -138 173 -101 27 21 -59 -64 81 -34 138 182 -96 -94 -77 31 176 76 -177 -58 74 144 30 -50 -128 -50
5270 -50 -65 41 74 153 11 -130 -32 88 6 -79 -67 34 -154 110 -155 -3 5 77 189 -86 115 -121 98 -105
5294 -105 -117 184 -183 117 -25 41 -18 -195 -6 154 127 49 6 76 1 -88 111 20 -57 132 -23 2 99 14 98
5319 98 -102 -180 -8 -137 18 27 3 -73 64 -76 89 83 195 165 -43 -170 -39 123 37 -227 -154 -95 -86 96 174
5344 174 35 240 75 104 27 56 0 23 -175 -26 6 -174 -40 75 134 67 5 14 15 -177 47 -108 -25 0 44
5369 44 -136 9 -233 -118 6 -170 -6 104 38 -64 88 -18 -78 -77 -92 -102 55 68 -23 135 -63 94 -188
5392 -188 17 36 51 196 -151 259 55 92 8 -92 151 171 104 109 -22 87 -181 140 63 -58 -154 135 43 51
5416 51 -12 -67 52 -185 76 135 103 63 90 73 180 94 -65 26 101 1 66 48 37 -95 -140 -33 -243 -53 17
5441 17 -37 117 73 -68 86 92 69 -183 -81 -190 16 18 -71 -126 11 151 -125 90 19 25 -71 -20 96 -56 -61 144
5467 144 51 7 -85 -85 -54 -121 -87 60 85 147 -122 -120 3 -4 -69 -9 -19 -74 24 -156 103 18 14 -41 -53 36 -84 71
5495 71 -57 174 13 56 -63 47 90 188 -144 -136 98 -9 145 92 -178 -98 -87 139 -50 46 -107 -109 149 -198
5519 -198 -96 -173 -167 -20 -74 122 -17 8 66 -29 23 35 39 -38 -93 -45 -70 -73 -16 209 -13 105 7 -86 276 174 14
5546 14 -2 -198 278 -60 -10 -208 22 -4 -146 7 -24 -99 -115 95 78 -23 -71 149 -132 34 -158 -118 86
5569 86 -10 -88 5 134 10 12 68 0 -16 126 70 -68 -61 -70 -59 -125 -84 40 138 -112 206 137 -55 63 -152 137
5595 137 113 30 103 19 117 134 -90 42 96 194 141 185 222 98 197 -155 135 47 -272 12 12 54 4 27 98 -153
5621 -153 -104 -81 64 42 -149 143 5 -115 -177 122 -44 -6 -78 -14 9 -5 -104 -168 43 73 89 131 69 -10 75 178
5647 178 -88 -88 -60 14 -45 142 -265 -38 10 49 -120 -6 78 15 28 -95 112 39 116 72 165 -72 42 -60 -66
5672 -66 -161 -170 -43 54 -239 -9 -155 -53 -128 -87 -42 115 -14 11 35 25 81 -134 1 5 139 93 -93 28 24 75
5698 75 42 161 -123 -207 59 -114 -116 -129 89 33 48 47 -17 -178 15 -156 -58 -63 162 112 34 -8 -238 -156 -51 127
5724 127 65 -136 -110 -44 -69 -48 72 127 -10 81 -54 -85 135 -77 -119 66 -56 108 98 -209 1 -48 -20 -171
5748 -171 -149 -10 27 -229 -16 25 130 33 -38 190 -239 -26 -4 -37 96 -45 262 -1 -92 114 74 12 -65 -113
5772 -113 108 59 -34 -66 -5 -52 -93 49 4 50 78 -21 18 -286 8 -65 -142 -2 -49 117 -52 51 42 -161 -75 54
5798 54 -75 79 120 53 98 164 154 -78 -141 102 257 -68 143 79 21 182 71 274 -80 107 -80 57 -107
5821 -107 0 -190 67 33 156 -63 91 87 -26 -118 -36 133 39 -64 58 41 68 -128 41 -50 118 232 28
5844 28 -130 138 39 56 32 -50 -241 -3 120 59 19 163 87 1 143 -65 119 -84 -15 38 10 124 -11 -166
5868 -166 140 110 114 138 295 -156 -171 -34 -35 38 77 -10 -59 36 116 8 -62 10 66 -147 74 21 -88 -83 5 136 88
5895 88 72 -75 -29 297 -189 47 109 163 -156 -4 -131 118 71 -179 139 24 80 295 -26 73 -109 11 177
5918 177 -103 -26 -29 -146 35 -84 246 108 117 130 -67 -16 -140 -30 143 111 -75 122 17 -115 -98 -21 28 -28
5942 -28 46 -166 12 -59 211 -133 -132 -21 -122 28 -128 -174 120 -44 40 -129 -19 149 105 159 -222 50 73
5965 73 111 6 11 146 -24 87 -105 48 -65 33 110 -143 4 80 109 119 143 18 23 7 119 101 -61 163 44
5990 44 -182 -140 -51 -43 19 -7 -36 -123 20 -20 -7 -41 6 -52 168 38 -297 234 214 154 22 13 20 -62 -43 80 116 -84
6018 -84 106 25 19 231 109 95 67 -159 106 -15 -115 -146 21 -12 -137 185 -80 11 -31 -83 -29 -108 69 55 9
6043 9 179 5 -162 6 80 -50 103 -157 29 87 -2 234 -125 -119 121 -104 43 79 89 -59 -50 -99 137 -100
6067 -100 116 -135 211 76 45 142 71 -9 -180 -96 -128 -51 -22 -11 -209 -72 192 21 65 223 17 274 128
6090 128 -9 -87 32 46 47 113 137 51 162 37 -27 128 -121 141 -45 -48 219 168 22 16 27 67 -22 114 95 -8
6116 -8 -38 -42 -163 -51 -69 7 -55 8 -56 16 67 -110 196 133 -388 -112 19 20 152 -54 -95 112 -39 -123 65 74
6142 74 -121 81 215 21 36 115 89 -32 -53 -153 -48 331 -88 -111 -32 -27 -184 -25 -97 -70 -10 -10 -10 137 -130
6167 -130 107 205 -32 -174 -12 -6 137 79 -5 -148 -44 -21 16 69 99 -61 54 -23 36 -73 81 -19 -2 34
6191 34 -126 -71 -131 -13 84 -2 93 -84 -119 -11 -102 54 -212 96 -170 162 36 -116 155 -223 -254 -162 127
6214 127 -131 -24 -82 111 121 50 34 -38 5 -108 117 190 175 69 93 -50 -69 14 117 69 8 177 -166 -249 35
6239 35 153 -164 -154 -50 4 -51 14 -72 -50 111 225 80 -29 -192 -147 -46 84 46 22 -95 199 16 -144
6262 -144 50 -105 -142 66 -75 -94 53 61 -167 214 172 3 -25 -11 -19 -3 -62 153 108 -43 -35 8 116 -65 -190
6287 -190 -120 2 70 36 -92 -37 -178 -147 315 33 16 99 102 -49 121 -50 71 185 13 -9 -71 154 11 15
6311 15 130 -14 -18 40 34 6 56 -101 16 -9 -43 103 70 90 86 -62 -58 -99 -7 29 -39 178 -76 101 -172 -221 217
6338 217 272 94 -62 51 203 62 -70 -13 146 170 -106 184 -176 19 -44 24 242 112 -33 -103 10 -88
6360 -88 -89 25 14 144 -22 -44 21 -101 46 14 79 98 -332 30 57 131 16 -115 -44 131 21 89 -46 -74 4
6385 4 -59 -164 154 -186 128 102 149 138 172 48 -140 4 61 89 64 277 -74 -93 -111 -99 -92 -178 -102 -30 -31 -170 -146
6412 -146 -184 56 -97 -220 73 99 -50 -141 -125 167 105 98 -23 43 112 96 177 -142 -131 -29 -4 -11 -25 79 10 112
6438 112 90 102 64 91 1 -178 62 192 58 56 209 -182 -57 -131 3 -126 -157 -13 94 2 -187 -43 -56 -36
6462 -36 -243 -70 -222 -25 -24 9 106 -162 39 82 -21 55 -4 119 48 -86 -16 -35 -30 202 40 74 -50 -134 -83
6487 -83 -52 118 -132 51 152 -184 227 -51 -21 86 -71 -107 17 -95 -136 -80 -116 -14 -34 -129 -124 -70 -13 105
6511 105 20 -152 -123 -93 -171 172 -56 4 -101 -68 26 137 -83 41 2 4 -91 15 38 127 -37 -31 -28 33 -127 61
6537 61 -114 -106 190 -11 -31 84 -88 83 120 -137 -26 62 185 92 -173 55 49 48 -85 108 86 -40 -42 -48 -117 107
6563 107 119 89 66 -24 136 104 -112 -114 68 -67 129 1 -236 62 76 135 -79 21 95 10 115 1 -61 75
6587 75 163 -72 -4 -54 9 -66 203 170 43 89 -119 -26 203 73 -47 -108 190 26 -82 10 -92 135 60 46
6611 46 -39 -69 -8 148 -63 -266 -44 145 -50 -193 -188 125 92 -350 -36 -69 -66 169 -30 156 -203 1 84 156
6635 156 -42 59 1 -207 3 31 -55 -111 50 -21 -190 -14 -77 -1 -28 -117 -9 -101 -73 -100 -18 227 117 177 8
6660 8 88 98 -191 -88 19 -191 131 -45 -221 -83 -101 -6 -89 -56 12 -160 -26 -35 27 23 173 -28 -4 175 16
6685 16 71 -92 13 15 11 35 63 -187 -28 27 27 47 86 80 86 98 -142 163 -80 191 -173 123 71 -32 -67 -68 -92 -53
6713 -53 -32 13 18 0 -30 -247 -51 -234 -104 -56 -28 -93 109 -2 -35 11 -8 -57 -103 -315 -136 234 98 102 -41 13
6739 13 72 91 115 -22 -55 -116 28 -160 7 -90 -15 81 173 -80 -130 99 26 145 -70 47 63 -133 108 62 96
6764 96 -96 -93 -205 0 -20 -65 -29 76 47 5 -23 -36 -55 123 107 28 -28 70 154 -30 -50 156 -43 -81 -97 -20 19
6791 19 -23 -73 98 -56 196 -25 55 -46 11 -25 -134 -90 17 166 177 -24 142 -125 20 42 92 53 -69 -87
6815 -87 35 93 173 2 27 57 -77 -82 81 27 43 16 -84 -17 -69 -101 -100 -14 19 -163 121 -150 46 150 49 105
6841 105 38 77 -184 -21 88 -8 -172 59 124 -47 -45 46 73 17 93 218 62 84 -11 87 166 75 129 -13 4 -45
6867 -45 -151 -18 25 -171 73 23 -61 1 15 70 76 34 22 -71 -16 -46 97 92 -15 -30 -151 289 -115 -6 -89 118
6893 118 126 146 -38 -68 70 -115 100 136 157 -37 59 -142 128 -128 -67 -87 114 20 -7 -116 41 69 295 109
6917 109 114 215 129 5 186 -63 -84 -176 -66 2 43 -12 48 64 -110 191 29 -148 40 -20 -27 -58 -168 11 11
6942 11 94 179 114 108 -109 145 1 55 34 -48 70 28 -135 -277 -59 -31 15 95 -90 -76 37 -139 118 -14 73
6967 73 -17 56 54 -124 113 9 -17 -58 194 -50 92 90 35 -75 1 128 90 -135 -143 206 -171 112 -112 -8 -104
6992 -104 24 9 98 -26 104 -53 -246 124 203 178 -11 127 -95 65 -65 27 93 123 -23 -197 44 30 61
7015 61 -20 -181 -72 213 82 110 151 70 99 34 175 74 -133 -62 -145 -105 159 0 -145 -133 -78 55 41 27 133
7040 133 -55 -78 21 11 -212 -55 169 136 -62 -2 85 -15 140 -125 -7 -65 23 116 169 40 -49 -66 -37 -94 -41
7065 -41 293 168 165 49 -263 -130 -16 -51 69 -136 -97 -118 50 -24 81 202 122 -37 117 52 56 65 -81 -33 58
7090 58 99 -68 225 -53 -95 -52 48 96 -158 -3 91 -1 198 110 -24 40 -21 -132 -103 -175 56 53 -190 130 -38
7115 -38 -49 -10 70 -134 120 6 -153 320 38 192 35 10 -33 59 3 -17 85 50 -222 -139 108 -32 -23 -232
7139 -232 -36 96 -88 -111 30 79 -160 -197 125 123 -265 -35 -10 135 -45 60 -83 214 80 136 -69 66
7161 66 33 9 88 21 55 -1 -92 -40 -62 144 18 -167 -177 83 16 70 -119 -90 -60 42 -45 -23 -50 -9 82 -73 -274
7188 -274 -110 -101 75 123 57 -231 99 53 -96 -7 24 176 -102 -14 116 -31 75 103 58 50 45 -159 10 -166 35
7213 35 34 259 25 -127 72 -133 40 36 -48 10 -211 5 63 42 67 161 32 23 58 -17 106 186 -8 -123 13
7238 13 101 -70 42 164 181 247 8 -115 15 122 -143 -11 7 -76 -250 79 -126 163 84 -225 -198 67 219
7261 219 -86 -93 -221 25 -74 -32 -25 209 -27 118 207 104 93 182 -106 76 108 -48 57 -77 -145 78 -234 4
7285 4 -122 -197 82 -31 -90 -20 20 57 17 -59 -134 -48 -6 61 4 -73 6 -14 43 66 75 -77 -93 -32 34 -45 131 144 -41
7314 -41 96 25 196 -30 78 -57 190 71 -87 26 -152 -102 -2 -28 224 12 -134 -117 -40 -169 102 -61
7336 -61 -167 11 -105 -74 101 129 175 47 23 135 -61 61 44 62 -4 119 -2 167 -45 132 -49 54 -96
7359 -96 -4 22 -44 -17 -13 -37 37 -12 -91 12 146 -47 -87 -21 -124 251 64 231 60 189 -136 215 -93 30
7383 30 71 -100 -187 17 77 63 141 77 46 -109 -107 -7 91 29 193 -133 31 7 116 -92 -23 -88 -47 10 -48 51
7409 51 9 -108 15 40 -49 186 84 20 -78 -54 -55 241 -94 0 -14 -76 -11 -107 -57 -218 -136 80 -43 -9 -11 85 36
7436 36 -37 -55 -35 111 -23 339 30 -81 69 7 34 221 -1 -105 29 192 -114 116 -15 195 102 99 28
7459 28 -11 -99 56 -62 81 84 148 -71 13 140 -27 -116 10 111 -29 24 45 95 127 -210 -5 7 -166 84
7483 84 53 55 159 -31 70 82 -170 -135 107 -139 -152 -351 -35 -94 -14 -129 -13 -1 -35 37 183 -169 -36 13
7507 13 -81 21 -72 77 26 55 -35 -258 9 63 -175 -4 76 -82 -97 79 63 42 248 -101 -30 -186 -145 -102 96
7532 96 73 72 156 -114 2 -24 79 52 158 -19 -111 46 -132 122 20 74 -78 -45 0 -205 271 -107 144 21
7556 21 -54 113 58 55 76 -62 34 -145 56 78 -4 135 -259 -51 -66 155 108 180 120 151 71 -210 40 83 99 -152
7582 -152 -102 162 65 82 72 127 -77 -62 51 19 146 99 -80 -44 -34 -111 -27 163 114 -130 18 -101 13 63 -116
7607 -116 -41 15 55 91 140 -53 -162 67 111 51 79 38 7 -36 80 -217 71 -61 136 -26 159 73 45 16 14
7632 14 35 -97 -44 -72 -24 98 -46 -26 44 -185 -182 53 21 210 114 -64 -18 -6 -136 143 51 38 -73 -5 -124
7657 -124 91 72 5 131 -119 -26 -25 43 -135 -91 -72 309 154 72 87 -102 95 -164 -221 -209 82 -161 84 15
7681 15 -51 -70 -48 52 -31 -115 -4 -87 98 -125 -44 100 -194 -8 -41 -50 -29 72 87 19 -198 216 -62 -59 -53 -130
7707 -130 85 -251 -8 -77 -26 2 -46 -62 -86 -51 6 -12 55 72 65 33 98 124 70 111 -151 -47 178 77 -37 -183
7733 -183 -144 1 -41 -27 147 56 19 -143 -93 -207 51 151 -40 -201 -3 -107 -18 35 -137 122 113 39 53 -187
7757 -187 21 -70 193 36 -166 -50 -115 40 -4 -17 101 12 84 143 -54 107 4 109 182 124 53 -67 180
7780 180 17 -28 -46 -25 67 25 -85 -93 40 -56 -116 52 53 -82 -13 -21 -1 28 -18 68 101 -42 65 -121 88 -42
7806 -42 24 -55 275 -128 -78 -61 -125 102 -113 -40 287 101 31 -48 101 250 -110 146 -4 241 9 -99 -80
7829 -80 -143 -1 110 -51 -162 156 104 -150 -25 -107 -135 42 -78 7 -21 -201 64 64 215 289 -53 112 -8
7852 -8 74 -51 -37 5 -63 65 -82 -30 94 -91 123 -16 161 129 70 47 -41 -77 -124 142 -226 -47 2 -219 -173
7877 -173 -10 66 -330 -37 -184 -201 -152 -76 25 -130 -36 82 -19 -54 -12 36 17 213 128 14 -37 20 153 -46
7901 -46 -93 23 124 -229 -48 -91 48 -20 26 -117 58 120 -25 296 -179 -75 -208 -6 121 -87 -180 17
7923 17 -98 -1 -52 48 68 8 39 -144 173 14 -150 -22 14 55 -180 -19 142 26 -105 50 163 -58 189
7946 189 -9 -141 25 96 -67 -136 37 -95 7 -17 -27 88 32 -8 134 12 -35 -99 121 -83 -28 -87 -110 57
7970 57 -27 -85 68 30 108 59 145 128 60 45 55 -153 -43 -1 75 -171 -80 121 -197 74 -81 -155 25 138 35
7995 35 -58 -12 -41 120 12 89 184 -41 -94 50 61 -198 36 -209 -21 320 128 -73 -2 -19 -44 20 166 64
8019 64 7 61 -97 72 15 94 23 -247 59 -144 4 -211 141 37 -105 -31 162 -90 3 -72 -3 -30 -22 -44 -50
8044 -50 -8 54 72 -38 165 28 93 -23 41 -195 8 64 -9 -7 118 142 -79 68 5 -96 -18 -38 -43 -25 31 166
8070 166 184 -24 135 -122 -115 50 -22 -88 -24 27 39 -13 -119 -117 -254 -58 58 -17 -12 -30 38 -134 -234 80 -192
8095 -192 -30 -131 109 191 -6 -67 -4 44 89 4 -48 61 -75 -10 27 -9 4 55 -53 -39 0 89 -216 -189 11
8120 11 46 -172 24 0 -121 -40 142 -5 -51 -157 -13 6 89 -41 -176 33 -183 -52 -14 197 44 -16 85
8143 85 -14 50 -73 75 -25 -74 98 4 -17 77 43 81 27 81 -1 7 189 -135 108 109 -141 171 -28 -39 -36 105
8169 105 -11 197 -32 15 -79 110 -255 24 36 -10 112 148 114 -142 210 -6 -19 91 90 19 198 -36
8191c6
$$ Imaginary data points
##PAGE= N=2
##DATA TABLE= (X++(I..I)), XYDATA
0 0 0 0 0 0 0 0 0 0 0 0 0 0 8 -8 8 -8 8 -16 16 -16 24 -28 32 -40 46 -53 63 -72 80 -94 108 -124 140 -156 179
35 179 -202 226 -251 282 -314 351 -388 429 -477 527 -583 643 -709 783 -863 948 -1044 1153
53 1153 -1271 1405 -1556 1727 -1925 2156 -2426 2753 -3153 3660 -4323 5233 -6567 8714 -12757
68 -12757 23087 -106878 -212972 -68838 27256 194416 75896 -203178 -145074 135598 45632
79 45632 -138680 19045 156518 -27963 -80828 46176 -32250 -98423 154295 192379 -166156
90 -166156 -202151 152060 118457 -158053 16226 237753 -86108 -295995 75786 253996
100 253996 -61998 -117248 111871 -23985 -222608 67990 266428 -68443 -217537 92552
110 92552 119019 -171719 -73673 218930 73528 -172109 -42046 71606 -55880 -9890 159974
121 159974 24175 -170149 -35106 98609 -9807 -13397 105262 -1364 -146953 -14357
131 -14357 97389 -13778 -13266 94309 -37525 -175778 22981 165420 -29951 -96651 91204
142 91204 38169 -166838 -23177 189515 16041 -136092 49968 82628 -144402 -70664 197999
153 197999 75717 -177508 -40625 121793 -46662 -93651 128899 97930 -151354 -87996
163 -87996 120792 29110 -89470 52304 87220 -103648 -95735 94389 65910 -58994 8883
174 8883 49202 -74775 -61594 90347 56636 -58672 834 37509 -74460 -48259 105109
185 105109 51362 -87104 -9957 61138 -65028 -65046 114007 73405 -114666 -45087 94044
196 94044 -23912 -93596 86791 104774 -110129 -92261 103505 38329 -101159 32424 118126
207 118126 -73817 -122308 83823 92490 -81624 -28410 97434 -28091 -118837 50412 111776
218 111776 -52589 -67375 61402 8976 -85841 25086 95478 -34442 -70536 41220 20451
229 20451 -63330 17985 80365 -33666 -69112 40900 29115 -57885 15056 81143 -37712
240 -37712 -81846 48803 54123 -61727 -8611 86105 -24210 -99662 40191 83702 -54512
251 -54512 -44014 79104 4165 -104648 17033 104080 -33381 -75831 57849 36628 -90729
262 -90729 -11220 105833 -5442 -92267 28296 61628 -59867 -33537 85585 15622 -86066
273 -86066 6181 68188 -33851 -42953 62686 23263 -74918 -4094 66439 -20798 -46344 49626
285 49626 25742 -71093 -8598 72018 -13612 -57820 41517 37306 -69276 -20930 79758 1698
297 1698 -71285 26419 54134 -57490 -37734 78847 21968 -79361 3812 68852 -35464
308 -35464 -54166 63861 39856 -75913 -18686 74156 -11259 -65626 41333 53802 -62414
319 -62414 -38215 68250 12104 -66374 17233 57858 -43393 -46980 56468 26523 -59323 1167
331 1167 56637 -28520 -48823 48399 34955 -55879 -10666 57570 -16124 -53087 39661 43271
343 43271 -53016 -23654 59147 -2316 -59961 27112 53982 -45750 -40189 55119 16025 -59681
355 -59681 9956 58495 -33616 -50804 48511 32838 -56751 -7722 60670 -17338 -58044 37135
367 37135 46854 -49096 -25423 57516 1615 -59923 20607 54490 -36262 -38059 48559 15853
379 15853 -56598 5452 56394 -23495 -46075 37126 25977 -49414 -4536 54921 -15118 -51826
391 -51826 30345 37733 -43524 -17336 53308 -2639 -54688 20541 46780 -35668 -29806 49299
403 49299 10728 -56693 6834 54201 -23060 -40898 38470 22373 -51869 -5368 56206 -11399
415 -11399 -49117 27765 33706 -44882 -16957 56554 2232 -55811 13084 45438 -29774 -29289 45054
428 45054 14337 -50885 1548 46477 -19636 -35308 37349 23170 -48492 -10590 47706 -5539
440 -5539 -38362 25239 26579 -42059 -15567 48135 2262 -43242 16642 33215 -37346 -24634
452 -24634 49615 14817 -49401 561 40025 -22230 -30346 40468 21053 -48145 -7115 46048
464 46048 -12552 -39821 33428 34124 -44852 -23226 46290 5662 -41811 18036 39295 -34622
476 -34622 -33959 40800 20544 -38602 1807 36369 -25176 -37289 35696 30146 -37550 -15062 32961
489 32961 -8513 -32685 24246 27648 -31043 -14318 32982 -6207 -34619 25995 38443 -30759
501 -30759 -28014 32702 9667 -31502 15545 36606 -29298 -34093 34094 19389 -37222 1744
513 1744 40567 -22429 -46491 27350 34511 -33404 -16756 36586 -7445 -46147 19150 44539
525 44539 -24513 -29311 32043 10150 -39781 8138 48305 -10975 -36637 19840 20827 -27479 -657
538 -657 39598 -6351 -37261 10608 21457 -21310 -4511 32154 -8752 -41144 8682 27607
550 27607 -17996 -12020 27831 -6104 -41160 10903 37818 -16082 -21883 28365 6399 -40440
562 -40440 5865 47588 -8086 -33605 22130 19783 -35991 -6073 49140 2182 -44194 6727
574 6727 28795 -25129 -18084 40582 10896 -47893 -8975 34805 -7403 -24258 24129 15631 -37863
587 -37863 -14451 33919 5058 -22449 13051 15166 -27430 -11532 32213 8074 -20654 9331
599 9331 14483 -25354 -10190 35332 10362 -27261 2108 16520 -22528 -12493 36720 11155
611 11155 -39355 -6554 27697 -13323 -23237 29177 19888 -38781 -16578 33510 476 -28223
623 -28223 20732 29206 -32511 -27814 34435 19684 -27291 2880 28359 -20303 -30538 27948
635 27948 28335 -24279 -13328 22088 -6879 -26129 17341 26148 -18718 -17188 15644 -2432 -20242
648 -20242 16171 23915 -20074 -20144 16765 3995 -17963 13481 23453 -20798 -22825 21023 11653
661 11653 -20028 7887 27131 -18970 -30392 21953 24017 -20774 -7007 24778 -9918 -32291
673 -32291 16995 30645 -19887 -19033 23204 2080 -32477 7187 35815 -10625 -28326 14416
685 14416 13307 -23419 -347 32450 -3668 -30096 7231 19262 -13515 -4792 24569 -2065
697 -2065 -28605 4470 21595 -9534 -9189 18636 -1132 -26937 4856 24797 -9277 -14717 17713
710 17713 4161 -27179 942 28953 -4705 -21168 12532 10306 -23926 -3300 30994 -377
722 -377 -27668 6979 18872 -17226 -9891 27407 5657 -29324 -63 23097 -10203 -15461 21760
735 21760 10248 -28490 -6936 26358 -763 -19690 11472 13559 -21265 -10029 23071 3526
747 3526 -19355 6693 14142 -17844 -11021 23548 7881 -21415 1024 17306 -11193 -13278 20301
760 20301 10168 -22016 -3028 19928 -7275 -17685 16523 15021 -21162 -10358 20298 517
772 517 -18626 9896 16343 -18151 -13675 19855 6306 -19562 3987 18385 -13628 -16868 19410
785 19410 12926 -19786 -4001 19237 -5632 -17562 13613 14802 -17054 -7763 19240 -1142 -19927
798 -19927 8689 18331 -13162 -13205 14975 3652 -17050 5386 17380 -12495 -15735 16162 9477
811 9477 -18250 -1705 19023 -6088 -17838 12157 13746 -15433 -6106 18354 -1271 -18692 8412
824 8412 16823 -13123 -11126 16798 3896 -18809 3298 18080 -9318 -14550 13890 7678 -18411
837 -18411 -970 19473 -5345 -19050 9834 13791 -14265 -7143 16953 197 -17462 5839
849 5839 15549 -10637 -10130 14887 4298 -16307 2339 16070 -7150 -12200 12533 7074 -15819
862 -15819 -1010 16728 -4501 -14873 9885 10139 -14847 -5260 16863 -907 -17036 6165 13410
875 13410 -11999 -9049 15717 3128 -17329 2682 16226 -8591 -12201 14318 7830 -17330 -1673
888 -1673 18739 -3224 -15922 9546 12352 -13986 -7251 16601 1932 -16636 3867 13806 -9484
901 -9484 -10696 12587 5454 -14249 -325 12410 -6041 -10587 10327 6908 -12817 -2136 12581
914 12581 -4007 -10660 9930 8687 -13035 -4383 14338 -453 -12582 6846 10942 -11553 -7176
927 -7176 14145 1971 -14756 4369 14275 -10427 -12762 13418 8160 -15227 -2131 14857 -5434
940 -5434 -15130 10674 13226 -13524 -8703 14721 2271 -15333 4000 15017 -7342 -11682 9726
953 9726 6164 -11552 -11 12763 -3909 -11608 5882 6809 -7835 -391 9891 -4449 -10656
966 -10656 6519 7804 -8199 -1913 10147 -3626 -11703 7147 10457 -8815 -4982 11047 -1521
979 -1521 -14056 6386 14449 -8444 -10479 11354 3778 -15383 1476 18153 -4770 -16632 7091
992 7091 10582 -12021 -4662 17042 1121 -18981 596 15594 -3964 -9658 9710 5977 -13695
1005 -13695 -4091 13167 1621 -8545 4035 5034 -9235 -3763 10504 3080 -6390 1455 1966 -7315
1019 -7315 225 10465 -23 -8283 2323 3044 -8550 -337 12999 -729 -13365 1705 8119
1032 8119 -7766 -3669 14522 2039 -17810 -618 15725 -3262 -10536 11580 9227 -16638 -8348
1045 -8348 17593 5743 -13120 2998 11597 -10757 -12827 13701 12269 -11618 -7590 8416 -1641
1058 -1641 -10450 5649 11286 -6033 -9306 2835 1549 -3191 4938 6343 -5783 -5884 3320 1511
1072 1511 -841 6701 3348 -8499 -3593 7268 314 -3858 7872 5103 -13402 -7177 12438 4980
1086 4980 -9911 1962 8809 -11667 -12553 13172 12096 -12524 -6931 11017 -2640 -14379 8250
1099 8250 17921 -8003 -15007 7866 8018 -9667 -195 15293 -753 -15542 279 10739 -1835
1112 -1835 -3705 6998 699 -10855 -2432 7743 2360 -1414 1096 -3558 -6856 2067 6256 -569
1126 -569 -895 1785 -5658 -6476 7358 8547 -5315 -3917 6048 -3086 -10144 7620 14647 -6632 -12035
1141 -12035 6764 5039 -10543 1198 16642 -2311 -17737 2213 12663 -5950 -6795 12714
1153 12714 4393 -17635 -5464 15164 3997 -9723 2211 6156 -8985 -6938 10473 7421 -6944
1166 -6944 -3449 3225 -2895 -3386 6318 5113 -3237 -3183 -934 -2290 2211 7574 345 -6531 -293 1519
1182 1519 -3864 2011 9783 -1297 -11474 433 7437 -3751 -3108 10042 1576 -14638 -2684
1195 -2684 13210 488 -9608 5354 7885 -11482 -8616 13114 7971 -10090 -2805 8706 -4519
1208 -4519 -10110 8876 11947 -7187 -9477 5187 2838 -5442 2618 7959 -3642 -8000 1538 3736
1222 3736 -1537 1904 3413 -4174 -4959 2302 2451 -710 2812 1635 -6572 -3603 6006 2483 -3852
1237 -3852 2841 4273 -7505 -5930 8618 5872 -7090 -1255 6743 -4532 -8722 7775 9944 -7541
1251 -7541 -7577 6948 1853 -8950 2626 11530 -4154 -11447 3919 7467 -5237 -3052 8160 349
1265 349 -9428 -58 7799 -876 -3437 4014 772 -6567 -150 6109 553 -2907 1456 -356 -4156
1280 -4156 1761 5327 -1274 -3263 2344 -439 -5154 2241 6528 -2637 -5759 2683 2159 -5162 1022
1295 1022 7583 -2271 -8081 3407 5709 -5267 -2798 8278 1006 -9578 177 8580 -1847 -5616
1309 -5616 5414 3816 -7965 -2466 8844 1566 -7146 968 4844 -4283 -3829 5922 2795 -5772
1323 -5772 -1132 3744 -2112 -2799 4260 2049 -4947 -572 3713 -1945 -2432 4510 2117 -5225 -959
1338 -959 4595 -966 -3012 4098 2495 -5968 -1540 6233 -34 -5044 2344 3630 -5337 -3097 6275
1353 6275 1531 -6456 517 5419 -3741 -5306 5540 4334 -5997 -2295 5573 -495 -5469 3419
1367 3419 5614 -3921 -4039 4278 1683 -4152 1210 4312 -2812 -3840 3458 2196 -3855 -111 3573
1382 3573 -2452 -3757 3139 2349 -3906 -524 4032 -1916 -4174 3139 3641 -3515 -1507 4162 -718
1397 -718 -4464 2873 5052 -3626 -3036 4198 992 -4686 1808 5271 -3147 -4874 4242 3237 -5168
1412 -5168 -1049 5633 -1107 -5939 2180 4061 -3614 -2596 4502 373 -5300 670 4846 -1463 -3354
1427 -3354 3059 1609 -4128 167 4510 -1087 -2949 2486 1757 -3580 -3 4817 -682 -4162 1750
1442 1750 2718 -3174 -998 4272 -448 -4593 1065 2973 -2942 -1838 4222 298 -5095 533 4404
1457 4404 -2062 -3094 3729 1828 -5208 -623 5566 -65 -4173 2346 3238 -4274 -2238 5562 2132
1472 2132 -4565 -358 3639 -1704 -2638 3603 2039 -4100 -1227 3210 -1113 -2626 2988 2031 -3753
1487 -3753 -1607 2891 -307 -2531 2585 2340 -3784 -2300 3490 740 -2437 1740 2259 -3920 -2322
1502 -2322 4422 1683 -3313 328 2835 -3084 -2879 4166 2657 -4102 -1139 3867 -1483 -3950 3478
1517 3478 4270 -3896 -3572 3378 828 -3658 1380 4575 -2575 -4610 2328 2711 -2038 -109 2959 -1737
1533 -1737 -3874 1810 3432 -1154 -673 2003 -1291 -3100 1989 2973 -1355 -859 1679 -1492 -3031 2558
1549 2558 3552 -1846 -2151 1455 -842 -2982 2505 4226 -2860 -3753 2162 888 -3246 1626 5007 -2170
1565 -2170 -5583 2084 4057 -2601 -999 4419 -335 -5855 313 5259 -277 -2879 2108 1012 -4432
1580 -4432 -989 5155 1286 -3191 -469 645 -2432 -428 3700 1066 -2723 -1252 459 -1044 878
1595 878 3294 -3 -3119 -406 902 -815 1216 3370 -1049 -4250 294 2585 -1037 -337 3469
1610 3469 -552 -5510 167 4891 -487 -2773 2700 1337 -5408 -1720 6097 2307 -4371 -410 2496
1625 2496 -2997 -2822 5059 3891 -4349 -3510 2487 723 -2079 2106 3181 -2430 -3726 802 1549 -7
1641 -7 1171 1248 -2281 -2651 927 1616 532 1226 -421 -3055 -1181 2502 1145 -380 1163 -374 -3918
1658 -3918 -939 4605 1926 -2695 5 1364 -3223 -2041 5327 3194 -4300 -2577 3010 -421 -3329
1673 -3329 3212 4900 -3390 -5342 2243 3092 -2420 -6 4031 -1349 -5543 182 4315 509 -1461
1688 -1461 823 -527 -2971 219 3727 1320 -1263 -731 -805 -1051 1198 2211 133 -784 -743 -1633 -819
1705 -819 2743 2464 -1880 -1912 383 -886 -1375 3164 3151 -3152 -3793 2051 1576 -2452 963 4189 -2001
1722 -2001 -5725 1413 4816 -1031 -2022 3046 570 -5314 -655 5537 1463 -3621 -91 1428 -2270
1737 -2270 -1464 3716 2338 -3039 -2107 561 -2 -274 1684 1213 -2011 -1877 -24 540 1214 1586 -730
1754 -730 -2077 -188 519 -20 1347 2247 -1420 -3334 673 2757 -546 -423 2421 -749 -4475 -73
1770 -73 4605 83 -3070 1045 1600 -3679 -1619 4867 2300 -3907 -1668 2474 -685 -2345 2837 3422
1786 3422 -2859 -3339 1727 1773 -1283 610 2109 -1170 -2715 519 1925 208 -92 177 -1425 -1529
1802 -1529 832 1381 307 337 -663 -2138 -421 2274 723 -1217 228 247 -2004 -500 3258 1184
1818 1184 -2410 -460 1503 -1392 -1718 2986 2706 -3217 -2464 2334 965 -2291 989 3288 -1741 -3834
1834 -3834 1581 2853 -1270 -927 1856 -188 -2944 120 2803 14 -1726 262 151 -1551 133
1849 133 2016 300 -1239 -366 -555 -610 819 1369 -516 -1016 318 -161 -784 1128 1501 -1012 -1578 933
1867 933 297 -1178 1026 2196 -1545 -2628 1400 1849 -1469 -688 2165 -120 -3062 780 2930 -553
1883 -553 -2041 1272 1240 -2467 -600 2741 861 -2533 -261 1689 -825 -1001 1571 1059 -1586 -774
1899 -774 1053 -247 -583 1160 773 -1516 -640 775 60 62 891 -151 -1548 155 1259 -327 -712
1916 -712 1192 234 -1722 250 1770 -348 -1451 1017 672 -1847 -308 2567 455 -2349 264 1790
1932 1790 -1397 -1551 2192 1452 -2428 -1102 1735 306 -1693 771 1709 -1249 -1421 1420 1010 -1206
1948 -1206 6 1184 -694 -1100 739 1017 -673 -29 565 -407 -580 1030 684 -871 -346 585 -639
1965 -639 -783 1040 456 -1105 -103 941 -686 -848 1113 980 -1404 -629 1562 80 -1396 969
1981 969 1795 -1254 -1280 1641 1137 -1560 -413 1887 -329 -1886 582 1565 -1043 -1056 1155 188 -1680
1998 -1680 -127 1571 -435 -1310 475 456 -944 121 1009 -463 -1135 496 546 -638 456 1147 -163
2015 -163 -707 394 439 -419 236 1044 -404 -1143 390 623 -916 -57 1148 -554 -1548 676 1358 -1120
2033 -1120 -1096 1473 534 -1804 -231 1978 -45 -1570 710 1346 -1158 -726 1553 660 -1419 -85
2049 -85 1281 -396 -732 910 655 -1003 -522 881 -22 -660 620 331 -1080 -589 894 55 -487 318
2067 318 42 -1047 -381 678 145 -564 677 197 -1037 181 1416 91 -924 632 691 -1228 -569
2084 -569 1797 613 -1703 -196 1229 -570 -1050 1254 1132 -1511 -1244 1432 490 -1261 43 1301
2100 1301 -765 -1497 754 1263 -649 -483 715 -261 -882 470 1064 -194 -381 261 -98 -506 660
2117 660 815 -359 -264 -144 -398 -283 1062 366 -929 -139 229 -591 -551 1024 745 -1390 -870 1084 350
2136 350 -927 935 1831 -934 -1735 1248 1686 -620 -513 1538 49 -1977 164 2078 22 -1495
2152 -1495 466 629 -901 -556 1589 375 -1246 -525 377 31 -101 745 152 -851 -410 165 297 310
2170 310 403 -428 -579 58 140 20 563 530 -982 -953 709 757 -593 74 1125 -702 -1591 815 1842
2189 1842 -683 -1246 821 509 -1798 -202 2392 343 -2199 -127 1535 -579 -896 1438 1318 -1618
2205 -1618 -1211 910 650 -461 348 888 -735 -1236 469 1123 131 -249 -99 -354 -345 356 562 425 84
2224 84 -681 -832 333 707 -315 -82 476 -362 -1166 543 1643 -80 -1101 659 410 -1100 -453 1717
2242 1717 715 -1837 -718 1669 32 -1226 978 1357 -1461 -1707 1026 1377 -956 -477 880 -443
2258 -443 -1626 227 1512 -200 -891 -142 274 -575 -53 834 454 -636 -567 38 11 480 141 44 -93
2277 -93 -206 -366 317 712 298 -681 -229 562 -413 -502 1108 409 -1533 -823 1208 609 -935 77 1287
2296 1287 -560 -1567 976 1523 -573 -785 964 261 -1306 -159 1649 200 -1357 39 919 -482
2312 -482 -457 962 494 -826 -685 401 367 -50 193 273 -476 -267 85 343 104 -8 -320 -381 201 51
2332 51 -4 424 464 -730 -793 677 740 -469 -259 768 -154 -1166 232 1317 -313 -1082 445 450 -1003
2351 -1003 -411 1234 542 -1504 -388 841 25 -1047 588 720 -1058 -1008 566 736 -296 -360 479
2368 479 -196 -617 447 573 -108 -175 69 -68 -9 73 165 -124 -41 -102 -196 -73 450 60 -442 123 -21 -486
2390 -486 2 865 162 -685 -162 746 -256 -371 635 597 -835 -432 1081 225 -844 119 787 -314
2408 -314 -868 461 706 -449 -275 365 -82 -656 141 752 -75 -555 161 18 -305 25 641 89 -280
2427 -280 128 93 -266 166 442 -425 -194 116 255 -355 383 230 -489 -216 411 395 -429 54 568 -386 -647
2448 -647 376 475 -460 -306 541 -14 -779 167 721 -351 -714 558 524 -470 -287 707 30 -627 -11 310
2468 310 -266 -382 531 89 -297 42 128 -148 -62 312 76 -522 -1 616 -272 -167 263 66 -503 64 299
2489 299 -142 -359 5 103 -510 86 552 -131 -407 450 392 -433 -83 457 309 -666 -14 362 -342 -260 386
2510 386 326 -545 -129 475 33 -535 177 358 -191 -240 235 184 -203 86 163 -397 -270 257 280 -360 167 211
2532 211 -374 -373 478 365 -254 -335 194 24 -241 295 189 -537 -476 165 -91 -236 344 205 -465 -366 236 -33
2554 -33 -330 395 375 -444 -460 459 327 -204 -22 380 -280 -339 133 654 -90 -117 74 -83 -331 222 298 -61
2576 -61 -160 0 -64 -257 6 438 -126 -423 3 10 -243 101 380 -79 -346 -114 283 50 264 224 -228 -179
2598 -179 160 387 -160 44 162 -381 -438 287 671 -90 -489 85 -223 -574 73 877 -62 -646 -49 244
2618 244 -328 -254 529 39 -629 -272 401 172 96 428 40 -547 -118 401 227 57 -64 -172 -190 -111 280
2639 280 376 26 169 -160 -262 -117 386 252 30 -83 -363 -447 211 480 -95 -333 103 94 -448 235 1024
2660 1024 79 -743 -264 401 -274 -93 663 607 -690 -760 448 547 -244 -140 69 -392 -598 308 678 111
2680 111 -252 -165 -286 -338 104 543 187 -359 -209 -243 320 492 350 85 -58 -520 -197 541 572 317 -416
2701 -416 -214 103 -241 164 694 140 -832 -395 280 213 -138 555 594 -837 -642 585 945 -349 -446 394
2721 394 -286 -551 361 876 -178 -707 -200 58 -116 135 652 436 -743 -502 114 113 22 253 -66 -524
2741 -524 -423 103 535 234 -63 -325 -211 -153 272 316 624 -145 -936 -438 534 84 -263 15 291 -467 -686
2762 -686 456 1012 -216 -534 -59 -144 -486 411 1003 94 -927 -344 566 -9 -219 588 280 -783 -727
2781 -727 458 517 50 -48 155 -452 -490 378 631 215 -458 -317 -271 18 43 407 368 -130 -700 -236 237 253
2803 253 -112 -35 -167 -530 -242 419 645 -235 -417 121 -36 -157 218 878 89 -966 -193 526 93 -14
2823 -14 627 358 -763 -585 238 829 -272 -211 226 -209 -680 164 689 239 -407 -236 -20 -214 164 528
2843 528 51 -467 -626 84 478 189 131 -64 -104 -204 -87 422 574 -222 -636 -24 238 26 214 364 6
2864 6 -789 -197 533 177 -230 2 218 -536 -369 372 887 -178 -228 210 171 -365 65 862 167 -546 -197
2885 -197 288 20 206 226 193 -265 -356 236 308 99 97 -48 -218 -362 41 218 313 -35 -274 -130 161 220 151
2908 151 62 -197 -397 -161 291 164 -165 -184 96 -177 -341 226 462 -71 -593 -70 46 -284 -188 388 14
2929 14 -547 -252 438 126 -105 337 85 -338 -256 281 228 48 -143 37 -214 -47 211 218 221 -112 -88 46 36
2952 36 189 353 -39 -54 -313 -81 173 170 79 -179 42 -81 -264 127 425 -127 -511 -57 343 16 -47 131
2974 131 38 -398 -132 253 152 -158 87 229 -269 -352 64 290 -8 -120 181 104 -227 -12 336 88 -166
2995 -166 -24 -17 203 10 177 -68 -186 -259 -87 -165 14 227 15 -145 156 37 192 224 38 88 -37 61
3017 61 -68 30 10 95 -104 -221 76 105 -244 -21 131 -115 -154 78 356 -217 -27 46 -92 -28 26 124 60 -67
3041 -67 -204 90 34 -48 184 137 -243 -60 -29 -172 -14 188 -40 -169 -42 320 121 -25 -283 -6 -161 165
3063 165 10 -55 -53 21 41 -74 281 139 -73 -137 242 82 -202 63 322 -50 -340 -39 19 4 147 188 -9
3086 -9 -262 -213 172 103 49 203 -188 -202 -271 274 301 -32 -136 -45 -232 -32 -68 100 47 -69 -11 0 84 84 -154
3111 -154 96 -282 -1 -200 14 220 16 -60 -36 -66 136 221 12 30 -249 -143 130 180 -79 123 -159 -432
3133 -432 -278 372 236 -19 -158 -85 -59 -136 322 347 -69 -239 83 9 -93 129 269 -36 -218 -48 312 158
3155 158 7 3 -10 -218 -196 154 133 -28 -209 -70 -36 -62 90 176 278 -25 -118 -143 180 193 214 82 -59 -222
3179 -222 -63 153 341 -199 -194 233 -126 -146 366 512 64 -573 -75 84 -93 46 234 -8 -395 -137 166
3200 166 15 -121 77 -105 -241 -86 288 333 202 -183 -24 -233 -34 251 354 131 -58 -202 -47 318
3220 318 -74 79 -68 -77 -173 181 395 131 -252 -78 85 82 -68 244 233 -60 -602 -126 381 -63 -68 95 0
3243 0 -441 -327 411 286 -176 -132 110 -124 -77 329 454 -11 -371 -76 27 -157 7 156 -45 -183 -171 332
3265 332 82 360 283 5 -2 -270 278 558 463 -198 -210 24 174 -22 49 293 -144 -570 -128 261 85 -169
3287 -169 122 -23 -320 -78 435 330 23 -246 30 197 36 199 641 -193 -522 -99 107 -9 -80 259
3307 259 -129 -270 -166 219 357 -28 -6 65 -27 -84 168 165 170 -330 -170 -27 -35 237 224 230 -87 -189 -98 202 161
3332 161 -135 153 -120 -252 -63 346 317 -238 -423 55 2 -92 161 409 63 -433 212 194 115 -242 88 -176
3354 -176 -333 -212 319 248 -237 -73 87 -11 -251 157 358 36 -209 -88 111 -30 -47 241 31 -127 -204
3375 -204 -2 99 330 -169 -195 4 -385 160 203 307 -94 -277 -47 183 -89 -27 237 -35 -314 -54 429
3396 429 183 -221 39 -50 -277 -87 291 285 -164 -28 48 -63 204 75 267 -72 -258 -45 -26 117 23 65
3418 65 -33 -338 -94 114 127 -225 124 1 -27 -46 -64 275 124 -162 32 -71 57 -103 52 262 -87 -339
3440 -339 -120 123 90 -150 79 79 -131 -141 171 240 -17 -225 16 292 -35 79 -133 -54 -120 -150 85 -52 62
3463 62 -26 159 -162 -14 180 150 -28 -47 52 -29 94 277 185 -41 75 -31 128 78 130 86 42 75 -6 -153
3487 -153 4 -34 78 -105 190 -194 42 193 107 -159 -183 71 -43 -80 -151 155 3 -152 47 320 57 -94
3509 -94 -93 27 81 -8 65 -28 -72 44 100 -81 70 40 141 -23 7 -47 -127 20 -31 37 -7 168 -84 114 13
3534 13 79 53 248 111 -178 169 54 81 22 -199 -21 108 23 17 -129 -66 40 -65 -26 -168 -198 -35 128 2
3558 2 118 -59 -28 -250 -135 70 6 120 -15 -175 -29 -22 121 62 -217 -37 173 79 -93 41 -199 9 48
3581 48 61 -79 56 20 -181 -215 -171 -115 -82 9 57 62 -147 -82 -14 129 -145 420 80 -73 111 -122 96 -118
3605 -118 -187 186 -128 -76 -40 25 48 12 -57 126 -133 -134 134 -172 260 -77 -187 -65 -60 160 118 -258 106 27
3629 27 -42 200 78 91 -80 45 -239 -194 -170 -213 58 -41 -28 -5 -13 206 -26 30 -68 94 154 -220 120 99 -189
3654 -189 -154 128 -101 -110 30 -54 -2 -48 -240 11 236 -122 -85 -130 40 26 -102 24 -46 22 86 -77 5 84 6
3679 6 -97 -45 -37 95 -56 165 -113 -46 130 -75 5 -93 -112 107 56 7 -46 51 -276 -49 157 19 131 262
3703 262 -13 -153 112 -95 46 43 112 -247 -340 -148 85 -19 121 186 280 -30 -70 72 -154 154 90 143 -82
3726 -82 -119 -100 174 106 -9 18 117 -62 184 17 -79 98 -96 -98 223 24 276 148 -109 -145 -134 -62 70 162
3750 162 -224 -38 -11 -66 117 -81 -40 -205 -145 114 -138 -168 56 59 -108 70 40 96 -23 -5 -65 -65 -132 4 141
3775 141 193 56 -51 34 -117 84 73 161 -217 -25 38 95 203 -52 121 186 -137 11 291 81 31 -31 -122
3798 -122 -63 48 197 141 154 -121 90 -11 -170 27 103 171 -173 -143 -29 180 106 -184 -78 218 -154 98
3820 98 176 81 -121 104 133 -1 -8 -30 -17 -161 -224 65 27 -317 -119 75 -154 -149 -16 -17 -189 -142 -133 238 36 36
3846 36 197 30 317 -211 -83 129 114 -94 -100 76 -16 -110 187 197 203 -139 -12 328 -24 -118 237 35 -170
3869 -170 -173 -72 -56 41 201 71 19 -94 -44 -82 -83 7 13 -122 -235 30 155 170 -6 77 122 -321 -33 101 18
3894 18 68 -109 55 -12 51 29 44 -73 105 -131 -140 76 55 -205 -185 250 -61 -162 79 73 116 3 145 197 -106
3919 -106 14 129 85 73 41 -24 -8 -102 136 43 -35 -75 -29 42 -35 -70 -157 -134 122 -174 145 -39 -73 11 156 -52
3945 -52 -5 -91 -42 -94 121 59 -29 30 -133 -84 42 -47 11 46 -56 66 73 137 293 78 -75 83 -210 -41 -174
3970 -174 -79 140 -139 -28 -16 4 119 -45 -30 11 -52 103 -26 -69 -49 -48 -313 -81 -98 227 78 -230 66 41
3994 41 107 -34 140 -8 89 40 13 -80 -49 -86 44 74 4 -137 -15 -54 142 104 -4 -116 -70 -140 33 -52 122
4019 122 20 -179 -37 -37 -7 -9 109 -133 95 -60 86 39 74 -88 -26 22 -168 -17 -154 -109 -45 24 27 -85 -1
4044 -1 149 -122 40 39 36 -18 54 37 82 -207 -51 17 75 11 -2 -124 30 108 119 -21 -59 -70 -6 -51 22 -1 88 101
4072 101 -193 -71 122 125 199 124 -219 140 -11 98 -4 40 -9 120 -113 156 -27 31 18 215 96 60 28
4095 28 69 -71 -265 -294 191 -2 -84 70 -154 -82 79 11 -109 134 8 261 76 5 -242 -40 20 -31 64
4118 64 -57 66 16 18 -7 -15 120 74 -11 -105 27 -66 130 -67 112 5 -18 140 71 -77 55 13 57 155 -156
4143 -156 128 41 219 -12 7 106 -137 99 -68 -123 166 11 10 -40 -14 -126 -79 317 -6 -167 -19 5 0 -165
4167 -165 13 168 21 -209 -107 -143 244 68 -16 -142 19 55 -127 -40 111 -198 -18 11 79 41 18 35 -220
4190 -220 -21 107 263 -89 -209 -64 117 62 -72 -4 129 -174 -59 55 250 -23 -38 13 -74 -164 -15 18
4212 18 -132 67 -209 -222 -40 -137 73 82 -33 -41 17 93 72 -11 -99 167 -1 15 30 -16 187 39 158 217 -78
4237 -78 88 168 -28 21 -29 121 128 81 -41 -197 -50 -14 -32 -42 105 87 16 -32 -179 126 169 -10 -96 41 -48
4262 -48 -83 85 -154 -115 11 -49 104 10 165 -92 -158 -4 -167 61 -19 -85 44 -68 -2 -16 -134 -27 -9 114
4286 114 51 -5 31 -24 51 32 6 73 67 43 22 52 -136 225 54 52 26 -153 162 -145 26 -2 -140 -143 3 -46 -243
4313 -243 -74 0 -211 109 250 -66 -242 -187 55 163 185 -116 142 -159 167 99 132 361 3 -135 -85 93
4335 93 -41 -48 95 -125 -97 -189 -49 73 27 102 -43 -163 -10 85 231 88 4 -154 43 49 -35 179 123 -120
4359 -120 -73 99 183 -69 -41 80 -168 -196 -105 149 85 2 -72 77 184 58 -32 91 149 -100 3 12 -15 -102 81
4384 81 78 -274 -148 134 -220 36 -21 -63 8 80 9 113 -113 -58 -48 -227 69 -51 16 -58 -4 -68 -31 291 195
4409 195 -82 74 -216 -177 -55 198 10 -3 51 -39 -104 -188 -157 -5 -16 -196 -124 -41 -60 -20 101 -10 89 -99
4433 -99 23 109 99 86 -54 -121 2 -13 81 -87 58 97 -53 43 68 83 -83 -13 56 63 5 4 167 -29 68 -1 52
4460 52 -39 141 27 -68 213 45 -74 55 25 -105 -94 -27 108 13 -272 -182 -113 -60 -7 98 -86 -131 -32 22 5
4485 5 71 142 180 -64 -84 -93 -101 30 118 -9 0 78 60 -95 120 80 -92 -247 90 -37 82 116 -112 -86 112 -111
4511 -111 -169 -77 -103 -17 -181 -211 45 -114 82 16 -79 -218 53 -118 -169 -106 -25 125 -219 147 46 75 -147 92
4535 92 -32 -49 12 4 -106 -47 -95 -139 -159 -51 25 -173 -79 -30 122 -26 -18 129 75 122 -87 162 -66 -106 133 265
4561 265 157 -9 89 -151 -10 240 39 112 -188 102 -42 254 73 46 22 -6 -40 -134 -30 -110 21 101 -42
4584 -42 10 183 223 -106 -154 -297 -8 107 25 4 49 151 -190 -108 -175 15 167 -69 -120 23 59 -39 43 -87
4608 -87 39 -44 -90 -157 72 -198 172 -207 -84 28 -33 90 140 -101 -13 97 -25 -148 -37 123 -74 -26 -29
4631 -29 21 13 -4 -42 54 61 72 -26 37 -163 -2 235 25 -55 207 49 -81 95 185 -7 -46 -86 -118 8 44 -108
4657 -108 138 -47 115 -64 33 -159 -100 159 -19 175 -10 16 -74 -17 95 134 -201 42 67 -36 52 51 -135
4680 -135 -118 167 -3 5 51 -97 -250 16 -83 67 69 34 52 -176 53 -39 10 36 19 160 20 -61 12 29 -28 -55
4706 -55 13 -61 179 179 -88 59 53 -126 108 97 -198 133 130 -74 -139 -58 23 -178 17 -2 -70 -9 59 112 -38 -93
4732 -93 98 -10 -154 -16 152 -53 -94 39 -27 185 -68 -144 -4 90 79 -40 -23 107 43 -155 164 -96 -58
4755 -58 47 -48 69 -69 77 150 -46 -125 33 -58 -23 5 -135 -257 141 44 256 -99 119 81 -96 -30 58 -147
4779 -147 -10 -60 124 129 -143 -33 -26 74 77 126 -217 54 -39 136 92 -52 186 -150 65 -68 -43 -4 30 -109
4803 -109 149 -40 14 53 -195 -72 50 -5 -143 34 -85 -158 -9 124 33 -96 -18 -168 26 24 -39 -7 5 251
4827 251 196 -11 61 236 92 -81 121 -37 -35 147 148 22 -45 201 -39 -23 95 27 -69 -81 36 -107 53 83
4851 83 -98 137 -32 89 4 98 77 109 119 -215 -149 -18 64 -76 242 202 -70 72 80 21 -24 14 22 52 -120 -173
4877 -173 -22 -169 -221 61 3 17 64 -34 -58 17 -1 -32 42 -41 -75 -123 -25 -3 -181 -168 39 -19 128 -196 172 -32
4903 -32 -32 78 249 -73 200 -53 -114 -26 19 79 -141 -20 1 28 136 9 11 47 31 26 -68 -63 122 9 67 76 -55
4930 -55 24 118 -94 -87 -7 -82 35 61 2 -62 -102 91 26 180 -43 16 -135 179 10 -35 57 -58 16 -28 -155 205
4956 205 -56 -66 -165 -180 -89 162 134 -114 -58 -125 27 1 15 -10 -12 -160 127 45 236 -34 -76 176 -44 -200 -5
4981 -5 126 181 -77 107 -147 -58 -112 113 210 123 91 -64 127 -24 28 15 -49 12 73 -30 -52 48 185 -60 70
5006 70 47 -170 -87 -35 274 -169 -142 119 52 -184 58 160 -170 76 -158 29 -151 -41 -11 -125 33 19 -23
5029 -23 -24 11 -96 -175 64 -52 -58 -37 73 -78 124 -157 199 -43 62 110 -128 117 61 133 -127 114 -48 -125
5053 -125 75 76 -169 59 -75 31 -65 10 2 -220 150 -65 47 -96 15 -94 11 85 -37 -35 90 106 34 9
5077 9 -66 -78 -1 109 -7 69 25 264 -128 -61 156 96 -120 -66 46 -9 -88 0 113 -99 -167 -30 -63 -111 -30 -123
5103 -123 -53 162 43 2 -197 -59 -127 29 -4 -56 -100 87 40 -150 -133 -113 -71 -126 60 26 298 -111 -79 -51 -101
5128 -101 -39 134 -147 -43 157 26 -49 -23 14 8 67 39 -17 115 122 35 44 50 38 -112 22 91 -48 103 40 26 88
5155 88 40 -77 149 142 23 -80 121 84 23 282 -156 32 2 -124 -29 -26 7 -26 85 64 117 -23 -136 23 93
5180 93 -36 5 -197 -18 119 92 56 -157 52 210 -60 -64 115 -160 -3 56 215 18 -108 -188 -201 26 -75
5203 -75 56 17 176 -90 -149 167 32 -196 -28 129 23 -133 -111 5 -83 -42 -49 -155 21 14 -177 127 90 -75
5227 -75 68 -35 5 -60 152 197 -41 185 18 69 114 85 49 -171 111 117 -249 218 93 134 94 25 48 7 -34
5252 -34 26 107 -71 55 -108 -20 167 -79 -49 142 59 -19 14 84 -84 -21 -8 32 60 -154 68 13 -39 86 96
5277 96 -102 64 -171 52 30 -66 -112 0 -63 -35 86 69 93 -104 -101 42 -40 173 -66 -23 43 -168 94 2 133
5302 133 68 82 40 217 -163 70 54 -122 119 -94 -60 59 66 -142 43 -42 75 -30 68 -54 35 44 -110 258
5326 258 -126 -168 -230 -116 50 179 15 -23 -69 26 66 133 124 31 93 -82 173 140 -43 20 162 -122 73 -144
5350 -144 8 -61 -83 -32 -55 24 -44 11 -20 45 40 1 112 65 -16 57 133 -40 -176 -80 69 -126 187 -208 -35 -25
5376 -25 129 12 -68 -110 207 -85 -44 166 -34 135 -161 53 -12 -51 0 2 -71 107 -148 -126 16 -81 -129 -3
5400 -3 -110 -26 -89 -34 183 33 152 -225 -47 -161 2 185 19 235 -81 -67 -9 -30 79 -23 197 -3 -85
5423 -85 -126 -21 -159 29 85 -153 85 -21 -34 -4 98 212 151 -6 -105 151 -48 -27 0 50 -5 -202 115 -72
5447 -72 -178 -6 -238 124 95 -18 11 123 -330 -42 119 125 -26 215 -53 -137 56 -13 112 -82 19 152
5469 152 22 -47 -91 45 -11 -5 -225 -27 29 41 104 22 -23 165 236 79 116 73 16 -110 -118 -19 97 -2 21 134
5495 134 -58 52 96 60 5 -79 -29 15 86 116 -107 -159 50 -82 66 58 -6 68 132 38 247 -28 10 -87 -19 93
5521 93 -366 211 -96 -22 -115 4 -124 -34 55 16 82 -27 -66 154 11 -8 -69 -147 -116 -194 -204 -126 -26 -29 -24 85
5547 85 63 -107 14 -53 91 92 166 -12 -85 112 -112 255 -12 -358 -133 -11 -42 -39 139 -54 93 -124 -13
5570 -13 -51 13 -111 -151 -9 162 -94 -52 -16 173 8 147 100 -27 232 -35 31 11 -112 -142 275 56 -20 43
5594 43 52 206 -58 133 54 -70 -31 -40 -265 -14 -330 -169 21 -105 28 -18 -10 -30 -73 81 185 41 -12 127
5618 127 -63 -246 10 60 -84 -78 -91 134 -69 57 -16 44 -180 206 -21 -147 149 -133 -158 -10 -24 -1 77
5641 77 120 -5 -121 106 -35 37 15 136 35 -144 -111 -113 97 -48 144 54 -75 109 156 93 -73 94 -173
5664 -173 3 118 95 -252 77 43 -59 61 28 1 114 -80 85 19 -164 -32 122 142 13 -127 -73 18 96
5687 96 -37 64 -5 -17 63 -152 53 -33 -15 147 -120 2 79 -21 0 -75 30 -138 217 203 -152 -108 92 -18
5711 -18 -34 -162 108 48 -93 149 -87 131 106 -79 -64 -128 -31 -38 115 136 -5 61 28 99 24 -19 32 90 69 130
5737 130 145 -3 -92 -37 -146 59 97 183 -1 -83 163 -61 22 -90 -187 109 165 26 116 0 -189 79 46 -106
5761 -106 59 -73 -15 43 -45 -39 -128 -16 139 103 -35 39 -63 60 170 -84 196 123 92 17 89 45 -16 25 -24
5786 -24 -71 -212 -56 161 -122 63 86 41 40 31 193 -136 93 151 192 -52 18 -72 123 -15 -172 166 -71 52
5810 52 -15 -80 224 -89 29 -48 -13 -26 -15 77 -220 27 -32 67 145 -192 48 -45 24 97 -49 132 -74 218 42
5835 42 59 223 115 87 93 32 -211 159 -95 -151 100 -117 -122 -35 19 98 8 -225 -65 -45 -77 -22 -61 -46 49 -87
5861 -87 -16 101 53 101 -13 80 54 251 32 -202 99 50 -91 -78 25 -32 24 18 114 -196 69 -26 -15 -181 -10
5886 -10 63 -20 121 100 29 -236 159 142 -21 71 -192 -202 -2 101 40 -65 216 17 -127 -9 59 114 -104 -1
5910 -1 108 -91 44 53 83 -90 85 144 100 -112 212 195 -120 91 -55 -19 31 239 -141 44 2 -74 7 80 161
5935 161 -40 260 33 -1 283 -128 40 77 1 -15 -7 -131 134 -93 225 -130 -89 73 39 253 -29 188 -179
5958 -179 -134 -27 -48 -107 222 -76 -135 73 115 21 197 -281 115 -9 53 -118 39 -111 -287 -22 -6 -106 -138
5981 -138 54 -43 -122 -241 7 -195 -107 -25 224 0 64 105 36 135 -195 -63 263 -44 136 -100 257 -43 113
6004 113 27 -89 95 -60 -12 10 99 -5 -112 -46 -14 -183 -45 10 74 136 -122 277 90 144 82 -95 173 -170
6028 -170 87 -108 -43 -78 -131 263 99 176 -36 -273 188 -31 86 -180 -24 37 59 -140 -161 24 69 122 183
6051 183 70 -96 77 85 25 96 26 -68 -48 -141 43 -142 147 4 26 -80 -47 -35 36 -173 -242 0 237 -9
6075 -9 -3 -155 -52 51 -123 144 88 -22 -45 -3 -51 110 -50 238 -166 44 -142 5 -99 15 66 -256 52
6098 52 122 58 77 -37 -1 156 154 -44 -31 26 70 -10 -201 -150 -110 -14 119 205 -114 101 -51 53 37 128 -60 61
6124 61 202 27 -45 116 -105 42 5 34 -20 174 -72 125 76 138 82 -125 -5 -171 -146 -33 12 -129 3
6147 3 -172 -190 87 -54 108 -90 -13 -115 -35 82 -154 -72 -136 -26 -67 24 38 2 -25 -135 92 -147 -151 -30 -17
6172 -17 142 -200 -163 300 -109 -22 58 87 -18 -126 106 26 -1 -109 -120 -38 15 26 -153 6 8 40 47 223 92
6197 92 7 -103 -36 -118 -87 -83 -195 3 -300 167 85 -98 -47 -40 -103 -41 -120 285 -272 -123 103 59 23 163 33
6222 33 -95 -78 103 -29 -53 70 102 -41 116 17 -24 -31 73 97 -143 -49 -76 -64 -111 7 117 19 16 155 -177
6247 -177 -17 -118 -40 23 -35 197 68 130 48 219 31 -72 85 85 174 32 63 -220 -43 61 -132 50 -56
6270 -56 -147 29 18 17 173 33 209 -55 26 207 -93 -49 8 -97 -99 -107 -69 66 -203 -113 92 -36 57 -18 -123
6295 -123 -1 -155 -127 13 82 69 108 209 11 248 -1 26 32 -93 -42 113 35 -48 -138 24 -226 -69 56 -27
6319 -27 -113 -157 -120 5 222 224 -22 -120 10 182 64 -80 -31 31 1 191 69 102 -144 40 -42 97 79 59 -88
6344 -88 -29 63 -193 156 48 -36 115 -72 147 -142 -84 -27 158 58 16 -70 44 -176 -10 10 -179 27 40
6367 40 64 63 -74 -139 22 -67 -57 -253 107 -214 146 53 50 -22 -63 115 -102 -136 17 -67 -28 6 -56 -119 42 41 114
6394 114 -88 153 180 180 -53 -51 62 -118 -101 -248 -16 -170 50 51 0 -44 46 -161 147 0 39 49 100 -68 -164
6419 -164 -66 36 123 51 55 -156 124 9 -87 98 -70 93 53 -76 169 -49 -217 -40 -51 1 -15 -41 114 -5
6443 -5 -6 -105 -60 42 39 78 -108 -106 43 -153 -144 65 -81 159 84 -179 131 23 -115 12 43 -70 189 22 75
6468 75 -156 -41 -32 113 -138 88 51 131 -19 96 -145 -176 106 138 207 97 -74 74 -25 112 59 23 64 -39
6492 -39 105 -113 104 104 51 -126 -23 117 -52 -18 31 -111 -34 113 -125 218 -40 118 -25 -144 99 -217
6514 -217 161 -1 -1 32 -64 -34 -101 33 11 47 87 60 -7 28 85 163 15 109 -7 -26 7 -206 73 86 -92 163
6540 163 -28 -3 64 -82 -2 100 201 -107 174 90 38 178 -22 14 104 195 -68 -17 105 -120 -5 -99 -98 -95 -117
6565 -117 -6 151 -110 -162 -52 86 56 -40 -5 -13 -23 -122 -141 -38 -56 -36 47 -44 36 -94 -173 -218 -64 93 3 -44
6591 -44 -56 55 11 -35 70 -62 77 71 -43 123 161 117 67 -95 -79 13 -132 -8 -96 13 -97 22 13 -73 -29
6616 -29 -103 -108 -83 198 -132 -207 -173 39 -78 0 -21 31 98 61 42 -49 -129 -187 108 202 -84 -96 -72 57 -93 213
6642 213 185 8 95 23 -116 108 -105 -37 7 -13 -53 70 -132 -98 39 -46 44 -52 -194 -56 -267 26 35 -11 143
6667 143 65 64 -103 34 -46 31 -125 -15 103 118 -11 63 -39 75 87 43 -97 -44 150 -87 -116 28 74 98
6691 98 -131 -25 66 -29 -169 -36 7 -130 -62 -116 -38 179 86 -199 -3 30 -87 113 144 39 -75 169 42
6714 42 86 -67 -143 -46 -3 -52 270 117 205 -26 74 200 -99 19 55 -11 215 -162 -65 25 -100 55 204 -21
6738 -21 -102 12 -3 84 62 -71 -47 121 16 -101 172 94 -27 -102 162 -98 27 209 -98 -70 40 -169 -4
6761 -4 234 30 -57 45 24 22 -123 17 84 -149 123 -67 189 74 75 -43 31 -36 139 -150 10 131 -66 24
6785 24 -14 6 -106 0 -68 38 -106 -28 140 77 -136 45 -205 118 -16 -148 -23 251 18 -152 -52 31
6807 31 -4 -72 146 -28 93 109 3 73 266 263 101 185 11 55 -82 -8 -63 107 -44 -106 -57 85 129 167 181
6832 181 -166 23 5 -25 132 108 -104 -29 227 -65 97 -44 99 171 111 105 -134 -148 -130 30 -187 -83 84
6855 84 -122 20 13 -98 -81 46 68 -24 77 -279 0 60 -27 -199 71 -66 70 214 -113 -41 83 -124 -73
6878 -73 53 70 -113 -37 -141 111 -185 36 -31 93 59 67 96 -19 -58 -38 -116 9 38 84 97 -117 -6 -183 -39
6903 -39 53 -69 -126 -26 6 -36 12 14 -50 -111 -4 -109 64 -135 11 36 -81 -184 12 -19 -28 -16 70 -120 -131 113
6929 113 -37 -43 46 191 81 -159 64 93 19 126 -21 -113 -37 -47 -322 43 -17 -55 -52 45 -151 -15 10 53 109
6954 109 -10 25 -127 -39 74 186 156 80 -36 -122 10 -162 -52 -95 105 35 -113 -116 -78 66 112 -61 21 -8
6978 -8 97 -128 -137 80 -66 -36 -172 -220 81 -43 45 -27 85 -100 96 -30 190 53 -66 141 145 7 -23 30
7002 30 -87 131 92 201 -105 -77 -101 -13 218 104 -24 -127 -15 -58 -41 78 -32 9 49 54 -84 167 51 -24
7026 -24 -42 -117 70 -30 12 54 76 -45 -49 138 -47 115 -129 -136 -7 -41 -122 48 161 65 98 12 2 -40 168 -51
7052 -51 -29 -72 -23 -95 -62 -23 -43 -60 64 90 117 28 54 66 -20 63 146 -14 -116 -195 -50 -96 -89 53 22 71 115 -185
7080 -185 66 -55 -144 93 -35 15 -1 61 101 45 20 59 33 41 -285 43 106 286 133 103 -32 -22 95 78 -33
7105 -33 -81 68 -174 95 46 -255 -49 -10 -14 119 -265 47 16 -107 104 -66 -108 -129 -131 -67 -56 65 -115 115
7129 115 16 53 -176 108 57 -14 -59 128 111 161 117 185 -79 148 29 63 -79 10 -3 85 -224 -37 -190 -51
7153 -51 1 -40 56 -212 -126 -95 -22 29 -5 -10 96 1 104 11 -134 -106 58 -44 62 85 153 20 -48 -149 -8 -11
7179 -11 -77 -18 114 -134 -161 43 2 147 87 -45 96 -108 49 -150 -255 82 95 71 -304 -3 -25 -40 -117 43
7203 43 -93 98 -176 20 -57 -176 -103 -19 -49 17 106 -105 -16 -19 102 26 -155 -39 27 -22 59 -91 -17 101 131
7228 131 110 -11 -113 22 261 -50 -119 41 83 129 56 -17 61 -12 135 -176 -97 -43 -15 -37 5 -141 66 136 -88
7253 -88 69 68 61 -160 -23 89 -16 -124 -131 -44 -257 -51 -20 27 147 178 -91 40 -54 -87 -24 -103 -98 33 -10 132
7279 132 75 -6 -85 74 -135 -349 102 156 33 112 57 -71 -9 -31 -219 16 31 -120 109 -160 36 47 36 -56
7303 -56 88 23 -193 106 -84 56 -140 45 57 130 157 -62 85 73 0 -22 74 -37 13 -65 20 -54 12 13 155
7328 155 -87 -14 25 11 -26 -26 113 -42 -81 23 90 149 95 64 194 -41 43 64 -17 314 14 26 17 73 67 -102 33
7355 33 -2 152 127 -9 -128 -124 125 0 93 107 111 26 -38 -98 -93 -46 -65 -3 -44 -112 328 -54 123 34 -93 36 -206
7382 -206 55 59 77 141 55 7 -56 149 -57 91 69 -33 -98 32 88 -42 72 73 10 -78 -126 167 -45 15 -70 -240
7408 -240 -36 -25 -45 -168 -114 -52 257 -29 -21 85 38 146 -117 47 119 -147 -69 14 -156 -4 54 138 -297 61
7432 61 76 17 68 -2 10 2 48 -33 188 104 39 -3 -114 -36 -22 -30 -112 -124 0 151 -118 76 121 -136 97 64 -127
7459 -127 -20 189 38 68 58 167 10 99 253 30 158 59 -95 234 -23 1 -85 120 23 156 143 -7 -42
7482 -42 8 -95 -19 133 7 28 135 -134 -55 56 -107 -107 104 -3 121 -28 88 -16 142 3 48 -195 55
7505 55 -263 3 164 -24 -146 -91 99 -156 -41 79 -22 -152 42 -79 -80 0 -90 116 -2 -92 79 -76
7527 -76 112 84 -37 -70 -177 141 -82 134 -9 13 -24 242 -92 -26 -93 -61 -83 -106 -35 82 -90 55 78 -130
7551 -130 10 28 93 -88 -34 -45 -233 101 -43 -80 78 51 -26 84 -132 -9 5 75 237 -8 -45 -89 134 -162
7575 -162 -132 10 291 264 -137 161 -26 -44 285 -79 32 119 156 -165 -211 35 -163 114 -12 5 147 -16
7597 -16 6 97 69 168 29 109 76 -217 9 44 32 -83 75 23 137 -84 95 -47 40 -84 -76 70 -3 -50 51
7622 51 -9 -107 -102 -59 -75 12 -74 -86 -126 59 8 -101 113 -93 108 29 9 -20 190 -111 -1 -27 6 -40 -72 67
7648 67 98 -25 -98 11 -199 -93 8 51 4 66 58 155 70 -103 304 -32 -48 205 57 16 64 43 84 86 -69 -52
7674 -52 -99 -27 23 -89 -148 36 -141 -141 74 -35 60 -133 194 -16 -81 -62 -110 95 57 57 -14 24 -39 -80 69 -58
7700 -58 30 -114 -26 -20 -24 98 -145 -102 2 -230 -203 70 -177 77 -49 -4 -111 -151 -128 -78 -148 68 6 70 -42
7725 -42 46 132 -188 106 130 253 49 -1 -161 116 -92 13 -61 160 -86 118 263 36 9 -2 122 -3 37
7748 37 -125 282 -14 303 -191 -109 -123 -50 70 -39 -53 -40 62 224 20 88 -120 -89 -64 -188 37 51 163
7771 163 78 58 36 21 -50 44 -12 45 199 15 56 47 -195 44 227 -120 -35 114 -9 132 113 -124 -55 -90 -22
7796 -22 -60 69 116 -149 187 169 -85 125 143 -162 -88 31 4 189 123 58 47 103 3 62 -270 281 231 70
7820 70 71 -37 30 -30 -81 18 161 -111 83 -93 -29 70 106 21 -24 -169 -39 -98 89 102 -72 -149 -7 142 -44
7845 -44 113 -13 68 29 108 -38 16 110 64 -50 0 2 -98 -163 128 102 44 209 186 -13 31 -25 160 -96 -30 114
7871 114 -4 -101 73 135 172 93 141 91 -177 19 49 8 -36 90 171 -10 -186 17 -134 -150 54 233 174 -23
7895 -23 -149 -38 132 0 -22 107 103 220 -147 66 18 -149 -244 -26 40 -151 5 -95 -107 12 -75 163 55
7918 55 90 75 14 -77 216 -116 56 51 138 34 39 -146 -106 -34 -173 185 119 -61 80 114 -203 109 -76 95 60
7943 60 -77 139 167 -98 66 -98 39 -13 -159 111 -210 219 5 143 -54 77 -142 -65 -53 4 153 7
7965 7 38 36 100 56 -63 -121 127 -110 28 106 46 113 -106 2 4 -136 -48 108 164 104 10 -124 -42 -57 85 37 -153
7992 -153 121 18 -10 12 12 1 110 31 184 118 -68 -160 -181 140 -112 -148 -63 74 -220 157 196 37 -132 -83
8016 -83 140 -16 -126 -58 67 -115 5 49 171 15 -20 117 141 -118 2 -22 -41 -119 -138 244 -66 -36 -24 -5
8040 -5 -71 -53 88 -79 -144 61 -147 74 -94 28 100 -45 -51 61 92 66 -133 -43 37 -24 -22 -34 268 -49 -76 95
8066 95 155 102 -208 -16 66 -18 -64 7 -63 3 56 -33 143 -24 180 79 -65 35 -176 101 -152 -62 0 -40 46
8091 46 121 37 -32 56 217 90 -80 -74 147 -79 -121 -180 -75 -195 -105 -57 102 191 -60 99 -42 93 -76 -172
8115 -172 -30 61 -122 10 -57 100 102 -32 52 71 -32 -47 194 11 -118 -206 48 114 -52 -114 -68 126 -138 166
8139 166 196 -186 -28 19 75 -104 98 90 42 54 -72 -122 -27 58 49 -97 -5 59 -186 -5 -1 -73 -94 139 42 -102
8165 -102 98 -117 74 61 -61 -158 56 11 -34 -66 -83 -25 -35 82 39 247 165 142 22 -44 97 70 1 19 8
8190HP0
8191G8
##END NTUPLES=NMR FID
##END=
