##TITLE=1H_MetGLU2808-2
 CDCl3
 8 sc, 
 30.8.2023
##JCAMPDX= 6.0         $$ Bruker NMR JCAMP-DX V2.0
##DATA TYPE= NMR FID
##DATA CLASS= NTUPLES
##ORIGIN= UXNMR, Bruker Analytische Messtechnik GmbH
##OWNER= root
$$ XWIN-NMR		Version 3.5
$$ Wed Aug 30 14:10:31 2023 Russian Standard Time (UT+4h)  she@DPX200
##.OBSERVE FREQUENCY= 200.13135
##.OBSERVE NUCLEUS= ^1H
##.DELAY= (6, 6)
##.ACQUISITION MODE= SIMULTANEOUS
##.ACQUISITION SCHEME= undefined
##.AVERAGES= 8
##.DIGITISER RES= 18
##SPECTROMETER/DATA SYSTEM= spect
##.PULSE SEQUENCE= zg30
##.SOLVENT NAME= D2O
##.SHIFT REFERENCE= (INTERNAL, D2O, 0, 15.7039)
##AUDIT TRAIL= $$ (NUMBER, WHEN, WHO, WHERE, WHAT)
$$ ##TITLE= Audit trail, XWIN-NMR		Version 3.5
$$ ##JCAMPDX= 5.01
$$ ##ORIGIN= Bruker BioSpin GmbH
$$ ##OWNER= she
$$ F:/spectra/data/she/nmr/H-F/1/audita.txt
$$ ##AUDIT TRAIL=  $$ (NUMBER, WHEN, WHO, WHERE, WHAT)
(   1,<2023-08-30 14:09:30.92 +0400>,<she>,<DPX200>,
      <created by zg, POWCHK disabled, PULCHK disabled
       configuration hash MD5:
       00 E9 B6 7A A2 85 ED C7 34 08 36 98 17 FE 4E 26
       data hash MD5: 16K
       16 C5 BE BB B6 4B 0B 36 B9 54 48 61 E5 EE 68 E1>)
$$ ##END=
$$ 
$$ hash MD5
$$ 7E 67 42 BE 34 A2 B0 31 07 0B 97 71 DC 4A A7 1A
##$RELAX= 
##$RELAX= 
##$RELAX= 
##$RELAX= 
##$RELAX= 
##$RELAX= 
$$ Bruker specific parameters
$$ --------------------------
##$DU= <F:/spectra>
##$EXPNO= 1
##$NAME= <H-F>
##$PROCNO= 1
##$TYPE= <nmr>
##$USER= <she>
##$AMP= (0..31)
100 100 100 100 100 100 100 100 100 100 100 100 100 100 100 100 100 100 
100 100 100 100 100 100 100 100 100 100 100 100 100 100 
##$AQSEQ= 0
##$AQ_mod= 1
##$AUNM= <au_zg>
##$AUTOPOS= <>
##$BF1= 200.13
##$BF2= 200.13
##$BF3= 200.13
##$BF4= 200.13
##$BF5= 200.13
##$BF6= 200.13
##$BF7= 200.13
##$BF8= 200.13
##$BYTORDA= 1
##$CFDGTYP= 0
##$CFRGTYP= 5
##$CHEMSTR= <none>
##$CNST= (0..31)
1 1 145 1 1 1 1 1 1 1 1 1 1 1 1 1 1 1 1 1 1 1 1 1 1 1 1 1 1 1 1 1 
##$CPDPRG= <>
##$CPDPRG1= <>
##$CPDPRG2= <>
##$CPDPRG3= <>
##$CPDPRG4= <mlev>
##$CPDPRG5= <mlev>
##$CPDPRG6= <mlev>
##$CPDPRG7= <mlev>
##$CPDPRG8= <mlev>
##$CPDPRGB= <>
##$CPDPRGT= <>
##$D= (0..31)
0 1.2 0 0 0 0 0 0 0 0.06 0 0.03 0 0 0 0 0.0002 0 0 0 0 0 0 0 0 0 0 0 0 
0 0 0 
##$DATE= 1693390170
##$DBL= (0..7)
120 120 120 120 120 120 120 120 
##$DBP= (0..7)
150 150 150 150 150 150 150 150 
##$DBP07= 0
##$DBPNAM0= <>
##$DBPNAM1= <>
##$DBPNAM2= <>
##$DBPNAM3= <>
##$DBPNAM4= <>
##$DBPNAM5= <>
##$DBPNAM6= <>
##$DBPNAM7= <>
##$DBPOAL= (0..7)
0.5 0.5 0.5 0.5 0.5 0.5 0.5 0.5 
##$DBPOFFS= (0..7)
0 0 0 0 0 0 0 0 
##$DE= 6
##$DECBNUC= <off>
##$DECIM= 32
##$DECNUC= <off>
##$DECSTAT= 4
##$DIGMOD= 1
##$DIGTYP= 9
##$DL= (0..7)
0 120 120 120 120 120 120 120 
##$DP= (0..7)
150 150 150 150 150 150 150 150 
##$DP07= 0
##$DPNAME0= <>
##$DPNAME1= <>
##$DPNAME2= <>
##$DPNAME3= <>
##$DPNAME4= <>
##$DPNAME5= <>
##$DPNAME6= <>
##$DPNAME7= <>
##$DPOAL= (0..7)
0.5 0.5 0.5 0.5 0.5 0.5 0.5 0.5 
##$DPOFFS= (0..7)
0 0 0 0 0 0 0 0 
##$DQDMODE= 0
##$DR= 18
##$DS= 0
##$DSLIST= <SSSSSSSSSSSSSSS>
$$ [...]
##$SUBNAM2= <"">
##$SUBNAM3= <"">
##$SUBNAM4= <"">
##$SUBNAM5= <"">
##$SUBNAM6= <"">
##$SUBNAM7= <"">
##$SUBNAM8= <"">
##$SUBNAM9= <"">
##$SW= 18.05172834244
##$SWIBOX= (0..15)
0 0 2 0 0 0 0 0 0 0 0 0 0 0 0 0 
##$SW_h= 3612.71676300578
##$TD= 16384
##$TD0= 1
##$TE= 0
##$TE2= 300
##$TE3= 300
##$TEG= 300
##$TL= (0..7)
0 120 120 120 120 120 120 120 
##$TP= (0..7)
150 150 150 150 150 150 150 150 
##$TP07= 0
##$TPNAME0= <>
##$TPNAME1= <>
##$TPNAME2= <>
##$TPNAME3= <>
##$TPNAME4= <>
##$TPNAME5= <>
##$TPNAME6= <>
##$TPNAME7= <>
##$TPOAL= (0..7)
0.5 0.5 0.5 0.5 0.5 0.5 0.5 0.5 
##$TPOFFS= (0..7)
0 0 0 0 0 0 0 0 
##$TUNHIN= 0
##$TUNHOUT= 0
##$TUNXOUT= 0
##$USERA1= <user>
##$USERA2= <user>
##$USERA3= <user>
##$USERA4= <user>
##$USERA5= <user>
##$V9= 5
##$VALIST= <valist>
##$VCLIST= <CCCCCCCCCCCCCCC>
##$VD= 0
##$VDLIST= <DDDDDDDDDDDDDDD>
##$VPLIST= <PPPPPPPPPPPPPPP>
##$VTLIST= <TTTTTTTTTTTTTTT>
##$WBST= 1024
##$WBSW= 4
##$XGAIN= (0..3)
0 0 0 0 
##$XL= 0
##$YL= 0
##$YMAX_a= 568431
##$YMIN_a= -684701
##$ZGOPTNS= <>
##$ZL1= 120
##$ZL2= 120
##$ZL3= 120
##$ZL4= 120
##$ABSF1= 10
##$ABSF2= 0
##$ABSG= 5
##$ABSL= 3
##$ALPHA= 0
##$AQORDER= 0
##$ASSFAC= 0
##$ASSFACI= 0
##$ASSFACX= 0
##$ASSWID= 0
##$AUNMP= <proc_1d>
##$AZFE= 0.1
##$AZFW= 0.1
##$BCFW= 1
##$BC_mod= 2
##$BYTORDP= 1
##$COROFFS= 0
##$CY= 11.3945322036743
##$DATMOD= 1
##$DC= 2
##$DFILT= <>
##$DTYPP= 0
##$F1P= 15.7292609196834
##$F2P= 12.9074282941183
##$FCOR= 0.5
##$FTSIZE= 0
##$FT_mod= 4
##$GAMMA= 1
##$GB= 0.15
##$INTBC= 1
##$INTSCL= 1
##$ISEN= 128
##$LB= 0.24
##$LEV0= 0
##$LPBIN= 0
##$MAXI= 10000
##$MC2= 0
##$MEAN= 0
##$ME_mod= 0
##$MI= 1.114404
##$NCOEF= 0
##$NC_proc= 0
##$NLEV= 6
##$NOISF1= 3.799351
##$NOISF2= 2.8
##$NSP= 1
##$NTH_PI= 0
##$NZP= 0
##$OFFSET= 15.70392
##$PC= 1
##$PHC0= -21064.61
##$PHC1= 33.45272
##$PH_mod= 1
##$PKNL= yes
##$PPARMOD= 0
##$PSCAL= 0
##$PSIGN= 0
##$REVERSE= no
##$SF= 200.130013532006
##$SI= 16384
##$SIGF1= 3
##$SIGF2= 2
##$SINO= 400
##$SIOLD= 16384
##$SREGLST= <1H.CDCl3>
##$SSB= 0
##$STSI= 0
##$STSR= 0
##$SW_p= 3612.71676300578
##$SYMM= 0
##$S_DEV= 0
##$TDeff= 0
##$TDoff= 0
##$TI= <>
##$TILT= no
##$TM1= 0
##$TM2= 0
##$TOPLEV= 0
##$USERP1= <user>
##$USERP2= <user>
##$USERP3= <user>
##$USERP4= <user>
##$USERP5= <user>
##$WDW= 1
##$XDIM= 8192
##$YMAX_p= 0
##$YMIN_p= 0
$$ End of Bruker specific parameters
$$ ---------------------------------
##NTUPLES= NMR FID
##VAR_NAME=  TIME,          FID/REAL,        FID/IMAG
##SYMBOL=    X,             R,               I
##VAR_TYPE=  INDEPENDENT,   DEPENDENT,       DEPENDENT
##VAR_FORM=  AFFN,          ASDF,            ASDF
##VAR_DIM=   8192,          8192,            8192
##UNITS=     SECONDS,       ARBITRARY UNITS, ARBITRARY UNITS
##FACTOR=    0.0002768,     1,               1
##FIRST=     0,             0,               0
##LAST=      2.2672688,     0,               0
##MIN=       0,             -684701,         0
##MAX=       2.2672688,     568431,          0
$$ Real data points
##PAGE= N=1
##DATA TABLE= (X++(R..R)), XYDATA
$$ plain form
0 0 0 0 0 0 0 0 8 -8 8 -8 8 -16 24 -24 32 -40 48 -64 72 -90 112 -128 152 -184 216 -248 288 -336 387 -447
30 -447 507 -576 656 -743 839 -943 1060 -1187 1328 -1478 1646 -1829 2027 -2246 2483 -2743
46 -2743 3025 -3337 3675 -4048 4461 -4915 5418 -5979 6610 -7320 8130 -9061 10148 -11430
60 -11430 12976 -14877 17283 -20440 24782 -31152 41430 -60741 109525 -489659 -684701
71 -684701 501376 177175 -270492 88876 309748 -328444 -293867 452952 546561 -143259
81 -143259 -243680 99394 -5667 -288781 71368 388209 -38323 -420605 -27384 250730
91 250730 -15622 -40643 277114 94066 -305316 -100650 271719 66416 -182949 -25586
101 -25586 13513 -220776 -157490 141578 126399 -94129 -58301 80910 24964 -29396 98504
$$ packed form
0@%%%%%%Qj6J6j6J6k4M0m8N6p2Q8j12J36j62K02k40K80l36M00m64N36o24P23q34
30d47R54j083J232j399J582j782K003k247K515k806L124l475L856m273M729n226
46b743N768o362P012p723Q509r376J0333j1397J2589j3930J5450j7191J9209k1578
60a1430K4406k7853L2160l7723M5222n5934P2582j02171J70266n99184j95042
71f84701J186077l24201m47667L59368K20872o38192L4577P46819R3609o89820
81a43259j00421L43074j05061k83114L60149L16841m26532l82282L93221K78114
91B50730k66352k5021L17757j83048l99382K04666L72369k05303k49365J57363
101b5586L9099k34289O3286K99068j5179k20528L5828J39211n5946n4360J27900
$$ plain form
112 98504 147172 -21381 -126349 -22601 24050 -53165 -1837 108467 9860 -120259 -19888
123 -19888 97373 38700 20953 90392 6015 -130991 -60360 62027 26914 -34537 -22664
134 -22664 -46689 -93815 -22485 96652 81733 -14902 -38583 -11843 -10435 11480 74949 51163
146 51163 -77295 -106001 3137 53089 24309 43429 44434 -55622 -84745 48294 114210
157 114210 19392 -35351 -17705 -54434 -69027 32575 90959 -5731 -86801 -38601 7971 2801
169 2801 38523 72784 3645 -79319 -36011 50613 30882 -19697 -702 -4870 -59982 -33635
181 -33635 62642 63332 -16134 -17007 30179 6330 -15743 30636 35404 -33652 -55438 -6668 8190
194 8190 -17274 -2371 22400 -3111 -23929 4105 26344 8196 -5282 9950 4836 -25389
$$ packed form
112I8504M8668j68553j04968J03748M6651p7215N1328J10304r8607j30119J00371
123a9888J17261n8673j7747O9439q4377j37006P0631J22387l5113o1451J1873
134b2664k4025m7126P1330J19137j4919r6635k3681K6740J408K1915O3469k3786
146E1163j28458k8706J09138M9952k8780J9120J005j00056k9123J33039O5916
157A14210r4818n4743J7646l6729j4593J01602N8384r6690q1070M8200M6572n170
169B801L5722L4261o9139q2964M3308Q6624j9731n0579J8995m168n5112K6347
181c3635R6277O90p9466q73M7186k3849k2073M6379M768o9056k1786M8770J4858
194H190k5464J4903K4771k5511k0818K8034K2239j8148j3478J5232n114l0225
$$ plain form
206 -25389 -20089 8972 6962 -8453 1458 9065 -12562 -14744 23645 33770 6176 -1133 3836
219 3836 -11254 -16813 10546 23269 -10570 -33612 -12404 3740 53 10498 22992 682 -31326
232 -31326 -12997 27185 17738 -12255 -8724 -3009 -20581 -15515 26490 32259 -14463 -25833 8387
245 8387 15511 1060 12436 21415 -10409 -33355 -2512 24192 4641 -11753 -3360 -3122 -12910
258 -12910 -773 22744 13403 -14975 -12948 3864 1185 -3560 3146 1058 -14456 -12780 8097
271 8097 10154 108 2670 3715 -2330 1562 11373 8039 -4529 -3774 2290 -3594 -3977 3727 91
286 91 -8555 -5244 5499 5146 -3455 806 7217 -519 -5363 1636 3685 -7473 -11864 649 3599
301 3599 -7261 -3999 6420 3147 -1924 4780 11178 2478 -4448 3050 5277 -1391 -2250 89 -1402
$$ packed form
206b5389N300K9061k010j5415R911P607k1627k182L8389J0125k7594p309M969
219C836j5090n559K7359J2723l3839k3042K1208J6144l687J0445J2494k2310l2008
232c1326J8329M0182r447k9993L531N715j7572N066M2005N769m6722j1370L4220
245H387P124j4451J1376Q979l1824k2946L0843K6704j9551j6394Q393K38r788
258a2910J2137K3517r341k8378K027J6812k679m745O706k088j5514J676K0877
271H097K057j0046K562J045o045L892R811l334j2568P55O064n884l83P704l636
286I1q646L311J0743l53q601M261O411p736m844O999K049j1158m391J2513K950
301C599j0860L262J0419l273n071O704O398q700o926P498K227o668q59K339j491
$$ plain form
316 -1402 -4895 -2633 3088 813 -3122 173 1620 410 1793 3450 -18 -5617 -1986 1891 -4705
331 -4705 -4888 1936 -1787 -6726 1350 9903 2363 -5429 4182 8453 -2620 -2732 7569 3703 -8623
346 -8623 -5772 8446 4847 -8279 -2462 6845 -1609 -8583 2829 10651 -3837 -12322 3170 7384
360 7384 -6100 -5648 5592 1658 -10231 -3485 10311 3442 -6721 -57 5680 -92 -3353 3782
374 3782 7200 -2768 -6340 3077 5865 -420 -1531 2558 1025 -4920 -1711 3898 -318 -3894 -1856
389 -1856 -992 -719 214 167 -1224 -2145 12 -589 -1451 2137 1580 -2133 -1209 2546 3547 -452 -1580 3162
407 3162 2139 -2643 -241 4352 1969 -3565 -762 5124 -573 -5422 435 2742 -2254 -3473 1397
422 1397 1778 -4428 -3606 2941 1456 -2606 -1804 439 179 -2034 614 5171 1590 -2595 -647 3281
$$ packed form
316a402l493K262N721k275l935L295J447j210J383J657l468n599L631L877o596
331d705j83O824l723m939Q076Q553p540p792R611M271j1073j12J0301l866j2326
346h623K851J4218l599j3126N817R307q454o974J1412P822j4488q485J5492M214
360G384j3484M52J1240l934j1889O746J3796o869j0163O664N737n772l261P135
374C782L418r968l572R417K788o285j111M089j533n945L209N609m216l576K038
389a856Q64K73R33m7j391r21K157o01q62L588n57l713R24L755J001l999j128M742
407C162j023m782K402M593k383n534K803N886n697m849N857K307m996j219M870
422A397L81o206Q22O547j485m062Q02K243k60k213K648M557l581m185J948L928
$$ plain form
438 3281 2458 -1366 289 2592 -1282 -2092 1183 3254 1326 -3457 -2583 2951 2151 -2661 -2353 1432
454 1432 -874 -5759 -37 6159 -771 -6573 -1408 2776 -25 -2077 2989 4279 -3042 -3626 3609
469 3609 4483 -721 -2137 2731 1855 -3490 82 4538 243 -2933 749 3328 -1027 -3824 179 236
485 236 -3242 -435 1340 -1304 -2438 -1281 192 349 1240 1133 -2136 -1340 2544 1143 -828 88 2025
502 2025 340 -2650 2000 5871 -2150 -5981 2841 6894 -400 -3376 3723 1386 -8525 -2768 7878
517 7878 2663 -7151 -5748 1479 -666 -3850 3508 6151 -3142 -6775 1344 5974 1157 -1863 2250
532 2250 339 -4261 63 4678 882 -3452 -1687 2504 1822 1289 2825 -132 -2715 258 1929 1465
548 1465 298 -2263 -5206 -4523 1011 2202 -1957 -1014 948 -1852 -1957 2518 5880 901 -3799 1447
$$ packed form
438C281q23l824J655K303l874q10L275K071j928m783Q74N534q00m812L08L785
454A432k306m885N722O196o930n802N165M184k801k052N066J290p321n84P235
469C609Q74n204j416M868q76n345L572M456m295l176L682K579m355k797M003N7
485B36l478K807J775k644j134J157J473J57Q91j07l269P96L884j401j971R16J937
502B025j685k990M650L871q021l831Q822M053p294k976P099k337r911N757J0646
517G878n215r814J403P227k145l184P358K643r293l633Q119M630m817l020M113
532B250j911m600M324M615l796m334J765M191o82n33J536k957k583K973J671m64
548A465j167k561k943O83N534J191m159R43J962k800j05M475L362m979m700N246
$$ plain form
564 1447 3944 -2443 -3704 2696 2954 -3711 -2436 5438 1740 -5677 492 6724 2060 -2382 782
579 782 1904 -3676 -4134 2946 2338 -4450 -5092 -136 964 -2222 106 3856 -723 -3621 2519 5583
595 5583 1133 -2600 -25 1243 -1410 844 4249 -171 -5055 -3052 1958 3476 1921 1619 -727
610 -727 -3997 -1330 3146 3263 651 -2426 -3685 -3728 -1845 2813 1977 -2707 -2580 -62 735 513 2716
627 2716 3727 -1313 -3022 2875 3754 -716 -1403 447 -103 -2007 207 3284 342 -3211 -1241 2122
643 2122 1922 -661 27 1506 -2021 -3172 171 849 -1046 -2171 -532 630 -1300 -1366 283 1688
659 1688 1807 516 616 1708 -805 -1593 1856 3603 889 -3043 -1788 1195 -407 -514 2549 1215
675 1215 -3237 -3642 1699 3724 -743 -2456 -290 -712 -2298 -481 3002 857 -4893 -2909 3194 2380
$$ packed form
564A447K497o387j261O400K58o665J275P874l698p417O169O232m664m442L164
579G82J122n580m58P080o08o788o42M956J100l186K328L750m579k898O140L064
595E583m450l733K575J268k653K254L405m420m884K003N010J518j555l02k346
610g27l270K667M476J17k612l077j259m3J883M658q36m684J27K518P97k22K203
627B716J011n040j709N897Q79m470o87J850n50j904K214L077k942l553J970L363
643B122k00k583O88J479l527j151L343O78j895j125J639J162j930o6J649J405
659A688J19j291J00J092k513p88L449J747k714l932J255K983j602j07L063j334
675A215m452m05N341K025m467j713K166m22j586J817L483k145n750J984O103q14
$$ plain form
691 2380 -425 424 1043 -1115 -1799 2870 4953 470 -2605 -1500 697 1021 414 1817 924 -2966 -2553
708 -2553 921 2085 311 -1382 -900 -865 -1528 -92 518 229 -956 -1543 22 1225 240 -293 -6 1079
726 1079 758 -426 939 1817 -794 -732 996 1571 -101 -1484 922 1876 -1113 -1428 949 752 -1750
743 -1750 -1863 1419 570 -3318 -1796 1275 34 -1288 -92 1553 -669 -1848 1290 2906 348 -965
759 -965 -485 742 -146 -475 1931 1293 -1379 -1242 588 1730 430 -450 331 -532 -1168 147 322 -86
777 -86 -1118 -1975 -795 -4 -240 -275 -791 139 -20 -143 1244 1631 340 -489 -229 1304 998 -700 219
796 219 597 -413 -860 418 1978 -236 -1855 974 1543 -836 -1104 306 447 -1674 -1860 996 95
813 95 -2418 -1327 824 669 -1077 -739 1922 735 -1048 1102 2196 723 -1075 -132 1739 162
$$ packed form
691B380k805Q49O19k158o84M669K083m483l075J105K197L24o07J403q93l890M13
708b553L474J164j774j693M82L5o63J436O10k89j185n87J565J203r85n33K87J085
726A079l21j184J365Q78k611O2J728N75j672j383K406R54k989l15K377j97k502
743a750j13L282q49l888J522L071j241j322J196J645k222j179L138J616k558j313
759i65M80J227q88l29K406o38k672J37J830J142j300q80P81q63o36J315J75m08
777h6j032q57J180P91k36l5n16R30j59j23J387L87j291q29K60J533l06j698R19
796B19L78j010m47J278J560k214j619K829N69k379k68J410J41k121j86K856r01
813I5k513J091K151j55j746L38K661j187j783K150J094j473j798R43J871j577
$$ plain form
829 162 -1225 504 668 -241 -897 -34 1737 242 -1393 21 782 -432 -1533 -204 1058 -1237 -2382
846 -2382 272 793 -632 -1198 381 1414 -850 -699 1912 1748 -277 -569 1248 1465 -1133 -594 1907
863 1907 322 -1742 -393 1319 255 -1440 65 1246 -962 -1669 232 644 -341 -1233 -162 290
879 290 -1023 -769 783 607 -454 -726 653 997 137 859 876 127 188 158 543 1178 394 -388 -615 50
899 50 553 -453 -413 662 -542 -1484 -470 912 364 -1429 -797 613 -637 -1020 495 969 -440 -1569
917 -1569 319 1673 -306 -190 1584 784 -784 -231 1793 1295 -907 -76 1093 19 -610 -167 715
934 715 49 -1660 -575 569 -339 -863 -565 110 -284 -1133 -24 847 -69 -621 -354 651 724 -701 236
953 236 1527 440 -641 -36 1430 678 -985 593 1272 -521 -1081 74 872 -97 -1277 -34 384
$$ packed form
829A62j387J729J64r09o56Q63J771j495j635J414P61j214j101J329J262k295j145
846b382K654N21j425n66J579J033k264J51K611j64k025k92J817K17k598N39K501
863A907j585k064J349J712j064j695J505J181k208p07J901M12r85q92J071M52
879B90j313K54J552j76j061k72J379L44q60P22J7p49O1l0L85O35p84p82k27O65
899E0N03j006M0J075j204r42J014J382n48j793O32J410j250l83J515M74j409j129
917a569J888J354j979J16J774q00j568N53K024m98k202Q31J169j074o29M43Q82
934G15o66j709J085J144r08n24K98O75l94q49J109Q71r16n52K67J005P3j425R37
953B36J291j087j081O05J466p52j663J578O79j793n60J155P98r69j180J243M18
$$ plain form
970 384 -1678 -967 667 628 -1068 -1384 482 229 -860 77 943 156 -768 -47 1529 542 -351 509 334
989 334 63 288 428 463 -56 -644 -82 410 490 -113 -735 -347 -340 -625 13 234 55 -839 -1526 188 783
1010 783 -394 -449 632 591 -828 -400 1877 723 -1072 469 1298 170 -734 264 1311 -383 -1219
1027 -1219 874 1093 -1122 -1229 644 829 -1141 -868 1150 -338 -1678 -235 630 76 -1064 -139 752
1044 752 -364 -728 725 376 84 164 839 972 -36 67 378 225 801 525 -166 64 -255 -334 -197 -48
1064 -48 584 -863 -1690 69 507 -583 -780 681 255 -1653 -630 1631 -90 -1369 -131 1403 350
1081 350 -703 713 1433 -588 -802 1486 1584 -289 -1070 582 682 -1090 5 1243 -513 -1619 -556
1098 -556 701 25 -915 132 287 -935 -294 493 35 -251 -231 229 203 106 482 -348 -387 875 996 245
$$ packed form
970C84k062P11J634l9j696l16J866k53j089R37Q66p87r24P21J576r87q93Q60j75
989C34k71K25J40L5n19n88N62M92Q0o03o22L88Pk85O38K21j79q94o87J714N95
1010G83j177n5J081m1j419M28K277j154j795J541Q29j128r04R98J047j694q36
1027a219K093K19k215j07J873J85j970K73K018j488j340J443Q65n54j140R25Q91
1044G52j116l64J453l49k92Q0O75J33j008J03L11j53N76k76o91K30l19p9J37J49
1064d8O32j447q27J759M38j090j97J461m26j908J023K261j721j279J238J534j053
1081C50j053J416P20k021k14K288R8j873p81J652J00j772J095J238j756j106J063
1098e56J257o76r40J047J55j222O41P87m58k86K0M60k6r7L76q30l9J262J21p51
$$ plain form
1118 245 334 707 137 -788 339 1672 -117 -1370 -158 526 -775 -1046 1023 563 -1912 -1075 1535
1135 1535 81 -1533 -368 838 -362 -1317 885 1432 -1139 -1225 1017 1338 -210 -211 1228 234 -1308
1152 -1308 511 1798 132 -618 -116 88 -455 -323 728 -285 -1060 -245 -240 -473 47 237 -196 -895 340
1171 340 846 -540 -317 672 124 -570 459 1447 41 -1181 598 1413 -379 -642 1176 1038 -1005
1188 -1005 -843 1728 693 -1769 -299 1334 -501 -1868 -111 1296 -995 -1602 987 870 -1208 -993
1204 -993 750 848 -883 -168 1412 40 -1268 273 1115 311 -294 287 654 -411 119 928 29 -393
1222 -393 48 -233 -207 -55 -6 -228 -916 208 301 -622 -335 79 -579 -859 -36 1152 -32 -1044 362
1241 362 805 -289 -49 1041 724 -919 -421 1391 681 -758 176 736 -322 -1018 185 968 -577
$$ packed form
1118B45Q9L73n70r25J127J333j789j253J212O84j301k71K069m60k475Q37K610
1135A535j454j614J165J206j200r55K202N47k571q6K242L21j548jJ439r94j542
1152a308J819J287j666p50N02K04n43J32J051j013p75Q15Nk33N20J90m33o99J235
1171C40N06j386K23R89n48o94J029R88j406j222J779Q15j792k63J818j38k043
1188a005J62K571j035k462J470J633j835j367J757J407k291o07K589j17k078K15
1204i93J743R8j731P15J580j372j308J541Q42q04o05N81L67j065N30Q09q99m22
1222c93M41k81K6J52M9k22o88J124R3r23K87M14o58k80Q23J188j184j012J406
1241C62M43j094K40J090l17j643M98J812p10j439R34N60j058o96J203P83j545
$$ plain form
1258 -577 -1056 442 265 -790 -446 79 89 -905 -414 545 -164 -707 -21 287 114 108 506 326 -143 201
1278 201 511 191 410 221 -160 -70 256 337 -383 -686 306 -90 -683 -113 412 -244 -1040 -207 739 -388
1298 -388 -808 314 285 -608 -560 653 771 -746 -515 1341 604 -545 305 1227 300 -924 413 1204
1316 1204 -187 -498 249 299 -461 -638 349 276 -1059 -453 458 -8 -286 -257 179 -60 -446 88 197 -233
1336 -233 -53 -156 124 393 -39 66 307 360 483 19 198 596 -14 -263 119 382 -177 -618 46 73 -380
1357 -380 -443 147 82 -385 -491 350 489 -404 -180 525 -206 -623 -120 709 149 -675 305 655 183 -41 518
1378 518 752 -80 -380 388 544 -329 -280 60 -10 -520 -428 148 -118 -398 -95 -84 -3 -11 -211 243 -38 -41 -165
1401 -165 -11 206 125 -305 114 385 60 -58 271 648 329 -266 273 325 -250 -141 32 166 -756 -678 346
$$ packed form
1258e77m79J498j77j055L44N25J0r94M91R59p09n43O86L08j73oL98j80m69L44
1278B01L10l20K19j89l81R0L26Q1p20l03R92l96n93N70N25o56p96Q33R46j127
1298c88m20J122k9q93M8J213J18j517K31J856p37j149Q50R22r27j224J337P91
1316A204j391l11P47N0p60j77R87p3j335O06R11m66k78K9M36k39l86N34J09m30
1336b33J80j03K80K69m32J05K41N3J23m64J79L98o10k49L82K63n59m41O64K7m53
1357c80o3N90o5m67j06Q41J39q93K24P05p31m17N03Q29n60q24R80L50m72k24N59
1378E18K34q32l00P68J56q73M9L40p0n10R2N76k66k80L03J1Q1qk00M54k81lj24
1401a65J54K17q1m30M19K71l25j18L29L77l19n95N39N2n75J09J73J34r22P8J024
$$ plain form
1422 346 185 -606 -349 -64 -54 -319 122 567 67 -567 -138 406 138 -128 22 406 -143 -373 511 555 220
1443 220 116 -127 297 95 -159 266 -48 -379 -195 -456 268 -106 -558 -175 -150 -282 -250 88 407 -117 -414
1464 -414 -66 250 36 66 124 430 -85 -117 535 443 -54 -40 262 354 -239 -320 620 -19 -407 -183 119 -52
1486 -52 -678 -5 216 -457 -586 79 271 -11 -545 -246 453 -230 -147 155 506 -30 -254 191 457 68 284
1507 284 331 176 -102 -69 43 460 -43 -284 -178 -280 -52 -196 73 406 -458 -409 -50 137 36 -152 54
1528 54 202 -367 -225 362 291 -178 -180 195 289 -60 176 520 132 -74 -77 335 273 -291 -150 183 -381 -504 -88
1551 -88 3 -136 -489 -243 134 -70 -142 4 31 -20 -344 170 254 28 14 41 182 142 -162 283 389 275 7
1574 7 -45 378 151 -241 17 203 -226 -214 -174 119 -112 -495 -175 190 -334 -159 329 324 -282 -303 275 435 -136
$$ packed form
1422C46j61p91K57K85J0k65M41M45n00o34M29N44k68k66J50L84n49k30Q84M4l35
1443B20j04k43M24k02k54M25l14l31J84k61P24l74m52L83K5j32L2L38L19n24k97
1464d14L48L16k14L0N8L06n15l2O52r2m97J4L02R2n93q1R40o39l88K24L02j71
1486e2o26O73K21o73j29O65J92k82n34K99O99o83Q3L02L51n36k24M45K66l89K16
1507B84M7j55k78L3J12M17n03k41J06j02K28j44K69L33q64M9L59J87j01j88K06
1528E4J48n69J42N87p1m69kL75R4l49K36L44l88k06lM12o2n64J41L33n64j23M16
1551h8R1j39l53K46L77k04p2J46K7n1l24N14Q4k26j4K7J41m0l04M45J06j14k68
1574Gn2M23k27l92K58J86m29J2M0K93k31l83L20L65n24J75M88no06k1N78J60n71
$$ plain form
1597 -136 117 316 100 -67 -232 637 420 23 48 205 -35 -115 69 249 -29 -431 -234 60 -168 -274 -123
1618 -123 -132 -104 -459 73 85 31 -238 -220 68 103 -64 243 259 18 98 214 451 147 -181 193 328 -216 29
1641 29 185 176 -252 -308 -5 187 -15 -282 66 164 -316 -329 125 43 -295 -46 230 75 -307 84 357 31
1663 31 -48 122 200 174 136 48 253 55 -94 94 -73 195 26 -198 -43 -54 -255 -126 10 66 -300 -360 236
1686 236 104 -19 -223 32 118 -327 -54 505 272 -185 85 316 100 -43 109 454 -301 -150 125 220 -72
1707 -72 -226 47 114 -540 -246 166 -103 -356 -353 -104 -44 -462 -81 207 -230 -202 22 88 175 -251 95 294 -152
1730 -152 142 263 31 142 72 81 237 53 -1 -35 31 72 -201 -384 -12 73 -294 -261 -117 -56 -490 -195 251
1753 251 -39 -303 -62 270 193 -108 190 316 -40 -191 209 227 166 -210 157 55 -180 30 203 21 -233
$$ packed form
1597a36K53J99k16j67j65Q69k17l97K5J57k40q0J84J80k78m02J97K94k28j06J51
1618a23rK8l55N32J2n4k69J8K88L5j67L07J6k41Q0J16K37l04l28L74J35n44K45
1641B9J56rm28n6L03J92k02k67L48R8m80j3M54q2l38K49K76j55l82L91K73l26
1663C1p9J70P8k6l8q8K05j98j49J88j67K68j69k24J55j1k01J29J36N6l66o0N96
1686B36j32j23k04K55Q6m45K73N59k33m57K70K31k16j43J52L45p55J51K75R5k92
1707g2j54K73O7o54K94M12k69k53LK49O0m18L81K88m37K8K24O6Q7m26L46J99m46
1730a52K94J21k32J11p0RJ56j84n4l4O6M1k73j83L72Q5l67L3J44O1m34K95M46
1753B51k90k64K41L32p7l01K98J26l56j51M00J8o1l76L67j02k35K10J73j82k54
$$ plain form
1774 -233 -243 14 -93 -261 -85 -97 -203 -190 -4 -33 107 -299 -93 -126 -91 108 33 153 248 -4 174 263 208
1797 208 67 -162 -91 176 -177 -43 138 -55 -239 -101 92 204 -373 -244 159 -150 -374 -20 203 -163
1817 -163 -486 11 197 -187 -52 126 274 -89 -68 460 190 -66 43 189 -131 -49 110 116 -60 -203 28
1838 28 -58 -173 -35 -139 -87 42 -164 92 -207 -89 62 -201 -69 22 52 -77 69 336 105 -167 294 234
1860 234 -35 -92 179 322 -169 -265 236 8 -329 -226 204 -104 -190 -30 145 -39 -313 116 88 -139 -72 96
1882 96 69 -346 -193 370 -135 -199 -9 147 116 18 254 158 230 -124 76 131 53 8 59 113 -57 -178 -152 -142 189
1907 189 -243 -181 6 -103 -184 -313 -52 -41 -140 -233 250 87 -204 -46 20 174 -8 29 208 -58 -185 59
1929 59 130 66 -224 -25 -17 -53 -48 8 -66 40 -278 -201 39 -45 -137 -4 -146 66 -181 -82 69 -89 20 -79 201
$$ packed form
1774b33j0K57j07j68J76j2j06J3J86k9J40m06K06l3L5J99p5J20R5k52J78Q9n5
1797B08j41k29P1K67l53J34J81j93j84J38J93J12n77J29M03l09k24L54K23l66
1817a63l23M97J86l84J35J78J48l63K1N28k70k56J09J46l20Q2J59Oj76j43K31
1838B8q6j15J38j04N2J29k06K56k99J18J51k63J32R1L0j29J46K67k31k72M61o0
1860B34k69n7K71J43m91r6N01k28l37J03M30l08q6J60J75j84k74M29k8k27O7J68
1882I6k7m15J53N63n05o4J90J56l1r8K36r6P2l54K00N5p8m5N1N4j70j21K6J0L31
1907A89m32O2J87j09q1j29K61J1r9r3M83j63k91J58O6J54j82L7J79k66j27K44
1929E9P1o4k90J99Ql6NN6p4J06l18P7K40q4r2J33j42K12k47R9J51j58J09r9K80
$$ plain form
1954 201 45 16 263 214 44 1 79 96 12 -56 34 152 -146 -210 231 126 -144 -102 97 -59 -307 -209 156 -57
1978 -57 -121 84 127 53 -205 252 124 166 -42 54 198 -35 -44 84 101 149 173 236 132 -193 -36 -35 88 -163 -80
2003 -80 25 -136 62 -250 -147 -1 -100 -63 -206 -112 247 0 23 195 87 -68 115 157 160 -106 -82 107 -3
2026 -3 -52 -43 180 49 -16 50 -32 -101 -7 -44 -36 -102 65 93 85 -234 -120 -38 -56 -121 13 24 -50 96 -67 123 36 79
2054 79 51 -99 204 -146 -62 -74 -24 -25 -55 1 -12 -127 19 -94 0 -110 -202 26 32 -391 166 32 -80 9 181
2079 181 40 7 -11 -29 55 -165 -3 60 -45 68 229 344 127 -94 -72 106 -299 -69 -13 -39 4 -175 -33
2102 -33 -225 -153 -184 -78 30 -121 -167 43 108 -2 -82 41 219 128 -80 89 -44 118 119 32 54 -32 101 78
2126 78 4 -21 -161 -47 -63 -253 -100 -99 69 -234 -218 -147 198 -24 -331 175 -25 -34 -61 48 180 -78 -80 80
$$ packed form
1954B01j56k9K47m9j70m3P8J7q4o8R0J18k98o4M41j05k70M2J99j56k48R8L65k13
1978e7o4K05M3p4k58M57j28M2k08R6J44k33rJ28J7M8K4O3j04l25J57JJ23k51Q3
2003h0J05j61J98l12J03J46r9L7j43R4L59k47K3J72j08j55J83M2Lk66K4J89j10
2026cm9RK23j31o5O6q2o9R4l7Qo6J67K8ql19J14Q2j8o5J34J1p4J46j63J90q7M3
2054G9k8j50L03l50Q4j2N0jl0N6j3j15J46j13R4j10r2K28Om23N57j34j12Q9J72
2079A81j41l3j8j8Q4k20J62O3j05J13J61J15k17k21K2J78m05K30N6k6M3j79J42
2102c3j92P2l1J06J08j51m6K10O5j10q0J23J78r1k08J69j33J62Jq7K2q6J33k3
2126G8p4k5j40J14j6j90J53JJ68l03J6P1L45k22l07N06k00rk7J09J32k58kJ60
$$ plain form
2150 80 108 -15 -68 185 184 -4 -2 124 125 -172 -38 -30 -54 -306 5 -59 -134 -240 -28 -129 80 -200 -218 56 -48
2175 -48 32 116 3 152 139 148 44 -35 133 174 54 153 104 31 101 73 -92 -71 9 13 -6 -14 144 40 -161 -71 130
2202 130 -55 -195 -44 113 -88 5 44 113 -113 70 96 133 -52 -27 317 -78 -14 88 41 -8 -75 5 26 -270
2226 -270 56 -16 37 -220 -117 -35 12 -65 -119 -54 12 -15 -133 57 82 106 157 -142 -54 98 51 145 63 126 14 -177
2252 -177 170 152 137 129 -36 -127 -193 -27 -142 -140 -171 -76 -30 -86 19 109 -49 18 -27 178 -73 -166 -55 26 132 42
2278 42 108 200 -112 87 127 -19 -111 44 88 181 129 94 5 -48 141 -51 -138 -42 -7 -34 -161 -33 -13 -170 -43
2303 -43 -84 58 -247 109 36 160 -53 -73 250 169 93 88 117 -74 -55 85 104 167 -26 -1 69 -45 6 -109 70
2328 70 -185 -88 106 99 -166 -102 117 118 -51 -80 -1 17 -196 -120 59 53 -49 66 94 -40 6 46 94 70 -58 -48
$$ packed form
2150H0K8j23n3K53jj88KJ26Jk97J34Qk4k52L11o4p5j06K12j01K09k80j8K74j04
2175d8Q0Q4j13J49j3Rj04p9J68M1j20R9m9p3P0k8j65K1Q0Mj9qJ58j04k01R0K01
2202A30j85j40J51J57k01R3L9O9k26J83K6L7j85K5L44l95O4J02m7m9o7Q0K1k96
2226b70L26p2N3k57J03Q2M7p7n4O5O6k7j18J90K5K4N1k99Q8J52m7R4q2O3j12j91
2252a77L47j8j5qj65r1o6J66j15Kl1R5M6n6J05R0j58O7m5K05k51r3J11Q1J06r0
2278D2O6R2l12J99M0j46r2J55M4R3n2l5q9n3J89j92q7R6L5k7j27J28K0j57J27
2303d3m1J42l05L56p3J24k13k0L23q1p6nK9j91J9J40J9O3j93K5P0j14N1j15J79
2328G0k55R7J94pk65O4K19Jj69k9P9J8k13P6J79oj02J15K8j34M6M0M8k4j28J0
$$ plain form
2354 -48 180 96 -95 -24 -131 -26 -147 -124 3 -35 -103 -76 -45 -22 -54 -110 95 -9 -64 139 40 109 69 4 147
2379 147 119 35 0 65 -32 -141 40 66 -135 135 50 -109 2 -162 -41 -135 -206 -120 123 -144 -102 11 27 21 -8
2404 -8 -42 42 136 16 43 100 -90 78 -105 -33 38 96 -51 168 145 -106 79 -136 -16 -4 -20 -146 -24 -59 81
2429 81 121 -71 -171 22 59 213 -201 -92 93 89 109 -37 116 174 -44 60 75 -12 152 -36 -79 -98 -224 -61
2453 -61 25 -184 38 112 -11 -39 78 76 -2 -206 92 -2 -10 -55 -64 -81 -50 -118 61 -42 -25 26 -14 -93 49 -109 33
2480 33 4 64 4 65 -103 -19 -53 -129 96 -163 -10 -40 3 62 26 -158 -6 11 -115 23 6 125 69 -32 30
2505 30 87 -23 -67 -8 93 6 0 96 -25 42 -46 43 -118 -148 -90 -76 -129 -121 2 -26 -27 -232 52 18 -77 -102 22 29
2533 29 23 32 308 85 159 85 49 65 -51 90 -112 48 0 36 -104 -18 137 63 28 67 -194 -112 36 -40 -39 5 -142
$$ packed form
2354d8K28q4j91P1j07J05j21K3J27l8o8K7L1K3l2n6K05j04n5K03r9O9m0o5J43
2379A47k8q4l5O5r7j09J81K6k01K70q5j59J11j64J21r4p1Q6K43k67M2J13J6ok9
2404hl4Q4R4j20K7N7j90J68j83P2P1N8j47K19k3k51J85k15J20J2j6j26J22l5J40
2429H1M0j92j00J93L7J54m14J09J85mK0j46J53N8k18J04J5q7J64j88m3j9j26J63
2453f1Q6k09K22P4j23k8J17kp8k04K98r4qm5rj7L1o8J79j03J7N1m0p9J42j58J42
2480C3k9O0o0O1j68Q4l4p6K25k59J53l0M3N9l6j84J52J7j26J38j7J19n6j01O2
2505C0N7j10m4N9J01q7oR6j21O7q8Q9j61l0N8J4n3QJ23k8jk05K84l4r5k5J24P
2533B9oRK76k23P4p4l6J6j16J41k02J60m8L6j40Q6J55p4l5L9k61Q2J48p6JM4j47
$$ plain form
2560 -142 -30 80 -105 -66 33 55 -103 173 57 -14 232 -40 11 61 58 -65 -24 63 -53 8 96 -21 38 134 146
2585 146 -195 14 -119 47 -127 -64 -172 -17 32 -55 -56 -142 64 35 67 -81 -97 -28 -12 -24 62 5 106 -144 33
2610 33 99 -43 45 -88 144 35 -22 -15 76 -21 -30 -156 -236 -71 36 -21 65 -82 -42 35 94 34 -1 -102 47 72
2636 72 24 -46 87 27 -20 47 -40 -170 -138 31 30 74 -60 -110 -43 -244 31 53 -107 117 20 106 -37 37 128 -63
2662 -63 -110 52 -30 -11 -3 49 125 31 -111 168 140 -46 -46 -43 -92 -59 -317 35 -118 -16 0 -119 -67 -119 -70 -1 -10 66
2690 66 -47 6 -44 154 -68 -51 33 46 109 94 83 -1 94 57 152 -21 141 20 14 57 42 89 26 -114 -25 -65 -72 -114
2718 -114 66 -128 -52 90 -2 -126 79 20 -68 144 4 152 -38 -62 1 63 53 -196 28 161 -112 59 -12
2741 -12 -73 -111 6 -45 -143 29 -81 116 -14 -149 -87 28 48 102 137 -85 -52 -33 -98 105 -31 31 1 65 -42
$$ packed form
2560a42J12J10j85L9R9K2j58K76j16p1K46k72N1N0lj23M1Q7j16O1Q8j17N9R6J2
2585A46l41K09j33J66j74O3j08J55M9q7jq6K06k9L2j48j6O9J6j2Q6n7J01k50J77
2610C3O6j42Q8j33K32j09n7PR1r7rj26q0J65J07n7Q6j47M0P7N9o0l5j01J49K5
2636G2m8p0J33o0m7O7q7j30L2J69jM4j34n0O7k01K75K2j60K24r7Q6j43P4R1j91
2662f3m7J62q2J9QN2P6r4j42K79k8j86%Lm9L3k58L52j53J02J6j19N2n2M9O9rP6
2690F6j13N3n0J98k22J7Q4J3O3j5j1q4R5l7R5j73J62j21oM3j5M7o3j40Q9m0pm2
2718a14J80j94P6J42r2j24K05n9q8K12j40J48j90k4O3O2j0k49K24J33k73J71p1
2741a2o1l8J17n1r8J72j10J97j30j35O2J15K0N4L5k22L3J9o5K03j36O2l0O4j07
$$ plain form
2766 -42 7 59 9 -35 52 19 -18 -50 79 33 29 -54 8 91 -66 -45 -58 -13 -46 -69 -13 38 -29 -108 71 75 -48 -17 88
2795 88 3 40 150 10 130 94 -30 -30 151 -211 11 48 -32 -29 -174 -18 -26 -145 -21 -22 64 -32 122 -105 -37 -58
2821 -58 45 13 235 -40 2 43 64 129 -39 -87 260 68 -66 60 -60 -16 161 -5 -276 125 5 -40 -59
2844 -59 -7 -117 2 -69 -83 -156 -36 -15 27 -46 96 -43 77 -80 0 -67 10 187 -16 96 -199 -152 39 -82
2868 -82 8 60 -176 53 64 49 -33 -97 -96 4 151 -17 -116 -67 -52 133 -70 -84 47 -66 26 98 59 -101 43
2893 43 -54 -72 78 -212 124 106 -1 -3 -20 -30 -18 -30 -116 9 -76 -147 65 80 -13 -60 -36 -22 -4 69 149 102 3 -14
2921 -14 196 -86 87 -25 -1 64 36 -51 -53 52 56 -5 28 94 47 13 -167 13 -42 -6 27 -47 22 -18 50 -133 -48
2948 -48 32 -16 50 49 81 62 -39 41 60 -27 11 -50 222 -63 83 173 150 -39 70 -40 29 -30 -6 -11 -177 -82 102
$$ packed form
2766d2M9N2n0m4Q7l3l7l2J29m6mq3O2Q3j57K1j3M5l3k3N6N1o7p9J79Mj23L1J05
2795H8q5L7J10j40J20l6j24%J81l62K22L7q0Lj45J56qj19J24jQ6r6J54k27O8k1
2821e8J03l2K22k75M2M1K1O5j68m8L47j92j34J26j20M4J77j66k71M01j20m5j9
2844e9N2j10J19p1j4p3J20K1M2p3J42j39J20j57Q0o7P7J77k03J12k95M7J91j21
2868h2R0N2k36K29J1j5q2o4JJ00J47j68r9M9J5J85k03j4J31j13R2P2l9j60J44
2893D3r7j8J50k90L36j8j07kj7j0J2j2q6J25q5p1K12J5r3m7K4J4J8P3Q0m7r9j7
2921a4K10k82J73j12K4O5k8q7kJ05Mo1L3O6m7l4j80J80n5L6L3p4O9m0O8j83Q5
2948d8Q0m8O6jL2j9j01Q0J9q7L8o1K72k85J46R0k3j89J09j10O9n9K4nj66R5J84
$$ plain form
2975 102 54 -62 -32 -72 109 102 -76 -7 17 -5 -43 55 -33 -34 -11 -29 -44 -68 -69 48 65 1 -39 41 161 26 103 18
3003 18 39 200 12 34 34 -127 125 43 1 74 -103 -48 9 8 -126 -60 -4 -21 -72 -152 156 42 -9 -145 -13 -37
3029 -37 -18 60 45 0 98 -87 -215 23 -105 56 -82 38 24 107 79 115 46 99 -57 64 -123 -14 85 -13 -65
3054 -65 -48 -12 152 -24 96 117 105 -33 -129 -7 24 -16 -15 12 -62 -80 27 -29 2 -9 -14 -41 75 -165 -128 -114 -180
3081 -180 -132 148 18 9 131 150 5 -108 59 125 -116 58 171 -13 -56 -28 2 -21 -163 0 65 17 90 -7
3105 -7 28 11 68 -28 -77 -21 -121 -75 -17 -88 102 54 -189 100 97 -50 73 109 45 -80 -54 10 60 -116 -62 84 -41
3132 -41 -51 52 1 -15 -23 -154 -93 -185 34 -31 24 -67 16 61 105 -9 -13 -63 -21 -47 -144 -11 35 61 -30 -8 84 -73
3160 -73 -90 0 55 -118 11 18 -2 -37 -187 -3 -70 -6 11 -72 -24 6 -54 71 -18 -1 120 -75 -12 83 53 80 147
$$ packed form
2975A02m8j16L0m0J81pj78O9K4k2l8R8q8jK3j8j5k4jJ17J7o4m0Q0J20j35P7q5
3003A8K1J61j88K2%j61K52q2m2P3j77N5N7jj34O6N6j7n1q0L08j14n1j36J32k4
3029c7J9P8j5m5R8j85j28K38j28J61j38J20j4Q3k8L6o9N3j56J21j87J09R9r8n2
3054f5J7L6J64j76J20K1j2j38r6J22L1m0JK7p4j8J07n6L1j1nk7J16k40L7J4o6
3081a80M8K80j30rJ22J9j45j13J67O6k41J74J13j84m3K8L0k3j42J63O5m8P3r7
3105gL5j7N7r6m9N6j00M6N8p1J90m8k43K89lj47J23L6o4j25K6O4N0j76N4J46j25
3132d1j0J03n1j6qj31O1r2K19o5N5r1Q3M5M4j14mn0M2k6r7J33M6K6r1K2R2j57
3160g3j7R0N5j73J29Pk0l5j50J84o7O4J7q3M8L0o0J25q9J7J21j95O3R5l0K7O7
$$ plain form
3187 147 64 -126 51 68 -100 13 34 95 -32 -67 87 -18 -84 -72 -52 1 -109 51 -72 14 94 28 -131 -35
3211 -35 26 -21 -30 -84 111 74 10 145 -53 83 93 -42 -14 174 -57 124 -97 16 -181 -75 98 43 -34 18
3235 18 -178 -181 -44 17 67 25 33 96 -41 -9 85 41 151 -91 -122 -24 -14 82 25 -37 49 25 178 -55 84 -17 -58
3262 -58 28 19 -35 -12 -2 -201 -61 -141 -32 90 -64 33 63 90 83 -80 75 22 61 56 -76 45 -13 118 104 -75
3288 -75 -38 9 -26 -20 18 -63 -77 34 47 62 -68 183 9 -27 124 25 -19 -82 -62 -37 72 -7 -14 136 58 -2 9 -41
3316 -41 64 -102 7 55 -40 161 40 30 -106 -24 -89 -76 59 68 39 -16 67 2 -75 52 99 130 25 -132 40
3341 40 -46 10 30 9 -80 127 62 60 -30 5 57 -113 152 43 -5 185 117 -32 -4 -74 24 -85 30 -63 -80 -86 -65
3368 -65 -55 78 -61 -123 174 -84 -3 24 -136 -13 -30 25 13 83 -4 25 -117 30 92 -111 0 -73 -15 88 120
$$ packed form
3187A47q3j90J77J7j68J13K1O1j27l5J54j05o6J2K0N3j10J60j23Q6Q0o6j59R6
3211c5O1m7rn4J95l7o4J35j98J36J0j35K8J88k31J81k21J13j97J06J73n5p7N2
3235A8j96lJ37O1N0m2QO3j37L2R4m4J10k42l1R8J0R6n7o2Q6k4J53k33J39j01m1
3262e8Q6rn4K3J0j99J40q0J09J22j54R7L0K7pj63J55n3L9nj32J21n8J31j4j79
3288g5L7M7l5OL8q1j4J11J3J5j30K51j74l6J51r9m4o3K0K5J09p9pJ50p8o0J1n0
3316d1J05j66J09M8r5K01j21j0j36Q2o5J3J35Rk9n5Q3o5p7J27M7L1j05j57J72
3341D0q6N6K0k1q9K07o5kr0L5N2j70K65j09m8J90o8j49K8p0R8j09J15r3j7oK1
3368f5J0J33j39o2K97k58Q1K7j60J23j7N5j2P0q7K9j42J47O2k03J11p3N8J03L2
$$ plain form
3393 120 10 -144 -123 115 -63 26 -151 -76 84 57 -4 -80 -44 8 -34 -53 12 -102 37 158 189 50 -8 -62 44
3418 44 139 -92 -14 89 -197 -72 -43 17 134 84 7 94 -24 -24 -158 -6 -10 -9 -117 -18 158 11 35 -124 -38 62
3444 62 22 36 -135 -56 -18 72 21 -21 49 70 -40 -185 -45 -51 -24 -1 1 -54 -124 -48 -120 219 129 94 100 121 36 -119 43
3473 43 131 2 -1 100 34 79 81 18 -28 101 -64 -15 -26 -39 13 -173 70 35 -53 58 -40 -40 -24 105 -179 88 -61
3500 -61 85 80 89 152 140 196 67 -75 81 10 26 79 51 -15 -52 -2 -168 -140 56 13 125 71 27 -37 -93 228 -31
3527 -31 -40 -56 70 25 -32 -20 -128 113 62 -27 -86 -116 0 0 39 -220 -64 -47 -29 4 8 249 -3 -43 -82 26 15
3554 15 -109 -22 231 24 -10 -90 -116 21 -111 -63 23 -195 111 -75 -90 -105 -102 -79 47 10 144 -177 -109 81 49
3579 49 -49 -36 -82 47 -39 -107 93 -99 -6 1 19 -47 142 -192 -129 -111 39 -41 -75 98 41 -61 5 -59 35 196
$$ packed form
3393A20j10j54K1K38j78Q9j77P5J60k7o1p6L6N2m2j9O5j14J39J21L1j39n8n4J06
3418D4R5k31P8J03k86J25K9O0J17n0p7Q7j18%j34J52mJj08R9J76j47K4j59Q6J00
3444F2m0J4j71P9L8R0n1m2P0K1j10j45J40oK7K3Kn5p0P6p2L39r0l5OK1q5j55J62
3473D3Q8j29lJ01o6M5Ko3m6J29j65M9j1j3N2j86K43l5q8J11r8%J6J29k84K67j49
3500f1J46nRO3j2N6j29j42J56p1J6N3k8o6l7N0j66K8J96m3J12n4m4o4n6L21k59
3527c1rj6J26m5n7J2j08K41n1q9n9l0J16%L9k59J56J7J8L3MK41k52m0l9J08j1
3554A5j24Q7K53k07l4q0k6J37j32M8Q6k18L06j86j5j5LK3J26l7J34l21O8J90l2
3579D9r8J3m6J29q6o8K00j92R3PJ8o6J89l34O3J8J50q0l4J73n7j02O6o4R4J61
$$ plain form
3605 196 113 -17 7 -266 67 -31 -24 -166 -13 -61 -41 -5 98 143 -15 116 -134 -12 -23 -15 -13 56 36 -46 24 29 -130
3632 -130 -8 155 234 69 -70 -55 -77 29 0 106 -44 78 110 -14 120 60 -137 19 48 -78 84 -144
3654 -144 74 141 95 18 -69 -50 -43 67 15 -76 20 11 75 24 -85 -126 193 5 -72 48 -61 -75 -39 90 158 77 105
3681 105 -79 -109 95 99 -30 -8 19 -243 -66 91 4 159 25 43 99 46 10 22 80 -44 -159 49 -209 -9
3705 -9 181 -95 -74 0 58 8 41 -68 112 -127 -147 -123 -55 -100 -120 -87 166 -82 12 -1 -145 71 -12 136 -134
3730 -134 -251 -61 25 -85 51 88 12 -21 -39 -16 92 -50 59 53 55 -134 -178 49 84 -88 -33 -84 -194 44 79
3755 79 -51 -111 154 88 -46 -83 -84 -6 -33 -53 86 8 -77 -22 30 249 17 66 -99 127 86 -110 -87 33 59 70
3781 70 -36 -5 -26 -122 -64 32 -152 -99 -76 41 16 -174 35 101 -39 40 -190 -205 58 58 2 11 123 45 -31 -74 72
$$ packed form
3605A96q3j30K4k73L33r8Pj42J53m8K0L6J03M5j58J31k50J22j1QKO9k0q2P0Nj59
3632a30J22J63P9j65j39J5k2J06k9J06j50J22L2j24J34o0j97J56K9j26J62k28
3654a44K18O7m6p7q7J9PJ10n2r1R6rO4n1j09m1L19j88p7J20j09j4L6J29O8q1K8
3681A05j84l0K04Mj29K2K7k62J77J57q7J55j34J8N6n3l6J2N8j24j15K08k58K00
3705iJ90k76K1P4N8n0L3j09J80k39k0K4O8m5k0L3K53k48R4j3j44K16q3J48k70
3730a34j17J90Q6j10J36L7p6l3j8K3J08j42J09oKj89m4K27L5j72N5n1j10K38L5
3755G9j30o0K65o6j34l7jP8k7k0J39p8q5N5N2K19k32M9j65K26m1j96K3J20K6J1
3781G0j06L1k1r6N8R6j84N3K3J17k5j90K09O6j40P9k30j5K63%n6RJ12p8p6m3J46
$$ plain form
3808 72 120 82 -34 176 108 -105 140 9 -48 -149 206 -45 -188 -103 -63 30 -122 -147 -93 51 -61 12 43 -30
3832 -30 75 -168 -59 -104 50 -47 -78 70 71 41 40 -29 -45 17 56 84 -23 133 -156 -45 -42 -15 58 -23 168 116 86
3859 86 89 -49 -67 1 1 -62 -89 -132 35 87 26 16 -100 -65 68 61 -97 -140 100 14 85 -162 51 11 37 -124 -144
3886 -144 3 -127 -25 7 -133 -51 16 -42 24 -92 -48 46 11 -25 -56 77 115 109 55 114 -32 59 -7 -50 18 69 -63
3913 -63 43 -44 44 -49 -47 22 41 23 -109 -4 -14 -48 -42 103 2 2 89 -59 50 79 -57 170 75 18 55 -213 145
3940 145 82 24 65 45 0 12 27 -27 -18 -96 105 62 -62 133 -29 -10 -71 -34 6 -84 134 -56 -30 98 -49 38
3966 38 -114 -58 -85 -152 -150 33 -101 103 42 -83 -30 56 -135 -86 -149 -47 91 21 98 -72 10 -16 180 -49 75
3991 75 248 16 68 22 6 -91 -126 52 -183 6 -48 -199 139 77 -69 -57 -116 90 171 -4 96 -20 -24 113
$$ packed form
3808G2M8l8j16K10o8k13K45j31n7j01L55k51j43Q5M0R3j52k5N4J44j12P3L1p3
3832c0J05k43J09m5J54r7l1J48Jl0jo9j6O2L9K8j07J56k89J11LK7P3q1J91n2l0
3859H6Lj38j8O8%o3k7m3J67N2o1j0j16L5J33pj58m3K40q6P1k47K13m0K6j61k0
3886a44J47j30J02L2j40Q2O7n8O6j16M4R4l5l6l1J33L8on4N9j46R1o6m3O8N1j32
3913f3J06q7Q8r3KO9J9j8j32J05j0l4OJ45j01%Q7j48J09K9j36K27r5n7L7k68L58
3940A45o3n8M1k0m5J2J5n4Rp8K01m3j24J95j62J9o1L7M0r0K18j90K6J28j47Q7
3966C8j52N6k7o7KJ83j34K04o1j25N3Q6j91M9o3J02J38p0P7j70Q2k6J96k29J24
3991G5J73k32N2m6j6r7l5J78k35J89n4j51L38o2j46J2n9K06Q1j75J00j16mJ37
$$ plain form
4015 113 -111 61 140 103 69 -74 76 6 -95 -22 12 41 -20 -9 102 27 80 35 108 5 114 -37 -51 58 175
4040 175 2 -7 -118 -99 -3 181 101 18 -8 70 -53 -5 0 -63 107 41 21 121 -131 -81 93 39 54 -12 51 195
4066 195 128 -138 44 75 58 -62 37 -19 -122 29 -45 -115 112 -41 -17 53 17 -127 -5 77 74 -90 -53 47 -99
4091 -99 -21 -61 -16 139 163 57 50 63 -95 -50 -174 -142 -26 75 91 -179 -94 -72 87 112 39 -75 -23 -96 -15 153
4117 153 -106 97 8 -27 35 -37 -72 -83 -57 -83 -134 -7 -129 -218 29 13 -76 46 20 -28 31 84 -53 -62 -159 -143 -67
4144 -67 -41 -26 1 47 80 38 0 7 75 -6 -47 119 -78 109 128 -48 -11 263 -45 123 110 -78 -3 -18 -54 43 -53
4171 -53 -75 -110 25 84 -4 96 140 50 155 -61 -113 35 -75 -35 -90 -211 3 136 126 -98 -84 138 119 32 -107
4196 -107 -85 171 -161 -38 124 45 -16 108 41 39 37 2 114 27 -30 -5 -109 -84 4 -272 36 -77 -104 -37 -181
$$ packed form
4015A13k24J72P9l7l4j43J50p0j01P3L4K9o1J1J11p5N3m5P3j03J09j51j4J09J17
4040A75j73rj11J9R6J84q0q3k6P8j23M8No3J70o6k0J00k52N0J74n4J5o6O3J44
4066A95o7k66J82L1j7j20R9n6j03J51p4p0K27j53K4P0l6j44J22Q2lj64L7J00j46
4091i9P8m0M5J55K4j06pJ3j58M5j24L2J16J01J6k70Q5K2J59K5p3j14N2p3Q1J68
4117A53k59K03q9l5O2p2l5j1K6k6n1J27j22q9K47j6q9J22k6m8N9N3j37rr7J6P6
4144f7K6J5K7M6L3m2l8PO8q1m1J66j97J87J9j76L7K74l08J68j3j88P5j5l6R7r6
4171e3k2l5J35N9q8J00M4r0J05k16n2J48j10M0n5j21K14J33j0k24J4K22j9q7j39
4196a07K2K56l32J23J62p9o1J24o7kkl5J12q7n7K5j04K5Q8k76L08j13k7O7j44
$$ plain form
4221 -181 22 8 -92 -49 63 -116 -54 -14 -3 -48 34 65 104 183 125 24 155 -71 -134 97 -116 39 72 -103
4245 -103 -92 104 -95 89 135 66 -117 -66 -84 54 -20 9 29 -14 132 58 41 -58 -70 -20 -166 -21 35 -36 -231
4270 -231 5 75 -105 69 9 11 46 24 184 3 -113 57 -9 -66 4 10 78 -35 -80 -120 -102 146 -61 -63 37 -23
4296 -23 49 142 -40 -69 60 17 64 -54 69 -82 -9 -6 99 -70 44 32 -64 -29 -71 128 88 54 9 -195 -51
4321 -51 -29 163 56 -120 89 1 32 53 -85 -89 -16 -29 46 25 33 110 -180 -57 77 -188 -63 72 -89 -7 148
4346 148 -72 70 -37 -83 123 -208 -41 -71 -120 60 57 85 -71 -57 -17 -60 14 25 14 -75 99 -37 22 138 -3
4371 -3 -125 67 23 32 169 44 82 11 153 -110 151 -54 125 -25 254 36 52 79 40 122 13 -21 17 5 -70
4396 -70 10 -139 27 -42 -47 -40 98 -53 8 -4 137 2 102 -84 -19 61 45 -5 101 -18 81 73 12 -35 142 14
$$ packed form
4221a81K03j4j00M3J12j79O2M0J1m5Q2L1L9P9n8j01J31k26o3K31k13J55L3j75
4245a03J1J96j99J84M6o9j83N1j8J38p4K9K0m3J46p4j7r9j2N0j46J45N6p1j95
4270b31K36P0j80J74o0KL5k2J60j81j16J70o6n7P0OO8j13m5m0J8K48k07kJ00o0
4296b3P2R3j82k9J29m3M7j18J23j51P3LJ05j69J14j2r6L5m2J99m0l4m5k04J44
4321e1K2J92j07j76K09q8L1K1j38mP3j3P5k1QP7k90J23J34k65J25J35j61Q2J55
4346A48k20J42j07m6K06l31J67l0m9J80lK8j56J4M0m3P4J1j1q9J74j36N9J16j41
4371cj22J92m4RJ37j25L8p1J42k63K61k05J79j50K79k18J6K7l9Q2j09l4L8j2p5
4396g0Q0j49J66o9nPJ38j51O1j2J41j35J00j86O5Q0j6n0J06j19R9qo1m7J77j28
$$ plain form
4422 14 -5 -156 69 -26 19 30 -40 90 21 -127 -166 8 -127 -2 -78 -64 154 6 65 101 26 -82 -15 169 18
4447 18 -75 131 2 -11 62 -17 8 38 -114 -72 -92 51 148 102 -3 -20 -182 -103 61 -65 31 78 -25 20 -147
4472 -147 13 2 17 15 -76 -66 -90 188 8 -124 -93 55 16 -59 26 -87 34 44 42 3 -114 56 -41 -91 -46 -79
4498 -79 -39 -27 -37 -17 21 -13 -136 -109 -133 156 121 159 -10 43 114 -243 -125 22 -27 53 27 70 -97 27 96 25
4524 25 37 56 -67 -28 -25 93 -42 -123 -159 44 108 -103 128 -72 -100 38 -44 -1 130 77 -35 -33 65 -83 21
4549 21 -222 -86 87 16 -11 19 99 -136 21 49 -92 -74 -74 -116 97 -114 38 16 83 -6 -60 -61 -18 -34 -60 55
4575 55 -61 105 69 23 47 66 135 73 93 129 11 -13 56 38 106 52 60 -87 5 -137 46 -122 78 121 94 -51
4601 -51 -78 -123 -102 99 152 111 39 28 -176 -15 76 30 -11 -56 29 47 5 87 -86 121 -31 -48 129 -114 -89 48
$$ packed form
4422A4j9j51K25r5M5J1p0J30o9j48l9J74j35J25p6J4K18j48N9L6p5j08O7J84j51
4447A8r3K06j29j3P3p9K5L0j52M2k0J43R7m6j05j7j62P9J64j26R6M7j03M5j67
4472a47J60j1J5kr1J0k4K78j80j32L1J48l9p5Q5j13J21J0kl9j17J70r7n0M5l3
4498g9M0J2j0K0L8l4j23K7k4K89l5L8j69N3P1l57J18J47m9Q0k6M3j67J24O9p1
4524B5J2J9j23L9LJ18j35q1l6K03O4k11K31k00k8J38q2M3J31n3j12KR8j48J04
4549B1k43J36J73p1k7L0Q0k35J57K8j41J8%m2K13k11J52k2O7q9n4jM3j6k6J15
4575E5j16J66l6m6K4J9O9o2K0L6j18k4O9j8O8n4Qj47R2j42J83j68K00M3k7j45
4601e1k7m5K1K01N3m1p2j1k04J61R1m6m1m5Q5J8m2Q2j73K07j52j7J77k43K5J37
$$ plain form
4627 48 47 -46 87 -25 57 -58 -209 85 136 43 -133 -92 -16 -136 -70 -9 -210 -63 37 42 -93 53 -7 -43 -23
4652 -23 -21 30 -53 -26 -9 -97 94 -28 4 68 -92 218 49 -46 -113 82 -24 104 61 -132 28 2 29 -11 -83 -58
4678 -58 34 -13 92 -25 -6 -38 59 0 -36 -78 34 -251 -167 39 -235 -1 2 90 28 67 -102 27 -65 70 -58
4703 -58 -128 143 -56 69 -65 58 72 7 9 37 -170 60 49 -204 1 -83 -118 45 -28 179 -107 -100 21 -48 12
4728 12 69 21 -75 7 -6 151 70 60 44 -104 -72 -58 -183 -67 66 23 164 -114 24 61 91 80 -22 -44 106
4753 106 100 -59 -32 6 95 -59 -45 17 -54 166 53 82 -44 -125 -175 65 -48 -66 68 76 -90 53 -130 89 -242
4778 -242 -13 60 -2 -14 -50 104 -52 21 -165 85 -64 165 -42 -44 9 -1 -123 127 9 -58 183 -26 -9 54
4802 54 -44 -19 11 -24 -118 -55 0 27 26 105 -68 -35 134 63 -1 57 -41 14 -155 -22 68 127 -46 -68 97 3 69 -15
$$ packed form
4627D8jr3J33j12Q2j15j51K94N1r3j76M1P6j20O6O1k01J47J00Nj35J46o0l6K0
4652b3KN1q3K7J7q8J91j22L2O4j60L10j69r5o7J95j06J28m3j93J60k6K7m0p2K5
4678e8R2m7J05j17J9l2R7n9l6m2J12k85Q4K06k74K34LQ8o2L9j69J29r2J35j28
4703e8p0K71j99J25j34J23J4o5KK8k07K30j1k53K05q4l5J63p3K07k86PJ21o9O0
4728A2N7m8r6Q2j3J57q1j0j6j48L2J4j25J16J33m3J41k78J38L7L0j1j02k2J50
4753A06oj59K7L8Q9j54J4O2p1K20j13K9j26q1n0K40j13j8J34Qj66J43j83K19l31
4778b42K29P3o2j2l6J54j56P3j86K50j49K29k07kN3j0j22K50j18o7K41k09J7O3
4802E4r8K5L0l5r4O3N5K7jP9j73L3J69p1o4N8r8N5j69J33R0N9j73k2J65r4O6q4
$$ plain form
4830 -15 -38 -49 -119 105 67 75 -94 -40 114 -22 59 37 82 -3 -59 53 -71 -65 144 125 116 22 -20 -87 -21 -1 -2 11 30
4859 30 46 -33 108 -37 3 50 81 -55 -8 -103 -6 79 53 -36 48 11 -35 37 -115 3 -125 -109 -5 -3 5 -42 71
4886 71 27 50 102 -98 206 -60 60 -80 -73 78 77 16 -115 27 -96 48 -75 -128 -3 66 -5 -44 -128 71 -78
4911 -78 53 62 45 121 -37 -56 -41 -29 -110 101 74 -87 -101 -30 72 -19 36 -101 -81 97 135 -147 -70 -135 24 168
4937 168 -28 95 -12 -184 -67 111 130 65 -2 -68 103 -134 -15 102 -5 93 -47 -110 29 50 -17 53 70
4960 70 35 27 83 -103 230 5 -46 142 40 -107 16 -78 23 -35 48 252 -71 3 -107 -171 -269 -19 -71 44
4984 44 6 94 127 124 58 9 -76 85 -65 -159 -15 -62 -66 -84 -4 -51 117 62 -19 13 2 -100 -31 -116 9 -73 87 -3
5012 -3 28 -74 -63 5 -44 -52 40 25 45 -15 -86 66 -74 38 106 59 89 -23 -77 35 -94 298 -73 -170 35 120
$$ packed form
4830a5k3j1p0K24l8Qj69N4J54j36Q1k2M5q5n6J12j24OK09j9rr4m2o7O6K0jJ3J9
4859C0J6p9J41j45M0M7L1j36M7r5R7Q5k6q9Q4l7m6P2j52J18j28J6J04KQm7J13
4886G1m4K3N2k00L04k66J20j40PJ51jo1j31J42j23J44j23n3J25O9p1l9q4J99j49
4911g8J31Rj7P6j58j9J5J2q1K11k7j61j4P1J02r1N5j37K0J78L8k82P7o5J59J44
4937A68j96J23j07j72J17J78J9o5o7o6J71k37J19J17j07R8j40o3J39K1o7P0J7
4960G0l5qN6j86L33k25n1J88j02j47J23r4J01n8Q3K04l23P4j10o4r8K50n2J15
4984D4l8Q8L3lo6m9q5J61j50r4J44m7mj8Q0m7J68n5q1L2j1j02O9q5J25q2J60r0
5012cL1j02J1O8m9qR2j5K0o0p1J52j40J12O8m7L0j12n4J12j29L92l71r7K05Q5
$$ plain form
5038 120 18 -28 144 -160 -18 83 -40 17 -38 4 16 -25 -180 25 -79 -130 106 9 -16 86 121 -19 -22 54
5062 54 -108 24 -68 -99 -71 -91 -81 -85 -176 -9 94 -68 268 -108 -60 -81 126 -18 -84 -46 -56 -7 -129 -56 143
5087 143 214 -31 76 -39 -74 33 64 -137 161 219 -112 -257 14 52 127 84 -4 -87 -22 63 -29 132 24 -5
5111 -5 59 3 -119 -33 -105 150 18 30 124 -28 -155 255 -17 -50 113 56 -32 42 -87 -67 46 -81 -43 57 84
5136 84 118 101 -15 77 -88 54 120 -42 48 20 -60 -68 -63 20 -36 40 -139 -83 14 25 -54 -29 -60 59 -36 34 3 55
5164 55 125 69 44 76 -31 172 50 -159 9 -35 134 -123 71 0 27 -65 -77 155 28 79 54 202 -46 -69
5188 -69 -88 2 19 29 14 0 89 -110 9 -42 73 -56 -80 -128 72 -91 -92 37 -48 48 -2 50 -162 13 -104 -68
5214 -68 46 -36 -53 74 43 239 8 -160 0 -54 -150 -31 9 68 -3 -34 37 -25 -4 33 54 10 -25 -32 104 10 -18
$$ packed form
5038A20j02m6J72l04J42J01j23N7n5M2J2m1j55K05j04n1K36r7k5J02L5j40lP6
5062E4j62J32r2l1K8k0J0mr1J67J03j62L36l76M8k1K07j44o6L8j0M9j22P3J99
5087A43P1k45J07j15l5J07L1k01K98N8l31j45K71L8P5m3q8q3O5Q5r2J61j08k9
5111eO4n6j22Q6p2K55j32J2R4j52j27M10k72l3J63n7q8P4j29K0J13j27L8J00K7
5136H4L4j7j16R2j65J42O6j62R0k8q0qNQ3n6P6j79N6R7J1p9K5l1J19r5P0l1N2
5164E5P0n6k5L2j07K03j22k09J68m4J69k57J94p1K7r2j2K32j27N1k5J48k48k3
5188f9j9R0J7J0j5j4Q9j99J19n1J15j29k4m8K00j63jJ29q5R6n0N2k12J75j17L6
5214f8J14q2j7J27l1J96k31j68J60n4r6J19M0N9p1l1P1o2K1L7K1m4l5pJ36r4k8
$$ plain form
5241 -18 -31 99 -81 -82 -137 91 -1 5 72 -83 120 -38 125 192 -215 41 -44 97 -86 -124 33 -19 23 47 103
5266 103 -87 -48 -17 67 112 -72 -16 -18 14 3 -5 26 -5 -83 57 10 -85 14 137 145 -17 -41 25 -140 -12 39 -112
5293 -112 -136 44 -15 28 68 -46 73 -30 15 -47 -172 -90 28 -69 -106 113 -44 90 -2 107 23 -54 -85 146
5317 146 -14 -34 60 -12 41 3 34 -58 112 -172 54 -17 48 -17 -89 -64 -82 -8 7 1 -52 -26 -94 -138 -8 54 62 -205
5345 -205 116 -75 -2 135 -141 30 -72 35 11 99 82 -65 90 -198 -142 -16 -63 -107 -2 63 -21 -112 -97 -40
5369 -40 91 28 -136 -10 130 -55 98 35 -10 3 -114 13 -14 27 120 33 41 36 84 122 46 161 20 129 116 -60
5395 -60 10 -37 80 4 -43 -30 -26 -67 116 90 117 -37 -46 50 -38 -42 -50 -42 32 -40 -21 -19 -46 -32 -118 61 71 12 117 152 -21
5426 -21 162 90 14 -228 -151 35 43 -14 56 97 -121 -79 197 100 108 -58 16 -139 -128 -82 87 -44 7 -136 -13 67
$$ packed form
5241a8j3J30j80jn5K28r2OO7j55K03j58J63O7m07K56q5J41j83l8J57n2M2K4N6
5266A03j90L9L1Q4M5j84N6kL2j1qL1l1p8J40m7r5R9J23Qj62k4O6j65J28N1j51
5293a12k4J80n9M3M0j14J19j03M5o2j25Q2J18r7l7K19j57J34r2J09q4p7l1K31
5317A46j60k0R4p2N3l8L1r2J70k84K26p1O5o5p2K5j8P4J5on3K6o8m4J30O2Qk67
5345b05L21j91P3J37k76J71j02J07k4Q8j7j47J55k88N6J26m7m4J05O5q4r1J5N7
5369d0J31o3j64J26J40j85J53o3m5J3j17J27k7M1R3q7QnM8L8p6J15j41J09j3j76
5395f0P0m7J17p6m7J3Mm1J83k6K7j54rR6q8mqQP4p2J9Kk7J4q6J79J0n9J05L5j73
5426b1J83p2p6k42P7J86Qn7P0M1k18M2K76r7Qj66P4j55J1M6J69j31N1j43J23Q0
$$ plain form
5452 67 -34 138 18 -12 -23 -48 -100 -12 -3 52 -168 -5 -123 -1 44 -39 44 -41 -18 27 -61 -79 -60 -53 -149 -96 61
5479 61 -229 129 -18 -24 28 57 102 -47 64 65 157 -34 -70 115 -89 20 -134 -18 -125 -26 12 -38 72 71 102
5504 102 -6 -75 -58 37 4 52 4 92 95 100 -53 111 0 -17 -10 5 -68 -39 16 -28 110 -19 -108 -116 -57 137 -131 -122
5532 -122 47 -53 6 -41 -133 -120 -58 17 -67 53 -58 108 115 -19 -69 111 87 129 9 -24 -180 74 9 16 12 -199
5558 -199 -22 -4 -43 67 -52 -4 -100 78 -42 -14 -31 -4 -55 14 -104 -137 22 -60 51 29 1 10 38 25 16 -141
5584 -141 -85 -148 94 -58 -81 36 21 24 50 20 24 119 12 30 11 -50 -53 97 187 -82 -32 34 -25 -120 -61 75 57 -125
5612 -125 -94 -21 183 -77 -163 12 74 -31 126 12 -51 32 -107 -64 -2 -71 -96 12 -104 86 -41 97 77 -17
5636 -17 -84 -10 -48 -8 3 -87 188 -12 71 -86 -93 -157 48 31 -72 -13 -20 -48 -82 40 25 177 -12 24 -157 -129 83
$$ packed form
5452F7j01J72j20l0j1k5n2Q8RN5k20J63j18J22M5q3Q3q5K3M5q8j8J9Pr6N3J57
5479F1k90L58j47oN2K9M5j49J11JR2j91l6J85k04J09j54J16j07R9L8n0J10jL1
5504A02j08o9J7R5l3M8m8Q8LNj53J64j11j7PJ5p3K9N5m4J38j29q9qN9J94k68R
5532a22J69j00N9m7r2J3O2P5q4J20j11J66Pj34n0J80k4M2j20l3j56K54o5Pmk11
5558a99J77J8l9J10j19M8r6J78j20K8j7K7n1O9j18l3J59q2J11k2k8RK8j3rj57
5584a41N6o3K42j52k3J17j5LK6l0MR5j07J8j9o1lJ50R0k69N0O6n9r5N9J36j8j82
5612a25L1P3K04k60q6J75O2j05J57j14o3Q3j39M3O2o9k5J08j16J90j27J38k0r4
5636a7o7P4l8M0J1r0K75k00Q3j57po4K05j7j03N9pk8l4J22j5J52j89L6j81K8K12
$$ plain form
5663 83 118 -45 -135 51 82 141 -53 -133 86 70 90 -36 -5 -57 51 -96 83 -59 -35 99 109 61 97 0 -129
5688 -129 -166 -13 94 160 -125 68 87 -29 112 -121 136 169 -119 123 142 14 40 46 110 23 161 -59 -51 73
5712 73 -25 44 4 -79 -24 79 18 74 -83 -36 4 83 129 -33 21 -107 -103 11 -43 -87 26 29 9 93 -35 224 60
5739 60 -85 53 -9 -9 166 -51 -35 -27 72 29 132 101 53 160 -90 -89 -2 27 20 -71 76 -44 170 -94 -49 -107 109
5766 109 14 202 191 -77 -39 -78 -2 -13 114 0 96 -12 122 2 -202 -177 -96 -53 94 -95 31 -5 -31 -127
5790 -127 65 -88 2 19 -5 52 0 -3 -8 -124 60 26 -126 -66 -127 72 128 135 31 -131 114 -91 50 -120 -59
5815 -59 88 -126 -6 97 66 -30 34 116 -206 62 -30 33 -87 44 -11 73 66 -18 54 -12 3 86 -107 71 140 29
5841 29 -61 -91 30 51 -6 -25 72 -6 -33 -2 26 29 29 -5 151 -8 -91 119 -183 15 23 10 -20 55 73 107 8 -43 34
$$ packed form
5663H3L5j63r0J86L1N9j94q0K19j6K0j26L1n2J08j47J79j42K4J34J0m8L6r7j29
5688a29l7J53J07O6k85J93J9j16J41k33K57L3k88K42J9j28K6OO4q7J38k20QJ24
5712G3r8O9m0q3N5J03o1N6j57M7M0P9M6j62N4j28MJ14n4m4J13Lk0Q4j28K59j64
5739F0j45J38o2%J75k17J6QR9m3J03l1m8J07k50JQ7K9pr1J47j20K14k64M5n8K16
5766A09r5J88j1k68L8l9P6j1J27j14R6j08J34j20k04K5Q1M3J47j89J26l6k6r6
5790a27J92j53R0J7k4N7n2lnj16J84l4j52O0o1J99N6Pj04j62K45k05J41j70O1
5815e9J47k14J20J03l1r6O4Q2l22K68r2O3j20J31n5Q4pq4P2o6J5Q3j93J78O9j11
5841B9r0l0J21K1n7j9R7p8k7L1K8L%l4J56j59q3K10l02J98Qj3l0P5J8L4r9n1P7
$$ plain form
5870 34 32 -18 130 23 -36 -33 -93 -16 -36 -17 -86 -59 -77 113 23 -66 -96 51 16 51 96 -181 -138 15 -64 -4 13 -6
5898 -6 92 -48 75 166 106 -45 -41 136 -22 -24 18 -189 -72 -65 153 -126 -221 63 30 -8 17 105 -78 -23 18 -54 -41
5925 -41 -116 55 8 120 -52 33 -33 106 49 -57 69 148 -48 43 -2 34 133 46 -134 213 103 5 4 61 -61
5950 -61 -107 -55 -62 -76 -141 -22 -34 -43 -62 -24 -139 34 17 -132 -41 82 134 17 -26 38 52 -12 164 -24 -18 54 -17 68
5978 68 -18 110 20 200 -6 174 79 -10 32 -27 94 110 50 -157 161 -100 33 -50 -35 -50 -73 5 -146 -71 60
6003 60 -85 -5 13 49 7 -2 90 -42 18 -20 76 -16 -37 -118 190 10 104 -34 -19 71 -59 30 43 28 4 32 -78
6030 -78 -50 148 -29 -35 57 83 26 107 -36 57 -37 -75 22 -116 -40 -55 -239 89 123 62 17 -140 -4 -51 102 3
6056 3 35 -91 40 130 128 -27 -81 -50 65 165 19 -79 98 86 31 0 -11 -7 37 -120 -11 -29 146 -17 29 117
$$ packed form
5870C4kn0J48j07n9Lo0P7k0J9o9K7j8J90r0q9l0J47l5L5M5k77M3J53p9O0J7j9
5898fR8j40J23R1o0j51MJ77j58kM2k07J17PK18k79r5K84l3l8K5Q8j83N5M1p2J3
5925d1p5J71m7J12j72Q5o6J39n7j06J26P9j96R1m5L6R9q7j80L47j10r8jN7j22
5950f1m6N2pj4o5J19j2rj9L8j15J73j7j49R1J23N2j17m3O4J4o4J76j88OP2p1Q5
5978F8q6J28r0J80k06J80r5q9M2n9J21J6o0k07L18k61J33q3J5j5k3P8j51P5J31
6003F0j45Q0J8L6m2rR2j32O0l8R6r2k1q1L08j80R4j38J5R0j30Q9J3j5k4K8j10
6030g8K8J98j77oR2K6n7Q1j43R3r4l8R7j38P6j5j84L28L4o1m5j57J36m7J53r9
6056CL2j26J31R0kj55n4L1J15J00j46r8J77j2n5l1j1MM4j57J09j8J75j63M6Q8
$$ plain form
6082 117 -62 -218 -80 -104 -40 -36 110 85 -66 -28 -15 -39 -222 40 -79 123 -68 -100 17 -57 55 62 -43 66
6106 66 -72 -41 27 95 5 81 -66 159 -14 33 -110 111 62 -38 56 75 -75 -69 92 32 94 107 -34 41 -27 -121
6132 -121 -17 12 148 -37 -149 49 -95 57 4 23 118 95 53 -111 -55 24 -146 -65 81 4 80 -84 11 -130
6156 -130 65 -23 71 4 -107 32 -184 69 -19 47 0 -58 -75 -144 73 6 67 -39 14 -196 34 42 65 161 -28
6181 -28 10 162 -59 -28 20 -53 14 -134 -86 -60 -30 -25 10 -137 -179 -34 5 58 -11 5 127 13 -89 34 81 25
6207 25 26 -16 149 -44 66 -86 26 -45 -139 89 46 -170 -16 -10 145 29 186 -61 -12 6 -138 62 -64 -16
6231 -16 -48 198 123 130 -87 -26 117 -117 -197 -53 74 198 46 13 -132 -215 -114 10 111 -11 17 50 -110 75
6255 75 3 78 -35 54 -130 55 21 1 73 76 22 40 60 -31 42 -18 83 11 22 -12 -92 19 85 53 -26 -63 44 -101
$$ packed form
6082A17j79j56J38k4O4MJ46k5j51L8J3k4j83K62j19K02j91l2J17p4J12Pj05J09
6106F6j38L1O8O8r0P6j47K25j73M7j43K21m9j00R4J9j50OJ61o0O2J3j41P5o8r4
6132a21J04K9J36j85j12J98j44J52n3J9R5k3m2j64N6P9j70Q1J46p7P6j64R5j41
6156a30J95q8R4o7j11J39k16K53q8O6m7n8j7o9K17o7O1j06N3k10K30QK3R6j89
6181b8L8J52k21L1M8p3O7j48M8K6L0NL5j47m2J45L9N3o9J6J22j14j02J23M7n6
6207B5Jm2J65j93J10j52J12p1r4K28m3k16J54OJ55j16J57k47M9J8j44K00j26M8
6231a6l2K46p5Pk17O1J43k34q0J44J27J24j52l3j45q3J01J24J01j22K8L3j60J85
6255G5p2P5j13Q9j84J85l4k0P2Ln4J8K0r1P3o0J01p2J1l4q0J11O6l2p9l7J07j45
$$ plain form
6283 -101 -37 -56 -1 -29 11 -31 33 -86 -96 113 218 209 19 59 -13 -109 94 -127 -3 25 86 143 -7 134 18
6308 18 -63 23 149 61 140 -151 97 30 106 141 39 -146 102 -12 54 -71 -62 49 84 -96 -92 -47 -11 34 17 41
6334 41 -112 -73 -53 42 16 -9 -32 23 -35 -121 26 -49 -19 -127 -34 139 106 43 -94 53 -23 -40 -108 17 -47 190
6360 190 139 -82 -41 95 13 8 28 -73 33 -68 8 -11 -102 -82 -105 -74 -102 41 14 -20 -151 39 1 74 4 206
6386 206 -88 61 18 -80 19 -59 -142 34 6 36 90 -68 211 -163 -122 8 -86 -53 -36 107 -154 -9 163 -1
6410 -1 -116 77 46 -104 103 45 -57 -24 -35 -224 37 -149 -200 -82 -75 92 -61 9 -57 -54 58 -4 28 31 5 93
6436 93 111 64 178 -29 1 -4 14 -142 73 -4 116 18 -56 66 29 -4 133 -1 -154 -82 58 -81 0 99 49
6461 49 -114 29 72 29 9 -81 -105 -77 -18 -39 -46 167 28 -79 -65 -14 -159 -74 122 -74 30 -27 -41 -117 -80 -106
$$ packed form
6283a01O4j9N5k8M0m2O4j19j0K09J05rj90M0p2r6K03k21J24K8O1N7j50J41j16
6308A8q1Q6J26q8P9k91K48o7P6L5j02j85K48j14O6j25RJ11L5j80MM5L6M5j7K4
6334D1j53L9K0R5k6k5k3N5n8q6J47p5L0j08R3J73l3o3j37J47p6j7o8J25o4K37
6360A90n1k21M1J36q2nK0j01J06j01P6j9r1K0k3L1k8J43k7l4j31J90l8P3p0K02
6386B06k94J49m3r8R9p8q3J76k8L0N4j58K79l74M1J30r4L3J7J43k61J45J72j64
6410aj15J93l1j50K07n8j02L3j1j89K61j86n1J18PJ67j53P0o6LJ12o2L2Lk6Q8
6436I3J8m7J14k07L0nJ8j56K15p7J20r8p4J22l7l3J37j34j53P2J40j39Q1R9n0
6461D9j63J43M3m3k0r0k4K8N9k1pK13j39j07J4N1j45Q5J96j96J04n7j4p6L7k6
$$ plain form
6487 -106 0 74 -62 -56 -18 15 23 -40 -13 157 13 -5 -109 -93 -1 48 -46 -73 64 -176 -115 -95 -88 51 31 58 -128
6514 -128 95 -8 -76 153 -143 -86 -68 97 -93 30 50 -68 -156 135 82 -39 65 14 95 0 -16 -66 73 93
6538 93 129 7 -48 -56 -38 19 -72 48 -141 9 -40 -35 -32 165 27 -21 -92 -25 -18 -174 -31 -21 -190 -57 -8 87 63
6565 63 -8 -35 -81 9 -121 -92 -66 72 -10 0 10 -64 -48 91 74 -15 29 7 -56 113 62 -103 19 -7 -2 91 40 -38
6593 -38 25 -54 151 -76 -71 149 17 36 -128 -20 61 -98 -52 -85 -32 -32 89 -101 8 27 -28 -82 102 27 -25 85
6619 85 15 8 12 -39 -131 -30 -14 -44 -37 -53 70 45 53 -29 -52 -100 38 95 55 47 36 131 -53 -44 -1 18 -118 -26 -1 -58 15
6650 15 -12 -137 45 7 61 -126 85 1 -48 50 158 1 -78 184 -9 -9 31 42 -104 1 60 214 -15 -94 77
6675 77 -65 101 -25 -9 70 -85 12 -66 56 -39 -45 -25 75 -85 -200 -28 37 -87 -59 57 29 179 -141 -9
$$ packed form
6487a06J06P4j36OL8L3Qo3K7J70j44j8j04J6R2M9r4k7J37k40O1K0PJ39k0K7j86
6514a28K23j03o8K29k96N7J8J65j90J23K0j18q8K91n3j21J04n1Q1r5j6n0J39K0
6538I3L6j22n5qJ8N7r1J20j89J50m9NLJ97j38m8p1O7Pj56J43J0j69J33M9R5k4
6565F3p1k7m6R0j30K9K6J38q2J0J0p4J6J39j7q9M4k2o3J69n1j65J22k6NR3n1p8
6593c8O3p9K05k27NK20j32J9j64J08Q1j59M6l3N3%J21j90J09J9n5n4J84p5n2J10
6619H5p0pMn1r2J01J6l0Pj6J23k5Qq2k3m8J38N7m0qj1R5j84RM3J9j36R2K5n7P3
6650A5k7j25J82l8N4j87K11q4m9R8J08j57p9K62j93%M0J1j46J05N9J54k29p9J71
6675G7j42J66j26J6P9j55R7p8J22r5oK0J00j60j15J72O5j24K8J16k8J50l20J32
$$ plain form
6699 -9 -28 -26 121 -31 81 46 152 -39 -42 3 -99 56 89 6 -265 -163 2 145 134 -51 -5 14 22 14 107 66 -1
6726 -1 118 -12 -107 125 103 168 38 -16 20 -10 33 -13 -76 -15 19 42 0 68 22 91 65 -150 -186 -24 -77 42 59
6753 59 74 -87 -59 77 -11 44 95 -92 -6 50 60 67 76 -104 12 -70 -18 -63 3 -28 -62 61 -97 -49 49 63 63 -61
6781 -61 -37 235 23 -53 157 14 6 34 -62 -44 -30 -134 -47 -25 2 56 -76 -42 2 100 0 250 -73 65 110 105
6807 105 -78 12 110 -24 -8 58 107 27 81 -58 -18 -16 -28 112 -50 63 25 -5 -4 -7 -7 -90 -143 9 63 40 53 -44
6835 -44 131 88 -248 70 -64 -57 -54 17 -26 -58 -143 38 104 -161 -22 -105 10 86 89 37 60 -33 8 -136 42 -151
6861 -151 75 19 140 20 -58 42 0 233 -168 34 144 -1 -93 64 33 109 12 -179 65 -83 -141 -69 -106
6884 -106 -35 20 -55 -26 -77 -57 -44 -32 -24 82 -144 19 52 -22 92 -7 -4 64 107 -10 -5 10 -27 -27 62 -22 10 29 11
$$ packed form
6699ij9KJ47j52J12l5J06j91lM5j02J55L3q3k71J02J65J43j1j85M6J9QqR3m1o7
6726aJ19j30r5K32k2O5j30n4L6l0M3m6o3O1L4K3m2O8m6O9k6k15l6J62n3J19J7
6753E9J5j61K8J36q8N5N1j87Q6N6J0PRj80J16q2N2m5O6l1l4J23j58M8R8J4%j24
6781f1K4K72k12p6K10j43qK8r6J8J4j04Q7K2K7N4j32L4M4R8j00K50l23J38M5n
6807A05j83R0R8j34J6O6M9q0N4j39M0Kj2J40j62J13l8l0Jl%q3n3J52N4k3J3r7
6835d4J75m3l36L18j34PLP1m3l2q5J81O6k65J39q3J15P6Ln2K3r3M1j44J78j93
6861a51K26n6J21j20p8J00m2K33m01K02J10j45r2J57l1P6r7j91K44j48n8P2l7
6884a06P1N5p5K9n1K0J3J2QJ06k26J63L3p4J14r9LO8M3j17NJ5l7%Q9q4L2J9j8
$$ plain form
6913 11 73 -40 38 55 -44 33 -55 58 63 124 54 -17 -1 32 12 26 -16 -67 -8 82 116 -114 -165 6 51 -150 5 -197
6941 -197 16 14 -89 -121 -141 2 -76 -53 -41 -57 82 -166 -18 -24 174 180 -57 -28 -36 108 -90 -76 -139 28 -86 79
6967 79 -217 -124 128 55 34 -114 -67 -153 -89 -74 -57 -58 -10 -84 -19 -20 68 128 -9 -121 43 30 125 72 74 161 26 -1
6995 -1 92 141 -82 -62 -58 -20 95 -93 -22 17 -41 5 38 125 107 79 -48 78 13 15 -23 -62 -50 -200 9 97 12 -11
7023 -11 73 56 -41 -24 -3 -86 19 95 15 35 -2 37 77 -260 48 46 9 2 -24 59 -53 49 30 14 -79 128 -57 14
7051 14 60 0 -161 64 -44 -63 -52 35 -68 111 -162 16 -3 -136 0 -31 31 35 135 -18 -30 49 138 23 -16
7076 -16 123 196 -7 -176 160 -138 139 -1 -24 161 -19 10 101 200 128 -106 22 12 -157 -80 97 -67 103
7099 103 -82 63 137 -133 -72 66 -66 116 56 1 -1 -162 -27 123 -73 14 1 -24 -52 -44 17 -138 -131 70 -143
$$ packed form
6913A1O2j13P8J7r9P7q8J13NO1p0p1J6L3k0J4m2n1N9R0L4k30n1J71M5k01J55k02
6941a97K13kj03l2k0J43p8K3J2j6J39k48J48oJ98Ok37K9qJ44j98J4o3J67j14J65
6967G9k96R3K52p3k1j48M7q6O4J5J7jM8p4O5jQ8O0j37j12J64j3R5n3KQ7j35k7
6995aR3M9k23K0ML8J15j88P1L9n8M6L3Q7j8k8j27J26o5Kl8l9J2j50K09Q8q5k3
7023a1Q4j7r7J7K1q3J05P6q0K0l7L9M0l37L08kl7pk6Q3j12J02j9j6r3K07j85P1
7051A4M6o0j61K25j08j9J1Q7j03J79k73J78j9j33J36l1O2MJ00j53j2P9Q9j15l9
7076a6J39P3k03j69L36k98K77j40k3J85j80K9R1R9p2k34J28j0j69P7J77j64J70
7099A03j85J45P4k70O1J38j32J82o0n5kj61J35J50j96Q7j3k5k8QO1j55PK01k13
$$ plain form
7124 -143 91 -47 -34 -83 -1 11 -49 -106 -125 40 -199 60 -4 -122 -76 -106 -69 22 -36 96 82 130 -86 9 280
7149 280 125 -100 -81 -27 -32 -2 91 -25 43 -24 41 -80 -2 67 -23 14 110 -19 -74 72 124 -49 -33 25 30 -5 -100
7176 -100 80 -60 5 137 -135 -48 13 -94 190 33 -75 -83 139 -96 47 16 -132 129 -7 -99 65 85 96
7199 96 49 13 105 -65 27 -45 105 106 -13 23 215 78 35 -17 141 -104 89 18 -52 -9 1 3 35 -8 -107 172 -10
7226 -10 3 10 59 -9 -54 -115 -96 4 -41 -49 -148 -6 -41 -17 98 -38 -90 82 2 -113 -91 -114 39 13 37 88 -10 -52
7254 -52 -1 3 149 -106 -19 94 -256 -109 31 134 -65 39 47 -33 -3 -132 3 -101 -149 125 -262 89 -78
7277 -78 -59 19 70 12 14 -64 -118 34 -29 -57 54 105 -71 3 -69 9 65 -107 34 -2 23 32 -100 133 40 -26 -170
7304 -170 -34 -58 -60 70 11 159 50 43 -198 41 60 -12 2 -15 81 39 175 -23 54 59 15 -76 119 66 31 -128
$$ packed form
7124a43K34j38J3m9Q2J2o0n7j9J65k39K59o4j18M6l0L7R1n8J32j4M8k16R5K71
7149B80j55k25J9N4nL0R3j16O8o7O5j21P8O9r0L7R6j29n5J46N2j73J6N8Nl5r5
7176a00J80j40O5J32k72Q7O1j07K84j57j08qK22k35J43l1j48K61j36r2J64K0J1
7199I6m7l6R2j70R2p2J50Jj19L6J92j37m3n2J58k45J93p1p0M3J0KL2m3r9K79j82
7226a0J3PM9o8m5o1J9J00m5qr9J42l5K4J15j36n2J72q0j15K2k3J53k6K4N1r8m2
7254e2N1MJ46k55Q7J13l50J47J40J03j99J04Qq0L0j29J35j04m8K74l87L51j67
7277g8J9P8N1n8Kp8n4J52o3k8J11N1j76P4p2P8N6j72J41l6K5Rj32K33r3o6j44
7304a70J36k4kJ30n9J48j09pk41K39J9p2J4j7R6m2J36j98P7Nm4r1J95n3l5j59
$$ plain form
7330 -128 -161 37 24 -60 184 57 -75 -2 43 -99 -70 141 -151 120 -34 35 37 -172 117 -72 -106 40 -47 79
7354 79 -110 -18 -109 -83 -81 -58 -21 -42 -28 5 -4 17 -7 -6 15 13 -191 -118 -36 52 16 146 120 -1 -9 -23 94 -54 16 122
7384 122 111 50 -47 -19 -33 103 -14 -3 75 143 -102 -88 -6 112 -31 -263 -23 20 -16 50 93 -57 -93 -42 -40 77
7410 77 -15 53 94 -75 -119 -128 -39 -202 -41 106 74 66 -89 38 -32 -107 48 -20 73 75 85 89 58 143 12 137 -29
7437 -29 24 -85 -42 -76 131 48 -59 16 17 -102 -73 53 -32 -71 -132 -69 101 13 -65 30 73 -79 -22 87 -6 -38 -35
7464 -35 -103 140 110 0 29 -31 94 80 45 57 16 -91 54 -15 49 -110 30 115 -116 -38 -16 -57 -69 -117 46 -77
7490 -77 8 -108 33 -71 14 -12 -2 37 -46 33 -76 -52 -75 58 156 -8 52 -86 51 4 -70 220 66 139 44
7515 44 -102 60 -66 -84 -13 78 71 -40 31 -113 -4 -65 41 -178 -37 44 -36 81 -37 73 -206 64 -114
$$ packed form
7330a28l3J98j3q4K44j27j32P3M5j42K9K11k92K71j54O9Kk09K89j89l4J46q7J26
7354G9j89R2r1K6KK3L7k1J4L3rK1k4JK1kk04P3Q2Q8l6J30k6j21qj4J17j48P0J06
7384A22j1o1r7K8j4J36j17J1P8O8k45J4Q2J18j43k32K40M3l6O6M3j50l6N1KJ17
7410G7r2O8M1j69m4rQ9j63J61J47l2qj55J27p0p5J55o8R3KJ0Ml1Q5j31J25j66
7437b9N3j09M3l4K07q3j07P5Jj19K9J26q5l9o1O3J70q8p8R5M3j52N7J09r3l2L
7464c5o8K43l0j10K9o0J25j4l5J2m1j07J45o9O4j59J40Q5k31P8K2m1j2m8J63j23
7490g7Q5j16J41j04Q5k6J0L9q3P9j09K4k3J33R8j64O0j38J37m7p4K90j54P3r5
7515D4j46J62j26j8P1R1pj11P1j44J09o1J06k19J41Q1q0J17j18J10k79K70j78
$$ plain form
7538 -114 106 -2 -7 28 -45 -75 -2 -124 72 5 -87 54 -49 -41 -9 103 -53 106 -254 71 -17 -123 159 71
7562 71 3 1 -11 20 82 -7 -99 39 185 130 -48 -21 3 -1 43 52 63 -42 143 6 -145 -100 45 41 -85 24 79
7589 79 -121 -77 119 -138 -27 -172 -38 -28 -53 -7 94 70 -5 -120 89 -67 -112 -6 -149 60 36 56 -27 137
7613 137 25 -57 -20 25 91 56 -16 -8 -19 54 -15 -81 -23 4 79 -65 1 107 -83 -92 5 89 -84 -188 7 63 145
7640 145 -122 54 133 61 -102 74 52 125 -18 40 -26 13 81 -133 30 -59 -43 -56 -45 -19 -19 31 -69 -47 -22 90
7666 90 -8 -130 -26 -134 -52 -49 289 -47 103 -7 212 41 84 65 -53 -28 21 103 -20 2 -155 94 -139 -33
7690 -33 35 -59 69 27 -30 23 20 -51 23 -20 -5 27 -164 -35 5 -92 78 127 32 72 -27 68 -36 128 109 67 -38
7717 -38 -68 9 -79 2 3 35 106 26 -73 93 159 -22 -53 -23 77 -40 -23 -15 170 137 -120 -19 -10 12 -76 -250 31
$$ packed form
7538a14K20j08nL5p3l0P3j22J96o7r2J41j03QL2J12j56J59l60L25q8j06K82q8
7562G1o8kj2L1O2q9r2J38J46n5j78K7K4mM4RJ1j05J85j37j51M5J45mj26J09N5
7589G9k00M4J96k57J11j45J34J0k5M6J01k4p5j15K09j56m5J06j43K09k4K0q3J64
7613A37j12q2L7M5O6l5p2Qj1P3o9o6N8K7P5j44O6J06j90rR7Q4j73j04J95N6Q2
7640A45k67J76P9p2j63J76k2P3j43N8o6L9O8k14J63q9J6j3J1K6%N0j00K2K5J12
7666I0r8j22J04j08Q2LL38l36J50j10K19j71M3j9j18K5M9Q2j23K2j57K49k33J06
7690c3O8r4J28m2n7N3lp1P4m3J5L2j91J29M0r7J70M9r5M0r9R5j04J64j9m2j05
7717c8l0P7q8Q1JL2P1q0r9J66O6j81l1L0J00j17J7QJ85l3k57J01RK2q8j74K81
$$ plain form
7744 31 -38 89 34 -26 62 -9 60 -98 29 50 -68 -43 -100 69 68 51 3 -1 51 209 -24 -7 42 -146 -56 130 60
7771 60 89 38 65 -99 92 89 -38 0 180 -55 -24 -57 -25 -31 65 -75 95 -30 16 51 -130 11 143 -27 -22 -60
7797 -60 8 -19 86 157 -35 -37 8 21 48 62 -192 -24 9 26 -133 84 95 -13 22 -59 -100 89 162 54 -136 -83
7823 -83 -64 46 30 -57 -7 104 -48 -84 -22 -4 -62 -51 155 70 -46 -25 4 -130 45 -135 3 97 -140 -32 -11
7848 -11 -100 68 -31 -6 98 -130 -52 -181 80 62 149 -77 28 21 14 87 -94 99 26 25 -85 -115 -38 92 -82 -88
7874 -88 -124 81 -160 35 13 -36 11 40 16 -16 138 36 174 9 -174 144 -51 -77 75 90 24 109 51 -76
7898 -76 -53 -45 -99 -18 46 -93 -63 162 69 -13 -71 -4 21 65 -12 7 33 24 59 35 -79 -105 -98 120 -46 -118 -66 -2 110
7927 110 31 59 3 52 12 -10 55 21 45 91 161 -57 13 24 19 55 -43 -137 40 -205 -100 -92 -15 -72 -58 93 -74 16
$$ packed form
7744C1o9J27n5o0Q8p1O9j58J27K1j18K5n7J69jj7m8mN2J58k33J7M9j88R0J86p0
7771F0K9n1K7j64J91lj27L8J80k35L1l3L2oR6j40J70j25M6L5j81J41J32j70Nl8
7797f0O8k7J05P1j92kM5J3K7J4k54J68L3J7j59K17J1j08L5q1m1J89P3j08j90N3
7823h3J9J10j6q7N0J11j52l6O2J8n8J1K06q5j16K1K9j34J75j80J38R4k37J08K1
7848a1q9J68r9K5J04k28P8j29K61j8Q7k26J05ppP3j81J93p3jj10l0P7J30j74o
7874h8l6K05k41J95k2m9M7K9k4l2J54j02J38j65j83L18j95k6J52J5o6Q5n8j27
7898g6K3Qn4Q1O4j39L0K25r3q2n8O7K5M4p7J9K6rL5k4j14k6PK18j66p2N2O4J12
7927A10p9K8n6M9m0k2O5l4K4M6P0k18P0J1nL6r8r4J77k45J05QP7n7J4J51j67R0
$$ plain form
7955 16 -36 -58 206 140 -55 93 69 102 -60 -52 54 159 -153 -10 3 32 -94 -100 46 -86 10 64 -89 122 -13
7980 -13 144 -51 -33 -78 -126 -68 24 136 -87 4 87 -9 -142 114 18 119 -8 -172 -7 -197 106 29 -35 -6
8004 -6 8 -6 -187 -45 -18 -16 -74 190 6 -44 80 -23 71 109 -54 106 48 -87 219 34 -16 97 78 133 43
8029 43 24 -26 -41 -32 -105 -102 -4 59 -65 -1 124 120 10 56 232 -67 -106 -73 -1 -82 -46 118 32 67 -55 -49 -79 -100 52
8058 52 203 94 0 26 -132 -178 -128 -73 58 -94 26 43 -128 -88 -9 -56 -108 -86 -49 30 10 -13 -51 -54 58 28 68
8085 68 -22 -65 69 85 -72 88 -150 145 26 198 -141 109 -85 -67 44 74 -81 47 -56 140 -22 -120
8107 -120 88 88 50 150 42 -67 29 -61 40 59 190 84 -61 73 72 40 -23 168 115 102 32 46 61 64 43 33
8133 33 11 97 15 77 -144 25 1 -9 95 77 120 43 54 39 -65 10 147 -146 -1 -212 74 -18 49 -127 173
$$ packed form
7955A6n2k2K64o6j95J48k4L3j62QJ06J05l12J43J3K9j26oJ46j32R6N4j53K11j35
7980a3J57j95J8m5m8N8R2J12k23R1Q3r6j33K56r6J01j27j64J65j90L03p7o4K9
8004fJ4j4j81J42K7Kn8K64j84n0J24j03R4L8j63J60n8j35L06j85n0J13j9N5r0
8029D3j9n0j5Rp3LR8O3j24O4J25mj10M6J76k99l9L3P2q1L6J64q6L5j22Ol0k1J52
8058E2J51j09r4K6j58m6N0N5J31j52J20J7j71M0P9m7n2K2L7P9k0k3l8lJ12l0M0
8085F8r0m3J34J6j57J60k38K95j19J72l39K50j94J8J11L0j55J28j03J96j62r8
8107a20K08%l8J00j08j09R6r0J01J9J31j06j45J34jl2o3J91n3j3p0J4J5Lk1j0
8133C3k2Q6q2O2k21J69k4j0J04j8M3p7J1j5j04P5J37k93J45k11K86r2O7j76L00
$$ plain form
8158 173 192 36 -36 30 13 77 -237 48 -22 -50 29 45 -78 -91 -21 2 -46 -81 -3 -2 12 -7 -69 -183 -97 -110 -47 -52
8186 -52 15 -57 -5 -52 35
$$ packed form
8158A73J9j56p2O6j7O4l14K85p0k8P9J6j23j3P0K3m8l5P8JJ4j9o2j14Q6j3O3n
8186e2O7p2N2m7Q7
8191C5
$$ Imaginary data points
##PAGE= N=2
##DATA TABLE= (X++(I..I)), XYDATA
$$ plain form
0 0 0 0 0 0 0 0 0 0 0 0 0 -8 8 -8 8 -16 18 -24 26 -32 40 -48 57 -67 81 -94 108 -128 148 -169 196 -222 252
33 252 -288 326 -367 414 -465 521 -581 648 -721 801 -887 982 -1087 1201 -1324 1460 -1607
50 -1607 1771 -1952 2150 -2370 2615 -2890 3201 -3552 3959 -4433 4991 -5662 6487 -7524 8882
65 8882 -10732 13405 -17609 25171 -65998 568431 430452 -300068 57516 275802 -287077
76 -287077 -359213 425155 460132 -321218 -508631 -1196 52575 -177573 73776 350662 -75229
87 -75229 -409159 47014 420181 84417 -91667 175246 85154 -280963 -85391 293670
97 293670 73997 -250927 -70358 71871 -117247 -85390 200861 163531 -105142 -92210 79865
108 79865 32457 -60628 25795 60283 -104035 -184904 -36738 62074 -10827 -263 96117 19872
$$ packed form
0@%%%%%%%%%%%qJ6j6J6k4L4m2N0n8P2q8J05j24J48j75K02k36K76l17L65m18M74
33B52n40O14o93P81q79R86j102J229j369J522j688J869k069K288k525K784l067
50a607L378l723M102m520M985n505O091o753P511q392R424j0653J2149j4011J6406
65H882j9614K4137l1014M2780r1169O34429j37979p30520L57584K18286n62879
76b87077p2136P84368L4977p81350j87413N07435N3771k30148K51349K76886m25891
87g5229l33930M56173L73167l35764j76084K66913r0092l66117J95572L79061
97B93670k19673l24924J80569J42229j89118L1857K86251l7330k68673J2932J72075
108G9865m7408r3085Q6423L4488j64318q0869J48166R8812p2901J0564R6380p6245
$$ plain form
120 19872 -97776 11506 143316 60592 -19433 30696 -15615 -123943 -38314 100172 47494
131 47494 -48134 -28508 -9741 -31130 26735 112723 59498 -63847 -78584 -18979 -376 1832
143 1832 30281 1995 -96606 -92547 42293 94964 28486 6621 13038 -49883 -61070 63321
155 63321 112769 -10519 -81562 -28224 -14455 -19450 58029 93115 -14788 -91707 -18157 52648
167 52648 29998 22295 32385 -30941 -93288 -33966 57871 29783 -41636 -24943 -702 -32462
179 -32462 -8371 73343 59868 -33899 -39914 22859 12203 -21482 13688 23606 -36849 -48820
191 -48820 14485 37956 3252 2940 26308 2641 -21670 5508 25954 906 -19901 -6502
203 -6502 -3764 -26370 -18812 13910 11694 -10258 -4544 7602 -6004 -8690 23632 29770 -6346
$$ packed form
120A9872j17648J09282J31810q2724q0025N0129m6311j08328Q5629J38486n2678
131D7494r5628J9626J8767k1389N7865Q5988n3225j23345j4737N9605J8603K208
143A832K8449k8286r8601M059J34840N2671o6478k1865O417o2921j1187J24391
155F3321M9448j23288p1043N3338J3769m995P7479L5086j07903p6919P3550P0805
167E2648k2650p703J0090o3326o2347N9322R1837k8088p1419J6693K4241l1760
179c2462K4091Q1714j3475r3767o015O2773j0656l3685L5170R918o0455j1971
191d8820O3305K3471l4704l12K3368k3667k4311K7178K0446k5048k0807J3399
203f502K738k2606P558L2722k216k1952N714J2146j3606k686L2322O138l6116
$$ plain form
216 -6346 -17928 -2867 -6331 -9340 12731 21154 -11109 -29579 647 23459 12971 9393 13965
229 13965 -5364 -28871 -8154 29010 13815 -24521 -20137 -2139 -9823 -6895 24678 24552 -21795
242 -21795 -31005 11975 23286 -507 424 8958 -14172 -29533 4329 31441 5809 -16448 -2558
255 -2558 5943 -959 6253 22562 9223 -20024 -15408 7192 4491 -6076 -2225 -1713 -12124 -8593
269 -8593 11567 12782 -3079 -3108 1921 -2791 -829 6384 1869 -9951 -8166 1922 -190 -2163 5741
284 5741 4263 -2761 1285 11092 9263 -1638 -786 5550 -2025 -8408 -1701 1081 -7569 -10204 2522
299 2522 7460 -3959 -3251 7712 4059 -3851 433 5527 -2763 -10009 -1461 3773 -2962 -3898 1355
314 1355 1669 -246 1892 6705 4497 -956 1575 3760 1140 688 1037 -1904 -5907 -2499 2325 -2815
$$ packed form
216f346j1582J5061l464l009K2071Q423l2263j8470L0226K2812j0488l578M572
229A3965j9329k3507K0717L7164j5195l8336M384J7998p684K928L1573j26m6347
242b1795r210M2980J1311k3793R31Q534k3130j5361L3862K7112k5632k2257J3890
255b558Q501o902P212J6309j3339k9247M616K2600k701j0567L851N12j0411L531
269h593K0160J215j5861k9N029m712J962P213m515j1820J785J0088k112j973P904
284E741j478p024M046R807j829j0901Q52O336p575o383O707K782q650k635J2726
299B522M938j1419P08J0963l653p910M284N094q290p246Q548N234o735r36N253
314A355L14j915K138M813k208n453K531K185k620m52L49k941m003L408M824n140
$$ plain form
330 -2815 -4875 2282 437 -5111 1272 7624 122 -8844 -20 6428 -3899 -5704 5110 2846 -7769
345 -7769 -4195 9529 6662 -7194 -2356 8813 1711 -5815 3914 11019 -2371 -11263 3781 9823
359 9823 -5264 -7507 4065 1446 -9514 -3877 9454 2702 -9537 -2635 5519 -276 -4462 1732
373 1732 4902 -3461 -7260 3223 6925 -926 -2557 2388 2728 -2287 99 6141 1756 -3340 -129
388 -129 1727 453 526 -294 -1519 -2215 -181 130 -1488 520 580 -3328 -2433 1551 1472 -2332 -3664 1239
406 1239 1685 -2477 -221 4361 2299 -2214 17 5744 1346 -4437 1142 4646 -951 -2697 2019
421 2019 2636 -2940 -2574 3976 2114 -3505 -2400 125 -52 -2264 -820 2924 -642 -5189 -1869 2619
437 2619 1483 -2021 -1019 2390 -221 -1442 2262 3524 926 -2524 -1435 4216 3544 -2026 -1645 2234
$$ packed form
330b815k060P157j845n548O383O352p502q966Q824O448j0327j805J0814k264j0615
345g769L574J3724k867j3856M838J1169p102p526R729P105j3390q892J5044O042
359I823j5087k243J1572k619j0960N637J3331o752j2239O902Q154n795m186O194
373A732L170q363l799J0483L702p851j631M945L40n015K386O042m385n096L211
388a29J856j274P3q20j225o96K034L11j618K008O0l908Q95L984p9l804j332M903
406A239M46m162K256M582k062m513K231N727m398n783N579L504n597j746M716
421B019O17n576L66O550j862n619J105K525j77k212J444L744l566m547L320M488
437B619j136l504J002L409k611j221L704J262k598l450J089N651o72n570L81L879
$$ plain form
453 2234 979 -3299 505 5870 -1202 -7629 -1696 3449 124 -3061 549 2332 -4024 -4751 2884
468 2884 3854 -2222 -3483 1375 2122 -2869 -182 5089 1054 -2733 1391 3965 286 -2889 1134 2603
484 2603 -1495 122 2313 -771 -2631 -527 1064 379 -94 -162 -2739 -2606 1500 435 -2763 -1295
500 -1295 638 -330 -2487 951 4850 -1518 -5148 3938 8224 -133 -4331 2320 2798 -5915 -1571 8978
516 8978 2861 -7907 -4396 4347 3042 -1883 2497 4625 -4274 -7480 1348 5487 -951 -5252 -1077
531 -1077 -316 -4167 -186 4761 617 -3663 -595 4343 3338 661 1595 -128 -2363 1079 3038 938
547 938 -801 -2303 -3054 -1165 3591 4043 -1260 -1783 1016 -847 -1667 1911 3432 -1789 -6160 -1019
563 -1019 2892 -2991 -4464 2259 3042 -2866 -2310 5302 2960 -4529 1090 7837 2051 -3590 -609 2041
$$ packed form
453B234j255m278L804N365p072o427N933N145l325l185L610J783o356p27P635
468B884R70o076j261M858P47m991K687N271m035l787M124K574l679l175M023J469
484B603m098J617K191l084j860K104J591o85m73o8k577J33M106j065l198J468
500a295J933r68k157L438L899o368l630R086M286q357m198O651M78q713M344J0549
516H978o117j0768L511Q743j305m925M380K128q899l206Q828M139o438m301M175
531a077P61l851L981M947m144m280L068M938j005k677R34j723k235L442J959k100
547I38j739j502p51J889M756M52n303n23K799j863q20L578J521n221m371N141
563a019L911n883j473O723P83n908N56P612k342p489N619O747n786n641K981K650
$$ plain form
579 2041 -2146 -3236 3538 3141 -4344 -3960 1899 2927 -686 -388 2955 -627 -4231 1193 3993 -1705
595 -1705 -5508 -2003 970 -1202 -630 2678 -831 -4644 -449 4944 5046 1799 24 -865 -2513 423
611 423 4535 2657 -1493 -3558 -3041 -1230 996 3566 1954 -3274 -3113 864 1541 282 539 870 -2969
628 -2969 -4467 1630 2969 -2459 -2900 418 827 -598 1049 3651 952 -2543 252 3749 2673 -434
644 -434 -684 1053 -1182 -2520 1020 1827 -1091 -2115 -441 742 -738 -1508 465 1341 626 -893 -1278
661 -1278 -55 -1236 -1898 1373 2638 -601 -3368 -1393 2848 1684 277 2679 1722 -2296 -1513 3167
677 3167 4269 -951 -3417 -163 404 -1378 -399 1992 50 -4667 -2492 4031 2338 -2131 -1523 -276
693 -276 -1297 -1671 2180 3660 -1324 -4009 -1153 1838 2260 982 1214 779 -1962 -1374 2759 2973 400
$$ packed form
579B041m187j090O774l97p485L84N859J028l613K98L343l582l604N424K800n698
595a705l803L505K973k172N72L308l509l813M195N393J02l247j775q89j648K936
611D23M112j878m150k065N17J811K226K570j612n228J61L977O77j259K57L31l839
628b969j498O097J339n428m41L318M09j425J647K602k699l495K795L497j076l107
644d34k50J737k235j338L540Q07k918j024J674J183j480p70J973Q76p15j519l85
661a278J223j181o62L271J265l239k767J975M241j164j407K402r57m018P83M680
677C167J102n220k466L254N67j782R79K391j942m717K175O523j693m469O08J247
693b76j021l74L851J480m984k685K856K991M22j278K32m35k741N88M133K14k573
$$ plain form
710 400 -1562 -735 185 -527 451 1035 -525 -1216 -1397 -279 988 -558 -1665 -790 80 -51 -1229 -90
728 -90 1098 -795 -904 1164 1704 -16 -943 878 2302 -521 -835 1490 1220 -1004 -1249 1784 1272
745 1272 -2597 -1216 2272 667 -1507 -542 813 -873 -2534 434 2001 -951 -2510 -1215 172
760 172 -15 -514 1180 1091 -1479 -806 1820 2324 885 -401 629 367 -359 670 760 3 -855 -1242 -164
779 -164 674 100 -247 -558 -40 112 -574 283 367 -1202 -1563 -877 358 278 -1255 -298 880 -89 -158 1199
799 1199 2271 478 -1146 1143 2468 -375 -922 741 819 -1037 -1436 1025 737 -2045 -994 1300
815 1300 661 -1135 -1092 1105 153 -1665 -185 1288 -715 -2121 -763 1265 195 -1314 502 1302
831 1302 110 -32 892 2201 862 -976 358 1484 27 -946 128 1031 -991 -2041 514 1071
$$ packed form
710D00j962Q27R20p12R78N84j560o91j81J118J267j546j107Q75Q70j31j178J139
728i0J188j893j09K068N40j720r27J821J424k823l14K325k70k224k45L033n12
745A272l869J381L488j605k174R65J355j686j661K968J567k952j559J295J387
760A72j87m99J694q9k570O73K626N04j439j286J030k62p26J029R0p57q58l87J078
779a64Q38n74l47l11N18J52o86Q57Q4j569l61O86J235q0j533R57J178r69o9J357
799A199J072j793j624K289J325k843n47J663P8j856l99K461k88k782J051K294
815A300o39j796M3K197r52j818J480J473k003j406J358K028j070j509J816Q00
831A302j192j42R24J309j339j838J334J126j457r73J074R03k022j050K555N57
$$ plain form
847 1071 -938 -1481 124 1047 -788 -1574 1168 861 -1606 -1258 585 887 -1296 -1120 1823 639 -1505
864 -1505 154 1988 999 -729 485 1901 -111 -1191 909 1286 -289 -1371 -495 695 -860 -1055
880 -1055 578 249 -1170 -986 299 761 -285 -550 276 -573 -229 27 257 906 407 -359 18 648 1177
899 1177 152 55 1085 246 -632 516 1168 568 -1339 -996 649 -321 -1311 298 521 -1133 -1928 -44
917 -44 1426 -731 -1304 698 107 -1113 -525 1372 1191 -1156 -344 1416 513 -444 417 1284 635 -777
935 -777 -35 1384 179 -657 -207 373 67 -1135 -220 603 -643 -1149 -586 64 296 -787 -701 920 -40
954 -40 -1151 -138 1031 727 -905 408 1467 -166 -766 777 1399 449 -1041 430 1125 -708 -528
971 -528 1139 875 -908 -1348 381 556 -1176 -453 484 -533 -1217 -605 794 69 -1147 -345 418 -167
$$ packed form
847A071k009n43J605R23j835p86K742l07k467L48J843L02k183J76K943j184k144
864a505J659J834r89j728J214J416k012j080K100L77j575j082Q76J190j555j95
880a055J633l29j419J84J285M62j046k65Q26q49L44K56K30O49m99p66L77O30N29
899A177j025r7J030q39q78J148O52o00j907L43J645r70r90J609K23j654p95J884
917d4J470k157n73K002n91j220N88J897j81k347Q12J760r03r57Q61Q67o49j412
935g77P42J419j205q36M50N80l06j202R15Q23j246n06N63O50K32j083Q6J621r60
954d0j111J013J169l04j632J313J059j633o00J543O22r50j490J471O95j833J80
971e28J667k64j783m40J729J75j732P23R37j017o84O12J399p25j216Q02P63n85
$$ plain form
989 -167 243 467 354 174 -538 491 1023 709 136 -444 146 373 29 449 472 140 -790 -1006 348 1008
1009 1008 -712 -1027 17 -33 -1284 -601 1092 371 -1688 -273 1016 -9 -890 190 1239 258 -891
1026 -891 1162 1518 -587 -742 1092 1392 -588 -697 1140 305 -1475 -91 925 -241 -1289 -537 698
1043 698 -406 -1137 327 201 -767 -311 215 233 -484 -333 365 240 466 606 -290 110 427 195 442 677
1063 677 916 -282 -931 590 1151 -359 -771 343 220 -1208 -733 1336 -7 -1991 -237 1083 -42
1080 -42 -1312 47 959 -771 -1158 1282 1443 -818 -1064 638 1117 -553 75 1627 141 -1034 289
1097 289 1432 505 -504 3 519 -802 -504 431 -189 -781 -656 -251 -16 -327 119 -320 -806 642 544
1116 544 -310 -232 213 -65 -282 527 1689 122 -1253 628 1458 32 -496 1145 948 -1464 -750 1787
$$ packed form
989a67M10K24j13j80p12J029N32l14n73n80N90K27l44M20K3l32r30k16J354O60
1009A008j720l15J044n0j251O83J693p21k059J415J289j025q81J080J049r81j149
1026h91K053L56k105j55J834L00j980j09J837q35j780J384J016j166j048P52J235
1043F98j104p31J464j26r68M56N26J8p17J51O98j25K26J40q96M00L17k32K47K35
1063F77K39j198o49J521N61j510m12J114j23j428M75K069j343j984J754J320j125
1080d2j270J359R12j730l87K440J61k261k46J702M79j670O28J552j486j175J323
1097B89J143r27j009N07N16j321K98R35o20n92J25M05K35l11M46m39m86J448r8
1116E44q54P8M45k78k17Q09J162j567j375J881Q30j426n28J641j97k412P14K537
$$ plain form
1134 1787 609 -1751 -542 979 -227 -1325 155 1078 -1399 -1648 815 1224 -668 -950 720 292
1150 292 -962 395 1906 26 -884 164 654 36 -5 926 315 -900 298 554 -147 193 342 -234
1168 -234 -698 -153 589 -886 -1039 407 -148 -1076 -275 911 -199 -1415 -47 1591 -252 -884 1067
1185 1067 1075 -800 -545 1615 1044 -1533 -302 1749 164 -1264 234 1575 -237 -1369 788 1187
1201 1187 -1259 -1123 661 536 -1101 -984 715 -285 -1622 124 1072 -51 -748 2 474 -295 7
1218 7 1039 242 -432 143 241 328 289 265 -46 -289 417 682 -449 -231 263 -602 -577 5 699 -420 -1367
1239 -1367 -68 517 -457 -560 485 205 -1056 -711 1265 728 -1064 49 1090 11 -610 546 1168
1256 1168 -215 -783 808 837 -421 -182 299 131 -755 -396 562 -274 -937 -189 -61 -139 -327 -34 133
$$ packed form
1134A787j178k360J209J521j206j098J480R23k477k49K463M09j892k82J670m28
1150B92j254J357J511j880r10J048M90o18m1R31o11j215J198K56p01L40J49n76
1168b34m64N45P42j475j53J446n55r28Q01J186j110j216J368J638j843o32J951
1185A067Qj875K55K160n71k577J231K051j585j428J498J341j812j132K157L99
1201A187k446J36J784j25j637J17J699j000j337J746R48j123o97P50M72p69L02
1218GJ032p97o74N75R8Q7l9k4l11k43P06K65j131K18M94q65K5N82O94j119r47
1239a367J299N85r74j03J045k80j261L45J976n37j792J113J041j079o21J156O22
1256A168j383n68J591K9j258K39M81j68q86L59R58q36o63P48J28p8j88K93J67
$$ plain form
1275 133 -473 -151 414 -73 -213 94 -217 -2 478 442 36 -236 647 352 -320 385 770 55 -510 24
1295 24 842 -232 -1100 160 333 -826 -751 406 586 -1190 -914 831 405 -972 148 750 208 -791
1313 -791 155 1075 -181 -526 548 750 -123 -110 662 845 -225 -190 776 254 -532 -175 51 -112 -572 -172
1333 -172 53 -472 -267 -300 -384 51 -216 -177 54 58 313 -219 -83 441 114 -285 299 534 75 -347 191 608
1355 608 22 -106 593 363 -371 -362 264 427 -680 -671 266 -304 -908 -267 372 -10 -880 -76 683 -75 -135
1376 -135 364 622 -139 -446 543 540 -238 -249 382 298 -58 -88 542 335 -191 70 326 -223 -55 -26 -239 -107
1398 -107 -542 -177 -153 -230 -64 -395 -110 226 8 -133 255 381 1 -302 247 649 -90 -92 375 422 -124 -357
1420 -357 611 739 -327 -165 210 204 -158 -373 171 -251 -862 -280 135 -45 -365 -162 -73 -92 -456 276 412
$$ packed form
1275A33o06L22N65m87j40L07l11K15M80l6m06k72Q83k95o72P05L85p15n65N34
1295B4Q18j074q68J260J73j159P5J157J80j776K76J745m26j377J120O02n42r99
1313g91R46R20j256l45J074K02q73J3P72J83j070L5R66n22p86L57K26j63m60M00
1333a72K25n25K05l3q4M35k67L9K31MK55n32J36N24l27l99N84K35m59m22N38M17
1355F08n86j28O99k30p34RO26J63j107RR37n70o04O41O39l82q70Q04P59p58o0
1376a35M99K58p61l07R89lp78j1O31q4l56l0O30k07n26K61K56n49J68K9k13J32
1398a07m35L65K4p7J66l31K85L36k18j41L88J26l80l03N49M02p39kM67M7n46k33
1420c57R68J28j066J62L75ol62k15N44m22o11N82M15j80l20K03Q9j9l64P32J36
$$ plain form
1441 412 -32 -159 128 412 259 -47 451 340 -67 -135 213 545 176 -379 -135 220 -13 -137 105 196 -319
1462 -319 -694 -124 156 -215 -322 -174 118 -207 -495 374 443 -232 -78 268 442 61 100 702 194 -305 63
1483 63 432 399 -164 -28 433 -116 -503 144 248 -69 -464 -248 119 -335 -628 -85 136 -182 -361 -213 115
1504 115 55 -164 85 -19 -62 169 211 502 181 -281 141 247 234 124 98 345 -141 -444 259 246 -34 -284
1526 -284 -165 48 -435 -416 188 -71 -277 -407 55 436 -138 -132 286 124 -250 99 285 516 -165 -40 381
1547 381 103 -46 245 263 148 -318 -278 359 -128 -46 -141 -67 -230 -567 -250 213 -187 -200 -126 -187 19 -145 133
1570 133 348 74 -1 147 271 203 -141 346 452 37 -150 348 327 117 -191 -56 417 -185 -152 127 45 -229
1592 -229 -581 -23 72 -264 -348 297 -207 -325 -38 522 363 -324 218 248 221 133 246 430 135 -144 265 426
$$ packed form
1441D12m44j27K87K84j53l06M98j11m07o8L48L32l69n55K44L55k33j24K42R1n15
1462c19l75N70K80l71j07J48K92l25k88Q69O9o75J54L46J74l81L9O02n08m99L68
1483F3L69l3n63J36M61n49l87O47J04l17l95K16L67m54k93N43K21l18j79J48L28
1504A15o0k19K49j04m3K31M2K91l21m62M22J06j3j10k6K47m86l03P03j3k80k50
1526b84J19K13m83J9O04k59k06j30M62L81n74OM18j62l74L49J86K31o81J25M21
1547C81k78j49K91J8j15m66M0O37m87Q2r5P4j63l37L17M63m00j3P4o1K06j64K78
1570A33K15k74p5J48J24o8l44M87J06m15j87M98k1k10l08J35M73o02L3K79q2k74
1592b29l52N58R5l36q4O45n04j18K87N60j59o87N42L0k7q8J13J84k95k79M09J61
$$ plain form
1614 426 44 -84 -20 81 78 -315 55 116 -138 -193 -304 20 136 -402 -225 -118 -220 -295 86 369 167 -187
1636 -187 177 330 -29 -83 293 172 38 -118 241 509 71 -24 236 34 -184 -289 275 59 -598 -318 57
1657 57 -99 -156 -99 153 -61 -367 -33 265 62 52 -28 64 50 -101 65 292 149 132 126 114 361 102 120 49
1681 49 -13 -237 -197 -1 138 -203 -347 71 -141 -361 -176 200 -35 -256 -103 296 165 -195 78 460 -64
1702 -64 -322 207 562 -20 -232 126 259 -265 -27 287 140 -324 -234 419 51 -213 -106 253 -377 -353 148
1723 148 -59 -191 -264 -269 115 -141 -248 201 52 69 200 9 207 229 125 124 79 243 -31 -126 246 295 -152
1746 -152 -125 183 3 -162 -182 204 -15 -350 -215 63 -157 -315 -20 198 -128 -312 77 103 -214 -18 -25 281
1768 281 -176 -177 423 25 -22 101 283 102 -6 67 246 -71 -164 95 65 -88 -181 -200 -116 -164 31 -97 -126 7
$$ packed form
1614D26l82j28O4J01ll93L70O1k54n5j11L24J16n38J77J07j02p5L81K83k02l54
1636a87L64J53l59n4L76j21j34j56L59K68m38r5K60k02k18j05N64k16o57K80L75
1657E7j56n7N7K52k14l06L34K98k03j0q0R2j4j51J66K27j43j7oj2K47k59J8p1
1681D9o2k24M0J96J39l41j44M18k12k20J85L76k35k21J53L99j31l60K73L82n24
1702f4k58N29L55n82k12L58J33n24K38L14j47m64R0O53l68k64J07L59o30K4N01
1723A48k07j32p3nL84k56j07M49j49J7J31j91J98K2j04jm5J64k74r5L72M9m47
1746a52K7L08j80j65k0L86k19l35J35K78k20j58K95K18l26j84L89K6l17J96pL06
1768B81m57jO00l98m7J23J82j81j08P3J79l17r3K59l0j53r3j9Q4m8J95j28k9J33
$$ plain form
1792 7 -181 -158 30 98 -26 -166 141 420 183 -15 281 260 -25 82 503 244 -202 -93 190 68 -118 -20
1814 -20 113 11 -527 8 25 -190 -207 -61 55 -387 -299 128 -33 -210 -162 99 -45 -96 81 334 -13 24
1836 24 180 193 53 274 180 80 154 -73 -161 -243 43 -44 -231 -171 84 -117 -137 -183 31 -118 -190 8 198 -248
1860 -248 -146 86 171 14 -271 441 325 -3 162 195 202 -18 -61 306 -49 -67 179 210 -192 -368 34 -12 -191
1883 -191 -311 101 26 -336 -276 61 -54 -206 -138 -23 -34 13 216 161 64 31 -64 403 97 -54 307 233 135 -65
1907 -65 5 57 184 -139 -149 -159 -75 -192 -108 -113 -64 -307 -16 -28 175 -62 -42 41 -1 -147 -19 56 155 -21 -29 138
1933 138 47 -236 79 164 153 6 -32 162 42 -128 31 48 -55 -226 -287 -29 -271 -185 -102 168 85 -74 -10
1956 -10 160 -2 -33 25 60 85 -196 5 136 -28 -73 152 105 -192 -157 59 187 -78 -99 27 -105 -261 -138
$$ packed form
1792Gj88K3J88O8j24j40L07K79k37j98K96k1k85J07M21k59m46J09K83j22j86R8
1814b0J33j02n38N35J7k15j7J46J16m42Q8M27j61j77M8K61j44n1J77K53l47L7
1836B4J56J3j40K21r4j00P4k27q8q2K86q7j87O0K55k01k0m6K14j49p2J98J90m46
1860b48J02K32Q5j57k85P12j16l28J65L3Pk20m3L67l55j8K46L1m02j76M02m6j79
1883a91j20M12p5l62O0L37j15j52O8J15j1M7K03n5r7l3r5M67l06j51L61p4r8k00
1907f5P0N2J27l23j0j0Q4j17Q4nM9k43K91j2K03k37K0Q3m2j46J28P5R9j76qJ67
1933A38r1k83L15Q5j1j47l8J94j20j70J59J7j03j71o1K58k42Q6Q3K70q3j59O4
1956a0J70j62l1N8L5K5k81K01J31j64m5K25m7k97L5K16J28k65k1J26j32j56J23
$$ plain form
1979 -138 127 10 -360 -189 56 -81 -149 162 13 -159 -96 72 115 -25 -40 187 241 51 5 -19 126 -8
2001 -8 60 -27 -79 -10 -116 -50 62 -68 -209 -21 -1 -96 -240 -192 -116 -150 -254 -147 90 -114 -102 -56 204 30 -44
2026 -44 244 159 27 184 257 208 -59 17 288 221 -63 -65 66 -113 -10 -95 69 -82 -258 43 50 -80 -104 -47
2050 -47 108 80 -78 78 113 53 -135 245 188 102 60 -43 -19 -9 -4 142 241 -19 -124 -29 165 129 -133 -104 -28
2075 -28 -90 -80 50 -18 -149 -138 -144 -44 -69 13 -44 -3 -149 4 67 213 101 22 78 96 115 41 141 75 -177 -5
2101 -5 153 -103 81 -221 -43 -36 -317 -274 -60 -189 -218 -179 -125 20 -102 10 13 -56 50 66 161 -19 -196 246
2125 246 131 112 57 42 94 75 -73 6 48 5 -43 -172 26 -226 -239 -138 -154 44 -139 -202 37 -60 -81 71 108
2150 108 -98 -6 31 74 -63 -18 268 -113 -83 66 35 220 -44 53 316 -44 56 -39 111 -42 -79 90 -33
$$ packed form
1979a38K65j17l70J71K45j37o8L11j49j72O3J68M3j40j5K27N4j90m6k4J45j34
2001hO8q7n2O9j06O6J12j30j41J88K0r5j44M8P6l4j04J07K37k04J2M6K60j74p4
2026d4K88q5j32J57P3m9k67P6K71o7k84kJ31j79J03q5J64j51j76L01Pj30k4N7
2050d7J55k8j58J56L5o0j88L80n7q6m2j03K4J0NJ46R9k60j05R5J94l6k62K9P6
2075b8o2J0J30o8j31J1oJ00k5Q2n7M1j46J53O3J46j12p9N6J8J9p4J00o6k52J72
2101eJ58k56J84l02J78Pk81M3K14j29k9L9N4J45j22J12Lo9J06J6R5j80j77M42
2125B46j15j9n5j5N2j9j48P9M2m3m8j29J98k52j3J01j6J98j83o3K39r7k1J52L7
2150A08k06R2L7M3j37M5K86l81L0J49l1J85k64R7K63l60J00r5J50j53l7J69j23
$$ plain form
2173 -33 25 -108 -59 -125 -100 13 131 173 85 -80 -31 -47 46 -1 10 17 86 -133 20 54 44 -75 -70 266 61 -140
2199 -140 101 33 -72 -295 37 132 -247 -142 -39 -34 -270 -57 69 3 -164 25 139 29 140 60 133 198 24
2222 24 11 84 35 58 -107 238 23 -88 22 16 -64 46 -64 -64 21 -26 85 -78 -91 -151 176 -101 -93 -145 -13 86
2248 86 45 7 117 119 99 113 133 207 45 147 30 9 64 -78 94 45 -35 -1 101 -115 -178 -178 -79 3 -86 -164 -94
2275 -94 -84 29 106 70 160 11 -89 120 81 121 125 94 55 -134 112 53 10 58 -84 67 166 123 -32 -43 96 -142
2301 -142 -67 -117 -7 -149 -199 -5 -49 -124 -75 -4 69 -181 46 294 -10 -42 7 237 44 -163 109 102 53 -25 -102
2326 -102 153 -74 85 41 24 -22 -30 -19 30 -17 -129 14 -12 -86 -190 143 5 -70 9 96 78 -6 114 52 -50
2351 -50 45 40 -29 233 -78 -29 -18 -117 42 30 162 -23 -174 29 -43 -72 34 -60 24 212 -28 -123 -49 -39 -99 -104
$$ packed form
2173c3N8j33M9o6K5J13J18M2q8j65M9j6R3m7J1PO9k19J53L4j0j19NL36k05k01
2199a40K41o8j05k23L32R5l79J05J03Nk36K13J26o6j67J89J14j10J11q0P3O5j74
2222B4j3P3m9K3j65L45k15j11J10oq0J10j10%Q5m7J11j63j3o0L27k77Qn2J32R9
2248H6m1l8J10Kk0J4K0P4j62J02j17k1N5j42J72m9q0L4J02k16o3%R9Q2q9p8P0
2275i4J0J13P7l6R0j49j00K09l9M0Ml1l9j89K46n9m3M8j42J51R9m3j55j1J39k38
2301a42P5n0J10j42n0J94m4p5M9P1P3k50K27K48l04l2M9K30j93k07K72pm9p8p7
2326a02K55k27J59m4j7m6qJ1M9m7j12J43k6p4j04L33j38p5P9Q7j8q4J20o2j02
2351e0R5no9K62l11M9J1r9J59j2J32j85j51K03p2k9J06r4Q4J88k40r5P4J0o0n
$$ plain form
2377 -104 194 38 -134 98 50 -68 50 151 -13 -78 115 248 94 -28 114 -14 -153 47 83 58 -172
2398 -172 -29 -69 -111 -120 -167 -167 -14 -162 42 76 -26 69 44 -7 18 -67 -27 1 -71 209 33 17 65 -115 20 -12
2424 -12 64 119 -320 0 138 -48 43 -12 134 45 -64 -71 56 -40 -10 116 -21 -163 86 45 28 72 86 214 105
2449 105 49 175 64 6 20 133 69 89 -69 62 -20 20 15 -102 73 5 -8 -100 139 -11 -84 -118 29 49 36
2474 36 123 -157 61 -31 60 126 50 25 40 85 -123 -72 75 179 72 73 29 -111 -25 -70 -119 -32 20 -49 -96 11 31
2501 31 -142 -63 -85 -96 -35 20 14 29 128 -37 16 3 -83 52 103 86 44 46 37 -31 109 -114 37 230 -295 -131 38
2528 38 -138 62 -122 19 65 67 127 7 -196 -7 70 33 212 176 -9 107 48 47 93 46 76 -11 78 66 -40 180
2554 180 93 -44 -43 48 -80 51 -146 22 -14 -10 -7 -12 41 87 -65 63 -14 65 118 -76 -76 -35 48 128 156 92 264 -57
$$ packed form
2377a04K98j56j72K32m8j18J18J01j64o5J93J33j54j22J42j28j39K00L6k5k30
2398a72J43m0m2rm7%J53j48K04L4j02R5k5n1K5q5M0K8p2K80j76j6M8j80J35l2
2424a2P6N5m39L20J38j86R1n5J46q9j09pJ27r6L0J26j37j42K49m1j7M4J4J28j09
2449A05n6J26j11n8J4J13o4K0j58J31q2M0nj17J75o8j3r2K39j50p3l4J47K0j3
2474C6Q7k80K18r2R1O6p6k5J5M5k08N1J47J04j07Jm4j40Q6m5m9Q7N2o9m7J07K0
2501C1j73P9k2j1O1N5oJ5R9j65N3j3q6J35N1j7m2Kro8J40k23J51J93n25J64J69
2528C8j76K00j84J41M6KO0j20k03J89P7l7J79l6j85J16n9jM6m7L0q7Q9j2j06K20
2554A80q7j37JR1j28J31j97J68l6MLnN3M6j52J28p7P9N3j94%M1Q3Q0K8o4J72l21
$$ plain form
2582 -57 71 -44 106 9 139 134 -40 18 40 -64 -22 27 -41 -158 59 -73 -11 4 103 178 -68 120 -48 24 84
2607 84 78 59 35 -11 -87 -217 0 20 62 73 -95 117 -8 -137 70 -130 -40 -134 112 -4 23 -104 28 11 32
2632 32 92 213 -19 -102 116 96 -40 -27 -141 67 54 -85 68 120 32 79 101 217 5 -65 66 55 -16 127
2656 127 -41 -167 -108 152 36 -37 75 -268 10 180 41 56 -12 -58 -96 -74 42 63 34 78 152 8 -30 18
2680 18 66 121 78 -110 145 97 -98 -113 -9 -88 14 75 53 -154 -61 -51 -83 -189 -39 93 9 106 100 110 33 100
2706 100 -34 171 -36 -5 -9 42 32 75 34 2 37 -5 63 -58 -196 14 -107 7 -84 -96 78 -121 97 -70
2730 -70 20 43 76 -58 -30 13 95 -28 197 0 -68 82 -12 175 12 36 76 -156 -38 -52 79 52 -25 12 -109
2755 -109 -106 -106 -58 -5 -148 -34 28 -1 15 -50 -28 190 15 95 -116 -128 124 159 -153 46 116 -72 135 30 75
$$ packed form
2582e7J28j15J50r7J30nj74N8K2j04M2M9o8j17K17j32O2J5R9P5k46J88j68P2O0
2607H4oj9k4m6p6j30K17K0M2J1j68K12j25j29K07k00R0r4K46j16K7j27J32j7K1
2632C2O0J21k32q3K18k0j36J3j14K08j3j39J53N2q8M7K2J16k12p0J31j1p1J43
2656A27j68j26N9K60j16p3J12l43K78J70j39J5o8m6l8K2J16K1k9M4P4j44l8M8
2680A8M8N5m3j88K55m8j95j5J04p9J02O1k2k07R3J0l2j06J50J32q4R7oJ0p7O7
2706A00j34K05k07L1mN1j0M3m1l2L5m2O8j21j38K10j21J14r1j2J74j99K18j67
2730g0R0K3L3j34K8M3Q2j23K25j97o8J50r4J87j63K4M0k32J18j4J31k7p7L7j21
2755a09L%M8N3j43J14O2k9J6o5K2K18j75Q0k11j2K52L5l12J99P0j88K07j05M5
$$ plain form
2780 75 -37 -161 39 -15 99 9 70 14 3 25 -85 -68 65 -44 90 186 -67 -75 92 55 40 31 39 42 112 57 -42
2807 -42 -19 43 46 59 -107 25 -220 10 -62 -201 70 -146 -82 36 -121 55 -62 -24 -50 -71 17 102 -79 53
2831 53 -42 25 56 123 -16 -19 105 40 68 -5 29 -38 54 74 114 40 -135 -212 40 75 87 107 -126 60 -97 0 197
2858 197 23 -20 -46 5 -52 -122 -81 1 -75 78 111 -211 -40 0 -77 23 20 37 32 43 89 116 102 138 -61 -159 -60 -122
2886 -122 75 -156 99 51 -74 -50 9 38 9 -34 93 -97 103 -24 74 -10 15 97 -124 22 -81 -34 81 0
2910 0 -67 168 -48 -92 7 -91 110 -81 -97 -149 10 120 -39 -112 152 -89 103 40 217 -46 15 -16 179 36
2934 36 133 44 10 190 8 106 34 54 75 -11 -64 23 -140 -98 -139 -26 -53 -109 85 -21 -267 121 85 -122 -43 -7
2960 -7 32 231 46 30 -1 75 63 143 170 27 -9 120 61 -13 -2 200 66 -63 -20 45 -62 -100 -97 66 94 -92
$$ packed form
2780G5j12j24K00n4J14r0O1n6j1K2j10J7J33j09J34R6k53qJ67l7j5rQLP0n5r9
2807d2K3O2LJ3j66J32k45K30p2j39K71k16O4J18j57J76j17L8k6k1Q8Q5j81J32
2831E3r5O7L1O7j39lJ24o5K8p3L4o7R2K0M0p4j75p7K52L5J2K0k33J86j57R7J97
2858A97j74m3k6N1n7p0M1Q2p6J53L3l22J71M0p7J00lJ7nJ1M6K7j4L6j99r8R9o2
2886a22J97k31K55m8j25K4N9K9k9m3J27j90K00j27R8q4K5Q2k21J46j03M7J15q1
2910@o7K35k16m4R9r8K01j91j6n2J59J10j59p3K64k41J92o3J77k63O1l1J95j43
2934C6R7q9l4J80j82R8p2K0K1q6n3Q7j63M2m1J13k7n6J94j06k46L88l6k07P9L6
2960gL9J99j85j6l1P6j2Q0K7j43l6J29n9p4J1K02j34j29M3O5j07l8LJ63K8j86
$$ plain form
2986 -92 27 13 -40 -33 149 111 54 -141 48 -10 -124 20 -68 -90 55 -85 -9 -12 124 94 15 177 -52 14 -11 95
3012 95 -12 -1 97 -65 -31 -30 -97 119 -50 17 85 -46 -56 -45 102 -11 153 -39 52 -10 36 -39 21 -238 35
3037 35 12 155 -24 89 19 -39 94 12 -104 33 23 -133 -84 13 -11 -17 -261 -31 -59 -169 76 19 -30 -23 83
3062 83 -112 15 64 -57 99 249 34 -17 -42 59 -20 42 -31 -85 39 -86 1 -3 -160 132 14 2 75 -41
3086 -41 -280 -17 -56 93 -145 24 111 119 154 -137 145 105 -178 128 165 -23 -82 68 -9 -43 35 -20 48 104 60
3111 60 99 -24 -137 -78 143 67 10 21 -231 -64 49 9 8 140 98 62 -12 -117 -29 -113 -251 23 97 58 62 -132
3137 -132 19 -196 -112 87 -67 -85 -17 -27 85 23 141 28 -3 41 -106 46 9 -69 -139 -67 -21 -16 -46 29 51 -102
3163 -102 -10 -74 159 54 -150 31 -62 9 -128 33 35 -127 -161 5 8 -139 -133 -107 -45 47 -37 -138 121 -4 136
$$ packed form
2986i2J19j4n3PJ82l8n7j95J89n8j14J44q8k2J45j40P6lJ36l0p9J62k29O6k5J06
3012I5j07J1R8j62L4Jo7K16j69O7O8j31j0J1J47j13J64j92R1o2M6p5O0k59K73
3037C5k3J43j79J13p0n8J33q2j16J37j0j56M9R7k4ok44K30k8j10K45n7m9PJ06
3062H3j95J27M9j21J56J50k15n1k5J01p9O2p3n4J24j25Q7mj57K92j18j2P3j16
3086d1k39K63l9J49k38J69Q7QL5k91K82m0k83L06L7j88n9J50p7l4P8n5O8N6m4
3111F0L9j23j13N9K21p6n7J1k52J67J13m0jJ32m2l6p4j05Q8q4j38K74P4l9Mj94
3137a32J51k15Q4J99j54j8O8j0J12o2J18j13l1M4j47J52l7p8p0P2M6Nl0P5K2j53
3163a02R2o4K33j05k04J81r3P1j37J61Kj62l4J66Lj47OK6O2R2q4j01K59j25J40
$$ plain form
3188 136 156 61 -15 -74 159 273 24 177 210 -1 54 -26 -53 79 -203 65 14 -72 -130 -123 -72 -94 -65 -136 75 -36
3214 -36 75 144 15 -74 70 16 74 102 52 110 47 -16 62 199 112 57 94 13 25 -3 135 26 -113 -62 181 -50
3240 -50 -192 -63 -32 -53 -100 -90 -25 12 193 17 -25 -47 65 19 -39 -60 -46 -4 -109 145 90 112 122 -34 -41 -39 21
3267 21 7 -122 -168 -131 91 -20 -25 57 -85 -111 -87 -64 29 -44 -82 -76 76 103 -63 -182 -73 -10 17 -2 8 21 -108
3294 -108 -52 -35 -124 10 83 -76 47 80 -60 -137 59 -5 36 -45 -26 -79 -52 -60 -101 90 11 11 106 66 39 118 70 -50
3322 -50 121 4 -8 73 2 -54 -68 5 9 72 -74 -31 -133 -35 129 38 -35 -150 25 -7 64 -88 -103 -79 36 50
3348 50 40 101 -7 -140 40 -14 -6 45 9 132 24 -28 14 83 72 47 33 -102 73 80 86 78 134 76 -119 18 2 24
3376 24 -76 -21 -48 100 -73 -1 -35 13 -54 20 -98 94 115 -39 52 50 12 24 -21 16 -52 -7 -70 -176 -143 138 7
$$ packed form
3188A36K0r5p6n9K33J14k49J53L3k11N5q0k7J32k82K68n1q6n8PN1k2K9p1K11j11
3214c6J11O9j29q9J44n4N8K8n0N8o3o3P8J37q7n5L7q1J2k8J38j09j39N1K43k31
3240e0j42J29L1k1m7J0O5L7J81j76m2k2J12m6n8k1J4M2j05K54n5K2J0j56pKO0
3267B1j4j29m6L7K22j11nQ2j42k6K4K3R3p3l8OJ52K7j66j19J09O3K7j9J0J3j29
3294a08N6J7q9J34P3j59J23L3j40p7J96o4M1q1J9n3K7qm1J91p9%R5m0k7P9m8j20
3322e0J71j17j2Q1p1n6j4P3MO3j46M3j02R8J64r1p3j15J75l2P1j52j5K4J15J4
3348E0j0O1j08j33J80n4QN1l6J23j08n2M2O9j1k5j4j35J75POqN6n8j95J37j6K2
3376B4j00N5k7J48j73P2l4M8o7P4j18J92K1j54R1kl8J2m5L7o8M5o3j06L3K81j31
$$ plain form
3403 7 2 57 -36 74 31 3 -69 -53 64 117 158 -45 -2 133 75 3 88 -44 -42 109 35 45 -46 -62 38 -26 -90 -151
3431 -151 114 49 -56 -64 100 -25 -87 -89 -143 -95 -77 62 -31 4 -27 -38 -9 148 -47 160 81 18 48 209 15 173
3457 173 16 -110 77 -50 56 79 -40 94 28 -6 82 -84 17 8 -162 -157 92 -65 111 -28 -201 95 -123
3480 -123 -9 -30 85 133 -82 17 103 12 72 82 -180 -82 -12 -69 3 86 -53 15 -7 -17 125 -102 90 -30 80
3505 80 56 4 64 -27 6 -19 -100 -14 -82 -3 227 63 16 169 34 31 17 10 47 -99 30 -27 -107 -131 230 85 -53
3532 -53 -42 53 85 1 31 -34 -33 180 42 80 114 8 107 93 -34 -39 -7 115 9 -151 -48 -19 -20 46 59 -210 72
3559 72 -57 40 23 -80 9 -86 -224 41 -84 50 -44 -9 106 77 -54 89 -271 124 150 -30 123 -38 -3
3582 -3 -156 67 -57 90 47 27 -193 22 -115 -100 68 82 -85 -39 -92 -182 79 -10 -3 21 28 122 -62 -33 -71 36
$$ packed form
3403GnN5r3J10m3k8p2J6J17N3M1k03M3J35n8p2Q5j32KJ51p4J0r1j6J00o4o4o1
3431a51K65o5j05qJ64j25o2kn4M8J8J39r3L5l1j1K9J57j95K07p9o3L0J61j94J58
3457A73j57j26J87j27J06K3j19J34o6l4Q8j66J01rj70NK49j57J76j39j73K96k18
3480a23J14k1J15M8k15R9Q6r1O0J0k62R8P0n7P2Q3j39O8k2j0J42k27J92j20J10
3505H0k4n2O0r1L3k5q1Q6o8P9K30j64m7J53j35lj4pL7j46J29n7q0k4L61j45j38
3532e3J1R5L2q4L0o5JK13j38L8L4j06R9j4j27nL2J22j06j60J03K9jO6J3k69K82
3559G2j29R7j7j03Q9r5j38K65j25J34r4L5J15k9j31J43l60L95K6j80J53j61L5
3582cj53K23j24J47m3k0k20K15j37J5J68J4j67M6n3r0K61q9PK4PR4j84K9l8J07
$$ plain form
3608 36 10 244 84 -1 77 95 -41 -15 109 -32 -31 35 54 -2 49 -126 30 -40 -78 50 -46 -95 -48 -40 -97 44 -61
3635 -61 -198 -92 246 -25 -56 -88 -35 -60 41 58 118 88 15 -4 -52 93 -92 137 -62 -52 24 13 -32 -35 36 67
3661 67 -60 142 -35 42 -58 -48 -123 14 99 94 42 43 -53 13 108 -205 59 -58 -21 102 -67 155 -68 60 53
3686 53 -13 33 88 67 38 151 17 195 1 17 -55 121 -3 29 45 -59 -54 -74 -13 -210 47 36 8 -66 -34 -10
3712 -10 -14 -101 -182 -100 23 -75 -45 20 45 42 49 49 -71 79 -33 137 -153 75 2 222 -75 99 -140 -14 61 -64
3738 -64 162 123 101 -23 12 8 57 -37 -61 133 -54 81 113 2 1 -124 -76 94 -53 -122 63 106 -95 -20 1 150
3764 150 -31 -64 9 -37 -90 20 84 161 -118 -84 50 -31 48 126 105 -47 -21 150 6 -44 37 -14 -82 30 -69 72
3790 72 -56 93 39 -123 39 25 -73 -84 -95 9 -199 -195 -104 37 -46 101 22 78 3 -62 42 36 -76 2 61 -93
$$ packed form
3608C6k6K34j60q5P8J8j36K6J24j41JO6J9n6N1j75J56p0l8J28r6m9M7Qn7J41j05
3635f1j37J06L38k71l1l2N3k5J01J7O0l0p3j9m8J45j85K29j99J0P6j1m5lP1L1
3661F7j27K02j77P7j00J0p5J37Q5nn2Jr6O6R5l13K64j17L7J23j69K22k23J28p
3686E3o6M6N5k1k9J13j34J78j94J6p2J76j24L2J6j04Nk0O1j97K57j1k8p4L2K4
3712a0mq7q1Q2J23r8L0O5K5lP%j20J50j12J70k90K28p3K20k97J74k39J26P5j25
3738f4K26l9k2j24L5mM9r4k4J94j87J35L2j11jj25M8J70j47o9J85M3k01P5K1J49
3764A50j81l3P3m6n3J10O4P7k79L4J34q1P9P8k1j52K6J71j44n0Q1n1o8J12r9J41
3790G2j28J49n4j62J62j4r8j1j1J04k08MR1J41q3J47p9N6p5o5J04oj12P8N9j54
$$ plain form
3816 -93 -82 65 128 -19 -18 39 -49 61 -114 56 -29 -40 -105 59 -52 -127 -1 -109 -12 57 7 -4 58 -100 20
3841 20 18 41 -29 18 65 45 18 169 101 -57 59 -18 -205 67 24 -13 -109 -9 -114 -129 64 -6 -41 20 236 166
3867 166 -58 105 -79 -5 28 97 -42 70 158 112 -170 26 160 84 151 -83 137 -36 147 -177 38 5 -15
3890 -15 27 -21 14 -121 -44 38 -74 82 123 93 -57 -3 -56 -109 195 28 -52 -26 74 76 -6 14 -13 -21 65 153 1
3917 1 -149 -141 37 73 -67 102 -145 -63 -27 14 -120 -68 -47 -18 -89 -90 -25 -139 -110 39 -81 15 76 -4 -79 7 29
3944 29 74 43 12 -9 -74 35 57 83 27 -76 221 -22 8 148 104 -244 -5 -2 -58 -89 77 101 61 -112 -3 46
3970 46 108 144 112 -60 -139 21 24 93 -5 -104 -11 156 -56 -4 73 -3 176 -13 44 -160 -85 -45 -19 -15 23 -17 -4 193
3998 193 -19 144 -71 -47 52 -5 -27 107 -53 -20 93 -22 -95 -28 58 22 -40 114 224 -44 55 34 -49 113
$$ packed form
3816i3J1J47O3j47JN7q8J10j75J70q5j1o5J64j11p5J26j08R7O9n0j1O2j58J20
3841B0kK3p0M7M7k0k7J51o8j58J16p7j87K72m3l7r6J00j05j5J93p0l5O1K16p0
3867A66k24J63j84P4L3O9j39J12Q8m6k82J96J34p6O7k34K20j73J83l24K15l3k0
3890a5M2m8L5j35P7Q2j12J56M1l0j50N4n3n3L04j67q0K6J00Kq2K0k7qQ6Q8j52
3917Aj50QJ78L6j40J69k47Q2L6M1j34N2K1K9p1jO5j14K9J49j20R6O1q0p5Q6K2
3944B9M5l1l1k1o5J09K2K6n6j03K97k43L0J40m4l48K39Ln6l1J66K4m0j73J09M9
3970D6O2L6l2j72p9J60LO9r8r9R3J67k12N2P7p6J79j89N7k04P5M0K6ML8m0J3J97
3998A93k12J63k15K4R9n7k2J34j60L3J13j15p3O7Q6l6o2J54J10k68R9k1q3J62
$$ plain form
4022 113 33 81 -118 -116 63 -51 4 -44 -20 -113 -1 -18 38 175 -11 -81 -23 -9 -101 40 151 -31 -22 -114 -137 95
4048 95 -40 76 20 67 38 74 -22 -26 75 -27 14 39 41 57 60 93 6 74 23 74 -47 32 231 -29 32 -39 75 -169
4076 -169 -9 13 -39 86 79 34 -95 -21 -15 170 171 108 -4 -4 -188 73 -29 -18 -20 -73 0 36 -141 136 23 80 -6
4103 -6 53 110 -80 94 5 -3 127 -12 85 -70 -8 23 -89 11 12 -40 82 233 2 128 32 87 -24 -58 -94 81
4129 81 67 -113 -67 53 -111 -19 -83 -159 -3 -75 56 98 -42 -75 -10 -33 -129 34 99 -23 170 187 -41 66 66
4154 66 106 74 -31 -76 -92 -63 220 -32 -125 44 -5 73 -88 45 -116 48 83 48 -197 -32 -55 -112 93 -119
4178 -119 69 -14 15 30 67 -69 -9 -79 66 52 -41 -20 -38 49 95 90 5 -55 -255 139 56 -98 66 81 111 -2
4204 -2 120 91 -87 3 -199 -68 -22 -76 -90 -98 -75 -2 21 -38 -54 33 9 -112 49 -33 59 -64 3 156 33 62 -35
$$ packed form
4022A13q0M8j99KJ79j14N5m8K4r3J12j7N6J37j86p0N8J4r2J41J11j82Rr2k3K32
4048I5j35J16n6M7k9L6r6mJ01j02M1K5KJ6LL3q7O8n1N1j21P9J99k60O1p1J14k44
4076a69J60K2n2J25pm5j29P4OJ85Jo3j12%j84K61j02J1kn3P3L6j77K77j13N7q6
4103fN9N7j90J74q9qJ30j39R7j55O2L1j12J00Jn2J22J51k31J26r6N5j11l4l6J75
4129H1j4j80M6J20j64R2o4p6J56p2J31M2j40l3O5k3r6J63O5j22J93J7k28J07%
4154F6M0l2j05m5j6K9K83k52r3J69m9P8j61J33j61J64L5l5k45J65k3n7K05k12
4178a19J88q3K9J5L7j36O0p0J45j4r3K1j8Q7M6nq5o0k00L94q3j54J64J5L0j13
4204bJ22k9j78R0k02J31M6n4j4qK3P3K3n9j6Q7k4j21J61q2R2j23O7J53j23K9r7
$$ plain form
4231 -35 108 133 -130 136 -35 30 -15 -30 -1 -17 139 -28 -43 95 -224 -53 70 -50 -111 24 76 23 -25 36
4255 36 -38 -36 -43 -56 -69 -96 18 150 75 90 95 65 -49 23 -111 -142 143 9 23 -58 191 1 2 56 33 128 22 17
4283 17 -7 15 77 -45 -3 -34 104 -4 71 73 -108 -75 12 55 2 32 -13 71 59 -59 71 17 -56 0 -46 25 28 118
4311 118 -132 75 68 112 4 -83 -169 -39 -83 -104 -114 49 22 41 94 11 -92 -67 228 -79 -14 -49 208 74 -22
4336 -22 -23 -74 -115 98 96 -19 -74 -25 13 -67 -65 73 1 41 0 63 -162 0 130 87 -170 -18 62 -157 81 -125
4362 -125 6 -218 -45 21 -3 -45 34 -30 31 121 7 55 -32 79 41 39 68 105 58 56 13 -50 54 -158 131 48 103
4389 103 -46 -118 8 30 -80 -166 -72 -53 86 129 198 35 -36 22 43 121 15 -43 29 -24 35 9 33 54 -54 97
4415 97 -50 -2 -208 30 -28 14 166 18 108 15 -94 -60 82 105 8 -112 -52 113 -66 -122 -8 24 56 81 -83
$$ packed form
4231c5J43K5k63K66j71O5m5j5K9j6J56j67j5J38l19J71J23j20o1J35N2n3m8O1
4255C6p4Kpj3j3k7J14J32p5J5Nl0j14P2j34l1K85j34J4q1K49j90JN4k3R5j06n
4283A7k4K2O2j22M2l1J38j08P5Kj81L3Q7M3n3L0m5Q4j2j18J30n4p3N6m6P1LR0
4311A18k50K07pM4j08q7q6J30m4k1j0J63k7J9N3q3j03K5K95l07O5l5K57j34r6
4336b2jn1m1K13kj15n5M9L8q0KJ38p2M0m1O3k25J62J30m3k57J52Q0k19K38k06
4362a25J31k24J73O6k4m2P9o4O1R0j14M8q7J11l8kK9L7m7km3o3J04k12K89q3N5
4389A03j49p2J26K2j10q6R4J9J39M3O9j63p1N8K1P8j06n8P2n3N9k6K4K1j08J51
4415I7j47M8k06K38n8M2J52j48R0r3j09L4J42K3r7j20O0J65j79n6J14L2L2K5j64
$$ plain form
4440 -83 -86 -25 -79 -228 23 37 112 43 107 -27 99 -48 -75 -2 98 -44 43 2 33 -103 28 67 98 86 -64 -228
$$ packed form
4440h3lO1n4j49K51J4P5o9O4j34J26j47k7P3J00j42Q7m1L1j36J31L9L1j2j50j64
$$ [...]
8191e
##END NTUPLES=NMR FID
##END=
