##TITLE=1H_MeTGLU 2808-1
 D2O
 8 sc, 
 30.8.2023
##JCAMPDX= 6.0         $$ Bruker NMR JCAMP-DX V2.0
##DATA TYPE= NMR FID
##DATA CLASS= NTUPLES
##ORIGIN= UXNMR, Bruker Analytische Messtechnik GmbH
##OWNER= root
$$ XWIN-NMR		Version 3.5
$$ Wed Aug 30 13:42:44 2023 Russian Standard Time (UT+4h)  she@DPX200
##.OBSERVE FREQUENCY= 200.13135
##.OBSERVE NUCLEUS= ^1H
##.DELAY= (6, 6)
##.ACQUISITION MODE= SIMULTANEOUS
##.ACQUISITION SCHEME= undefined
##.AVERAGES= 8
##.DIGITISER RES= 18
##SPECTROMETER/DATA SYSTEM= spect
##.PULSE SEQUENCE= zg30
##.SOLVENT NAME= D2O
##.SHIFT REFERENCE= (INTERNAL, D2O, 0, 15.7039)
##AUDIT TRAIL= $$ (NUMBER, WHEN, WHO, WHERE, WHAT)
$$ ##TITLE= Audit trail, XWIN-NMR		Version 3.5
$$ ##JCAMPDX= 5.01
$$ ##ORIGIN= Bruker BioSpin GmbH
$$ ##OWNER= she
$$ F:/spectra/data/she/nmr/H-F/1/audita.txt
$$ ##AUDIT TRAIL=  $$ (NUMBER, WHEN, WHO, WHERE, WHAT)
(   1,<2023-08-30 13:41:51.34 +0400>,<she>,<DPX200>,
      <created by zg, POWCHK disabled, PULCHK disabled
       configuration hash MD5:
       00 E9 B6 7A A2 85 ED C7 34 08 36 98 17 FE 4E 26
       data hash MD5: 16K
       D5 8D FA 99 F0 B9 27 BB 23 2E 3E 26 9C EB A4 C7>)
$$ ##END=
$$ 
$$ hash MD5
$$ EB C6 EF E0 6F 95 CF 28 A3 22 C9 AB 63 46 CB A9
##$RELAX= 
##$RELAX= 
##$RELAX= 
##$RELAX= 
##$RELAX= 
##$RELAX= 
$$ Bruker specific parameters
$$ --------------------------
##$DU= <F:/spectra>
##$EXPNO= 1
##$NAME= <H-F>
##$PROCNO= 1
##$TYPE= <nmr>
##$USER= <she>
##$AMP= (0..31)
100 100 100 100 100 100 100 100 100 100 100 100 100 100 100 100 100 100 
100 100 100 100 100 100 100 100 100 100 100 100 100 100 
##$AQSEQ= 0
##$AQ_mod= 1
##$AUNM= <au_zg>
##$AUTOPOS= <>
##$BF1= 200.13
##$BF2= 200.13
##$BF3= 200.13
##$BF4= 200.13
##$BF5= 200.13
##$BF6= 200.13
##$BF7= 200.13
##$BF8= 200.13
##$BYTORDA= 1
##$CFDGTYP= 0
##$CFRGTYP= 5
##$CHEMSTR= <none>
##$CNST= (0..31)
1 1 145 1 1 1 1 1 1 1 1 1 1 1 1 1 1 1 1 1 1 1 1 1 1 1 1 1 1 1 1 1 
##$CPDPRG= <>
##$CPDPRG1= <>
##$CPDPRG2= <>
##$CPDPRG3= <>
##$CPDPRG4= <mlev>
##$CPDPRG5= <mlev>
##$CPDPRG6= <mlev>
##$CPDPRG7= <mlev>
##$CPDPRG8= <mlev>
##$CPDPRGB= <>
##$CPDPRGT= <>
##$D= (0..31)
0 1.2 0 0 0 0 0 0 0 0.06 0 0.03 0 0 0 0 0.0002 0 0 0 0 0 0 0 0 0 0 0 0 
0 0 0 
##$DATE= 1693388510
##$DBL= (0..7)
120 120 120 120 120 120 120 120 
##$DBP= (0..7)
150 150 150 150 150 150 150 150 
##$DBP07= 0
##$DBPNAM0= <>
##$DBPNAM1= <>
##$DBPNAM2= <>
##$DBPNAM3= <>
##$DBPNAM4= <>
##$DBPNAM5= <>
##$DBPNAM6= <>
##$DBPNAM7= <>
##$DBPOAL= (0..7)
0.5 0.5 0.5 0.5 0.5 0.5 0.5 0.5 
##$DBPOFFS= (0..7)
0 0 0 0 0 0 0 0 
##$DE= 6
##$DECBNUC= <off>
##$DECIM= 32
##$DECNUC= <off>
##$DECSTAT= 4
##$DIGMOD= 1
##$DIGTYP= 9
##$DL= (0..7)
0 120 120 120 120 120 120 120 
##$DP= (0..7)
150 150 150 150 150 150 150 150 
##$DP07= 0
##$DPNAME0= <>
##$DPNAME1= <>
##$DPNAME2= <>
##$DPNAME3= <>
##$DPNAME4= <>
##$DPNAME5= <>
##$DPNAME6= <>
##$DPNAME7= <>
##$DPOAL= (0..7)
0.5 0.5 0.5 0.5 0.5 0.5 0.5 0.5 
##$DPOFFS= (0..7)
0 0 0 0 0 0 0 0 
##$DQDMODE= 0
##$DR= 18
##$DS= 0
##$DSLIST= <SSSSSSSSSSSSSSS>
$$ [...]
##$SUBNAM2= <"">
##$SUBNAM3= <"">
##$SUBNAM4= <"">
##$SUBNAM5= <"">
##$SUBNAM6= <"">
##$SUBNAM7= <"">
##$SUBNAM8= <"">
##$SUBNAM9= <"">
##$SW= 18.05172834244
##$SWIBOX= (0..15)
0 0 2 0 0 0 0 0 0 0 0 0 0 0 0 0 
##$SW_h= 3612.71676300578
##$TD= 16384
##$TD0= 1
##$TE= 0
##$TE2= 300
##$TE3= 300
##$TEG= 300
##$TL= (0..7)
0 120 120 120 120 120 120 120 
##$TP= (0..7)
150 150 150 150 150 150 150 150 
##$TP07= 0
##$TPNAME0= <>
##$TPNAME1= <>
##$TPNAME2= <>
##$TPNAME3= <>
##$TPNAME4= <>
##$TPNAME5= <>
##$TPNAME6= <>
##$TPNAME7= <>
##$TPOAL= (0..7)
0.5 0.5 0.5 0.5 0.5 0.5 0.5 0.5 
##$TPOFFS= (0..7)
0 0 0 0 0 0 0 0 
##$TUNHIN= 0
##$TUNHOUT= 0
##$TUNXOUT= 0
##$USERA1= <user>
##$USERA2= <user>
##$USERA3= <user>
##$USERA4= <user>
##$USERA5= <user>
##$V9= 5
##$VALIST= <valist>
##$VCLIST= <CCCCCCCCCCCCCCC>
##$VD= 0
##$VDLIST= <DDDDDDDDDDDDDDD>
##$VPLIST= <PPPPPPPPPPPPPPP>
##$VTLIST= <TTTTTTTTTTTTTTT>
##$WBST= 1024
##$WBSW= 4
##$XGAIN= (0..3)
0 0 0 0 
##$XL= 0
##$YL= 0
##$YMAX_a= 868023
##$YMIN_a= -922857
##$ZGOPTNS= <>
##$ZL1= 120
##$ZL2= 120
##$ZL3= 120
##$ZL4= 120
##$ABSF1= 10
##$ABSF2= 0
##$ABSG= 5
##$ABSL= 3
##$ALPHA= 0
##$AQORDER= 0
##$ASSFAC= 0
##$ASSFACI= 0
##$ASSFACX= 0
##$ASSWID= 0
##$AUNMP= <proc_1d>
##$AZFE= 0.1
##$AZFW= 0.1
##$BCFW= 1
##$BC_mod= 2
##$BYTORDP= 1
##$COROFFS= 0
##$CY= 11.3945322036743
##$DATMOD= 1
##$DC= 2
##$DFILT= <>
##$DTYPP= 0
##$F1P= 15.7292609196834
##$F2P= 12.9074282941183
##$FCOR= 0.5
##$FTSIZE= 0
##$FT_mod= 4
##$GAMMA= 1
##$GB= 0.15
##$INTBC= 1
##$INTSCL= 1
##$ISEN= 128
##$LB= 0.24
##$LEV0= 0
##$LPBIN= 0
##$MAXI= 10000
##$MC2= 0
##$MEAN= 0
##$ME_mod= 0
##$MI= 1.114404
##$NCOEF= 0
##$NC_proc= 0
##$NLEV= 6
##$NOISF1= 3.799351
##$NOISF2= 2.8
##$NSP= 1
##$NTH_PI= 0
##$NZP= 0
##$OFFSET= 15.70392
##$PC= 1
##$PHC0= -21049.94
##$PHC1= 13.65272
##$PH_mod= 1
##$PKNL= yes
##$PPARMOD= 0
##$PSCAL= 0
##$PSIGN= 0
##$REVERSE= no
##$SF= 200.130013532006
##$SI= 16384
##$SIGF1= 3
##$SIGF2= 2
##$SINO= 400
##$SIOLD= 16384
##$SREGLST= <1H.CDCl3>
##$SSB= 0
##$STSI= 0
##$STSR= 0
##$SW_p= 3612.71676300578
##$SYMM= 0
##$S_DEV= 0
##$TDeff= 0
##$TDoff= 0
##$TI= <>
##$TILT= no
##$TM1= 0
##$TM2= 0
##$TOPLEV= 0
##$USERP1= <user>
##$USERP2= <user>
##$USERP3= <user>
##$USERP4= <user>
##$USERP5= <user>
##$WDW= 1
##$XDIM= 8192
##$YMAX_p= 0
##$YMIN_p= 0
$$ End of Bruker specific parameters
$$ ---------------------------------
##NTUPLES= NMR FID
##VAR_NAME=  TIME,          FID/REAL,        FID/IMAG
##SYMBOL=    X,             R,               I
##VAR_TYPE=  INDEPENDENT,   DEPENDENT,       DEPENDENT
##VAR_FORM=  AFFN,          ASDF,            ASDF
##VAR_DIM=   8192,          8192,            8192
##UNITS=     SECONDS,       ARBITRARY UNITS, ARBITRARY UNITS
##FACTOR=    0.0002768,     1,               1
##FIRST=     0,             0,               0
##LAST=      2.2672688,     0,               0
##MIN=       0,             -922857,         0
##MAX=       2.2672688,     868023,          0
$$ Real data points
##PAGE= N=1
##DATA TABLE= (X++(R..R)), XYDATA
$$ [...]
3138B849J32o529J084O354k179n978L355N413m484m490N362L275n953k045O185
$$ 2849 2981 -3548 -2464 3890 1711 -4267 -912 4501 17 -4473 889 4164 -1789 -3834 2351
3153B351J159o431M2O337j186o228K273N899l379n187M249M441n169l350N788
$$ 2351 3510 -2921 -2879 3458 2272 -3956 -1683 4216 837 -4350 -101 4340 -829 -4179 1609
3168A609K099n974j098O331K8o365J018O330k436n693L233N297m307m449N231
$$ 1609 3708 -2266 -3364 2967 2995 -3370 -2352 3978 1542 -4151 -918 4379 72 -4377 854
3183H54L225n694k206O148J167o401j14O368j010o181K362N736l393n217M269
$$ 854 4079 -1615 -3821 2327 3494 -2907 -3021 3347 2337 -3844 -1482 4254 861 -4356 -87
3198h7M492n100l467N796K311o236j044O182m8o211J189N975k275n506L292N038
$$ -87 4405 -695 -4162 1634 3945 -2291 -3335 2847 2799 -3412 -2223 3752 1477 -4029 -737 4301
3214D301m171m493N118L223n603k052O085J046o320N5O223j335n823K182N430
$$ 4301 130 -4363 755 3978 -1625 -3677 2408 3454 -2866 -2811 3412 2077 -3746 -1564 3866
3229C866l128m941M138M202m854l389N844K047o231o64N929j77o074J326N754
$$ 3866 738 -4203 -65 4137 -717 -4106 1738 3785 -2446 -3110 2819 2642 -3432 -2106 3648
3244C648k069n581L388M830m534l837N078L201n691k086N949Q91o127J17O260
$$ 3648 1579 -4002 -614 4216 -318 -4155 923 4124 -1567 -3653 2296 3187 -2940 -2823 3437
3259C437j350n910K493N241l317m692M221M124n091l048N512K071o069p32N950
$$ 3437 2087 -3823 -1330 3911 594 -4098 123 4247 -844 -3892 1620 3691 -2378 -3110 2840
3274B840k86n818J311N503k168n347L428M592m158m008M890L294n810j793N809
$$ 2840 2554 -3264 -1953 3550 1382 -3965 -537 4055 -103 -4111 779 4073 -1737 -3530 2279
3289B279R63o218M74N824j051n905K450N168l523m584M500L697n032k906N575
$$ 2279 3242 -2976 -2502 3322 2271 -3634 -1184 3984 461 -4123 377 4074 -958 -3864 1711
3304A711J789n819p66N978k86n896J396N690k556n068L299M592m371l703N157
$$ 1711 3500 -2319 -3085 2893 2607 -3289 -1893 3797 1241 -3827 -528 4064 -307 -4010 1147
3319A147K622n361j827N737Q35o024L53N905j457n649K524N160l451m535M107
$$ 1147 3769 -1592 -3419 2318 3153 -2871 -2518 3387 1930 -3719 -1195 3965 514 -4021 86
3334H6L876m944k730N299J852n799n86N936n81n713J359N731k672n119L578M518
$$ 86 3962 -982 -3712 1587 3439 -2360 -2946 2990 2409 -3304 -1945 3786 1114 -4005 -427 4091
3350D091m310l740N107K761n599j582N624O27n829N12N610j451n609K705N054
$$ 4091 -219 -3959 1148 3909 -1690 -3272 2352 2979 -2850 -2338 3272 1821 -3788 -1083 3971
3365C971l650m304M576L383n017k492N177J686n784n86O084m77n966J714N414
$$ 3971 321 -3983 593 3976 -1041 -3533 1644 3330 -2454 -3040 3044 2567 -3399 -1685 3729
3380C729k725m918L529M293m333l325M871K455n429j378N576L92n658O47N760
$$ 3729 1004 -3914 -385 3908 -425 -3750 1121 3576 -1853 -3231 2345 2737 -2921 -2274 3486
3395C486j935n045K573M699l565m126M410L209m906k386N377J483n800l10N798
$$ 3486 1551 -3494 -921 3778 213 -3913 497 3706 -1200 -3586 1791 3274 -2526 -2836 2962
3410B962p65n547J742N260k897m513L409M260m405l307M953K365n323j388N701
$$ 2962 2197 -3350 -1608 3652 755 -3758 -349 3911 -494 -3801 1152 3517 -1806 -3194 2507
3425B507K61n681P82N481j769n160K707M648l565l937M361L029n025k059N263
$$ 2507 2768 -2913 -2131 3350 1581 -3579 -872 3776 211 -3726 635 3664 -1361 -3420 1843
3440A843J348n704l32N820p18n544J677N195k751m618L660L829m384k867M807
$$ 1843 3191 -2513 -2845 2975 2257 -3287 -1610 3585 834 -3784 -124 3705 -679 -3546 1261
3455A261K245n513j075N472J50n450O31N696j942n027K888M412l667l905M336
$$ 1261 3506 -2007 -3082 2390 2540 -2910 -2279 3417 1475 -3552 -664 3748 81 -3824 512
3470E12L213m972k303N361J270n678O9N620j092n434J963N058k923m538L793L887
$$ 512 3725 -1247 -3550 1811 3081 -2597 -2528 3092 2000 -3434 -1471 3587 664 -3874 -81 3806
3486C806m376l117M855K208n330j190N630J14n512Q96N438k115m936K857M393
$$ 3806 -570 -3687 1168 3376 -1954 -3144 2486 2600 -2912 -2016 3422 1307 -3629 -772 3621
3501C621l533l776M316K928m931k084N416J024n632J60N458j040n208J903N001
$$ 3621 88 -3688 628 3556 -1375 -3459 1957 2981 -2651 -2491 2967 1927 -3281 -1378 3623
3516C623k800m545L606L771m335k869M769K154n185j014N211J15n390J127N125
$$ 3623 823 -3722 -116 3655 -680 -3549 1220 3374 -1811 -2825 2386 2501 -2889 -1762 3363
3531C363k085m780K812M326l601l559M376K666m924k009N436J011n438O5N304
$$ 3363 1278 -3502 -690 3636 35 -3524 852 3518 -1406 -3415 2021 3032 -2406 -2341 2963
3546B963j334m915J983M828k881m317L699L560m224k879M987J716n044j011N457
$$ 2963 1629 -3286 -1303 3525 644 -3673 26 3586 -638 -3517 1470 3186 -1858 -2869 2588
3561B588k48n290R30N304j948m913L130L981l581l611M469K627m875j593N171
$$ 2588 2340 -2950 -2020 3284 1336 -3577 -447 3534 -47 -3658 811 3438 -1437 -3030 2141
3576B141O85n298J24N183j247m882K089M766l123m088L913L319m352k597M760
$$ 2141 2826 -2472 -2348 2835 1588 -3294 -1205 3561 438 -3650 263 3582 -770 -3367 1393
3591A393J750n232n94N211j02n355J181N131k449m359K895M055l691l413M415
$$ 1393 3143 -2089 -2683 2528 2426 -2929 -1748 3383 934 -3425 -530 3525 -166 -3579 836
3606H36K536m824j662N219N51n184L43N232j403m931K121M679k947m033L776L182
$$ 836 3372 -1452 -3114 2105 2656 -2528 -2185 3047 1644 -3287 -1166 3513 566 -3467 309 3491
3622C491m309k514M792J602n192o05N217p8n185J180M754k255m285K950L853l837
$$ 3491 -818 -3332 1460 3062 -2130 -2735 2482 2404 -2781 -1601 3153 898 -3387 -437 3416 -421
3638d21k920M222K369m746j638N141M85n150L58N334j380m969K439M258l061l833
$$ -421 -3341 881 3250 -1496 -3134 2007 2492 -2658 -2300 3034 1654 -3315 -876 3382 321 -3512
3654c512L920K999m332k314M730J562n203m03N189m50n078J297M788k230m469
$$ -3512 408 3407 -925 -3239 1491 3053 -2150 -2553 2636 2186 -2892 -1595 3193 963 -3506
3669c506L299L718l976k927M486K195m757j544M988M46n117O33N014j588m692
$$ -3506 -207 3511 -465 -3392 1094 3289 -1468 -3012 1976 2422 -2695 -2062 2952 1364 -3328
3684c328K492M288l385l662L925K895m313j933M539J396n029m32N021n17m967
$$ -3328 -836 3452 67 -3595 330 3225 -1088 -3021 1518 2914 -2115 -2547 2474 1957 -3010
3699c010J627M804k525m222L179L490l716l036M509K082m844j111M960K76m946
$$ -3010 -1383 3421 896 -3326 -147 3343 -373 -3409 1100 3182 -1662 -2773 2187 2463 -2483
3714b483M95N036j682m716K507M168l275l399L923K758m420j972M659J211n060
$$ -2483 -1988 3048 1366 -3350 -843 3325 50 -3349 574 3332 -1088 -3060 1599 2810 -2250
3729b250k19N136p77m849J477M705k565l992L243L455m064k516M445J885m835
$$ -2250 -2469 2667 1890 -2959 -1482 3223 658 -3334 -91 3364 -700 -3216 1229 3114 -1721
3744a721r67N000j80m762O72N005j727m550K534M075l259l658M280K519m476j797
$$ -1721 -2688 2312 2132 -2630 -1958 3047 1320 -3230 -696 3379 120 -3538 742 3261 -1215 -3012
3760c012M844Q87n017K5M968q02m892J763M693k983l646L419L136m164k311M376
$$ -3012 1832 2719 -2298 -2273 2695 1893 -2999 -1236 3457 474 -3172 247 3383 -781 -3092 1284
3776A284J774m831q48M957j40m929J033M691j883m274K633L759l248l188L839
$$ 1284 3058 -1773 -2621 2336 2196 -2733 -1700 2991 1108 -3166 -533 3226 -22 -3210 629
3791F29K600m464j707M660R18m922K73M647p59m926J865M363k584l905L263L417
$$ 629 3229 -1235 -2942 1718 2636 -2286 -2013 2634 1875 -3051 -1186 3177 593 -3312 -49 3368
3807C368m066k471M294J817m798p06M931k75m720J042M629k049m116K583L709
$$ 3368 -698 -3169 1125 2942 -1856 -2562 2369 2094 -2626 -1584 3045 996 -3120 -537 3172
3822C172l367l048M003K263m253j608M638P12m717M9M707j038m417J890M077k584
$$ 3172 -195 -3243 760 3023 -1230 -2838 1800 2512 -2205 -2156 2551 1513 -2904 -1014 3063 479
3838D79l731L584K924m003k262M354J364m515n33M542j12m660Q47M582j786m341
$$ 479 -3252 332 3256 -747 -3009 1345 2709 -1806 -2339 2203 2091 -2569 -1722 2860 1074 -3267
3854c267K938L527l325l092M013K144m382j237M521O97m929L72M588j101m572
$$ -3267 -329 3198 -127 -3219 794 2938 -1444 -2681 1840 2537 -2392 -2020 2568 1467 -3105
3869c105J992M372k996l344L250K977m043k003M332J143m446o00M771m85m556
$$ -3105 -1113 3259 263 -3081 169 3146 -897 -2900 1432 2575 -1871 -2471 2300 1815 -2741
3884b741J427M132j983l963K702L560l267k948M044K067m617j216M612N08m653
$$ -2741 -1314 2818 835 -3128 -426 3134 -133 -3081 963 3030 -1587 -2803 1809 2317 -2336
3899b336N95M334j284m247K165L816k722l510L370K920m059j963M352J309m615
$$ -2336 -1741 2593 1309 -2938 -773 3043 321 -3189 181 3101 -958 -2921 1431 2740 -1875
3914a875n13M842o17m678J551M238k228l768K837L390l438k941M211J821m294
$$ -1875 -2388 2454 1837 -2841 -1290 2948 720 -3048 -211 3179 -259 -3200 1011 2832 -1462
3929a462r48M355L27m833P45M349j338m294K369L774k791l387L450K693m090j936
$$ -1462 -2410 1945 2272 -2561 -1816 2533 1195 -3099 -730 3044 253 -3134 316 3009 -1081 -3017
3945c017M358J206m538j46M564o76m467J263M309k201l753K873L279l476k685
$$ -3017 1341 2547 -1991 -2137 2427 1751 -2716 -1453 2856 655 -3098 -225 3054 -422 -3107
3960c107M271J566m181j204M725J43m693P96M202j343m216K142M016l063l072
$$ -3107 1164 2730 -1451 -2655 2070 2213 -2480 -1684 2518 1175 -3041 -899 3117 54 -3018
3975c018L440K494m027j686M395P66m412n5M513q04m430J741M113k629l424K930
$$ -3018 422 2916 -1111 -2797 1598 2364 -2048 -2103 2410 1606 -2824 -1083 3030 401 -3023 -93
3991i3L089l693k368M104J724m324p49M289J48m534Q65M201j515l892K180L626
$$ -93 2996 -697 -3065 1039 2763 -1561 -2310 1979 2127 -2407 -1542 2659 1144 -2748 -568 3058
4007C058k951l250L678K423m119j669M448O68m266k29M594p72m462J744M007k523
$$ 3058 107 -3143 535 2958 -1161 -2830 1618 2286 -1980 -2209 2385 1613 -2849 -1105 2902 379
4023C79l325L107K775l521k325M096J605m389q32M458O0m333O99M243j795l742
$$ 379 -2946 161 2936 -585 -2910 1186 2791 -1598 -2430 2028 2088 -2245 -1546 2697 902 -2840
4039b840K437L162k857k918L605K178l964j414M307M84m244P0M603j184m247J970
$$ -2840 -403 2759 -98 -3016 589 2767 -1197 -2611 1696 2180 -2064 -1994 2609 1425 -2822 -852
4055h52L604k403l404L088K814l680j789L698J436m240m67M356k91m069R35L845
$$ -852 2752 349 -3055 33 2847 -833 -2622 1076 2512 -1728 -2195 2161 1870 -2199 -1264 2581
4071B581j618l756K396L320k961k854L624K002m031j077L917P06m349J84M345
$$ 2581 963 -2793 -397 2923 -38 -2892 732 2734 -1297 -2374 1543 2249 -2100 -1916 2429
4086B429r35m235J784L790k482l109K926K792l590k113L937J314m318m35M407
$$ 2429 1494 -2741 -957 2833 351 -2758 168 2960 -630 -2743 1194 2508 -1810 -2245 2162
4101B162l85m321J161M010j915l457K473L055l022k507L518J828l842j076M009
$$ 2162 1777 -2544 -1383 2627 712 -2745 -272 2783 -239 -2746 772 2600 -1242 -2318 1691
4116A691N43m298L24M141j160l959J882L563k250l203L035K647l761j796L795
$$ 1691 2234 -2064 -1740 2401 1241 -2718 -836 2727 477 -2726 309 2956 -805 -2601 1194
4131A194J274m192k02M019m97l973J245L717j746l757K817L012l201k435L541
$$ 1194 2468 -1724 -1926 2093 1596 -2377 -1132 2585 839 -2918 -101 2911 -290 -2725 816
4146H16J812l976j032M038M57m281N65M125j263l854J809L411k074l352L292K299
$$ 816 2628 -1348 -2380 1658 2115 -2166 -1601 2524 1261 -2593 -784 2627 553 -2799 493 2792
4162B792l673j669L904R99m013l20M073n87l956J284L680j905l459K745K813k993
$$ 2792 -881 -2550 1354 2353 -1660 -1980 2093 1506 -2450 -1166 2514 609 -2850 -105 2708 -285
4178b85k378L351J917l898j083M109J40l993M88M069j376l751K093L432k689k807
$$ -285 -2663 688 2605 -1293 -2376 1733 1873 -2120 -1632 2437 1061 -2690 -597 2835 146 -2661
4194b661L047K186l439j598L775R61m062k13M168o13m093J304L792j890l351K666
$$ -2661 386 2572 -867 -2465 1310 2271 -1791 -2004 2164 1551 -2542 -1238 2554 664 -2687 -21
4210b1K646l118k305L786J530l976q12M175k42l750O10L807j426l408K108L116
$$ -21 2625 -493 -2798 988 2518 -1458 -2270 1905 1663 -2087 -1477 2330 904 -2504 -396 2720
4226B720k534k806K984K248l513j282L628O82l982Q4L980q51l689J330L664k278
$$ 2720 186 -2620 364 2612 -901 -2183 1445 2127 -1855 -1771 2209 1358 -2331 -1001 2663 385
4242C85l065K700K719l131k285L694J332l755q61M254k77l874Q74L771j540l643
$$ 385 -2680 20 2739 -392 -2677 1017 2349 -1406 -2267 1987 1710 -2164 -1290 2481 941 -2702
4258b702K311L146k832k670L323K065l712j227L729N84l843M6L942r57l725J626
$$ -2702 -391 2755 -77 -2747 576 2641 -1071 -2298 1431 2015 -1828 -1782 2160 1203 -2522 -896
4274h96L629k437l126K895K637l334j816L451J199l695m79L750k0l794P57L689
$$ -896 2733 296 -2830 65 2702 -632 -2448 1003 2202 -1493 -1972 1778 1758 -2036 -1279 2410
4290B410j636l527K303L053k652k511L089J920l661j066L766O27m065K24L985
$$ 2410 774 -2753 -450 2603 -49 -2560 529 2449 -1212 -2278 1488 2115 -1950 -1726 2259
4305B259r80l835J793L296k263k854K656K487l212j893L709J279l920n18L997
$$ 2259 1279 -2556 -763 2533 270 -2584 72 2559 -653 -2546 1163 2442 -1478 -1996 2001
4320B001l91l902J051L592j638l296K313K780k728k323L164J817l622r82L615
$$ 2001 1610 -2292 -1241 2351 713 -2583 -270 2510 -218 -2541 623 2440 -1182 -2164 1451
4335A451N04l756K14L887j181l537J661L192k094k802K708K277l106j660L350
$$ 1451 1955 -1801 -1587 2300 1119 -2418 -757 2435 341 -2461 247 2524 -582 -2242 1108
4350A108R91l587m06L831m13l904J221L462j570l232K280K713k870k174L254J659
$$ 1108 2099 -1488 -1894 1937 1524 -2380 -1159 2303 733 -2499 -219 2494 -376 -2550 704 2363
4366B363l648q86L773M22l953L87L720j066l504J694L271k532k562K893J934l006
$$ 2363 -1285 -2171 1602 2024 -1929 -1542 2178 1112 -2392 -698 2573 41 -2521 372 2306 -700
4382g00j517L326Q66l656j86L751m72l631J272L346j690l219K424K607k894j961
$$ -700 -2217 1109 1975 -1681 -1867 1884 1412 -2219 -947 2399 709 -2510 -86 2521 -373 -2334
4398b334L181J433l448p93L669jl684N45L517r86l390J772L041k350k706K809
$$ -2334 847 2280 -1168 -1961 1708 1707 -1977 -1432 2085 1099 -2291 -519 2522 172 -2534 275
4414B75K120l180j613L716P55l857J32L617o59l599J417L255k070k898K595K560
$$ 275 2395 -785 -2398 1318 2073 -1784 -1652 1965 1306 -2293 -876 2379 309 -2589 6 2566
4430B566k962k034L237J413l410q22L622J41l674O33L569j260l303J787K922k349
$$ 2566 -396 -2430 807 2220 -1190 -2012 1610 1751 -1923 -1290 2279 1019 -2284 -497 2425 76
4446G6k645L132J870l355j209L388N82l335k08L563m08l583J335L296k078k818
$$ 76 -2569 563 2433 -922 -2131 1257 1839 -1496 -1704 1859 1451 -2132 -797 2499 421 -2397
4462b397K462K374k920j822L081J338l382n86L487n4l483O84L346j366l149K021
$$ -2397 65 2439 -481 -2303 778 2116 -1266 -1852 1635 1581 -1902 -1218 2128 762 -2387 -366
4478c66K689k327k341K769J784l236j008L415L60l398k7L619p07l281J224L038
$$ -366 2323 -4 -2345 424 2208 -1028 -2036 1379 1739 -1659 -1686 1933 1226 -2055 -831 2207
4494B207k017k632K576K293k819j689L140J094l427o07L486k19l184O47L310j348
$$ 2207 190 -2442 134 2427 -392 -2081 1059 2153 -1274 -1881 1605 1386 -1798 -1151 2159 811
4510H11k997J848K734k548k098K769J829l284j016L195N58l434J90L512r12l462
$$ 811 -2186 -338 2396 -152 -2250 519 2348 -936 -1952 1243 1801 -1633 -1443 2069 1157 -2305
4526b305J663K806j844k522K306K315k987j659L220Q40l162l84L360k40l413Q24
$$ -2305 -642 2164 320 -2202 104 2419 -568 -2227 993 1833 -1329 -1713 1647 1407 -2006 -1182
4542a182L239j342k926K012K510k403k157K948J393l193o61L049N18l313J52L262
$$ -1182 2057 715 -2211 -199 2311 -92 -2249 699 2092 -1101 -1762 1287 1805 -1508 -1356 1906
4558A906q35l192J613K530j748k557K468K054l002j324L140R99l468k65L291l40
$$ 1906 1071 -2121 -508 2022 274 -2283 185 2239 -763 -2087 1053 2052 -1416 -1681 1610 1270
4574A270l163Q99L134j519k885K036K446k366k111K985J408l275p69L328K93l503
$$ 1270 -1893 -994 2140 621 -2264 -228 2218 -148 -2259 726 2134 -1141 -1910 1418 1711 -1792
4590a792M60L360j092l093J751K597k004k230K301J941l018j211L180Q37l256
$$ -1792 -1332 2028 936 -2157 -406 2191 187 -2043 258 2199 -819 -2030 1150 1987 -1269
4605a269k77L310m11l257Q93L087j595k573K119K231k447k014K938J398l246o95
$$ -1269 -1546 1764 1353 -1904 -1011 2076 481 -2092 27 2258 -189 -2203 735 2133 -1113 -1808
4621a808L270J51l284L99L213j018l065J717K622k121k398K487J854k698j224
$$ -1808 1462 1613 -1671 -1272 1941 923 -2142 -425 2197 76 -2322 165 2019 -679 -1903
4636a903K914Q24l269k8L194m88k983Q67K859j441k681K031K133k346j673K758
$$ -1903 1011 1835 -1434 -1462 1732 1244 -1739 -872 1987 546 -2135 -104 2029 -317 -1990 768
4652G68J139l030n94L169%l167N37K968r73k814J473K617k085k309K577J858k846
$$ 768 1907 -1123 -1717 1452 1452 -1715 -1178 1790 817 -1997 -524 2093 8 -2301 276 2134 -712
4669g12j037K828O26l263L02L141p36l137J211K952j587k784K298J927k305j586
$$ -712 -1749 1079 1705 -1558 -1256 1885 1149 -1988 -777 2175 588 -2196 102 2029 -276 -1862
4685a862K544J254l111m66L064r2k889M59K915j134k526J443K465k143k025K506
$$ -1862 682 1936 -1175 -1641 1423 1331 -1558 -1099 1816 682 -1844 -401 2064 -79 -2104 402
4701D02J559k919p65K830O34l307K34L017p31k722J123K683j852k353K093K111
$$ 402 1961 -958 -1723 1107 1741 -1566 -1332 1685 954 -1768 -645 2038 186 -2167 -74 2037
4717B037k337j590K746R36k871o43L157k16k961O91K989j344k622J632K280j924
$$ 2037 -300 -1890 856 1792 -1079 -1722 1435 1219 -1742 -1051 1938 594 -2028 -396 1884 -40
4733d0k027K687J160k762p12K897J37k763J09L128j022k603J220K494j603k246
$$ -40 -2067 620 1780 -982 -1694 1203 1340 -1423 -1314 1814 792 -1811 -591 1903 300 -1946
4749a946K107J821k456j349K701R05k965m80L194j88k847N69K742j288k565J958
$$ -1946 161 1982 -474 -1823 878 1783 -1182 -1662 1532 1344 -1503 -934 1808 520 -2045 -87
4765h7K164k258j743K573J190k840p28K909L74k931N0L056o42k988J267K625j730
$$ -87 2077 -181 -1924 649 1839 -1001 -1729 1180 1554 -1377 -1327 1729 1087 -1901 -634 1991 261
4782B61k248K088J869k502j330K719P76k877m27L153l76k597O32K649j306k410
$$ 261 -1987 101 1970 -532 -1862 857 1633 -1244 -1671 1482 1106 -1491 -859 1790 484 -1926
4798a926J932K046k191j778K395J294k564j013K997L10l059M33K742r15k485J288
$$ -1926 6 2052 -139 -1917 478 1772 -792 -1805 1192 1502 -1557 -1124 1618 703 -1782 -494
4814d94K437j806k173K233J594k495j112K664Q27k875j95K824l70k783Q01K816
$$ -494 1943 137 -2036 197 1791 -704 -1816 848 1675 -1200 -1395 1429 1059 -1724 -923 1893
4830A893j406k420J837K119k137j606K513Q51k596p06L005J18k878M68K664r67
$$ 1893 487 -1933 -96 2023 -114 -1720 793 1644 -952 -1658 1347 1465 -1413 -945 1719 752
4846G52k514J316K332j673k011K226J501k614j045K754N51k773k05L061n04k913
$$ 752 -1762 -446 1886 213 -1798 428 1929 -685 -1730 1024 1575 -1198 -1403 1658 1154 -1759
4862a759R68K482j191k297J785J932k229j609K586J026k608o60K786K05k993N14
$$ -1759 -791 1691 500 -1797 -12 1920 -309 -1918 668 1694 -914 -1574 1212 1417 -1576 -1062
4878a062K732j073k472J499K346k051j935K607J310k654q75K497N53k660j92L017
$$ -1062 1670 597 -1875 -376 1970 -81 -2016 591 1901 -753 -1628 869 1422 -1238 -1430 1587
4894A587n38k763J164K268j317k423K105J709k039j580K494Q99k693l39K816k46
$$ 1587 1049 -1714 -550 1718 401 -2022 83 1792 -247 -1827 667 1566 -1127 -1466 1350 1104
4910A104k711O08K752j163k552J795K099j843j915K272J300k513j082K866N09
$$ 1104 -1607 -999 1753 590 -1962 -167 1932 89 -1826 446 1746 -767 -1849 1017 1526
4925A526k885K31K804o44k821J105K437j487k125K066J607k230j467K799P87k798
$$ 1526 -1359 -1128 1676 1032 -1789 -684 1753 266 -1859 207 1814 -416 -1883 916 1703 -1095
4941a095l33K691j72k734P83K689j305k454J766J948j768j876K215J277k484p16
$$ -1095 -1428 1263 1091 -1643 -860 1829 524 -1930 -164 1784 16 -1860 355 1632 -852 -1568
4957a568K631K93k952L47K924q37k495J224K178j572j988J860J653k194j334K689
$$ -1568 1063 1356 -1596 -1249 1675 838 -1657 -433 1745 173 -1815 45 1698 -496 -1830 859
4973H59P36k691l83K702j07k709Q44K425j075k460J810J727j880j435K181J198
$$ 859 1595 -1096 -1479 1223 1116 -1593 -749 1676 601 -1859 -49 1678 -202 -1637 544 1742
4989A742k442q93K780K94k904L40K710p67k603J299K288j583k238K191J537k279
$$ 1742 -700 -1593 1187 1481 -1423 -1083 1627 860 -1743 -444 1844 261 -1977 214 1751 -528
5005e28r31K369O30k618k80K709j44k848O95K646j205k363J665J960k014j407
$$ -528 -1459 910 1540 -1078 -1358 1351 1207 -1641 -946 1700 495 -1868 -203 1757 -257 -1664
5021a664K421R12k493o54K496J49k495J54K712p37k607J428K153j725j823J994
$$ -1664 757 1669 -824 -1478 1018 1167 -1328 -1174 1538 801 -1806 -378 1775 50 -1773 221
5037B21J431k158j266K558P17k669j47K696l95k612R73K344j328k133J699J808
$$ 221 1652 -506 -1772 786 1503 -1166 -1313 1383 988 -1624 -651 1693 365 -1768 -69 1739
5053A739k160j411K516R49k652l07K490M3k486K50K531q60k487J571K105j809
$$ 1739 -421 -1832 684 1633 -1019 -1326 1164 1207 -1279 -1029 1502 642 -1845 -274 1831 22
5069B2j842J976J666k450q56K450N39k626r8K486m38k359R87K311j579j907J719
$$ 22 -1820 156 1822 -628 -1484 966 1505 -1121 -1219 1267 829 -1530 -543 1768 189 -1718 1
5086AJ942k326j209K068J030k456l11K410p4k586P16K321r91k198J481J887j851
$$ 1 1943 -383 -1592 476 1506 -950 -1261 1149 1075 -1511 -795 1526 535 -1663 -182 1705 -146
5103a46j572K248J211k376q02K369K24k386n3K664n70k332R88K203j488j827J757
$$ -146 -1718 530 1741 -635 -1437 932 1156 -1230 -1283 1381 811 -1521 -533 1670 182 -1645 112
5120A12J613k061j249K317P63k509k77K406j0k526P57K273j055k150J444J950
$$ 112 1725 -336 -1585 732 1495 -1014 -1291 1115 1105 -1421 -664 1609 554 -1596 -152 1798
5136A798j869j581K053J276k453o46K261M44k453R3K473p52k011R55J988j242
$$ 1798 -71 -1652 401 1677 -776 -1422 839 1283 -1170 -1077 1396 644 -1367 -412 1576 334
5152C34j936J853J506k195j019K078P15k397k45K637k44k545Q67K080j049k016
$$ 334 -1602 251 1757 -438 -1457 621 1336 -1061 -1306 1331 1087 -1458 -591 1489 440 -1576
5168a576J373J869j930j316K055J007k197n68K180K37k169J24K201o07k224J175
$$ -1576 -203 1666 -264 -1580 475 1482 -715 -1283 897 1134 -1035 -911 1290 683 -1541 -366
5184c66J901j539j509J647J428k030r27K321L58k291j54K350k92k302P21K247
$$ -366 1535 -4 -1513 134 1562 -468 -1395 926 1284 -1007 -1161 1189 897 -1405 -684 1563
5200A563j106k042J406J710j714j479K215Q58k204m90K278J09k430L69K211n21
$$ 1563 457 -1585 -179 1531 -183 -1662 553 1411 -793 -1283 995 1104 -1326 -957 1254 733
5216G33k237J097J971j454j737J787J464j954r93J950Q23k350k78K444l56k389
$$ 733 -1504 -407 1564 110 -1627 160 1624 -330 -1323 627 1450 -900 -1178 1266 910 -1479
5232a479J003J806r63j969J515J684j812j289J811R91k108l02K211Jk106Q0K301
$$ -1479 -476 1330 367 -1602 -87 1597 -215 -1504 307 1298 -810 -1112 1099 1100 -1006 -926 1375
5249A375q90k023J203J817j392j599J643J259k052p78K169N99k454K8K290l22
$$ 1375 485 -1538 -335 1482 90 -1509 134 1393 -659 -1437 732 1331 -1123 -1095 1195 873
5265H73k207O79K144j070j940J402J583j759j033J962P34k037n66K168K66k330
$$ 873 -1334 -655 1489 419 -1521 -119 1464 -295 -1328 634 1368 -669 -1235 933 1199 -1131
5281a131K74K249r03j799R96J780j622j229J452J305j794q23K241K10k199R7K046
$$ -1131 -857 1392 489 -1310 -314 1466 -156 -1385 67 1372 -422 -1245 996 1206 -993 -896 1150
5298A150l66k057Q10J979j262j712J469J490j611j267J973Q01k213l18K156j19
$$ 1150 784 -1273 -463 1516 254 -1458 11 1501 -110 -1377 596 1397 -816 -1134 1022 903
5314I03k215N42K210q81j916J093J739j405j542J595J278k034o18K069L36j968
$$ 903 -1312 -770 1440 559 -1357 -264 1475 70 -1472 123 1401 -633 -1251 818 1154 -814
5330h14p5K200m77k143P17J972j221j663J525J440j601j196J903O64k076k91K108
$$ -814 -889 1311 834 -1309 -592 1380 159 -1504 21 1461 -140 -1336 567 1231 -845 -1136 972
5347I72q2k160N15K038q18j839J137J611j424j437J851R58j861p97K237K05k252
$$ 972 890 -1270 -755 1283 465 -1374 -237 1374 -50 -1487 364 1322 -539 -1336 901 1106 -1146
5364a146L49J954m03k103Q14K078j387j543J489J199j672q54J865N11j953l51
$$ -1146 -797 1157 754 -1349 -535 1543 156 -1387 102 1301 -371 -1225 640 1151 -802 -1153
5380a153K223k71j930N68J930r03j892J265J321j388j158J785R15j979l99J805
$$ -1153 1070 799 -1131 -563 1367 464 -1428 -163 1158 -230 -1388 397 1312 -667 -1066 739
5396G39L80k092J40K231o92k006R17J783j282j512J556J031j549q69J832N80j989
$$ 739 1119 -973 -833 1398 706 -1300 -383 1400 118 -1394 162 1193 -356 -1225 607 1187 -802
5413h02k10J859j33j957O02J905q93j596J119J325j589r15J645R07j940o58K156
$$ -802 -1012 847 714 -1243 -641 1264 371 -1225 -106 1219 -370 -1285 360 1267 -673 -1331 825
5430H25K96k076J00K208p52j684P75J535j019j501J481J139j817o07J899K91j904
$$ 825 1121 -955 -855 1353 601 -1083 -308 1227 208 -1293 188 1327 -490 -1097 802 1093 -811
5447h11q1J856k93j868N77J893q69j722J184J482j503r86J515O91j733l86J821
$$ -811 -892 964 671 -1197 -620 1273 404 -1318 -134 1348 -155 -1141 374 1065 -668 -1054 767
5464G67L5j853L67J901o59j831R56J666j338j290J434J058j613p06J791L76j717
$$ 767 802 -1051 -684 1217 558 -1273 -317 1349 11 -1279 155 1213 -400 -1106 685 1061 -656
5481f56k77J957l22j901P66J743r48j657J159J380j548r57J651P23j875l24J802
$$ -656 -933 1024 702 -1199 -433 1310 362 -1295 -136 1244 -304 -1261 390 1113 -762 -1086 716
5498G16J09j903M73J755p21j720J082J293j025j408J648J018j893n75J963J91
$$ 716 825 -1078 -605 1150 429 -1291 -209 1084 59 -1349 299 1317 -576 -1151 812 1003
5514A003j817n8J989l52j856P04J537q39j653J365J122j300r74J643N65j731k12
$$ 1003 -814 -872 1117 765 -1091 -387 1150 311 -1342 23 1145 -155 -1129 514 1079 -652 -864
5531h64J702k6j883M60J784o89j606J018J302j091j423J624Q76j546p40J725L11
$$ -864 838 812 -1071 -611 1173 484 -1122 -104 1198 107 -1316 308 1184 -362 -1102 623 934
5548I34j850M5K061n31j865O73J783j087j251J117J084j349q97J539O07j737l45
$$ 934 -916 -871 1190 659 -1206 -533 1250 163 -1088 29 1113 -236 -1133 406 1013 -724 -1069
5565a069J883k1j849L60J837q84j562J254J264j316r81J473O19j468m05J576J82
$$ -1069 814 793 -1056 -696 1141 257 -1305 -51 1213 -103 -1084 389 1008 -460 -865 711 893
5582H93j686q2J951m84j811P74J487r01j342J242J276j505j065J680O10j561k22
$$ 893 -793 -875 1076 592 -1219 -445 1042 141 -1201 41 1317 -188 -1253 427 1037 -524 -746
5599g46J692k55j862N86J718p19j593J040J291j310j008J588N93j600l97J525
$$ -746 946 691 -1171 -585 1133 414 -1179 -139 1152 -158 -1166 422 1015 -585 -982 543
5615E43L11j693J00J721m99j725R12J576j268j185J335J042j628p57J772L72j486
$$ 543 854 -839 -739 982 483 -1242 -330 1246 -22 -1207 128 1170 -458 -1215 557 929 -557
5632e57l91J809n4j950O67J493q17j361R97J549j528q88J429O87j717m14J723
$$ -557 -948 861 807 -1143 -476 1017 200 -1161 -164 1385 -143 -1031 398 1085 -632 -1046 677
5649F77Q0j638K09J719o57j513P00J463q45j272J175Q23j355o50J499K69j507
$$ 677 757 -881 -672 1047 390 -1123 -423 1040 195 -1077 98 921 -434 -1084 415 684 -823
5666h23j09J831k19j824P34J655r84j526J078J345j355r16J534P12j577n11J670
$$ -823 -932 899 680 -1144 -410 1245 261 -1265 -187 1158 -197 -1113 421 1133 -444 -955 715
5683G15K04j763J56J740p36j358R03J390j260j160J370R40j682m09J455M61j614
$$ 715 919 -844 -688 1052 316 -1042 -139 1251 -9 -1169 201 1141 -541 -950 505 966 -648
5700f48j05J722l65j485M54J559q78j419R23J234j121r81J516O40j597l00J546
$$ -648 -753 969 604 -881 -427 1132 254 -1165 -242 992 -129 -1110 406 1046 -551 -851 695
5717F95J28j712K61J663o91j484R56J510j322j082J251Q07j390o74J809Q5j562
$$ 695 823 -889 -628 1035 344 -1140 -184 1326 4 -1078 173 980 -410 -1084 725 810 -752
5734g52N1J588l42j609Q11J348r26j172J047J029j349p51J348N56j565j63J582
$$ -752 -701 887 545 -1064 -253 1095 169 -1003 44 1073 -276 -1027 321 877 -688 -851 731
5751G31n8j613N33J468p39j389Q73J297r87j238J218R55j554m40J579J27j616
$$ 731 673 -940 -407 1061 322 -1067 -194 1103 116 -1122 96 1051 -503 -943 636 763 -853
5768h53J70J513l75j399M67J628j164j046J152Q89j132p35J401N13j683j38J590
$$ -853 -683 830 455 -944 -477 1151 -13 -1059 93 982 -150 -885 516 1029 -654 -792 798
5785G98p8j566N48J337p39j399J136J155j201j019J240P53j399l01J356L30j784
$$ 798 720 -846 -298 1039 300 -1099 37 1192 -9 -1028 212 965 -434 -735 621 951 -833
5802h33K27J424j64j717P95J440j138j104J085J163j562o93J672K46j502j45J482
$$ -833 -606 818 654 -1063 -268 1172 34 -1070 15 1178 -384 -1077 595 841 -661 -806 676
5819F76N1j547N19J167o11j285R09J149j063r62J184P65j499m50J615Q3j439K74
$$ 676 727 -820 -301 866 255 -1030 -121 1028 -35 -997 187 952 -547 -997 618 701 -738 -464
5837d64J285n05j439R12J192r49j206J264Q15j329m86J346L77j437p9J473l15
$$ -464 821 316 -1123 -211 981 32 -1174 90 905 -424 -910 436 813 -624 -703 770 455
5854D55j443O29J231o15j248Q51J283j328r44J707K48j409j88J388J21j375K70
$$ 455 -988 -359 872 257 -991 -140 1143 -185 -1129 578 826 -583 -771 617 738 -637 -367
5871c67J280p25j134P06J330j131j036J180Q46j271p04J477M00j659O4J515l46
$$ -367 913 188 -946 -240 1090 -41 -1077 103 949 -322 -1026 451 851 -808 -744 771 425
5888D25j396O70J416j015r89R70J106j353p12J306M11j433k32J493N5j620L19
$$ 425 -971 -301 1115 100 -889 81 1187 -166 -878 428 839 -594 -826 667 722 -898 -579
5905e79J537o17j198P91J146j182r91J349O35j457l03J379L89j478lJ486n07j304
$$ -579 958 341 -857 -66 1080 -102 -1093 256 891 -566 -869 510 899 -579 -582 904 397 -907
5923i07O81J131q31j079J065Q51j073p28J387L79j619r4J417L8j289P0J589o89
$$ -907 -226 905 74 -1005 60 911 -162 -890 497 876 -743 -837 580 618 -671 -601 988 299
5941B99j148N87J139p41j005J122O90j263n39J649j70j313jJ507k94j499O44J224
$$ 299 -849 -262 877 136 -869 253 943 -320 -859 790 620 -693 -694 813 519 -980 -336 888
5959H88p06r04P37Q15j050p07J471K39j209l32J544k04j363L94J240o27j166P83
$$ 888 182 -722 15 830 -220 -927 544 783 -426 -758 786 582 -781 -387 853 226 -940 -157
5977a57J108j027r38J168N67j217m08J487K49j603L67J001j38j308N70J108p38
$$ -157 951 -76 -1014 154 721 -496 -904 583 832 -771 -404 597 459 -849 -279 829 91
5994I1q37P49J100j385m49J101M78j416k1J424j74j525N56J042n47j161R04Q76
$$ 91 -746 3 1103 -282 -731 370 848 -568 -589 835 661 -864 -308 734 187 -974 -70 806
6012H06j030p93J259N78j172m71J480R2j419J26J346m27j317O85J138q15q50R13
$$ 806 -224 -1017 242 820 -352 -823 657 749 -670 -544 802 375 -942 -257 881 66 -784 129
6030A29Q32j287m40J195L11j155j60J229j40j479P13J179p09j153J047R03j071
$$ 129 961 -326 -766 429 740 -415 -575 654 514 -965 -252 927 218 -935 112 1015 -56
6047e6p81J064M92j254j89J192K80j420J50J241m05r84M26J119r26r21J123O19
$$ -56 -837 227 719 -535 -724 468 748 -672 -522 719 314 -670 -244 875 -51 -972 151 770
6065G70r83n64J322J76j483J41J304j55j428N72J133n74j224R77Q41r53n81J022
$$ 770 -213 -777 545 721 -762 -621 683 528 -900 -328 805 231 -993 -16 825 -128 -709 313
6083C13M78j216k93J368J8j173Q6J202m58j118N45J073q34p78J092N66r93o74
$$ 313 791 -425 -718 650 668 -505 -419 783 325 -793 -248 825 -9 -787 305 871 -122 -796
6101g96J285K22j356LJ508m93j122L67J154p15r22Q72Q16r35q04J202M70j239
$$ -796 489 711 -645 -642 866 373 -749 -382 772 57 -865 7 823 -112 -916 286 756 -483
6119d83m44J543p9j248J92J308o28r43P30Q57o64r19R39P79j159n63J226K53j268
$$ -483 -927 616 537 -711 -519 789 161 -782 -52 805 141 -778 161 940 -219 -782 444 697 -571
6138e71%J235l57j035N46J096o76r32P72N48p38p55J172L90j156M0J037q7j139
$$ -571 -571 664 307 -728 -182 914 238 -694 78 626 -112 -867 305 695 -461 -421 616 529 -610
6157f10L13J169p80q81N92J024r86n21Q82N42j003m62J133J81j285L17J091m26
$$ -610 -297 872 92 -789 -197 827 -159 -680 202 744 -259 -721 412 593 -692 -375 716 290
6175B90j039M46J028n98j035J045P99j273m77J242L03j271k04J519k09j348K35
$$ 290 -749 -303 725 127 -908 137 936 -337 -814 428 731 -540 -744 775 566 -782 -547
6192e47J271n09j019O47P68o52p94J006N60j036l74J150j6j204K43J207m01j095
$$ -547 724 215 -804 -157 611 -41 -835 171 731 -305 -679 471 455 -749 -506 701 300 -795
6210g95O71R30q08p57J030M79j047l18J055L4r78L1J128j92j001L53R83o85r01
$$ -795 -124 806 -2 -759 271 750 -297 -615 440 474 -504 -473 655 463 -538 -185 798 113 -788
6229g88O89Q11r16p58R87N31q53m50J319r3j133J50J103k62j055N15J042r24o90
$$ -788 -99 712 -204 -962 25 556 -297 -747 572 479 -654 -504 599 337 -718 -203 839 -85 -775
6248g75Q56P26j109l70J055K23j060P4R99j49j143K94J104n76p95O76P30r02m54
$$ -775 81 807 -302 -672 383 606 -454 -380 619 470 -673 -379 725 149 -646 30 760 -142 -596
6267e96R05N13j307O6P31N4j104K81J185m97j044P27Q59o97p78P58O77j009l18
$$ -596 309 822 -485 -419 312 366 -738 -457 728 231 -813 -86 773 76 -702 56 733 -276 -594
6286e94J045K67j304m6J277k03r94K37J119o41j072R44P57r43n75J049K14j002
$$ -594 451 718 -586 -632 645 442 -552 -315 804 163 -909 35 792 -151 -726 323 537 -465
6304d65j18J085j7j008J67J010m68q69N93Q07p98o61P96N61q49m34J114J60j220
$$ -465 -583 502 485 -523 -356 654 186 -683 -90 717 -81 -742 54 615 -234 -668 446 606 -614
6323f14J4J087l09q93M18J036o23r79R09P74r75m33Q13M17j116k0J044j20j099
$$ -614 -600 487 178 -715 -297 739 116 -863 46 820 -155 -588 225 642 -474 -494 550 430 -669
6342f69K94Q83n07p49O38R11q40p45R07O09j088j75Q01L13j080J14J072j79j199
$$ -669 -375 508 1 -748 -110 801 -39 -784 123 732 -356 -531 270 583 -497 -383 689 510 -689
6361f89M64R52o09j018R11Q17r04m62Q75M35j177j66J138l43q38K88R35m30r12
$$ -689 -225 727 118 -900 11 828 -76 -538 337 772 -405 -571 567 224 -614 -326 609 179 -733
6380g33P49Q94r29p17Q04O65j044l99J054J00r91J88R33k95q80M33Q91m70j078
$$ -733 16 910 -19 -736 68 733 -311 -710 344 444 -547 -359 574 279 -601 -168 723 253 -825
6399h25Q98N28p83o05J092K21r15o0J103q4j280M12J150m85j028P85M42n85p66
$$ -825 73 601 -182 -787 305 526 -389 -449 654 570 -710 -298 852 367 -661 124 566 -19 -785
6418g85J040M27j082k13J063M2j071K50R83k66j027M65P23o22o34P20O86j058
$$ -785 255 682 -400 -613 450 492 -579 -329 654 388 -639 -174 549 -73 -707 13 699 -359
6436c59k10Q86L16j091j51J105r1j114M30R95o21p28N29Q62r03m17P22O09j051
$$ -359 -569 317 633 -458 -609 496 405 -709 -279 716 95 -633 -104 758 -145 -562 160 769 -282
6455b82l16R83R1j000N9J170m33p57L21R30q28p63J063M16r16m94J138R6q71j00
$$ -282 -598 385 476 -524 -465 705 272 -485 -164 766 -62 -825 238 654 -262 -756 382 478 -393 -493
6475d93J149l45r07M16R54o09p58N42O14o76m70P96L81r86L0Q72m7r78J63J119
$$ -493 656 311 -596 -180 774 165 -593 -51 563 -113 -583 213 594 -392 -362 510 463 -515 -352 767
6495G67m53r46N64O70p52o21R22M41r92n2P35J45q92R5Q01m3r33K98R81n04r21
$$ 767 314 -632 -68 602 -150 -771 151 592 -400 -452 283 428 -464 -369 432 389 -544 -246 735 231 -690
6516f90P30N11p80m74R33M47j014j95J151l28p12R9Q28j94j094P76O77o23p45
$$ -690 40 551 -229 -703 230 677 -337 -532 619 291 -421 -322 506 312 -782 -6 671 48 -697
6535f97O61N92r16k46J044Q4j109K37R84k24j002L75Q72m76q42P87M63p49o48
$$ -697 -36 556 -360 -606 438 522 -587 -350 634 410 -592 -217 655 179 -663 124 587 -162 -810
6554h10J037M28j027r3Q91Jj008L03Q03j72j013P48M51n01o72P87L17o47l42R39
$$ -810 227 655 -372 -465 426 427 -581 -278 525 353 -660 88 539 38 -634 153 470 -177 -519 420
6574D20J2r91K50Q39o9j084M99N76l92o24P15M50p44k81O20J64q26L6Q59J5j001
$$ 420 432 -559 -309 530 461 -623 -124 452 60 -564 151 601 -143 -424 196 360 -466 -430 429 444 -557
6595e57J84R90m95p45O78O08n82q15R49L36r10j87Q97K1p75j01J013l56o72J96
$$ -557 -373 617 122 -623 55 663 81 -734 215 551 -359 -546 351 372 -403 -504 509 153 -519 -323
6615c23Q81l60r28R79M21q61l93R12P1p80j47R62k7q62L12O85m35q92P00P68o90
$$ -323 558 198 -730 249 670 -191 -584 328 399 -381 -528 434 407 -455 -143 542 107 -785 -85 683 -7
6636gn37Q39M13j056P3O38J56r74K68O95l36p64N37O47n92o21P01N16p92l24P70
$$ -7 -544 295 708 -348 -275 363 519 -455 -187 508 172 -592 -55 592 0 -621 80 596 -196 -520 250
6657B50K79r35J39O27q0p10J87Q08l09q75N73O68p49m23P60M34r60j73Q55q0p70
$$ 250 529 -406 -267 360 280 -430 -243 565 256 -619 -46 622 -127 -550 210 644 -316 -489 366 286 -484
6678d84J80Q72m05o44L83O07m72o03O76L61p32l50R23O9q81R5Q68j44q17L09P32
$$ -484 -304 568 163 -481 -98 509 37 -566 110 471 -261 -611 312 381 -500 -405 463 319 -498 -189 543
6699E43l55p37M79P29q27l77O88L75r67O4P05J24r74K77Q61l73p49L22Q00n80
$$ 543 188 -549 -70 659 -168 -545 143 518 -449 -385 320 444 -530 -253 608 235 -514 -192 608 28
6719B8n13L78O37p43l63Q21J55p45j25J155l06q20L69N74n33m61L18Q91p77n07
$$ 28 -485 -107 530 -213 -576 245 400 -345 -470 685 379 -441 -72 502 -31 -492 -174 717 -60 -567
6739e67O64M50q03l14R23Op23J2Q23l40p32O13M48m91n22P24M30r53l29R50J78
$$ -567 97 547 -256 -570 353 359 -364 -352 471 131 -601 12 460 -31 -553 171 601 -352 -681 269 447
6760D47q69Q3P88j67q52L37O53l80o48N04P85q26m75P25L44p55R6O35O0q92k7
$$ 447 -422 -339 449 282 -570 -233 420 40 -608 -104 681 -145 -620 105 449 -306 -210 425 485 -407 -434
6781d34P48j25o70N08N25p12n42Q62M14p87l02R56j5p01L5Q49m09m92K62N11m01
$$ -434 314 189 -481 27 552 -160 -702 160 574 -213 -515 441 426 -275 -240 609 200 -292 -30 481 80
6802H0n68O18L50m72m76Q01J17n68l09O94J12q25K36O85l60n77L65O78o68n02
$$ 80 -488 130 480 8 -468 333 450 -118 -427 267 379 -446 -210 475 115 -462 -97 581 -87 -589
6822e89O12N37q55k64Q04J44q91M02O69l39p74K82Q54n51m05L16N46o81l61R28
$$ -589 23 560 -295 -559 245 389 -502 -100 569 230 -544 -262 592 41 -364 -48 498 -183 -544 384
6842C84J12q57J7Q80k00o67L7P41n45m20O29J82l04m46O46K87p20k33Q50Ko73
$$ 384 496 -361 -344 536 336 -331 -294 447 -98 -518 111 293 -11 -457 189 476 -244 -477 373 375 -298
6863b98j0P98j78p88L74N64l53n49N40L83p46j84O16K35o94j34Q38j87m43l3O66
$$ -298 -308 490 312 -476 -102 462 109 -440 100 483 -263 -447 169 404 -290 -424 414 227 -216 -249 417
6884D17l36m58L55N04n30l91O90K71q25j11P17j6o48K45M91j08p34M33O16m24
$$ 417 81 -377 -22 482 -48 -439 251 522 -303 -414 303 287 -361 -116 375 267 -467 -34 582 158
6904A58l97L61K91o00k68Q04J0o89nO58j3o82K09N77l44o43O00M99n49n05N01
$$ 158 -239 122 413 -187 -455 349 359 -330 -335 323 310 -372 -163 414 70 -573 27 526 -23 -528 -27
6925b7N67q37o0P19N2p94J06P86j84q96N16L89l61m47N40L59n74k11O11J51q54
$$ -27 540 -297 -357 362 414 -380 -274 512 328 -568 -52 337 -24 -471 69 428 -146 -357 254 405 -449
6946d49N6Q15k64n20K47M67k97m89M59L96m92m89Q25J14n44l37Q45q2o62K62O03
$$ -449 -393 422 158 -362 -115 352 55 -434 25 421 -71 -560 265 379 -165 -502 343 261 -401 -139 464
6967D64l18n44K54P11m44p68Q40M48q38k38P96N8q06J29O91k08p12J65Q96m88
$$ 464 146 -398 -144 567 123 -645 195 643 -195 -433 363 421 -385 -256 435 227 -485 -320 576 88
6987H8o43O43M14n88j88L77L48p67j27P29K7o91J02O12j90p31O61L87n31m61N63
$$ 88 -555 88 502 -86 -274 103 451 -316 -443 286 313 -378 -276 336 146 -585 76 463 -68 -529 34
7008C4M65p29r8P15r6o20K9O04j45n51L11N55n33m02M73N88p09l64O57K30n62
$$ 34 499 -230 -328 387 291 -329 -300 304 159 -392 -81 474 -59 -461 12 600 -109 -473 184 414 -148
7029a48k95P46n6o83J90P70k63o14J92O23n17l85M91L74n85l94Q79J82o21j43
$$ -148 -443 303 247 -436 -246 524 261 -353 -161 462 -55 -440 51 425 -160 -554 325 507 -114 -257
7049b57N23q3n03m2P46m30m92N59M68n63l64P03J3o39p1P95J7q67K70O42k07p57
$$ -257 266 183 -320 -362 384 -46 -538 21 489 -74 -438 265 278 -361 -432 363 380 -487 -217 425 218 -539
7071e39N56M02m31l76O43K32q14l5O91l8o53J56P94n15l14J18N98m01m02K85L79
$$ -539 17 419 -12 -388 255 487 -327 -362 329 291 -362 -206 588 73 -241 -123 475 74 -328 -43 336
7092C36m18m22O42J45m95k50P11J2p36L01M65k49n10L32O90n44k46L07L53o50
$$ 336 -82 -504 138 283 -212 -462 249 261 -475 -174 291 42 -468 -136 554 10 -236 71 424 -226
7112b26p0O05j56m76J0N78r8p17L30O46l53m51M58K53m29m76P66k9m46q5O83r9
$$ -226 -296 309 153 -323 -313 265 167 -550 -220 426 73 -378 80 333 -96 -572 194 165 -281 -366 317 218
7134B18n57K25M98j80p68O14L85m46m69N14N08p22l30Q75p7p22J37O59l05n91
$$ 218 -339 -114 384 204 -564 50 435 -11 -480 34 542 -180 -510 365 288 -434 -297 362 57 -534
7154e34L84M96l43k44K65M66n89l69O93J34p40Q1P03k58o47L71N38k19n99L88
$$ -534 -150 346 3 -241 24 490 -99 -468 225 359 -381 -300 403 145 -502 -131 407 188 -411 -23
7174b3M53n05l94O04L29q11O1N96p0p17L90N73k73o00L31N39l95n15N01K79m07
$$ -23 430 -75 -469 135 464 -347 -286 310 240 -477 -87 486 213 -387 -56 483 88 -427 74 353 -54
7195e4l09N12J86n87O4N60n2o10J57N76m56l57L95M17m77l85L92M67m83l19N76
$$ -54 -363 149 335 -252 -188 372 320 -290 -133 443 -13 -370 25 442 -35 -420 -28 439 -44 -363 213
7216B13M9o03K67N22j42o69M3O22l82k62K51M68p34k6P10j39n95M9O11p9n33K55
$$ 213 262 -341 -74 448 306 -363 -320 302 -80 -342 -91 377 -357 -383 327 188 -407 -358 253 174 -359 -104
7238a04M78k40n11M08K81l75l44N82K12o39m2O13N5n44jN33j60m94J22N54k25
$$ -104 374 134 -377 31 312 -63 -407 175 387 -252 -294 319 374 -170 -171 362 202 -292 -170 384 159
7259A59o32N57L55n72j35N22L8o47J74M89j54n92K48M55j91n30M97M72n90k20
$$ 159 -473 84 439 -133 -268 254 292 -355 -181 308 154 -438 -190 265 74 -456 41 513 -77 -297
7279b97M06L80p41q1N82J29o00K9M78k31l91J71N95m14m76N67J78m66l27Q79q2
$$ -297 109 489 -252 -333 249 378 -222 -193 285 54 -337 -166 429 15 -461 106 284 -182 -509 370 288
7300B88n22J1N11o7n24J41N89k94o23N28L25o68o2N20K68n63j48O14l2o17K71
$$ 288 -234 -223 288 221 -303 -162 427 133 -490 38 363 -305 -367 153 421 -142 -290 324 292 -325 -54
7321e4L02j91m62L46M29m22l39M59L43o62L1N14j96k86Q1M63j76m64J57M99m02
$$ -54 248 57 -405 -59 370 -52 -391 68 411 -251 -220 294 98 -188 -107 356 180 -284 -127 372 -30
7342c0k25K40N36o83k87P11J5m26k83O25p3l51o1P25k46o62M12M50m30l43N73
$$ -30 -255 -15 521 -162 -449 262 277 -149 -432 193 120 -231 -292 433 187 -475 -63 387 -43 -386 187
7363A87K16o10m9M92l8n16R9O28q0q22L76M51l30l16K35M29m48l95O71J02n99
$$ 187 403 -207 -256 236 198 -318 -219 409 329 -493 -117 334 4 -312 -77 352 -96 -491 180 282 -317
7384c17J04N69j14o08L35N30l96n34N67J14l34m71O87J59l05k78N33j0n20J58
$$ -317 -213 356 242 -366 -31 499 103 -431 136 250 -84 -555 132 291 -14 -292 241 231 -289 -131
7404a31L13L7m46J80K38k27m51O49K09m83l86Q97r9m90J00M32k08m97L38K23j96
$$ -131 182 219 -227 -47 191 -36 -487 162 371 -112 -498 399 300 -190 -90 342 134 -363 -25 198 2
7425Bl78L75M23m63l19M56L79n93l14Q92j36o52J50O01k64l93K51L42l23l30L34
$$ 2 -376 -1 422 -41 -360 96 475 -118 -432 460 324 -328 -178 423 159 -234 17 359 36 -294 40
7446D0K88l34k31N34K8o51LO83k78k15k1L46j61m40L68K53k80q9K70J80n08o7
$$ 40 328 -6 -237 297 325 -326 -323 360 82 -133 -154 192 31 -409 -41 212 -68 -157 113 293 -215 -282
7468b82M99q3l32k4P25m02m06L22L23l29l08N23R9m38k05N04J85n56k6N97k60
$$ -282 217 134 -198 -222 503 101 -305 17 340 11 -297 226 325 -113 -318 186 371 -185 -211 386 126
7489A26o07M34L87l57k97K13N27n55j92N37J13o22l4N75r4m91L50K81j30m19K82
$$ 126 -481 -47 340 -17 -314 -101 426 -129 -321 216 329 -293 -327 248 154 -337 13 294 164 -255 27
7510B7K06k61l10M40J44l65j69P46j88l33j70O09l34l07J52L77l62l00N81K78
$$ 27 233 -28 -338 102 246 -119 -288 458 270 -63 -233 376 42 -265 -113 264 -98 -398 183 461
7530D61n09l80N26K02o45P7O25k24m30J62N13k66m93J73N95n71j98L33L44l84
$$ 461 -48 -428 98 300 -345 -268 357 133 -297 -135 378 112 -381 -208 387 -184 -382 -49 295 -89
7550h9k59N77J61o88J86N36k58l77J89L84l60k58L46K55m35k28N36P9n47p3M92
$$ -89 -348 229 390 -298 -112 424 166 -211 -22 362 2 -256 90 345 -90 -318 218 297 -250 -323 169
7571A69n0l47J47N02n33j02J34M70m92j86M04K44n32%M23j06m14J29N39l60l16
$$ 169 119 -228 -81 421 -112 -214 -80 390 -102 -288 116 360 -172 -172 251 145 -269 -140 399 39 -277
7592b77J19O37m33m48M72K79m37k55M01K13n37J84L52k2m53pO40l00l19K47L24
$$ -277 -158 479 46 -402 70 349 -88 -343 58 271 -266 -82 270 248 -205 -212 428 128 -191 56 380
7613C80n29k71M62J51l44j53O59k58l60J59L29j36l71J84K64o6l65M33J89l93
$$ 380 -149 -420 42 193 -151 -304 355 97 -263 -104 225 89 -282 -98 166 100 -265 168 357 -36
7633c6r5J91K37o49K66L96l18l79L16M60k75l43J52L94l10m45P08Rm90j15N91
$$ -36 -131 60 297 -352 -86 310 -8 -387 -71 389 114 -229 -77 317 7 -438 270 279 -211 -326 265
7654B65o8l44J80K06j68m30L14L43l94o4K80J28k69k92N33ol66k6M53k29j92P0
$$ 265 197 -147 33 239 71 -359 -45 298 -96 -160 120 248 -21 -313 220 214 -152 -178 275 46 -146 -76
7676g6L19k59l83L47M43l78l27M39O6l46k9M40J98p03L4M11m9n26L46M33n00l19
$$ -76 243 -16 -399 -52 391 13 -314 125 191 -155 -184 256 454 -249 -215 196 147 -379 -33 400 -100 -419
7698d19N72R2m26J4N32k42l66J37L13M7l98N7N46m00j95K83K55m39k78L51K59
$$ -419 153 245 -181 -167 365 123 -243 -106 207 254 -144 -87 459 59 -136 147 402 -37 -315 36 295
7719B95l76k00M01K4m48M9M98j81n05L85M01m35k42N25P9n29J30K61J41m43p8
$$ 295 -81 -281 120 144 -304 -255 243 62 -443 -58 343 -92 -334 191 270 -259 -129 132 273 -170 -248
7740b48M18j35k85L7L69o0j78K8L44l53p6L17n2k67P0K11L4l30R3M58m27k99M02
$$ -248 170 35 -250 -213 156 96 -82 -54 290 -63 -139 178 126 -141 -71 140 174 -156 -63 395 -32 -331 71
7763G1K39k18k60J25J85k17j22M54r6l56J03L45j48m06K08M72l56k16K54J45k54
$$ 71 310 92 -168 -43 142 -75 -197 257 161 -195 -92 253 105 -301 -93 379 23 -193 61 206 -48
7784d8k87L46J28l96K25M05j11n98K67L55k51l42K51J76j50j74K81K89p36J53
$$ -48 -335 11 139 -257 -32 373 262 -336 -69 286 35 -307 -56 120 -30 -204 77 366 -370 -217
7804b17L88P0m12nM50j49m33L52K57l84k95M89K67m66q9L66P3m45l8M79j7n34
$$ -217 171 241 -171 -176 274 125 -308 44 301 -83 -378 111 378 -88 -177 189 262 -183 -221 258 241 -293
7826b93J46M42k20l95K91L63k99j61NL52l40j28M39J27n28L7N95l08m77K93L01
$$ -293 -147 295 75 -320 -29 334 35 -126 -121 231 -109 -237 202 329 -199 -162 433 125 -352 -59 242
7847B42k65j96K38K18l09k73M17j7l18l1M99p3n12L06L36j14l91J52L19l01r2
$$ 242 -23 -219 19 237 -72 -345 72 55 -263 -294 205 132 -380 -74 262 148 -243 -91 228 -73 -165
7868a65J69K00p4n07N01P0n10J53K37j87j42L00K60m24k28L04K28l88M4M12r1
$$ -165 4 204 130 -377 124 194 -316 -163 74 -113 -255 45 305 -119 -347 -43 185 -203 -159 253 162
7889A62k09J1K16K5o39L18M61m08k34L11K83l23q2J11L78n77O3M47j45m61J08
$$ 162 -47 -36 180 205 -434 -116 345 -63 -297 14 297 -26 -108 3 381 -196 -133 314 169 -292 -184
7910a84L49j3m22K87J89j82l20L83K4l46M8K64K14o39J96M46l01k70N4N51l18
$$ -184 165 152 -270 17 206 24 -296 87 111 -235 -187 77 291 -348 -152 294 -7 -277 -223 328 10
7931A0j55Q4L84m46k5L47J43m78k4K79J10l37k5M16k65j90J08L53l10k50K83L02
$$ 10 -145 -61 323 -123 -148 199 342 -136 -160 119 229 -108 -133 283 18 -172 -64 289 -21 -271 12 314
7953C14m80p3M73K4m75j6M39j75l85L75K17j37k84K22J68k02k36J83L52n97J10
$$ 314 -166 -239 234 258 -217 -233 206 31 -354 21 238 101 -183 39 207 5 -231 -48 304 -293 -183
7974a83M12j53k34PL99j49l61L11K29l02k13L53P7j24k41L70Q1l71Q8J64j04l86
$$ -183 229 76 -158 -151 248 99 -262 49 278 -24 -237 116 193 69 -172 198 279 -92 -4 160 56 -330
7996c30R2N48k25l05L76J98m11j50L80Ql52L3K85rl99K10J14M7l28N8M78l92j60
$$ -330 -238 310 85 -220 156 354 -57 -207 173 181 -171 -138 147 138 -261 -51 63 110 -218 -160 318 -74 -234
8019b34J45J66k35o6M17pm95K00L88j20l40J07L25j63k86K08K91l09k82M35L8
$$ -234 -89 77 -158 -224 193 186 -309 -109 279 159 -181 -74 251 88 -198 10 301 -8 -290 145 183
8040A83m98J08M84r6m37K02L25m43q7K75J88k64j66J57K91m87M7L58J64m63J16
$$ 183 -315 -207 277 181 -256 -54 271 -172 -259 16 204 -60 -226 -69 222 -265 -218 140 304 -159 -43
8061d3J95j65k19N4L55j72m22L95K63l70j63L77J75n64K33L08k82k98L19J12M1
$$ -43 152 -13 -232 -178 177 5 -417 -22 241 -129 -292 85 260 -304 -71 237 -45 -343 -24 88 129
8082A29k17K43K7l64K4L73j04k37j47N73k50l60L92R8j80k23J91L28k55l14N48
$$ 129 -88 155 182 -182 -158 215 111 -126 -273 300 50 -310 82 180 0 -223 -32 296 41 -273 275
8103B75j70k32j09J47K03l22R2L78l48j06J51L16r9m87L49J79l63j06M52J31m14
$$ 275 105 -127 -236 -89 114 -208 -116 262 -86 -192 -41 275 176 -311 38 217 -146 -252 200 331 -83
8124h3j73M95m3n22Q0L01J7l37J63K76m47O4K72N6k69k6L45J28m08j39M23m5m58
$$ -83 -256 239 196 -326 -246 55 72 -265 -102 174 -273 -209 63 119 -150 -176 169 297 -111 -250 173 128 -330
8147c30L11J17j41q6J89L12m56j13L13K67l92n5K02j2n00L85J50p4k99K18K82
$$ -330 -19 98 -43 -129 60 372 -84 -197 116 383 -9 -64 138 126 -374 11 161 87 -212 6 288
8168B88n40k5M54M2m36L8M05j45j64M7J84R6k61r7K64o4l20J76K05k56j15L75
$$ 288 -252 -277 177 219 -217 -179 226 81 -83 -36 148 244 -17 -114 150 86 -234 -58 147 -109 -224 151
8190A51j5
$$ 151 136
8191A36
$$ Imaginary data points
##PAGE= N=2
##DATA TABLE= (X++(I..I)), XYDATA
0@%%%%%%%%%%%mJ2j6J6k4L2m0M8n6P2q3R6j13J33j60J86k15K48k88L34l77M28
$$ 0 0 0 0 0 0 0 0 0 0 0 0 -4 8 -8 8 -16 16 -24 24 -32 40 -43 53 -60 73 -87 99 -116 132 -156 178 -199 229
33B29m89N54o25P04p93Q88r91J107j233J370j519J682j863K060k273K506k760
$$ 229 -260 294 -331 373 -420 468 -523 584 -649 721 -798 884 -979 1081 -1192 1314 -1446
50a446L042l353L693m070M490m961N489o088O779p577Q515r637J1006j2723J4944
$$ -1446 1596 -1757 1936 -2134 2356 -2605 2884 -3204 3575 -4002 4513 -5124 5882 -6841 8103
65H103j7945K2239k8931M0968r5019N90277J50135m30387J91183l9711p89361
$$ 8103 -9842 12397 -16534 24434 -70585 519692 669827 239440 430623 390912 -398449
76c98449n24408M89884M60157o5054J93111O05000r9694q04336l16008K53560
$$ -398449 -922857 -432973 27184 -37870 155241 760241 660547 -143789 -459797 -206237
86b06237j59873k27154N80906O96969j92575m02719R9279q6093o22534j83423
$$ -206237 -366110 -593264 -12358 684611 492036 89317 188596 102503 -520031 -703454
96g03454N82597L81449j53718J02725L69402k55045o99356q2579L52934r0415
$$ -703454 -120857 260592 106874 209599 579001 323956 -375400 -457979 -105045 -195460
106a95460j29153N33871M45531l66492m07628J29794m1263m48516R660N94535
$$ -195460 -324613 209258 654789 288297 -119331 10463 -30800 -479316 -469656 124879
116A24879K31042k64794M3395K55601l25744n50146J26670L97756j05558q8950
$$ 124879 355921 91127 134522 390123 64379 -485767 -359097 38659 -66899 -155849
126a55849M54945K23033m63646l08848K11262j4168l37331J39564N43149N9772
$$ -155849 299096 522129 58483 -250365 -39103 -53271 -390602 -251038 292111 351883
136C51883l38715M2234J91163l33206l78933K73718L61607j57576p9534L68046
$$ 351883 13168 55402 246565 -86641 -465574 -191856 169751 12175 -67359 300687
146C00687O7254m73137j89276K71525R27k54668J94072M33557q7444l50181P4452
$$ 300687 367941 -105196 -294472 -22947 -22020 -276688 -82616 350941 263497 -86684 -12232
157a2232J55837l04711k28324L44121K80917k10151p0756K94708l6780m31197
$$ -12232 143605 -161106 -389430 -45309 235608 25457 -45299 249409 212629 -218568
167b18568n7556L13123j8917k15554K16365L29302j94612l22619J29437J39955
$$ -218568 -276124 36999 18082 -197472 18893 348195 153583 -169036 -39599 100356
177A00356k73918j14962L69106J82099k63864n3504K56427r3904l70687N1983
$$ 100356 -173562 -288524 80582 262681 -1183 -54687 201740 107836 -262851 -210868
187b10868L18669n9921j89547K18852K25749k60208k56551J85946J16856k48602
$$ -210868 107801 47880 -141667 77185 302934 42726 -213825 -27879 88977 -159625
197a59625l4035L50137P9547k88007j9073K25532j26695k93556J36095K87866
$$ -159625 -193660 156477 236024 -51983 -71056 154476 27781 -265775 -129680 158186
207A58186j10113j66895K11918J41668k82620j75564K26496Q6586k28157K1707
$$ 158186 48073 -118822 93096 234764 -47856 -223420 3076 89662 -138495 -116788
217a16788L11485j1264k88886L0452K08093j47407k24697J94896K39073j63161
$$ -116788 194697 183433 -105453 -75001 133092 -14315 -239012 -44116 194957 31796
227C1796j43220K11705P7532k87062r5189K57816M6424k23871N9679K70939q5185
$$ 31796 -111424 100281 177813 -109249 -204438 53378 99802 -124069 -64390 206549 121364
238A21364k72483Q3802J92765j63556j66248K26267J78472k03330j13124K09435
$$ 121364 -151119 -67317 125448 -38108 -204356 21911 200383 -2947 -116071 93364
248I3364L0296k67689k2192K59667N3k09169Q8501K19210j36138k28379J29557
$$ 93364 123660 -144029 -166221 93446 93499 -115670 -27169 192041 55903 -172476 -42919
259d2919J62851j71282j08861K32586J08888k23507o8483K05574j2239k39331
$$ -42919 119932 -51350 -160211 72375 181263 -42244 -110727 94847 82608 -156723
269a56723M1995K46007n1503j95843J14458J76036j70174j81612J68869J32957
$$ -156723 -114728 131279 79776 -116067 -1609 174427 4253 -177359 -8490 124467
279A24467j83435o8431K30878N1072k35134k5943K06028m3774k13702Q8378K20591
$$ 124467 -58968 -127399 103479 154551 -80583 -106526 99502 55728 -157974 -69596 150995
290A50995r7881j76373J37360J35305j90613j27417J97596R2386j93705k7319
$$ 150995 53114 -123259 14101 149406 -41207 -168624 28972 121358 -72347 -99666
300i9666K21587n694k29435K4738J97889p7441j82402J27351J83081j38634j47817
$$ -99666 121921 116227 -113208 -88470 109419 31978 -150424 -23073 160008 21374 -126443
311a26443J57532R8280j97174p7457K08029N1629j94058M344K00877m6503k07683
$$ -126443 31089 129369 -67805 -145262 62767 114396 -79662 -75318 125559 79056 -128627
322a28627O3602J79350r9869j49585J45919J39912j61331j12011J67259O1118
$$ -128627 -65025 114325 14456 -135129 10790 150702 -10629 -122640 44619 105737
332A05737j93194k8917K06128N980j90674M0394J81671q5712j82873J05816J58204
$$ 105737 -87457 -116374 89754 95734 -94940 -54546 127125 41413 -141460 -35644 122560
343A22560j28880j20346J66447R9443j83785p4367J82200K7811j92191J2275K00579
$$ 122560 -6320 -126666 39781 139224 -44561 -118928 63272 91083 -101108 -88833 111746
354A11746l4928j82846O9959J61267j11651j51085J32672J27952j46151q7442
$$ 111746 76818 -106028 -36069 125198 13547 -137538 -4866 123086 -23065 -110507
364a10507J70887N6748j86383l2964J80194p276j76639M7877J77692p1777j60518
$$ -110507 60380 117128 -69255 -102219 77975 70699 -105940 -58063 119629 47852 -112666
375a12666R6448J32840j30916j14732J52009R2812j58720n4878J71818K0080j82552
$$ -112666 -16218 116622 -14294 -129026 22983 115795 -42925 -97803 74015 94095 -88457
386h8457M795J74765l7216j62064P5683J55012j00643j38075J19434J07288j44865
$$ -88457 -83662 91103 53887 -108177 -32494 122518 21875 -116200 3234 110522 -34343
397c4343q0985J64347N7185j67218k1850J69908j5756j73958M2169J64203o9115
$$ -34343 -115328 49019 106204 -61014 -82864 87044 71288 -102670 -60501 103702 34587
408C4587j44177J02020J28646j25948j10262J39756P8066j55861m6315J69257
$$ 34587 -109590 -7570 121076 -4872 -115134 24622 102688 -53173 -99488 69769
418F9769K0741j68090J0234J60831m5523j56635P1504J43697r2783j20629J19020
$$ 69769 90510 -77580 -67346 93485 47962 -108673 -37169 106528 13745 -106884 12136
429A2136R8917j39656p7376J48849M6644j55534j3069J62203j3520j58251M1140
$$ 12136 111053 -28603 -105979 42870 89514 -66020 -79089 83114 69594 -88657 -47517
440d7517J45808p1991j35221R6693J21296j14619r5823J33312O8654j50020m4198
$$ -47517 98291 26300 -108921 -12228 109068 -5551 -101374 31938 100592 -49428 -93626
451i3626J55834J4176j55297J8441J54376m5738j46550O9519J29709r5557j12246
$$ -93626 62208 76384 -78913 -60472 93904 48166 -98384 -28865 100844 5287 -106959
462a06959J18728R3364j33727o6698J45939L6551j55866r850J56002j7398j48102
$$ -106959 11769 105133 -28594 -95292 50647 87198 -68668 -78518 77484 60086 -88016
473h8016M7046J39305p2601j27770R3042J09108j13545q7541J32185O5423j41929
$$ -88016 -40970 98335 25734 -102036 -8994 100114 -13431 -100972 31213 96636 -45293
484d5293l8457J46104P690j47661J9629J43900m3870j31940O8165J19204r0755
$$ -45293 -83750 62354 70044 -77617 -57988 85912 42042 -89898 -21733 97471 6716
495F716j05087J08424Q4197j24296n8931J38145L3234j44562o209J43368k2936
$$ 6716 -98371 10053 94250 -30046 -88977 49168 82402 -62160 -68369 74999 52063
506E2063j39482M8043J31290o8633j16765Q9345R9361j10363q1108J26677N8961
$$ 52063 -87419 -39376 91914 23281 -93484 -4139 95222 -15141 -96249 30428 89389
517H9389j37573l1681J43976M849j43766K1581J36254m7833j25832P0846J13979
$$ 89389 -48184 -79865 64111 68960 -74806 -53225 83029 35196 -90636 -19790 94189
528I4189q9191r7488J06071P7433j22225n5967J33235L1311j36775k701J36038
$$ 94189 4998 -92490 13581 91014 -31211 -87178 46057 77368 -59407 -62108 73930
539G3930k5115j31378M8510J20906o9301j07620Q7878R3438j02974p5321J16272
$$ 73930 48815 -82563 -34053 86853 17552 -90068 -2190 91248 -11726 -87047 29225
550B9225N2239j28481k7560J35293K054j34639K3491J28401m7123j18880O7098
$$ 29225 81464 -47017 -74577 60716 62770 -71869 -48378 80023 32900 -85980 -18882
561a8882J05039q4892q8801J02674P1748j16836n1381J26887K6621j33171j46
$$ -18882 86157 1265 -87536 15138 86886 -29950 -81331 45556 72177 -60994 -61140
572f1140J33511k4773j26129M8510J14284p0028j01283Q8261Q6396j03232o9185
$$ -61140 72371 47598 -78531 -30021 84263 14235 -87048 1213 87609 -15623 -84808
583h4808J16247M9126j25595k5735J29632j637j29051K7633J23702m9724j12690
$$ -84808 31439 80565 -45030 -70765 58867 57230 -71821 -44188 79514 29790 -82900
594h2900O8089R8366q4455q2889R8277O5960j09892m5500J19265K2550j24869
$$ -82900 -14811 83555 -900 -83789 14488 80448 -29444 -74944 44321 66871 -57998
605e7998J967J24662k6670j18577M9417J07748o7747r3825Q3618P7177r7722o0225
$$ -57998 -56031 68631 41961 -76616 -27199 80549 12802 -81023 2595 79772 -17950 -78175
617g8175J10162M2143j19291k0439J24152l397j23857K7795J17231n0994j05750
$$ -78175 31987 74130 -45161 -65600 58552 55155 -68702 -40907 76324 25330 -80420
628h0420P1275R1834q6842p6472R8683N8682j08741l9510J16752J8119j20478
$$ -80420 -9145 82689 -4153 -80625 18058 76740 -32001 -71511 45241 63360 -57118
639e7118M831J19751k9548j13793N1553J03274p0424q8793Q5478P2599r7009n4575
$$ -57118 -52287 67464 37916 -75877 -24324 78950 8526 -80267 5211 77810 -19199 -73774
651g3774J05854L5316j12671j4315J16791o883j15935K8164J10100m9391r9366
$$ -73774 32080 67396 -45275 -59590 57201 50318 -65617 -37453 72647 23256 -76110
662g6110O7658Q5489q2539o9288R4770N1687j04192l3353J10316J3419j13235
$$ -76110 -8452 77037 -5502 -74790 19980 71667 -32525 -65878 44438 57857 -55378
673e5378P972J12123k9324j06823M9830R6627o8335q3353Q4094O7881r6132n0205
$$ -55378 -47406 64717 35393 -71430 -21600 75027 6692 -76661 7433 75314 -20818 -71023
685g1023J04759L0919j10416j0983J12361j0183j10325L1390J04449n0690r4927
$$ -71023 33736 64655 -45761 -56744 55617 45434 -64891 -33501 70948 20258 -74669
696g4669O7828Q1543q2088o5232R3562M7502j01908k8725J07256Q742j08658J1469
$$ -74669 -6841 74702 -7386 -72618 20944 68446 -33462 -62187 45069 53811 -54847 -43378
708d3378J06374l1178r9871M9822R0357o6635p7475Q0102O2106r1500m5006R9891
$$ -43378 62996 31818 -68053 -18231 72126 5491 -71984 8118 70224 -21276 -66282 33609
720C3609K6885j05102p947J06056j1650j03687L1318R7427m9679q7673O6153P4736
$$ 33609 60494 -44608 -52555 53501 41851 -61836 -30518 66909 17230 -70443 -4290 70446
732G0446p9620n9935R0716M2801r8152k4434J03099N061j04222J4926J01279l4076
$$ 70446 -9174 -69109 21607 64408 -33744 -58178 44921 49982 -54240 -39314 61965 27889
744B7889r4820N1993Q4864o7636p1861Q0419N6647r0824l9567R7834K1759j01750
$$ 27889 -66931 -14938 69926 2290 -69571 10848 67495 -23329 -62896 34938 56697 -45053
756d5053k736J01997j6109r8921L4418R1678n1120q1503O5860O8603p8154n3691
$$ -45053 -47789 54208 38099 -60822 -26404 65274 14154 -67349 -1489 67114 -11040 -64731
768f4731Q7434L7407r4070j9771R7215J813r7219J6137R4125l4232q7358N0573
$$ -64731 22703 60110 -33960 -53731 43484 45297 -51922 -35785 58340 24108 -63250 -12677
780a2677P7857o5041o5457P7293N0902q6353l5052R3018J7738r6132J71R6091
$$ -12677 65180 139 -65318 11975 62877 -23476 -58528 34490 52228 -43904 -43733 52358
792E2358j8199r2672L5577Q5965n1287p6334O5478O3624p7339m8874Q6077L2559
$$ 52358 34159 -58513 -22936 63029 11742 -64592 886 64510 -12829 -61703 24374 56933
804E6933r1812j5626R4385k180r3774J9830Q9783l6359q2706N2017P2286o5259
$$ 56933 -34879 -50505 43880 41700 -52074 -32244 57539 21180 -61526 -9509 62777 -2482
816b482n9780P6051M5629q4171k9859Q9174J3387r1509L738R0550k0716q6118
$$ -2482 -62262 13789 59418 -24753 -54612 34562 47949 -43560 -39822 50728 30012 -56106
828e6106L6419P9388n1158o9640O3735N7582p4107m3635Q1991K8440q7136j1983
$$ -56106 -19687 59701 8543 -61097 2638 60220 -13887 -57522 24469 52909 -34227 -46210
840d6210Q9010m534q7868K0967Q3851l6590p6850N1015O7080o3787n5102P3923
$$ -46210 42800 38266 -49602 -28635 55216 18626 -58224 -7209 59871 -3916 -59018 14905
852A4905M1068q1592k5799Q6161R954q8097O411Q6946k2848q2167L7864P4884
$$ 14905 55973 -25619 -51418 34743 44697 -43400 -36989 49957 27109 -55058 -17194 57690
864E7690n1513o5017O3452N3162p3032l9462P9950K4428q3872q825Q5223o787
$$ 57690 6177 -58840 4612 57774 -15258 -54720 25230 49658 -34214 -43039 42184 35397
876C5397q3522K2228P8955l6940p1877N0327O2088o1674n0449P0728L7203p7334
$$ 35397 -48125 -25897 53058 16118 -55759 -5432 56656 -5018 -55467 15261 52464 -24870
888b4870k2803Q1305P588q2450P518Q1028k2547p6651L6746O9557m9526o0430
$$ -24870 -47673 33632 41220 -41230 -33712 47316 24769 -51882 -15136 54421 4895 -55535
900e5535O0880M8961p0012l5522P6372K1045p9789o287Q0752q868p9034K3857
$$ -55535 5345 54306 -15706 -51228 25144 46189 -33600 -39887 40865 31997 -47037 -23180
912b3180P4227l7665o7201N0506N7585o1104m5944O9624L2660p5211j8655P8378
$$ -23180 51047 13382 -53819 -3313 54272 -6832 -52776 16848 49508 -25703 -44358 34020
924C4020M126p8854J0386P6620k4323p1987L7659O4882m9458n5638N9355M4262
$$ 34020 38146 -40708 -30322 46298 21975 -50012 -12353 52529 3071 -52567 6788 51050
936E1050o7373l1490P2734J7849p5545m284P6218r878p3831K3109O9555l6024
$$ 51050 -16323 -47813 24921 42770 -32775 -37059 39159 29281 -44550 -21441 48114 12090
948A2090o2494M7945N3239n8001m2383O6240K9517p1301j6245P4068K761p4335
$$ 12090 -50404 -2459 50780 -7221 -49604 16636 46153 -25148 -41393 32675 35436 -38899
960c8899J0791P2352k4187o8008L6817O1498m8795n2241N8433M1066o5885k8350
$$ -38899 -28108 44244 20057 -47951 -11134 50364 1569 -50672 7761 48827 -17058 -45408
972d5408P0659J5089p2695j452P2489j1950p0103K4468O5990l6463n9438M7496
$$ -45408 25251 40340 -32355 -33807 38682 26732 -43371 -18903 47087 10624 -48814 -1318
984a318N0035n7117l8682O4347K6278o9112j2977P0684K75p0497J2442O7875k4329
$$ -1318 48717 -8400 -47082 17265 43543 -25569 -38546 32138 32413 -38084 -25642 42233 17904
997A7904o3629L5837N7324m6822m8110N6026L7651o3355k5371O7798J2191o8713
$$ 17904 -45725 -9888 47436 614 -47496 8530 46181 -17174 -42545 25253 37444 -31269
1009c1269M64O7796j2830o5446K4893O1132l6197n5089M6903M6441n6114l5486
$$ -31269 -30805 36991 24161 -41285 -16392 44740 8543 -46546 357 46798 -9316 -44802
1021d4802O2788K2875o6680r779O7959k974o7400J5110O4498k5987o0127L6603
$$ -44802 17986 40861 -25819 -35598 32361 29387 -38013 -22903 41595 15608 -44519 -7916
1033g916N3611m6539m4862N5373L4213o2170k1865O5895R377o7058L154O5269
$$ -7916 45695 -844 -45706 9667 43880 -18290 -40155 25740 35117 -31941 -28787 36482
1045C6482j4438o2142K5039N7392l5240n0883M5281M2583n4016l2698O0449K1293
$$ 36482 22044 -40098 -15059 42333 7093 -43790 1491 44074 -9942 -42640 17809 39102
1057C9102o3938q884O4541l217o3112J4882O0200k5647n5784L5625M9675m4809
$$ 39102 -24836 -33720 30821 27604 -35508 -20626 39574 13927 -41857 -6232 43443 -1366
1069a366m2128N3157L1922n9159k0489O2880P611o3675M648O2477j6091n9168
$$ -1366 -43494 9663 41585 -17574 -38063 24817 32428 -31247 -26599 35878 19787 -39381
1081c9381K6136N4654l5630m8337M4775L9976n2432l0092N8886J8581o2677o383
$$ -39381 -13245 41409 5779 -42558 2217 42193 -10239 -40331 18555 37136 -25541 -31924
1093c1924O3500n493o1368J6007N7820k6425n2562L5648M6168m4317l8349N1879
$$ -31924 31576 26083 -35285 -19278 38542 12117 -40445 -4797 41371 -2946 -41295 10584
1105A0584K8889n7520j8060O0696O580o1280N162N9388j6134n5754K6133N0880
$$ 10584 39473 -18047 -36107 24589 31169 -30111 -24949 34439 18305 -37449 -11316 39564
1117C9564l5322m5030M3619L7430n0537k7912N5671J6994n8964n215N9715o122
$$ 39564 4242 -40788 2831 40261 -10276 -38188 17483 34477 -24487 -29702 30013 23891
1129B3891n8399J6867N5111k6698n0133L5409M3865m3330l5710N0242K6337n5615
$$ 23891 -34508 -17641 37470 10772 -39361 -3952 39913 -3417 -39127 11115 37452 -18163
1141a8163j5739N8813M440n9385O596N7563j6968n3482K6197M8331l4983m2150
$$ -18163 -33902 24911 29351 -30034 -23438 34125 17157 -36325 -10128 38203 3220 -38930
1153c8930M3013L4396m9528k5413N4438J4863n7049l835N7192p192n4896J7346
$$ -38930 4083 38479 -11049 -36462 17976 32839 -24210 -28045 29147 21955 -32941 -15595
1165a5595N1363k6635m6586L5110M0427m2121l3107M8227K4033n2869j3970N5692
$$ -15595 35768 9133 -37453 -2343 38084 -4037 -37144 11083 35116 -17753 -31723 23969
1177B3969L089n6219P833N4173j7681n0624K6751M5430l4615l8920M1472L1386
$$ 23969 27058 -29161 -21328 32845 15164 -35460 -8709 36721 2106 -36814 4658 36044
1189C6044m7540k2647N2394J2539n5000j910N5381q666n3147J8653M8824k7284
$$ 36044 -11496 -34143 18251 30790 -24210 -26120 29261 20595 -32552 -13899 34925 7641
1201G641m3876L5069L7580m2153k9752M7360K1675n1810j1711N3636J642n3660
$$ 7641 -36235 -1166 36414 -5739 -35491 11869 33544 -18266 -29977 23659 25301 -28359
1213b8359Q521N1789j8424m7851K7012M2652l4402l6370M0751K9046m6020k0368
$$ -28359 -19838 31951 13527 -34324 -7312 35340 938 -35432 5319 34365 -11655 -32023
1225c2023M9888J1163n2070j315N2153q787n0087J7955M6699k6677m1464L4005
$$ -32023 17865 29028 -23042 -24357 27796 19009 -31078 -13123 33576 6899 -34565 -560
1237e60L5275m0564k7900M6005J9271m9601j0090N1245N70n1272R376M9244j8506
$$ -560 34715 -5849 -33749 12256 31527 -18074 -28164 23081 23651 -27621 -18245 30999 12493
1250A2493m5713K7048M0381l4291l3722M0114K6563m5351j7961M8691Q714n0170
$$ 12493 -33220 -6172 34209 -82 -33804 6310 32873 -12478 -30439 18252 26966 -23204
1262b3204L99N0087j0035m7797J9057M4226k7352l8935L4256L2535l9889k5386
$$ -23204 -22805 27282 17247 -30550 -11493 32733 5381 -33554 702 33237 -6652 -32038
1274c2038M4663J7011m7689p949M8909j113m8597J0356M6488j8873m2794K6593
$$ -32038 12625 29636 -18053 -26002 22907 21794 -26803 -16447 30041 11168 -31626 -5033
1286e033L7643l3528l1377L8976K4069m3571j5780M6629P123m7803J648M7515
$$ -5033 32610 -918 -32295 6681 30750 -12821 -28601 18028 25151 -22652 -21004 26511
1298B6511j0857m5181J9308M1636k7044l6419L3656L0084l9144k2949M3319J4915
$$ 26511 15654 -29527 -10219 31417 4373 -32046 1610 31694 -7450 -30399 12920 27835
1310B7835m5899o396M7254k684m6400J1040M4232j9210m0511K6727L5294l3059
$$ 27835 -18064 -24460 22794 20110 -26290 -15250 28982 9772 -30739 -4012 31282 -1777
1322a777k9020L8167K2068m2359j3894M4794N442m5604L159M4846j1187m2996
$$ -1777 -30797 7370 29438 -12921 -26815 17979 23421 -22183 -19024 25822 14635 -28361
1334b8361J9154L9178k6387l4286L2650K8152l7675k1152M1650J3343m3972n252
$$ -28361 -9207 29971 3584 -30702 1948 30100 -7575 -28727 12923 26266 -17706 -22958
1346b2958M4797l238m4003J1573M1623j9280l8048K6358L3081l2384k6831L7606
$$ -22958 21839 18601 -25402 -13829 27794 8514 -29534 -3176 29905 -2479 -29310 8296
1358H296J9494m0910j1972M3134L869m3801M270M2802j2082m0689J9717L6792
$$ 8296 27790 -13120 -25092 18042 21911 -21890 -17620 25182 13100 -27589 -7872 28920
1370B8920k6602l1697L2404K5546l7113j8728M0485J1309m2365l384M2624m243
$$ 28920 2318 -29379 3025 28571 -8542 -27270 13215 24524 -17841 -21225 21399 17156
1382A7156m1775J2075L9544j9566l5684K6119L0676l1556k4663L5933J7757l9143
$$ 17156 -24619 -12544 27000 7434 -28250 -2131 28545 -3011 -27674 8259 26016 -13127
1394a3127j0417M1049K808m1481M635M0735j2303l8328J9411L4486k5728k9516
$$ -13127 -23544 17505 20313 -21168 -16533 24202 11899 -26429 -7018 27468 1740 -27776
1406b7776L1304K3475l5450j6853L8583R643m0200k380M0816n517l9366J2584
$$ -27776 3528 27003 -8447 -25300 13283 22926 -17274 -19654 21162 15645 -23721 -11137
1418a1137L7214j9703l3448K6061K8063l1045k2506L5255J5717l7735q980L9483
$$ -11137 26077 6374 -27074 -1013 27050 -3995 -26501 8754 24471 -13264 -22244 17239
1430A7239J598l9654N853L8347j2623l6257J9695L2356k5773k7292L0530K1601
$$ 17239 18837 -20817 -14964 23383 10760 -25497 -5802 26554 781 -26511 4019 25620
1442B5620l4402j4996L6988Q275l8362j258L8350n842l7190J2503L5163j9412
$$ 25620 -8782 -23778 13210 21485 -16877 -18135 20215 14373 -22817 -10314 24849 5437
1454E437l1277K5071K6591k9903k0797L3688J4128l5855p639L7190J033l7452
$$ 5437 -25840 -769 25822 -4081 -24878 8810 22938 -12917 -20556 16634 17667 -19785
1466a9785O090L6142j2882l3681J9057L0149k4963k5135K9528J9805l3356j3515
$$ -19785 -13695 22447 9565 -24116 -5059 25090 127 -25008 4520 24325 -9031 -22546
1478b2546L5639O932l6756k78L6661o391l5478J3295L2733j9300k9202K4800K4595
$$ -22546 13093 20025 -16731 -17009 19652 13261 -22217 -8922 23811 4511 -24691 109 24704
1491B4704k9290j8900L2342J2959l4621o403L5534j14l5465O726L4375j3151l2134
$$ 24704 -4586 -23486 8856 21815 -12806 -19209 16325 16211 -19254 -12528 21847 8696 -23438
1504b3438J9355K8134k4426k3385K8615J7876l1732j2031L3616O034l4907O40
$$ -23438 -4083 24051 -375 -23760 4855 22731 -9001 -21032 12584 18618 -16289 -15649
1516a5649L4681o732l3766J3114L1328j8862k7516K4231K2483k8503j6843L1296
$$ -15649 19032 12300 -21466 -8352 22976 4114 -23402 829 23312 -5191 -22034 9262
1528I262J1060l3124n116L3691o81l3828P239L2544j3457k9992J9310K6161k4487
$$ 9262 20322 -12802 -17918 15773 15092 -18736 -11497 21047 7590 -22402 -3092 23069 -1418
1541a418k1460K8338J6102l0919j0369L2327M638l3109J532L2702p113l1807J3280
$$ -1418 -22878 5460 21562 -9357 -19726 12601 17239 -15870 -14338 18364 11251 -20556 -7276
1554g276K9152j8718k5862K3856K0994k7515j5289K9637R815l1320m096L2045
$$ -7276 21876 3158 -22704 1152 22146 -5369 -20658 8979 18794 -12526 -16622 15423
1566A5423j721l1714P312L0665j2972k8392J8398K4748k3462j9812K7295J4622
$$ 15423 13702 -18012 -10700 19965 6993 -21399 -3001 21747 -1715 -21527 5768 20390
1578B0390k9579r243L1078L477l1254J779L1070p483k9920J3134K7536j8407k4199
$$ 20390 -9189 -18432 12646 16123 -15131 -13352 17718 10235 -19685 -6551 20985 2578 -21621
1591b1621K3274J9681k7142j3908K8856Q630k9988l083L0149k339k9807P721K8830
$$ -21621 1653 21334 -5808 -19716 9140 17770 -12218 -15301 14848 12509 -17298 -9577 19253
1604A9253j3161k6769J8227K3475k2592j8817K6008J3389k8369p869K9454K741
$$ 19253 6092 -20677 -2450 21025 -1567 -20384 5624 19013 -9356 -17225 12229 14970
1616A4970k9817K363K9479p528k8040J2299K6071j7408k2688K1851J8523k5816
$$ 14970 -14847 -12484 16995 9467 -18573 -6274 19797 2389 -20299 1552 20075 -5741
1628e741j3023K8051P833k9251k529K9217k455k8437P471K7077j2646k5104J7547
$$ -5741 -18764 9287 17120 -12131 -14660 14557 12102 -16335 -8864 18213 5567 -19537 -1990
1641a990K2097k2058j7754K5275J2552k7310p257K8495J959k8485L160K8006q198
$$ -1990 20107 -1951 -19705 5570 18122 -9188 -16445 12050 14009 -14476 -11316 16690 8492
1654H492k6452J2636K4496j7209k1427K1421J7068k4618j2218K6796O985k7946
$$ 8492 -17960 -5324 19172 1963 -19464 1957 19025 -5593 -17811 8985 15970 -11976
1666a1976j657K7970l507k7167Q194K5593j2212k3634J6770K0377k0813j6226
$$ -11976 -13633 14337 10830 -16337 -8143 17450 5238 -18396 -1626 18751 -2062 -18288
1678a8288K3843J1936k6404o769K7351J860k7444L315K6502q157k5080J2722K2757
$$ -18288 5555 17491 -8913 -15682 11669 13529 -13915 -10600 15902 7745 -17335 -4613 18144
1691A8144j6943j9665K0628J5900k3642j1542K5933O274k6587j292K6545l546
$$ 18144 1201 -18464 2164 18064 -5578 -17120 8813 15087 -11500 -12792 13753 10207
1703A0207k5832Q109K4465j2550k2126J6675J8991k0257j5230K3283J0665k5080
$$ 10207 -15625 -7516 16949 4399 -17727 -1052 17939 -2318 -17548 5735 16400 -8680
1715h680n911K5891J122k6018L619K5243q163k3685J2437K1488j6603j8295J9956
$$ -8680 -14591 11300 12422 -13596 -9977 15266 7103 -16582 -4145 17343 740 -17555 2401
1728B401J4750k2852j0240K4296N706k5291q99K5316l583k4566Q136K3060j2330
$$ 2401 17151 -5701 -15941 8355 14061 -11230 -12129 13187 9604 -14962 -6826 16234 3904
1741C904k0864J6303J7658j9540j4147K2355R812k4169n167K4966N73k4875L827
$$ 3904 -16960 -657 17001 -2539 -16686 5669 15481 -8688 -13855 11111 11684 -13191 -9364
1754i364K4429q567k2414J2295K0142j5955j7210J9375J3491k1903r457K3767
$$ -9364 15065 6498 -15916 -3621 16521 566 -16644 2731 16222 -5681 -15138 8629
1766H629N033k4547n11K4390m109k3298Q275K1761j2288j9685J6105J6455j9084
$$ 8629 13662 -10885 -11396 12994 8885 -14413 -6138 15623 3335 -16350 -245 16210 -2874
1779b874j2917K1489Q971k3076m767K3804K42k3590M159K2616q000k1352J2098
$$ -2874 -15791 5698 14669 -8407 -13174 10630 10872 -12718 -8559 14057 6057 -15295 -3197
1792c197J9186j5729j6322J8694J2827k1024q804K2655M609k3574Q0K3038m173
$$ -3197 15989 260 -16062 2632 15459 -5565 -14369 8286 12895 -10679 -10599 12439 8266
1805H266k2230Q136K0993j2126j8548J5345J5701j8338j2105K0649Q014k1963
$$ 8266 -13964 -5828 15165 3039 -15509 -164 15537 -2801 -14906 5743 13757 -8206
1817h206l975K2634m8k2722M234K1940q302k0462J2116J8091j5354j5134J8024
$$ -8206 -12181 10453 10405 -12317 -8083 13857 5555 -14907 -2791 15300 -54 -15188 2836
1830B836J1677k0197q026K1732L984k2299J12K2087m232k1050Q112J9489j1638
$$ 2836 14513 -5684 -13710 8022 12006 -10293 -10181 11906 7674 -13376 -5264 14225 2587
1843B587j7407J5110J4521j7673j1347J9823P644k1162l821K2068n71k1641M402
$$ 2587 -14820 290 14811 -2862 -14209 5614 13258 -7904 -11725 10343 9772 -11869 -7467
1856g467K0749q179j9408J1784J7181j4900j4336J7402J1020j9286p581K0977
$$ -7467 13282 5103 -14305 -2521 14660 -240 -14576 2826 13846 -5440 -13021 7956
1868G956L286k1180L00K1505m532k0405Q065J8852j1671j6409J4606J3948j7355
$$ 7956 11242 -9938 -9638 11867 7335 -13070 -5005 13847 2176 -14233 373 14321 -3034
1881c034j0495J9055P023k0451l262K1045p36k0622M360J9996q257j8276J1487
$$ -3034 -13529 5526 12549 -7902 -11164 9881 9145 -11477 -7117 12879 4622 -13654 -2167
1894b167J6372j4620j3510J6874J0370j8660o925J9948L220k0598O23K0403m533
$$ -2167 14205 -415 -13925 2949 13319 -5341 -12266 7682 10902 -9696 -9073 11330 6797
1907F797j9409Q205J7915j1388j5825J4095J3079j6671r775J8450O453j9484l007
$$ 6797 -12612 -4407 13508 2120 -13705 390 13469 -3202 -12977 5473 11926 -7558 -10565
1920a0565K0191p81k0184M767J8949q138j7432J1332J5312j4051j2795J6619R511
$$ -10565 9626 8845 -11339 -6572 12377 4239 -13193 -1861 13451 -600 -13395 3224 12735
1933A2735j8282o021J9294K399j9627J177J9465m906j8442Q172J6872j1266j4639
$$ 12735 -5547 -11568 7726 10125 -9502 -8325 11140 6234 -12208 -4036 12836 1570 -13069
1946a3069J3991J1943j6075r230J8010N796j9028k377J9461j430j8858M824J8092
$$ -13069 922 12865 -3210 -12440 5570 11366 -7662 -10039 9422 7992 -10866 -6042 12050
1959A2050q318j6145J1004J4207j3791j1696J5921Q882j7621n793J8887K089j8967
$$ 12050 3732 -12413 -1409 12798 -993 -12689 3232 12114 -5507 -11300 7587 9676 -9291
1972i291J309J8660m778j7656Q089J6119j1160j3819J3542J1289j5492q527J7134
$$ -9291 -7982 10678 5900 -11756 -3667 12452 1292 -12527 1015 12304 -3188 -11715 5419
1985E419N383j8356j577J8563j794j8368N262J7195q393j5444J0842J3476j3266
$$ 5419 10802 -7554 -9131 9432 7638 -10730 -5468 11727 3334 -12110 -1268 12208 -1058
1998a058j1094J5438Q301j6985n060J7952J765j8219J489J8006n135j6754Q261
$$ -1058 -12152 3286 11587 -5398 -10458 7494 9259 -8960 -7471 10535 5400 -11354 -3093
2011c093J5031j0950j2947J3304J0542j5173q095J6731M982j7578j715J8050j948
$$ -3093 11938 988 -11959 1345 11887 -3286 -11381 5350 10332 -7246 -8961 9089 7141
2024G141j7617N268J6755q466j5074J1184J2565j2939j0333J4745P667j6283m538
$$ 7141 -10476 -5208 11547 3081 -11993 -809 11756 -1183 -11516 3229 10896 -5387 -9925
2037i925J7417J086j7691K168J7313n399j6175Q340J4499j1059j2175J3005R901
$$ -9925 7492 8578 -9113 -6945 10368 4969 -11206 -2866 11633 574 -11601 1404 11305
2050A1305j4837o991J5899M300j7024j196J7399k107j6850N411J5826q693j3706
$$ 11305 -3532 -10523 5376 9676 -7348 -8544 8855 6748 -10102 -4691 11135 2442 -11264
2063a1264J0904J1783j3077r376J4505P013j5794m231J6664Q80j6848K347J6445
$$ -11264 -360 11423 -1654 -11030 3475 10488 -5306 -9537 7127 8007 -8841 -6494 9951
2076I951n443j5556Q674J3518j0779j1518J2804R161j4482o375J5342L834j6412
$$ 9951 4508 -11048 -2374 11144 365 -11153 1651 10812 -3670 -10045 5297 9131 -7281
2089g281p27J6768k497j6123N621J4966q519j3137J0776J1112j2790q735J4197
$$ -7281 -8008 8760 6263 -9860 -4239 10727 2208 -10929 -153 10959 -1831 -10566 3631
2102C631O469j5607l632J6042Q70j6277K314J5807n412j4577Q087J3068j0661
$$ 3631 10100 -5507 -9139 6903 7773 -8504 -6190 9617 4205 -10372 -2285 10783 122
2115A22j0864J2558Q583j3998o090J5125L142j5379m39J5717k593j5562N879J4100
$$ 122 -10742 1816 10399 -3599 -9689 5436 8578 -6801 -7240 8477 5884 -9678 -3799 10301
2129A0301q241j2733J0587J0589j2462q203J3814N781j4814l085J5541K89j5682
$$ 10301 2060 -10673 -86 10503 -1959 -10162 3652 9433 -5381 -8466 7075 7364 -8318
2142h318K659J5114n450j4085Q058J2476j0386j0395J2406P573j3327n572J4675
$$ -8318 -5659 9455 4005 -10080 -2022 10454 68 -10327 2079 9652 -3675 -9247 5428
2155E428K805j5141j25J5396k860j4926N663J3766q383j2030J0700R986j2284
$$ 5428 8233 -6908 -7033 8363 5503 -9423 -3760 10006 1623 -10407 293 10279 -2005
2168b005p719J3449N424j4575k659J4937p7j4958K973J4442n698j3532Q435J1709
$$ -2005 -9724 3725 9149 -5426 -8085 6852 6775 -8183 -5210 9232 3534 -9998 -1563 10146
2182A0146j0449r697J1955P520j3153n182J4091K591j4648L67J4508k939j4246
$$ 10146 -303 -10000 1955 9475 -3678 -8860 5231 7822 -6826 -6459 8049 5110 -9136
2195i136N723J3179q230j1447J0404R262j2232o924J3370M672j4015k292J4528
$$ -9136 -3413 9766 1536 -9911 493 9755 -2477 -9401 3969 8641 -5374 -7666 6862
2208F862k78j4568K999J4047n859j2770Q207J1300j0481r020J1837O875j3077
$$ 6862 6584 -7984 -4985 9062 3203 -9567 -1360 9940 -541 -9561 2276 9151 -3926
2221c926m466J3888J981j4330P02J4077l225j3545N845J2585q451j0667J0124
$$ -3926 -8392 5496 7477 -6853 -6151 7926 4701 -8844 -2999 9586 1135 -9532 592
2234E92Q827j1712o721J2973M422j3887j723J3880q03j3786L318J3270n682j2296
$$ 592 9419 -2293 -9014 3959 8381 -5506 -7229 6651 5848 -7938 -4620 8650 2968 -9328
2248i328Q163J0454r890q715J1831O282j2774m197J3733J469j3739Q40J3621l262
$$ -9328 -1165 9289 -601 -9316 2515 8797 -3977 -8174 5559 7028 -6711 -5871 7750 4488
2262D488j3090N802J1915q172j0273J0058Q411j1544o320J2761L912j3289j655
$$ 4488 -8602 -2800 9115 943 -9330 728 9139 -2405 -8725 4036 7948 -5341 -6996
2275f996J3535p21j3435L422J2654n759j1666Q003J0154r843q165J1194O058j2355
$$ -6996 6539 5818 -7617 -4195 8459 2700 -8966 -963 9191 -652 -8817 2377 8435 -3920
2289c920m015J3274J546j3574J047J3148l474j2487N731J1598p847j0166R870
$$ -3920 -7935 5339 6885 -6689 -5642 7506 4032 -8455 -2724 8874 1027 -9139 731
2302G31Q082j1211n751J2177L725j3074j374J3148r52j3027L683J2181n897j1233
$$ 731 8813 -2398 -8149 4028 7753 -5321 -6695 6453 5501 -7526 -3843 8338 2441 -8792
2316h792P943R728r761p848J1112N636j2139l367J2784J218j3064J302J2945l778
$$ -8792 -849 8879 -882 -8730 2382 8018 -4121 -7488 5296 6514 -6550 -5248 7697 3919
2330C919j2016N823J0861p863r455R649P583j1186n319J2111L032j2496q14J2666
$$ 3919 -8097 -2274 8587 724 -8731 918 8501 -2685 -8004 4107 7139 -5357 -6171 6495
2344F495j524j2236L601J1696n908j0572P954Q993r562p354J0994N391j1877l127
$$ 6495 4971 -7265 -3664 8032 2124 -8448 -494 8499 -1063 -8417 2577 7968 -3909 -7036
2358g036J2412O12j2407J633J2229l916j1536N995J0510p952q998R500P128j0749
$$ -7036 5376 5988 -6419 -4786 7443 3527 -8009 -2014 8496 544 -8454 1046 8174 -2575
2372b575n126J1673L072j2333o23J2334j800j1832L800J1180n900j0087P634Q784
$$ -2575 -7701 3972 7044 -5289 -5912 6422 4622 -7210 -3410 7770 1870 -8217 -583 8201
2386H201r381o815J0603N003j1583k734J2008M77j2229J955J1608l938j1041O052
$$ 8201 -1180 -7995 2608 7611 -3972 -6706 5302 5779 -6450 -4495 7113 3175 -7866 -1814
2400a814R823p687q535R532O565j0603m812J1578K552j1776l93J1715j742j1350
$$ -1814 8009 322 -8213 1319 7884 -2719 -7531 4047 6599 -5177 -5570 6145 4403 -6947
2414f947L639J0982n726r858P552Q406r297o426J0221M702j1061k871J1731M97
$$ -6947 -3308 7674 1948 -7910 -358 8048 -1249 -7675 2546 7248 -3813 -6684 5047 5544
2428E544j1697J754J1349l874j0651N915R411p555q013R155O442j0318m589J1050
$$ 5544 -6153 -4399 6950 3076 -7575 -1660 7751 196 -7817 1338 7780 -2538 -7127 3923
2442C923K501j1575k94J1641j989j1198L949J0328n605r488P621Q084r097o199
$$ 3923 6424 -5151 -5445 6196 4207 -6991 -3042 7286 1681 -7807 -186 7898 -1199 -7398
2456g398J0068M124j0921k113J1331J57j1240J815J1047m037j0068N661R088p508
$$ -7398 2670 6794 -4127 -6240 5091 5248 -5992 -4177 6870 2833 -7235 -1574 7514 6
2470Fp635R015N913r859m318J0965K062j1169K9J0969k032j0614L882R934n727
$$ 6 -7629 1386 7299 -2560 -6878 4087 6149 -5020 -4991 5978 3946 -6668 -2786 7148 1421
2485A421r021P564P525q803n922R971L992j0679j941J0772P7j0792K039J0359
$$ 1421 -7600 -36 7489 -1314 -7236 2735 6727 -3952 -5893 4879 4956 -5836 -3797 6562
2499F562l701r898N654Q696p352p338Q822N555r613l850J0441J851j0771J57J0713
$$ 6562 2861 -7037 -1383 7313 -39 -7377 1445 7000 -2613 -6463 3978 5829 -4942 -4785 5928
2514E928k299j0008L837R500n693q378P137P159q517n649R789L710j0545j676
$$ 5928 3629 -6379 -2542 6958 1265 -7113 24 7183 -1334 -6983 2806 6516 -4029 -5705
2528e705J0802m05j0409K053J0026m025r230N628Q343p110o925Q332N532r751
$$ -5705 5097 4692 -5717 -3664 6362 2337 -6893 -1265 7078 -32 -6957 1375 6907 -2844
2542b844l498J0385J661j0654M82J0246k211r902M015R035n366q300O751P207
$$ -2844 -6342 4043 5704 -4950 -4468 5778 3567 -6335 -2320 6715 1349 -6951 -200 7007
2556G007q347n309R231L582j0141j467J0455n27j0247K374R670l875r133N631
$$ 7007 -1340 -6649 2582 6164 -3977 -5444 5011 4484 -5763 -3389 6281 2406 -6727 -1096
2570a096P847o890o608Q101N328r283l460R904J625j0202L32J0094k130r674L723
$$ -1096 6751 -139 -6747 1354 6682 -2601 -6061 3843 5468 -4734 -4402 5692 3562 -6112 -2389
2585b389Q829n315p956P012O562q162n167R236L465j0076j248R982l11r978K173
$$ -2389 6440 1125 -6831 181 6743 -1419 -6586 2650 6115 -3961 -5209 4773 4462 -5516 -3343
2600c343R622m041q784N531P695o783o676Q137M901q998l102R901R92r800N76
$$ -3343 6279 2238 -6546 -1015 6680 -103 -6779 1358 6259 -2739 -5841 4060 5052 -4748 -4172
2615d172R690k385r196L925Q496n415p419O600O346p961m871R083L126r495j399
$$ -4172 5518 3133 -6063 -2138 6358 943 -6476 124 6470 -1491 -6362 2721 5847 -3648 -5047
2630e047R842o48r808K503R230l996q348N389P360o787o019P849M679q734l268
$$ -5047 4795 4147 -5661 -3158 6072 2076 -6272 -883 6477 -310 -6329 1520 6199 -2535 -5803
2645e803R430J303r505N67R414k253r081L845Q305n156p342O504O198p828m815
$$ -5803 3627 4930 -4575 -4008 5406 3153 -5928 -2083 6222 1066 -6276 228 6426 -1402 -6217
2660f217Q650L141r301j247R460m75r323K189Q939l864q110N287P167o652n863
$$ -6217 2433 5574 -3727 -4974 4486 4011 -5312 -3123 5816 1952 -6158 -871 6296 -356 -6219
2675f219P676M672q609l068R144J183r306M73R154k048q889M175P892n496o924
$$ -6219 1457 6129 -2480 -5548 3596 4779 -4527 -4054 5100 3052 -5837 -1662 6230 734 -6190
2690f190O488N869p556m542Q437K750q836j153R242n50r121K023Q773l970p821
$$ -6190 298 6167 -1389 -5931 2506 5256 -3580 -4733 4509 3959 -5162 -3139 5634 1664 -6157
2705f157N585O657o556n589P604M256q386k692Q920J038r075N53R046k569q290
$$ -6157 -572 6085 -471 -6060 1544 5800 -2586 -5278 3642 4680 -4395 -3842 5204 2635 -5655
2720e655L867P749n265o633O440N495p692m054Q388K568q859q91R069q21q810
$$ -5655 -1788 5961 696 -5937 503 5998 -1694 -5748 2640 5208 -3651 -4542 4527 3706 -5104
2735e104K464Q131l810p354N267O355o600n148P322M044q336k365Q662R15q970
$$ -5104 -2640 5491 1681 -5673 -406 5949 -651 -5799 1523 5567 -2769 -5134 3528 4443 -4527
2750d527R23Q649k369q191L928P332n290o258O197N334p437l651P867K398q355
$$ -4527 -3604 5045 2676 -5515 -1587 5745 455 -5803 394 5728 -1709 -5360 2507 4905 -3450
2765c450r22Q737p88q549K408Q111l926p438N453O168o326n078P259L700q073
$$ -3450 -4372 4365 3577 -4972 -2564 5547 1621 -5817 -364 5804 -522 -5600 1659 5359 -2714
2780b714k228Q355O90q454P94Q531k505p839L750P227n149o105O269M972p239
$$ -2714 -4942 3413 4103 -4351 -3557 4974 2469 -5370 -1620 5607 458 -5647 622 5594 -1645
2795a645l550P724K233q251n57Q305j120p976K438P689l994o869M983O267o318
$$ -1645 -5195 2529 4762 -3489 -4046 4259 3139 -4837 -2399 5290 1296 -5573 -590 5677 -641
2810f41m785P151L361p718k084Q372K81q204J016Q094k538p602L960O830n304
$$ -641 -5426 1725 5086 -2632 -4716 3656 3937 -4267 -3251 4843 2305 -5297 -1337 5493 189
2825A89n862O255M916p106l368P704J768p985l18Q066j120p906K574P389l996
$$ 189 -5673 582 5498 -1608 -4976 2728 4496 -3489 -3807 4259 3139 -4767 -2193 5196 1200
2840A200o638N254N785o506m340O995L279p709j860Q184L10q128J095P891k656
$$ 1200 -5438 -184 5601 -905 -5245 1750 5029 -2680 -4540 3644 3954 -4174 -3079 4812 2156
2855B156p240L759O683n079n635O199M390o934l262P678J623p964O6P657j127
$$ 2156 -5084 -1325 5358 279 -5356 843 5233 -1701 -4963 2715 4338 -3626 -3560 4097 2970
2870B970p623K598P266l880o676N222N660o465m242O933L157p504j931P767L79
$$ 2970 -4653 -2055 5211 1331 -5345 -123 5537 -928 -5170 1763 4920 -2584 -4515 3252 3631
2885C631p797J171P536k341p306M080O135m959n393N893M378p021k805P331J813
$$ 3631 -4166 -2995 4541 2200 -5106 -1026 5109 150 -5243 650 5028 -1993 -4798 2533 4346
2900D346p638k91P631j042p638K705P049l980o303M909N397o128m098O731K925
$$ 4346 -3292 -3583 4048 3006 -4632 -1927 5122 1142 -5161 -252 5145 -983 -5081 1650 4575
2915D575p190j657P715K13p699J298P440k745o993M018O208n067n154N754M236
$$ 4575 -2615 -4272 3443 3656 -4043 -2745 4695 1950 -5043 -1025 5183 116 -5038 716 4952
2930D952o586k957P189J550p444j84P429j222p256K431O933l937n851M821N270
$$ 4952 -1634 -4591 2598 4148 -3296 -3480 3949 2727 -4529 -2098 4835 898 -4953 -132 5138
2945E138n948m023O676K661p034j538P425J90p401J075P212k486o789L749O084
$$ 5138 -810 -4833 1843 4504 -2530 -4068 3357 3547 -3854 -2779 4433 1947 -4842 -1093 4991
2960D991m904n084N877L945o623k640P009J387p350j30P372j224p025K603O555
$$ 4991 87 -4997 880 4825 -1798 -4438 2571 3958 -3392 -3522 3850 2626 -4399 -1796 4759
2975D759l800n993N101M980o013l751O359K760o756j562P136N6p044J413O811
$$ 4759 959 -5034 67 5047 -966 -4717 1642 4402 -2354 -3916 3220 3276 -3768 -2355 4456
2990D456k595o612L891N815n003m733N568L865o478k529O950J348p133j66P354
$$ 4456 1861 -4751 -860 4955 -48 -4781 787 4652 -1826 -4355 2595 3943 -3190 -3356 3998
3005C998j395p006K623O354l828n597M935M688n657l735O443K491o978j016P093
$$ 3998 2603 -4403 -1780 4574 746 -4851 84 4772 -885 -4620 1823 4314 -2664 -3680 3413
3020C413k30p127J453O753k587o428L833N655m817m693N750L484o259k226O479
$$ 3413 3183 -3944 -2491 4262 1675 -4753 -920 4735 -82 -4775 975 4459 -1800 -4026 2453
3035B453J303o868pP017j536o627K584O292l822n568M886M614n755l384O172K300
$$ 2453 3756 -3112 -3119 3898 2362 -4265 -1681 4611 789 -4779 107 4721 -1034 -4418 1754 4054
3051D054o689j141P133k88o781J380O553k730o023L904N338m838m566N830L262
$$ 4054 -2635 -3776 3357 3069 -3712 -2332 4221 1491 -4532 -628 4710 -128 -4694 1136 4398
3066D398o207k256O678R30o711K74O723j723o191K639N886l639n380M612M480
$$ 4398 -1809 -4065 2613 3543 -3168 -2894 3829 2106 -4085 -1446 4440 801 -4579 33 4513
3081D513n608l322O291J876o203j081O684l44o665J517O585k632n994L786N120
$$ 4513 -1095 -4417 1874 3750 -2453 -3534 3150 2806 -3859 -2342 4243 1611 -4383 -597 4523
3096D523m651m292N575L126o272j842O504P47o735M39O585j405o352K594N696
$$ 4523 -128 -4420 1155 4281 -1991 -3833 2671 3418 -3317 -2878 3707 2302 -4050 -1456 4240
3111D240l620n249M910M182n609k999N988K102o517o77O456l31o566J605O131
$$ 4240 620 -4629 281 4463 -1146 -4145 1843 3945 -2572 -3249 3207 2876 -3690 -2085 4046
3126D046k793n555L723N067m806m041N390L140o166j899O297P50o298M37O407
$$ 4046 1253 -4302 -579 4488 -318 -4359 1031 4171 -1995 -3894 2403 3153 -3145 -2708 3699
3141C699j639o169K823N630l626n004M655M099n594k996O139J716o227q15O381
$$ 3699 2060 -4109 -1286 4344 718 -4286 369 4468 -1126 -4122 2017 3733 -2494 -3309 3072
3156C072m10o331J638O155k860n660M008M826m907l868N507K947o134j762O411
$$ 3072 2662 -3669 -2031 4124 1264 -4396 -388 4438 -469 -4337 1170 4117 -2017 -3779 2632
3171B632M86o419O05O301j568o095K707N501l663m903M943L811n663k760O193
$$ 2632 3118 -3301 -2696 3605 2037 -4058 -1351 4150 487 -4416 527 4338 -1325 -4085 2108
3186B108J516o171n58O281o23o258J638O031k680n507L783M805m660l868N458
$$ 2108 3624 -2547 -3105 3176 2553 -3705 -2067 3964 1284 -4223 -440 4365 -295 -4163 1295
3201A295K652n919j523O040O24o403N55O272j882n637K846N294l920m548M616
$$ 1295 3947 -1972 -3495 2545 3169 -3234 -2679 3593 1711 -3926 -1080 4214 294 -4254 362
3216C62L842n418k673N910J539o147l20O149q19o178K021N617k954m978L704M722
$$ 362 4204 -1214 -3887 2023 3562 -2585 -2905 3244 2425 -3753 -1732 3885 931 -4047 -343 4379
3232D379m851l620N365K619n976j606O184O37o236N87O227j997n773L034N207
$$ 4379 -472 -4092 1273 3892 -2084 -3690 2494 3131 -3105 -2518 3709 1712 -4061 -1027 4180
3247D180l934m513M759L673n412k922O083J501o011l77O176r63n710J694N717
$$ 4180 246 -4267 492 4165 -1247 -4169 1914 3415 -2596 -2973 3203 2240 -3470 -1776 3941
3262C941k723n334L875M345m599l622N341K650n774j516N909M99o255J063N874
$$ 3941 1218 -4116 -241 4104 -495 -4117 1224 3874 -1900 -3416 2493 2992 -3263 -2200 3674
3277C674j941n569K833N042l901m197M737L305n206k807N926J355n909l22O183
$$ 3674 1733 -3836 -1003 4039 138 -4059 678 3983 -1223 -4030 1896 3251 -2658 -2980 3203
3292C203r05n963K017N482k974m952L926M162m591l369N360K432n732j489O066
$$ 3203 2298 -3665 -1648 3834 860 -4092 -166 3996 -595 -3964 1396 3828 -1904 -3393 2673
3307B673J49n983Q11O056k041n601L008N029l974m097M597L250n065k619N676
$$ 2673 2822 -3161 -2350 3706 1665 -3936 -928 4101 127 -3970 627 3877 -1188 -3807 1869
3322A869J470n953k38N993j010n660K096N102k577n070L887M137m695l195N296
$$ 1869 3339 -2614 -2852 3141 2131 -3529 -1433 3669 1092 -3978 -91 4046 -649 -3844 1452
3337A452K177n757r49N788J24o128J229N537k030n331L170M750l938m063M642
$$ 1452 3629 -2128 -3077 2711 2835 -3293 -2064 3473 1443 -3888 -718 4032 94 -3969 673
3352F73L055n167k108N584J234n938o7N941j124n612K204N190l176m664L973L921
$$ 673 3728 -1439 -3547 2037 3271 -2667 -2734 3207 2083 -3529 -1325 3865 689 -3975 -2 3919
3368C919m494l293N364K117n737r90N679M5n821J155N591k125n204L049M455l756
$$ 3919 -575 -3868 1496 3613 -2124 -3114 2565 2610 -3211 -2056 3535 1410 -3794 -745 3710 -46
3384d6l844M737K910n215j969N632Q71n536N5N686j342n420K242N001l136m472
$$ -46 -3890 847 3757 -1458 -3427 2205 3076 -2460 -2405 3281 1939 -3481 -1239 3762 626 -3846
3400c846L823M025m890k794N182J970n522r11N843k32n875J394N231k230m932
$$ -3846 -23 4002 -888 -3682 1500 3470 -2052 -2963 2880 2648 -3227 -1833 3398 1168 -3764
3415c764L147M446m130l480M751K783n407j690N482Q81n985M16N656j348n306
$$ -3764 -617 3829 -301 -3781 970 3753 -1654 -3344 2138 3019 -2966 -2550 3106 1758 -3548
3430c548K317N088l345m399M173L550m563k897N308J582n431p57N759m42n660
$$ -3548 -1231 3857 512 -3887 286 3836 -727 -3624 1684 3266 -2165 -2922 2837 2395 -3265
3445c265J282N538k137n088L078M285l770l699M675K699n128j747N544O30n527
$$ -3265 -1983 3555 1418 -3670 -592 3693 -77 -3776 899 3598 -1530 -3277 2267 2897 -2630
3460b630L69N296j178n468K585M808l333m255L963L629m659k762N169J818n557
$$ -2630 -2261 3035 1857 -3611 -1026 3782 449 -3806 157 3786 -873 -3635 1534 3352 -2205
3475b205n91N625n60n385J446N074k399m522K995M124l944l211M530K589n111
$$ -2205 -2796 2829 2269 -3116 -1670 3404 1005 -3517 -522 3602 -342 -3553 977 3566 -1545
3490a545j781N478N08n496N18N551j373n147K235M549l147l916L744L311m536
$$ -1545 -3326 2152 2660 -2836 -2318 3233 1860 -3287 -1052 3497 350 -3566 178 3489 -1047
3505a047k318M858J623n380n61N548l60n632J508N065k193m704L344M136m155
$$ -1047 -3365 1493 3116 -2264 -2825 2723 2363 -3269 -1761 3304 1111 -3593 -249 3887 -268
3520b68l434M736K619n259j593N583M48n512N46N272j465n158K307M953l440l930
$$ -268 -3702 1034 3653 -1606 -3199 2384 2832 -2680 -2134 3138 1673 -3485 -1178 3775 335 -3595
3536c595L903L454m706k407M977J466n334n75N554n32n464J609N173k690m303
$$ -3595 308 3762 -944 -3351 1626 3092 -2242 -2817 2737 2205 -3259 -1650 3523 833 -3470
3551c470L226L904m105l204M704K281m908j467N315M60n468N22N282j627m937
$$ -3470 -244 3660 -445 -3649 1055 3336 -1572 -3039 2276 2736 -2732 -2210 3072 1445 -3492
3566c492K613M477l402l703L796L209m474k365N034J172n194l34N456o73n287
$$ -3492 -879 3598 196 -3507 289 3498 -976 -3341 1693 2865 -2329 -2663 2793 2120 -3167
3581c167J790M819k638m348L408L839m205k930M425K321n008j368N351L37n387
$$ -3167 -1377 3442 804 -3544 -136 3703 -502 -3432 993 3314 -1694 -3062 2289 2626 -2761
3596b761O08N353j905m784K656M447l358l664M016K889m679k014M798J315n419
$$ -2761 -2153 3200 1295 -3489 -833 3614 256 -3408 608 3497 -1182 -3196 1602 2917 -2502
3611b502K29N101q00n144J759M790k724m249L453L581m119k814M584K152n084
$$ -2502 -2273 2828 2028 -3116 -1357 3433 709 -3540 -87 3494 -625 -3439 1145 3297 -1787
3626a787r51N023K20n260P97N203k002m666K768M264l550l372L934K675m602j777
$$ -1787 -2738 2285 2505 -2755 -1958 3245 1243 -3423 -655 3609 59 -3313 621 3296 -1306 -3083
3642c083M856J125n278m5N308p79n301J766M712k639m234L513L496m009k740M683
$$ -3083 1773 2898 -2380 -2425 2883 2104 -3197 -1431 3281 642 -3592 -79 3417 -592 -3332 1351
3658A351J871m995j002N068jn110J004M952j815m768L007L888l504l382M089K495
$$ 1351 3222 -1773 -2775 2293 2292 -2818 -1814 3138 1323 -3445 -438 3450 -54 -3436 653 3148
3674C148m418j737M894Q67n166R0N030q42n023J931M588k827m049L803L193m201
$$ 3148 -1270 -3007 1887 2754 -2412 -2322 2708 1866 -3157 -1226 3362 535 -3514 289 3482 -719
3690g19k495M514J639m884o71M847L3m966R61M927j925m683K946L978l632l271
$$ -719 -3214 1300 2939 -1945 -2616 2231 2264 -2702 -1741 3186 1261 -3422 -476 3502 -130 -3401
3706c401M130K510m576j666M887P91n088J2N231j071m819K042M331k790m153L761
$$ -3401 729 3239 -1337 -3003 1884 2675 -2413 -2401 2830 1759 -3060 -1018 3313 523 -3630 131
3722A31L176m148k481M617J617m854n78M942l30m841J233M662k030m464K895L953
$$ 131 3307 -841 -3322 1295 2912 -1942 -2520 2422 2092 -2749 -1516 3146 1116 -3348 -453 3500
3738C500l788k969M097K297m441j607M890O28m855L61M802j374m685K251M252
$$ 3500 -288 -3257 840 3137 -1304 -2911 1979 2607 -2248 -1887 2915 1541 -3144 -893 3359
3753C359l084l675L768K896m089k376M681J276m832k41M864n73m788J344M723
$$ 3359 275 -3400 368 3264 -825 -3201 1480 2756 -2076 -2317 2547 1974 -2814 -1470 3253
3768C253k266m345L140L485l550l035M152K133m378j449M914K49m785N03M744
$$ 3253 987 -3358 -218 3267 -283 -3318 834 2967 -1411 -2860 2054 2303 -2482 -1979 2765
3783B765j276m495K208M041k882l594L601K911m207k103M490J266m633p06N141
$$ 2765 1489 -3006 -798 3243 361 -3233 368 3279 -928 -3031 1459 2725 -1908 -2614 2527
3798B527o48m856J497M804k527m072L023L647l954k728M381J998m660j258M999
$$ 2527 1879 -2977 -1480 3324 797 -3275 -252 3395 -559 -3287 1094 3092 -1568 -2826 2173
3813B173J56m701M74M742j498m342K074M233l274l260L738K696m340j758M548
$$ 2173 2329 -2372 -1898 2844 1346 -2996 -922 3311 37 -3223 515 3211 -1129 -2887 1661
3828A661J027m797l01N141q93m540J505M283k405l879L142L223l650k686M382
$$ 1661 2688 -2109 -2410 2731 1838 -2702 -1197 3086 681 -3198 -56 3167 -483 -3169 1213
3843A213J745m659r73M800R5m671O83M590j375m472K282L985l284l077L652K496
$$ 1213 2958 -1701 -2674 2126 2221 -2450 -1767 2823 1448 -3024 -742 3243 -41 -3118 534 3030
3859C030m106j823M523J084m818j02M754p47m626J645M199k451l680L041L345
$$ 3030 -1076 -2899 1624 2708 -2110 -2212 2542 1795 -2831 -1186 3013 562 -3118 -77 3268
3874C268l832k619M321J720m537q31M717j99m581J020M458j858m204K617L677
$$ 3268 -564 -3183 1138 2858 -1679 -2510 2207 2008 -2573 -1553 2905 1047 -3157 -540 3137
3889C137l085l205L652K679m351j718M601R36m860n1M592p29m437J649L985k237
$$ 3137 52 -3153 499 3178 -1173 -2891 1710 2646 -2214 -2265 2327 1598 -2839 -1190 2795 558
3905E58l699L252L005l808k377M345J377m328q19M618q6m502R34M264j564m100
$$ 558 -3141 111 3116 -692 -3069 1276 2653 -1675 -2494 2124 2038 -2464 -1530 2734 1170 -2930
3921b930K535L614l220l125L776K401m290j557M569O07m522J04M697j105m485
$$ -2930 -395 3219 -1 -3126 650 3051 -1239 -2796 1773 2380 -2142 -2038 2659 1554 -2931
3936b931J858M184k851l253L073L056l891k371M370J367m396n95M507k52m594
$$ -2931 -1073 3111 260 -2993 80 3136 -755 -3126 1244 2611 -1785 -2380 2127 1875 -2719
3951b719J092M402j812l940K616L522l171k957L536K312m166j425M440N76m544
$$ -2719 -1627 2775 963 -2977 -361 3161 -10 -2967 569 2881 -1285 -2710 1730 2306 -2238
3966b238K93M522j313m121J821M120k706l522L322K716l638k106M071J540m446
$$ -2238 -1945 2577 1264 -2857 -1036 3084 378 -3144 178 2894 -744 -2850 1221 2761 -1685
3981a685n48M438l09m440J211M212k005l955K687L342l256k597L629K030m067
$$ -1685 -2233 2205 1896 -2544 -1333 2879 874 -3081 -394 2948 -308 -2905 724 2754 -1313
3996a313j216M223N27m482L44M505j351l807J756L695k355l471L247K614l728
$$ -1313 -2529 1694 2221 -2261 -1917 2588 1237 -2570 -814 2881 526 -2945 302 2916 -812
$$ [...]
8191b0
##END NTUPLES=NMR FID
##END=
