##TITLE=1H_MTPMA2509
 CDCl3, 8 sc, 
 28.9.2020
##JCAMPDX= 6.0         $$ Bruker NMR JCAMP-DX V2.0
##DATA TYPE= NMR FID
##DATA CLASS= NTUPLES
##ORIGIN= UXNMR, Bruker Analytische Messtechnik GmbH
##OWNER= root
$$ XWIN-NMR		Version 3.5
$$ Mon Sep 28 10:35:09 2020 Russian Standard Time (UT+4h)  she@DPX200
##.OBSERVE FREQUENCY= 200.1315066352
##.OBSERVE NUCLEUS= ^1H
##.DELAY= (6, 6)
##.ACQUISITION MODE= SIMULTANEOUS
##.ACQUISITION SCHEME= undefined
##.AVERAGES= 8
##.DIGITISER RES= 18
##SPECTROMETER/DATA SYSTEM= spect
##.PULSE SEQUENCE= zg30
##.SOLVENT NAME= CDCl3
##.SHIFT REFERENCE= (INTERNAL, CDCl3, 0, 15.7039)
##AUDIT TRAIL= $$ (NUMBER, WHEN, WHO, WHERE, WHAT)
$$ ##TITLE= Audit trail, XWIN-NMR		Version 3.5
$$ ##JCAMPDX= 5.01
$$ ##ORIGIN= Bruker BioSpin GmbH
$$ ##OWNER= she
$$ F:/spectra/data/she/nmr/H-F/1/audita.txt
$$ ##AUDIT TRAIL=  $$ (NUMBER, WHEN, WHO, WHERE, WHAT)
(   1,<2020-09-28 10:34:02.70 +0400>,<she>,<DPX200>,
      <created by zg, POWCHK disabled, PULCHK disabled
       configuration hash MD5:
       00 E9 B6 7A A2 85 ED C7 34 08 36 98 17 FE 4E 26
       data hash MD5: 16K
       5E 3D 06 E8 A2 87 60 8A 15 FE 63 7E 3F 10 FE 1A>)
$$ ##END=
$$ 
$$ hash MD5
$$ C5 E3 64 D6 25 40 E5 B0 E1 1D 1E 0E F1 BD 75 1A
##$RELAX= 
##$RELAX= 
##$RELAX= 
##$RELAX= 
##$RELAX= 
##$RELAX= 
$$ Bruker specific parameters
$$ --------------------------
##$DU= <F:/spectra>
##$EXPNO= 1
##$NAME= <H-F>
##$PROCNO= 1
##$TYPE= <nmr>
##$USER= <she>
##$AMP= (0..31)
100 100 100 100 100 100 100 100 100 100 100 100 100 100 100 100 100 100 
100 100 100 100 100 100 100 100 100 100 100 100 100 100 
##$AQSEQ= 0
##$AQ_mod= 1
##$AUNM= <au_zg>
##$AUTOPOS= <>
##$BF1= 200.13
##$BF2= 200.13
##$BF3= 200.13
##$BF4= 200.13
##$BF5= 200.13
##$BF6= 200.13
##$BF7= 200.13
##$BF8= 200.13
##$BYTORDA= 1
##$CFDGTYP= 0
##$CFRGTYP= 5
##$CHEMSTR= <none>
##$CNST= (0..31)
1 1 145 1 1 1 1 1 1 1 1 1 1 1 1 1 1 1 1 1 1 1 1 1 1 1 1 1 1 1 1 1 
##$CPDPRG= <>
##$CPDPRG1= <>
##$CPDPRG2= <>
##$CPDPRG3= <>
##$CPDPRG4= <mlev>
##$CPDPRG5= <mlev>
##$CPDPRG6= <mlev>
##$CPDPRG7= <mlev>
##$CPDPRG8= <mlev>
##$CPDPRGB= <>
##$CPDPRGT= <>
##$D= (0..31)
0 1.2 0 0 0 0 0 0 0 0.06 0 0.03 0 0 0 0 0.0002 0 0 0 0 0 0 0 0 0 0 0 0 
0 0 0 
##$DATE= 1601274842
##$DBL= (0..7)
120 120 120 120 120 120 120 120 
##$DBP= (0..7)
150 150 150 150 150 150 150 150 
##$DBP07= 0
##$DBPNAM0= <>
##$DBPNAM1= <>
##$DBPNAM2= <>
##$DBPNAM3= <>
##$DBPNAM4= <>
##$DBPNAM5= <>
##$DBPNAM6= <>
##$DBPNAM7= <>
##$DBPOAL= (0..7)
0.5 0.5 0.5 0.5 0.5 0.5 0.5 0.5 
##$DBPOFFS= (0..7)
0 0 0 0 0 0 0 0 
##$DE= 6
##$DECBNUC= <off>
##$DECIM= 32
##$DECNUC= <off>
##$DECSTAT= 4
##$DIGMOD= 1
##$DIGTYP= 9
##$DL= (0..7)
0 120 120 120 120 120 120 120 
##$DP= (0..7)
150 150 150 150 150 150 150 150 
##$DP07= 0
##$DPNAME0= <>
##$DPNAME1= <>
##$DPNAME2= <>
##$DPNAME3= <>
##$DPNAME4= <>
##$DPNAME5= <>
##$DPNAME6= <>
##$DPNAME7= <>
##$DPOAL= (0..7)
0.5 0.5 0.5 0.5 0.5 0.5 0.5 0.5 
##$DPOFFS= (0..7)
0 0 0 0 0 0 0 0 
##$DQDMODE= 0
##$DR= 18
##$DS= 0
##$DSLIST= <SSSSSSSSSSSSSSS>
$$ [...]
##$SUBNAM2= <"">
##$SUBNAM3= <"">
##$SUBNAM4= <"">
##$SUBNAM5= <"">
##$SUBNAM6= <"">
##$SUBNAM7= <"">
##$SUBNAM8= <"">
##$SUBNAM9= <"">
##$SW= 16.880792210976
##$SWIBOX= (0..15)
0 0 2 0 0 0 0 0 0 0 0 0 0 0 0 0 
##$SW_h= 3378.37837837838
##$TD= 16384
##$TD0= 1
##$TE= 0
##$TE2= 300
##$TE3= 300
##$TEG= 300
##$TL= (0..7)
0 120 120 120 120 120 120 120 
##$TP= (0..7)
150 150 150 150 150 150 150 150 
##$TP07= 0
##$TPNAME0= <>
##$TPNAME1= <>
##$TPNAME2= <>
##$TPNAME3= <>
##$TPNAME4= <>
##$TPNAME5= <>
##$TPNAME6= <>
##$TPNAME7= <>
##$TPOAL= (0..7)
0.5 0.5 0.5 0.5 0.5 0.5 0.5 0.5 
##$TPOFFS= (0..7)
0 0 0 0 0 0 0 0 
##$TUNHIN= 0
##$TUNHOUT= 0
##$TUNXOUT= 0
##$USERA1= <user>
##$USERA2= <user>
##$USERA3= <user>
##$USERA4= <user>
##$USERA5= <user>
##$V9= 5
##$VALIST= <valist>
##$VCLIST= <CCCCCCCCCCCCCCC>
##$VD= 0
##$VDLIST= <DDDDDDDDDDDDDDD>
##$VPLIST= <PPPPPPPPPPPPPPP>
##$VTLIST= <TTTTTTTTTTTTTTT>
##$WBST= 1024
##$WBSW= 4
##$XGAIN= (0..3)
0 0 0 0 
##$XL= 0
##$YL= 0
##$YMAX_a= 827418
##$YMIN_a= -717965
##$ZGOPTNS= <>
##$ZL1= 120
##$ZL2= 120
##$ZL3= 120
##$ZL4= 120
##$ABSF1= 10
##$ABSF2= 0
##$ABSG= 5
##$ABSL= 3
##$ALPHA= 0
##$AQORDER= 0
##$ASSFAC= 0
##$ASSFACI= 0
##$ASSFACX= 0
##$ASSWID= 0
##$AUNMP= <proc_1d>
##$AZFE= 0.1
##$AZFW= 0.1
##$BCFW= 1
##$BC_mod= 2
##$BYTORDP= 1
##$COROFFS= 0
##$CY= 11.3945322036743
##$DATMOD= 1
##$DC= 2
##$DFILT= <>
##$DTYPP= 0
##$F1P= 16.9975609425685
##$F2P= -3.02152046262296
##$FCOR= 0.5
##$FTSIZE= 0
##$FT_mod= 4
##$GAMMA= 1
##$GB= 0.15
##$INTBC= 1
##$INTSCL= 1
##$ISEN= 128
##$LB= 0.24
##$LEV0= 0
##$LPBIN= 0
##$MAXI= 10000
##$MC2= 0
##$MEAN= 0
##$ME_mod= 0
##$MI= 1.114404
##$NCOEF= 0
##$NC_proc= 0
##$NLEV= 6
##$NOISF1= 3.799351
##$NOISF2= 2.8
##$NSP= 1
##$NTH_PI= 0
##$NZP= 0
##$OFFSET= 15.70392
##$PC= 1
##$PHC0= -9976.645
##$PHC1= 23.2009
##$PH_mod= 1
##$PKNL= yes
##$PPARMOD= 0
##$PSCAL= 0
##$PSIGN= 0
##$REVERSE= no
##$SF= 200.130013532006
##$SI= 16384
##$SIGF1= 3
##$SIGF2= 2
##$SINO= 400
##$SIOLD= 16384
##$SREGLST= <1H.CDCl3>
##$SSB= 0
##$STSI= 0
##$STSR= 0
##$SW_p= 3612.71676300578
##$SYMM= 0
##$S_DEV= 0
##$TDeff= 0
##$TDoff= 0
##$TI= <>
##$TILT= no
##$TM1= 0
##$TM2= 0
##$TOPLEV= 0
##$USERP1= <user>
##$USERP2= <user>
##$USERP3= <user>
##$USERP4= <user>
##$USERP5= <user>
##$WDW= 1
##$XDIM= 8192
##$YMAX_p= 0
##$YMIN_p= 0
$$ End of Bruker specific parameters
$$ ---------------------------------
##NTUPLES= NMR FID
##VAR_NAME=  TIME,          FID/REAL,        FID/IMAG
##SYMBOL=    X,             R,               I
##VAR_TYPE=  INDEPENDENT,   DEPENDENT,       DEPENDENT
##VAR_FORM=  AFFN,          ASDF,            ASDF
##VAR_DIM=   8192,          8192,            8192
##UNITS=     SECONDS,       ARBITRARY UNITS, ARBITRARY UNITS
##FACTOR=    0.000296,      1,               1
##FIRST=     0,             0,               0
##LAST=      2.424536,      0,               0
##MIN=       0,             -717965,         0
##MAX=       2.424536,      827418,          0
$$ Real data points
##PAGE= N=1
##DATA TABLE= (X++(R..R)), XYDATA
$$ [...]
2394g65M795m104L67J409j906J171N43k70j205n19K275q40k216K833j884j303
2410a619L991k277l179M764j404k372M340l740j515N632l609j415L772m015J662
2425i84K797m952J962R76j799K708k358l66K291k401K767r91l468N686k901j255
2441b288N363o312J698N441p286L303K307o130O108k70m809M941k027k88L352
2456C103m409K074M80j735L880m024q0M412n170L030J454o146O072j24n193N613
2472C237k764k065N795m334p47L417l270J379R43k890J734k60K4K37j745J559
2488B50m6j802L203k473j677M206k342j615L593k978o68M012l075j428L653k014
2504a201o98K660k487l64K687j559j40J70j91J409q77L15J93j582K458j28k982
$$ plain form
2394 -765 4030 -74 293 1702 -204 967 1510 1240 35 -484 1791 951 -1265 1568 -316 -1619
2410 -1619 2372 95 -3084 1680 276 -2096 2244 -1496 -3011 2621 -988 -2403 1369 -2646 -984
2425 -984 1813 -3139 -1177 -201 -2000 708 -1650 -2016 275 -2126 641 -350 -3818 1868 -1033 -2288
2441 -2288 3075 -3237 -1539 3902 -3384 -81 2226 -3904 2204 1934 -2875 2066 39 -249 3103
2456 3103 -1306 768 1248 -487 3393 -631 -711 3701 -1469 1561 3015 -3131 2941 2817 -2376 3237
2472 3237 473 -1592 4203 -131 -878 2539 -731 648 1591 -1299 435 175 199 436 -1309 250
2488 250 204 -1598 1605 -868 -2545 1661 -681 -2296 1297 -1681 -2349 1663 -1412 -2840 813 -1201
2504 -1201 -1899 761 -1726 -2090 597 -962 -1102 -932 -1123 286 -591 -276 -83 -1665 793 665 -2317
2521b317L812j471j845M846l806p75N020n243J703L454n475L465J037m078M391
2536B718j675k134M156k855L89J645l306L174o71k528M196l826K58M512o219K669
2552E03K804o409M688O56n927O370j521l899N287l524r20M289m167P67J731k839
2568b111K486p95j853L220k722P48J930l639K758Q74m674M686q66l651N309k414
2584g14k643N717l983j019N595m583J14L496l959K109J322k802K103n44o82K029
2600A556k726J745J368l971M017k06m021N803k546l244O160l842j305N143n154
2615a223R34M119n548K759J386m070L912j455k114M035l123J69K402l937K771
2630A017L99l547M021k004k061N018m762K76M780o321K777K849o349M607N18n410
$$ plain form
2521 -2317 1495 24 -1821 3025 -781 -1556 3464 -1779 -76 3378 -2097 1368 2405 -1673 2718
2536 2718 1043 -1091 3065 210 599 2244 -1062 2112 1441 -1087 3109 -717 -459 4053 -2166 503
2552 503 3307 -3102 1586 2242 -3685 2685 1164 -2735 2552 -972 -1892 2397 -1770 -1003 728 -2111
2568 -2111 375 -420 -2273 947 -1775 -1027 903 -2736 22 896 -3778 908 42 -3609 1700 -714
2584 -714 -3357 2360 -1623 -2642 2953 -1630 -1516 1980 -1979 130 1452 -1350 753 209 -473 1556
2600 1556 -1170 575 1943 -2028 1989 1783 -2238 3565 1019 -2225 3935 93 -1212 3931 -1223
2615 -1223 -289 3830 -1718 1041 2427 -1643 2269 814 -1300 2735 -388 -219 2183 -1754 1017
2630 1017 1416 -2131 1890 -114 -2175 2843 -1919 -1643 3137 -3184 -407 2442 -3907 700 1218 -4192
2646d192N759j478l271M756k919q83L755l651J228J438k868L026j466j296L801
2661A739l505M97L327m911L114J787n153M540j96m341N767k144k860N507l510
2676c42j205M653l939Q30K543l477K304L40k441K931k014n2K300l315K119J060
2692B295m148M224n22m310N798k740k701N796l733j601M685m130K28L181m164
2707a842K007P44k786L028j617r27K461k998J470J595m032L391l94l139M548k734
2723a225j677M827m167K63M086n137K402K165m995M178o8l683M029j321j518L206
2739A365k540P68J498k344J890l32j309K501j961K1K893l573J303K355l766K397
2755A166J268m056L179K72k917K896n55j906K584j254o64J577j362K37N55j230
$$ plain form
2646 -4192 1567 89 -3182 1574 -1345 -2228 1527 -2124 -896 542 -2326 700 -766 -2062 1739
2661 1739 -1766 -1269 2058 -2853 261 2048 -3105 1435 1239 -3102 2665 521 -2339 3168 -342
2676 -342 -1547 3106 -833 -3 2540 -937 1367 1707 -734 2197 183 131 2431 -884 1235 2295
2692 2295 -1853 2371 1849 -2461 3337 597 -2104 3692 -41 -1642 3043 -1087 -859 2322 -1842
2707 -1842 165 909 -1877 1151 -466 -1393 1068 -1930 -460 1135 -2897 494 100 -3039 1509 -1225
2723 -1225 -2902 1925 -2242 -1979 2107 -3030 -628 1537 -3458 720 652 -3031 998 -323 -1841 1365
2739 1365 -1175 -407 1091 -1253 637 305 -1004 1497 -464 -443 2450 -1123 180 2535 -1231 1166
2755 1166 2434 -1622 1557 1829 -1088 1808 1253 -653 1931 677 13 1590 228 465 1020 -210
2771b10J111m47q45J732j916N52J449k591J645R85l587L005j9l471M087j505k675
2788b700M328k373j289L353k990Q24J500k565J405O4j117K065k123Q70J420l165
2804b493K942k92l273M325j300k138M029l239N8L474l786J511J520k789K776o92
2820F33j966K644j085l41J644j929J379r0j378K196j841K8K362k408R74R31k827
2837a074K285O32l283K749m01j585K208o88j541J507j93m55L28k97l61K67K74
2854C72o85l53N12M69j063O95j6j212J200P88k203R72O90k181K285l01k775L111
2872C05m83j784K760k152k20K426j924K68P65j658K040n64q50J890k409J864J138
2889A412l697K947J59k892M594l039j303M904l566P0K902m331K481J581l264K626
$$ plain form
2771 -210 901 454 -391 1341 -575 -23 1426 -1165 480 1465 -2122 883 864 -2607 1480 -25 -2700
2788 -2700 1628 -745 -2034 1319 -1671 -847 653 -1912 -507 -443 -1560 505 -1618 -748 672 -2493
2804 -2493 449 157 -3116 1209 -91 -2229 1800 -1439 -1381 2093 -1693 -182 1338 -1451 1325 633
2820 633 -1333 1311 226 -115 1529 -400 979 889 -489 1707 -134 -106 2256 -152 822 1753 -1074
2837 -1074 1211 1843 -1440 1309 908 -677 1531 843 -698 809 616 161 489 192 -169 98 372
2854 372 -313 -666 -154 315 -748 -53 -69 -1281 -81 707 -1496 -524 166 -2015 270 -31 -2806 305
2872 305 -178 -1962 798 -1354 -1574 852 -1072 -804 -39 -1697 343 -221 -1071 819 -1590 274 1412
2889 1412 -2285 662 821 -2071 2523 -516 -1819 3085 -481 -411 2491 -1840 641 2222 -1042 1584
2905A584j183j144L233k960P70J473k656K738p67k615L863k416m89L100l904J313
2921f0K529l954K735p3l417L817r43k068K740k049l21K213j710n20J058o01L02
2938c22Q2j007Q84n08N78M02j730R99J165k274J304P84k574K460N55l014K499
2955B83K63k535L127j195k168L203j334n62K328k432J201O81j747K207j289r26
2971h95L010k607P37J932m103L269P19m239M553j455k650M944l451r96M107l650
2987g75J158J944l843K735K54k334K455k116J50K408l198J469Q92l052L485j269
3003C63k457L907k563o72L495l714O57K719m007J950J133l328K722k47k070K636
3019E24j304q79K279j699K70J007j614J314L3j505J973j210j08K131k694O83K488
$$ plain form
2905 1584 401 -743 2490 -470 300 1773 -883 1855 1088 -1527 2336 -80 -569 2531 -1373 -60
2921 -60 2469 -1485 1250 1177 -2240 1577 634 -1434 1306 -743 -1064 1149 -561 -1081 -23 -624 -322
2938 -322 -240 -1247 -363 -871 -293 109 -1621 -622 543 -1731 -427 357 -2217 243 798 -2216 283
2955 283 546 -1989 1138 -57 -2225 978 -356 -918 1410 -1022 179 860 -887 1320 31 -895
2971 -895 2115 -492 245 2177 -1926 1343 2062 -2177 2376 921 -1729 3215 -236 -1232 2875 -775
2987 -775 383 2327 -1516 1219 1473 -861 1594 -522 -372 2036 -1162 307 1199 -1853 1632 363
3003 363 -2094 1813 -750 -1422 2073 -1641 -984 1735 -2272 -322 811 -2517 205 -42 -2112 524
3019 524 -780 -1659 620 -1079 -809 198 -1416 -102 -69 -1574 399 -811 -919 1212 -1482 -799 1689
3036A689l378J487J739l661L078O12l606L339m07k028L034j624j082K521k035
3051c22N34J014j730K129j051r86K631k681L53K708l679J983J339l871L115L5
3067A521l395L979j577k220L847k416q42K919k965R53J061k338J946m41j142J713
3083F03j644M49J307k716J921L78k822K924o74k094L789k354j249L725k797j3
3099a267K442l017J249J214k413J672L83j671J868o97o75J409j082M51O64j401
3115h71J982p92j199K488j796j52J980k002L05K149k913J496J227k880K130J13
3131A265k149K230m59j362J723q50k22Q73r94O47n31n03J893j918J33J717k593
3148a100R54J620l279J989R37k985K324l3k025J835m35j364J978j161j03P32j021
$$ plain form
3036 1689 -1689 -202 1537 -2124 954 1566 -2040 1299 892 -1136 1898 274 -808 1713 -322
3051 -322 212 1226 -504 1625 574 -412 2219 -462 -109 2599 -1080 903 2242 -1629 1486 1521
3067 1521 -1874 2105 528 -1692 2155 -261 -1103 1816 -1149 -196 865 -1473 473 32 -1110 603
3083 603 -1041 -592 715 -2001 -80 298 -2524 400 -274 -2368 1421 -933 -2182 1543 -1254 -1267
3099 -1267 1175 -1842 -593 621 -1792 -120 263 -1408 460 -237 -912 497 -585 -134 530 -871
3115 -871 1111 319 -880 1608 -188 -340 1640 -362 -57 2092 -821 675 1902 -978 1152 1265
3131 1265 -884 1346 887 -475 1248 398 176 1049 55 702 171 -332 1561 -357 -224 1493 -1100
3148 -1100 -146 1474 -1805 184 1121 -1864 460 427 -1598 237 -198 -1562 416 -745 -848 -116 -1137
3165a137J150n60n50J181j095K41J088j710J258L22j819J864k4j915K722j465
3181d49j062K685j818k38K056j870O73J006j653R65M88r37R97n72J69J50p52J037
3199H75j32q81J536q62m96J324j220Q0J398k027R21J169k166R00P74j835J267
3216F25K77j439J286o01q10J227p36Q4O2l03P23p31k18J158j585L01J775k862
3234a767J382J463l050J886M98k578K205J77k075J971m07r42J579j071K14J80
3250c35o62J354j141j7J613k044J259J093k835K236N05k535K801q26j591L030
3266A905j910r31K469k016O55J425k118J115J27p69J007q18L81O66j281J230m67
3283F70j195J882q95o70J684j578k47K238k285J13J526j639L75J159k247Q72Q96
$$ plain form
3165 -1137 13 -547 -1097 84 -1011 -770 318 -1392 -134 188 -1631 233 209 -1706 1016 -449
3181 -449 -1511 1174 -644 -882 1174 -696 -23 983 -670 295 783 -154 843 271 440 590 -162 875
3199 875 743 -138 1398 536 40 1364 144 224 1622 -405 516 1685 -481 419 1193 -642 625
3216 625 902 -537 749 148 -662 565 -171 -87 -25 -328 395 -336 -554 604 -981 -680 1095 -1767
3234 -1767 -385 1078 -1972 -86 412 -2166 39 216 -1859 112 -295 -1237 342 -729 -515 -335
3250 -335 -997 357 -784 -801 812 -1232 27 1120 -1715 521 1026 -1509 1292 466 -1125 1905
3266 1905 -5 -936 1533 -483 172 1597 -521 594 721 -48 959 141 522 1188 -93 1137 670
3283 670 -525 1357 462 -208 1476 -102 -349 1889 -396 -283 1243 -396 -21 1138 -1109 -237 659
3300F59j346R93l4j313R92o4n67Q36j068L65Q03j340J144p83n28J950j511n50
3318a362K220k457P24K245l425J709J390l139K654p5k476K781n61j229J918j941
3334a024R96J179k422K492j613m70L032l121N40K629l782K545J213m558L854J66
3350A656l304L916j587j580K883k062P8J460k390J905K30j802J652j149jJ669
3366A574k423J098Q34k328K225m44k077K235n68j271K146j705n96K461k005k61
3382a105K033k158O56J076j843L53J145j217R19n3r19J297p40N4O82j663J334
3399a49O41j828K143q85j605L154j812j231L240k778O30K293l310J550J560k959
3415a346K623n98j750K585j453N2J163j993J731L51k333K995j955p64L315l371
$$ plain form
3300 659 -687 306 272 -1041 -49 -113 -680 156 -912 -547 256 -1084 60 -723 -1251 699 -812 -1362
3318 -1362 858 -1599 -875 1370 -2055 -346 1044 -2095 559 484 -1992 789 228 -1001 917 -1024
3334 -1024 -28 1151 -1271 1221 -392 -862 2170 -951 -411 2218 -1564 981 2194 -2364 1490 1656
3350 1656 -1648 2268 681 -899 1984 -78 0 1460 -930 975 1205 -597 1055 -94 -95 1574
3366 1574 -849 249 1083 -1245 980 536 -1541 694 126 -1145 1001 -704 -1300 1161 -844 -1105
3382 -1105 928 -1230 -574 502 -1341 -988 157 -1060 -141 -194 -1113 184 -556 -502 180 -1483 -149
3399 -149 492 -1336 807 -78 -1683 1471 -341 -1572 1668 -1110 -480 1813 -1497 53 1613 -1346
3415 -1346 1277 679 -1071 1514 61 113 1276 -717 1014 1365 -968 2027 72 -692 2623 -748
3431g48P10K515l644J848J526m357L228K49k716K790j048j028J661j321L76N18
3447E59j264J262o77q57J630j702N22J494k193P07J089k152J592K20k035K028
3463B23k06j450J723p83r70K269j478m38J668j215QJ155j610Q92L30p48R27m43
3481a46l7P14j141Q69M67j566J604Kk020K876j270j223K688j864l48K299k441
3498e37P35J615k321Q69M91r12P74l70k86J051j371Q05J51j484K122j198q47K333
3516A620j931k63K239k369K81J555k251R87R63j905J127L79j780J549l83m76M88
3533a70o64O21m70j29J148j190K01J339j766M46J296k047R90Q39j788J339M27
3550D22j533J310j12q85J229m71k76J004q79K65M91p19P73m87l71J045p78J84
$$ plain form
3431 -748 -38 2477 -1167 681 2207 -2150 1078 1327 -1389 1401 353 -675 986 -335 41 559
3447 559 -705 557 -120 -977 653 -1049 -527 967 -1226 -519 570 -1582 10 230 -1805 223
3463 223 17 -1433 290 -493 -1463 806 -672 -1110 558 -657 -649 506 -1104 -212 118 -630 297 -146
3481 -146 -183 531 -610 259 726 -840 764 766 -1254 1622 352 -871 1817 -47 -395 1904 -537
3498 -537 198 1813 -508 361 852 -60 714 344 58 1109 -262 543 694 -790 1332 134 -713 1620
3516 1620 -311 -574 1665 -704 -423 1132 -1119 -132 831 -1074 53 432 -1348 201 -182 -658 -170
3533 -170 -834 -213 -683 -812 336 -854 -653 686 -1080 -634 662 -1385 -395 444 -1344 -5 422
3550 422 -1111 199 87 -798 431 -40 -316 688 -191 74 565 -154 619 132 -239 806 28 212
3568B12P03j140O66N19j258J294m64r69J722p64q45J811j403j19J339j230rP24
3586G89r14N48N7l37K97r39Q09r1j016J256k69j003J720j218n05J658j495k94
3604i47J661j568P5J451j689O69K79r42R25J12p06M21k16K08Q8o19J225q14l48
3623g35J295j393J22J534j688M36J483k111J108J055k089J390K40j463J599l22
3639D61p57J104o21n0N64p57P22j69l74J161j348J06J253j582M40R12j695J078
3657D48L68j676J862n61j335K111j167n56J615j556k4J305j471M42N41q57R28
3674D17o01m25P92j098P75N52j561J075J50j402J964q09j750L208k056p84K541
3691I88k016J29J697k023Q88Q19j424R75j60o47J087p54M28L82j249J503m13j123
$$ plain form
3568 212 915 -225 441 960 -298 996 532 -437 1285 521 -324 1487 84 -35 1304 74 65 789
3586 789 -125 423 480 143 440 -499 310 219 -797 459 190 -813 907 -311 -816 842 -653 -947
3604 -947 714 -854 -779 672 -1017 -348 -69 -1011 -86 26 -680 -259 -475 -267 -179 -798 427 -387 -735
3623 -735 560 -833 -711 823 -865 -429 1054 -1057 51 1106 -983 407 647 -816 783 461
3639 461 -296 808 187 137 701 -56 666 497 123 1284 -64 42 1295 -287 153 1065 -630 448
3657 448 816 -860 1002 441 -894 1217 50 -506 1109 -447 -471 834 -637 -195 346 -511 417
3674 417 -184 -609 183 -915 -140 412 -1149 -74 76 -1326 638 -171 -1921 1287 -769 -1553 988
3691 988 -1028 -899 798 -1225 -337 482 -942 33 -127 -774 313 -441 -13 369 -880 623 210 -913
3709i13K225j441l82K410k516L65K020k643J157J147k251J282M72j499J557m65
3725E25r73J275o53jN62q72P16l28m67J177j010l60J743j634r9J542k082Q59J459
3744A379k424J030P59k207J866k6j638J738o35r79J717j170j30J090j620J245
3760em7j105J524n48o35J487j894R70J395k557J616K33j877K522q78k047L097
3777A251j752l75K307k169J60J766j764J222m24r32J620q20l0Q93j727J409M62
3794A097k306K590r47j302K892k010p83K345j898J69J382j950R45P10j111N96
3810D19j31m21N45k65j7k71m22O93q2n34P16l34o21J364j048m70J358r27k53J273
3830E72j603K91J375j614O26Q73j546J003K59j090Q84k04o74J404r92K14N24j150
$$ plain form
3709 -913 1312 -129 -511 1899 -617 -252 1768 -875 282 1429 -822 460 932 -567 990 525
3725 525 -448 827 174 173 735 -137 579 251 -216 961 -49 -409 1334 -300 -399 1143 -939 -80 1379
3744 1379 -1045 -15 744 -1463 403 377 -1261 477 -158 -1137 580 -590 -720 370 -1250 -5
3760 -5 -52 -1157 367 -181 -816 671 -1223 -253 1142 -1415 201 434 -1443 1079 201 -1846 1251
3777 1251 -501 -876 1431 -738 -578 1188 -576 646 222 -710 910 90 60 953 -774 635 1097
3794 1097 -1209 1381 434 -868 2024 14 -769 1576 -322 -153 1229 -721 224 934 -177 419
3810 419 288 -133 412 147 130 -141 -563 130 48 -486 230 -104 -725 639 -409 -879 479 -448 -701 572
3830 572 -1031 -740 635 -979 -353 520 -1026 -23 236 -854 30 -174 -848 556 -436 -222 302 -848
3848h48J235k41j129J893j053l99J643j854M56J745k412J491K88k014K638p66
3864F73j470K195j299J6J372k087P24P07q91J029j038J64R75j495R93K63j520
3881f89J767l59j669K196j136o62J606j345m34J498r91jQ49j107K99J09m0N4l34
3900c89K9K55m44O69m12m34J070o25l60N61l39k41Q30p68m03J214l67l50Q45p21
3920c80k53Q23m93J17O15r60P36l7m80M75j63K43Q9n99Q73m74o83J605j016n6
3940a8J202j295J25J105j733J229J95j323J277k83q02J049o13k29Q33q99M92J98
3958E10p65R70q55K46M69j041P71K16j289J213j79j431J682n16r48J342r54k06
3976g65J202j122K93M97q25K44L90k32J68m23N51K25q79J072j97j341J581m65
$$ plain form
3848 -848 387 146 -983 910 -143 -542 1101 -753 -297 1448 -964 527 815 -1199 1439 673
3864 673 -797 1398 99 115 1487 -600 124 831 -60 969 -69 95 1070 -425 568 831 -689
3881 -689 1078 719 -950 1246 110 -552 1054 -291 -725 773 -218 -219 630 -477 -178 -69 -109 -55 -389
3900 -389 -360 -105 -549 120 -292 -726 344 -281 -641 -80 -419 -660 170 -598 -1001 213 -154 -504 341 -380
3920 -380 -633 190 -303 -186 429 -531 205 168 -312 163 0 243 332 -267 606 132 -551 1054 38 -18
3940 -18 1184 -111 14 1119 -614 615 810 -513 764 481 -321 728 115 -114 719 -180 312 510
3958 510 -255 715 -140 106 575 -466 305 521 -768 445 266 -1165 517 1 -947 395 -559 -765
3976 -765 437 -685 -392 105 -720 -476 -86 -318 -150 -573 -22 203 -676 396 199 -1142 439 -26
3994b6m15R81o67o82J326p59r6R64r77L40O17o89J97L77o70N54l55L27K5m72N82
4015D82K25q66Q81n22n22J312r46l07J200j037J58J137j599L86R40j554J139j39
4033C68q57R58k42o04N26l88j1K19l42M07l5o59J109j003j02J429k001J102N45
4052D19j496J068K26j364J223J55j335J567o80m39J019r69l1Q07o14K65K86n12
4070d05N21m02K4Q36j226P83L02j306J378q2j312J953p47j015J784r15n23J249
4088H97p63k23J106j283O34K94o34N72m74j27R93j114L92O19j499J062J04j204
4106f48J526o98q46J351j049O0J168j498J58J209j286N95L91j174P69o5q37J113
4124B39r81M59M93q99P21m8q20J253o60p82J534j171k94J557j418O14Q60j893
$$ plain form
3994 -26 -441 540 -127 -809 517 -242 -338 626 -351 -11 606 -83 114 491 -179 375 20 347 372 -100 482
4015 482 707 -159 722 200 -322 990 44 -263 937 -100 58 1195 -404 -18 922 -632 507 368
4033 368 -489 469 227 -377 149 -239 -250 -31 -373 34 -1 -660 449 -554 -656 773 -1228 -126 419
4052 419 -1077 -9 217 -1147 76 231 -1104 463 -217 -656 363 -606 -637 170 -444 -179 107 -405
4070 -405 116 -286 -262 574 -652 131 433 -873 505 423 -889 1064 317 -698 1086 171 -352 897
4088 897 134 -89 1017 -266 368 662 28 600 126 -1 992 -122 270 889 -610 452 556 -648
4106 -648 878 180 -666 685 -364 -304 864 -634 -476 733 -553 42 433 -741 28 -37 -874 239
4124 239 -742 -283 210 -689 32 -16 -836 417 -243 -1025 509 -662 -956 601 -817 -203 657 -1236
4142a236J368O33j746J277l7j010J260q40q4J209r17L91j21m45N95l47k87R29
4160E92o39K45O54j580J044M57j383J334K93j551J413l89j108J365m78p84J217
4177G02p11Q3N36o56P4L39o03N73m49p8L64m78M20L60j105P38K56j401J368o4
4197B68j168J332m35q14J229j028j63J162r04K65L50p40O63m1m98P24o20j23J076
4216E35j248P66M38j414J499n11p73J478r78j61J145r81K79O53j346R12Q7q14
4234d34P86l2l84P59p18jO56p16M02j08l57P87n82j9N58q05K89O46j089N65M81
4255F84j086O31J12n99N95j29o59N19n7l97L85m5l48K58j34J21j5j40K80l60J28
4276b56O33r92J55O31o22K42M22r93P90J49q69R21m46j15P13n63r8M44m81N41
$$ plain form
4142 -1236 132 765 -981 296 259 -751 509 -331 -415 794 -123 268 147 -298 297 -50 -337 592
4160 592 -47 198 852 -728 316 773 -610 724 1017 -534 879 490 -618 747 269 -515 702
4177 702 -9 74 610 -46 28 367 -236 337 -112 -190 174 -304 116 476 -629 109 365 -1036 332 268
4197 268 -900 432 -3 -817 412 -616 -779 383 -521 -256 94 -646 17 -24 -522 202 -418 -541 535
4216 535 -713 53 491 -923 576 65 -708 770 -208 -369 776 -205 74 727 -619 293 380 -434
4234 -434 352 320 -64 695 -23 -24 632 -84 318 210 -147 640 58 39 597 -208 81 727 -362 203 684
4255 684 -402 229 341 -258 337 208 -451 68 11 -386 -1 -46 -394 -136 -270 -149 -164 -304 -24 -384 -256
4276 -256 377 -615 -460 171 -451 -209 213 -780 10 159 -710 211 -235 -350 363 -200 -298 146 -335 206
4296B06J2p93J046o47J05Q91j285N29N21r81J085k66p71J146q75R3J050j594N65
4315C7O90j088O78Q9q06Q84k83k63N34o23Q40l86l82O50o62J37P60j101J66Q11
4335F82r51J85M15r13N14K59o37L04q9l8N50m14l6k85K64l0k21J55L16o03L27
4356b46J54l32P3L03l70L41K58p47M15M09n49J38N49r60R31qo75P96k48m59N43
4377C16m96L19J66m05L47k33J90O06r27L17M50r30N58K85j209J217n58m79J262
4396G96q88k21J142j170K73O74r45P81l05o73R23m55m22J231j173M25K87q09R40
4415D11l72p83J035m94j07P91r49L96M39j045M28M52r09Q72j35m85N28l89L08
4434hRn6L2J66n23O16m23o9P62o05q0Q06r32J26Q75j062L57M32j039P63K45o92
$$ plain form
4296 206 218 -575 471 -176 -71 820 -465 64 585 -396 689 423 -348 798 -77 16 1066 -528 37
4315 37 727 -361 317 406 -400 484 201 -62 472 -151 689 303 -79 571 -91 46 806 -295 -129 682
4335 682 -269 -84 331 -582 -68 191 -446 -142 -231 -269 281 -133 -169 -454 -190 -220 -441 -286 30 -573 -246
4356 -246 -92 -424 -351 -48 -418 -77 181 -566 -151 258 -291 -153 396 -564 367 359 -316 480 232 -227 316
4377 316 -180 139 305 -100 247 14 204 810 -117 200 650 -280 278 563 -646 571 13 -466 796
4396 796 -92 -313 829 -341 -68 606 -339 442 137 -536 387 -68 -490 741 -432 -7 280 -529 411
4415 411 39 -744 291 -203 -310 481 -468 -72 367 -678 -250 202 -707 165 30 -455 73 -316 -8
4434 -8 1 -55 -23 143 -380 236 -187 -256 506 -99 -179 627 -305 -179 696 -366 -9 423 -616 147 392 -300
4456c00P64k55m28O59j51l63O00o24L75Q4o91R64n22j81N70n35O9N25o86M46L06
4477F26j009Q43n4q45O73j51m69R19n82n51J010q93K97M6k41O73m43m29Q07m80
4497b53n1N29p69N19R0q98Q97J71j147J127k86k12O34j048K24Q86r41M02O02j212
4517g36Q91Q0n62Q36o54m9N25m61K44J70n04N20j62k31R47q13j62P60p20n1J035
4538I03j227N40O30q88K97l4l48L36j30j93L09l83k47Q61n69M31j73m46Q38p64
4558b57PO13o01M5O85r85N72N92j068K98P9m88Q18n78j31N41n15n0Q11o39K09
4579d2j61k14P19l36l73N42m68L24L24p36L10K97o17O90l40k53P75m86J29M40
4599E24o93J64N40q48P60J37j038O80J06m43O27k53j02J01l52K75Mn1R5j19M5
$$ plain form
4456 -300 464 209 -219 440 289 -74 526 -98 277 361 -330 634 112 -69 501 -34 35 560 -126 320 626
4477 626 -383 460 406 -439 234 83 -386 533 -49 -600 410 -483 -186 -140 -381 292 -151 -580 227 -253
4497 -253 -304 225 -544 -25 65 -833 64 235 -912 215 -71 -283 351 -697 -473 413 -528 -126 476 -736
4517 -736 155 235 -327 509 -145 -194 331 -130 114 284 -220 300 138 -93 854 41 -121 639 -81 -132 903
4538 903 -324 216 846 -42 255 221 -127 209 79 -114 195 -188 -435 426 -143 288 115 -331 507 -257
4558 -257 -250 363 -238 -193 492 -493 79 671 -397 -99 -20 -508 310 -268 -399 142 -373 -423 388 -251 -42
4579 -42 -203 -417 302 -34 -407 135 -333 -9 315 -421 -111 186 -431 259 -81 -334 441 -45 84 524
4599 524 -169 -5 535 -313 447 584 -454 226 332 -111 516 263 161 262 -90 185 189 138 233 114 159
4620A59L16n99N4O34o86J83M71q09M63l9m32M67J3m89L08j63j42M14k67J39P0
4641F5k09K13K1l90L91k95l30R00p32K14L10n99K97M16r03O48J42k90M75n53K42
4662C3L25l96j43K51n60Q00l39p2M56o63L03M51n42K46j21k96P54j71l80M94m24
4683FL1L99m27k0K92k14L38k78k19N06m02j68L24ol4j86KQ4J30l02K91k60j01
4706b14M97n26K4N34m12J85j38q8K06r8k77P2L16l33K51m9l17K33r7J71o1j20
4728b41R4n2n3M09l31p8M35k71q0L28p59O33L75p54M46J49o57O01l01K91q5l38
4750b39M46J16o23Q72n64KN16p69L59K91o48O09J61o52N16l75k31N56j29j42L46
4771D18n79L13k09j23K90j04n8L47n08K50K36p40Q41l68l50N01l66O6K95j89k21
$$ plain form
4620 159 475 -124 -70 564 -122 61 532 -277 186 147 -285 182 195 -294 14 -149 -291 123 -144 -5 65
4641 65 -144 69 90 -300 91 -204 -534 366 -366 -152 158 -441 -144 272 -631 17 159 -131 344 -209 33
4662 33 358 -38 -181 70 -490 310 -29 -101 355 -308 -5 446 -96 150 29 -267 487 316 -64 430 6
4683 6 37 436 9 -11 281 67 405 127 -92 414 12 -156 168 162 128 -58 -56 28 158 -144 147 -113 -214
4706 -214 283 -243 -219 315 -97 88 -50 -138 68 -30 -307 -235 81 -252 -1 -50 -367 -134 -231 -60 -121 -241
4728 -241 -147 -199 -252 157 -174 -252 183 -88 -168 160 -599 34 409 -345 101 250 -407 194 -107 184 99 -239
4750 -239 207 323 -300 572 8 10 526 -243 116 407 -241 368 529 -123 393 18 -213 343 214 72 418
4771 418 -161 152 -57 -180 110 6 -52 295 -213 37 273 -467 374 6 -344 157 -209 -143 152 -37 -258
4792b58N4k9J00J77n59M04k5K4J15J52l57K01k8k52K70j47o7R5J16j51K53j46
4814e8L77m25j3N94n18q0M76o20J53O76j054N80L83p18L97P2m03P12n17k49Q88
4835F53p46L64Q2n97N54l76j71Q33o41l7N38l92J07J85n83M44o6m85O20m22L4
4856a02M80o32R3O6k53O12n5l44L40m74J14J54l46K17L35l73L71k28p48Q19l54
4877c08l12O57j83j41M02j72j36M49m86J35M93m18k0K26j70K80j41k33K24l29
4897a83L30O0n27P02k0m37N03k72j43J35j51j30M79n57J60M64o37L20O0l38M63
4918B81m38O1N65n99L13J87p96M79n2k88O97n13j65M41m49R5J56m98M19M85r64
4939e83M61K76m73M99m87L32L4k37j36L87j82M7L4k25N68j96k38M12m48M4L27
$$ plain form
4792 -258 -204 -233 -133 44 -515 -111 -136 -112 3 155 -202 -1 -29 -281 -11 -158 -225 -130 -14 -165 88 -58
4814 -58 319 -106 -119 475 -43 -123 353 -267 -114 562 -492 88 471 -247 150 222 -181 531 14 -235 653
4835 653 -93 271 353 -244 310 -66 -237 596 -45 -82 456 64 171 356 -227 217 151 -334 286 -136 -102
4856 -102 378 -254 -161 -95 -348 264 209 -135 205 -269 -155 -1 -347 -130 205 -168 203 -25 -773 46 -308
4877 -308 -620 37 -146 -287 115 -57 -193 256 -230 -95 398 -20 -40 186 16 296 155 -78 146 -183
4897 -183 147 207 -320 382 362 -75 428 156 13 148 -3 -133 346 -211 -51 413 -224 96 156 -182 281
4918 281 -157 -96 469 -130 183 370 -426 53 1 -287 410 -103 -268 173 -276 -181 -25 -523 -104 381 -583
4939 -583 -122 154 -319 180 -307 25 59 -178 -314 73 -109 -62 -28 -253 315 119 -119 293 -155 -111 216
4960B16m39L18p1o5K18Lk79L83l02K53N8k94J10J68j39M2j98l42N99j66J3L32
4982D18m13K8J51j56q2K25k37K26L9m02L25J53k06K07l54j73L37o9j71K71k89
5003a72K65J8k62L05m19L02j5j20K30j29k30K50k36o8L20j17l86N87m76L08J04
5024E9j97K39n3k43O8L25l58L82m00L53j45K33j42j33O6L06n93J05K74k03n7L07
5046A93j65P8J91m76K58Q7k02M06m34Q0K33m9q0m2j62J05k22J12L51l23LM4j50
5069a64J70J11k93L66J32o16K87j9j93L72l51N4MJ46m6q6K53j57p6j69K71j64
5091a68LL74m95K04N4k08J2M7P7R0j4m69O27m38L36j01J3R2k7k39K11J87n1O8
5115A85j22l6m5P5J73j13r7R5j70L6M27m43k2M71l75k05N10k46O7j70j42K91l46
$$ plain form
4960 216 -223 95 24 -41 177 180 -99 284 -18 235 293 -1 109 277 138 180 -18 -360 239 73 86 418
4982 418 5 33 184 28 -54 171 -66 160 199 -203 122 275 69 276 -78 -251 86 17 -154 117 -172
5003 -172 93 111 -151 154 -265 37 22 -98 132 3 -227 23 -213 -281 39 -78 -464 123 -353 -45 59
5024 59 -138 101 48 -195 -127 198 -160 222 -178 175 30 263 121 -12 54 360 -233 -128 146 -57 -114 193
5046 193 28 106 297 -179 79 166 -36 370 -64 16 249 200 120 78 -84 21 -201 -89 262 -61 -58 -14 -164
5069 -164 6 117 -176 190 322 -294 -7 -26 -219 153 -198 -144 -140 6 -40 -126 127 -30 -106 -275 -4 -168
5091 -168 -165 209 -286 -82 -28 -236 -224 -177 -100 -10 -24 -493 134 -304 32 -69 -56 36 9 -230 -19 168 117 185
5115 185 63 27 -18 57 230 117 20 115 -55 -19 408 -35 -57 414 39 -166 344 98 165 -5 -147 144 -202
5138b02K98P7j86J43nk0Km5j93L25p4N1R6l22J33J12k49j2K32l27J60M9k94N11
5162B60k86l48L56q2n3K49l30R0J0k2P4n3l0K55j95r5L03n19K59L72n32O76r3
5185B66o25O39j56k26M06l17J1M02o52K68J21l69N09p7j33K24o12N15K91n46L04
5206B43n8j82N29n12N6K34l14o9M20l52L64j53l84K49r3r8J69j02l29O90n07J35
5228f4J01k38O2K82l70M53k66k80L44j63j58J48O3k57N14o11N07j20j72L39k61
5249a47q0N25l46k02M44l59K6K44m44L25j81N2K02N4k06L38l82K06M04o58L89
5270B04J78n33K25L1m37R52l99m62N64n61K63L41o74M34n7k39L32m6k40O09n71
5291h6L80j45m83M73q2m89N40K5k96L03l42L91L7k44J95k05j84J60M1m76M65o2
$$ plain form
5138 -202 96 173 -13 130 125 105 107 62 -131 194 120 171 267 -55 78 190 -59 -71 161 -166 -6 43 -251 260
5162 260 -26 -374 -18 -100 -153 96 -234 -144 -134 -156 -82 -135 -165 90 -105 -200 103 -416 -157 215 -317 359 266
5185 266 -359 280 124 -102 304 -13 -2 400 -252 16 137 -232 277 200 67 291 -321 194 485 -61 243
5206 243 185 3 532 20 76 310 -4 -73 347 -5 359 206 -178 71 -22 -120 49 -53 -382 308 -199 -64
5228 -64 37 -201 -139 143 -227 226 -40 -320 24 -139 -297 -149 -86 -343 171 -440 67 -53 -225 114 -147
5249 -147 -227 298 -48 -250 194 -165 -139 105 -339 -14 -195 -143 59 113 -93 245 -137 69 473 -185 204
5270 204 382 -151 74 105 -332 620 221 -241 323 -238 25 366 -308 126 69 -170 162 116 -124 485 -86
5291 -86 294 149 -334 139 57 -432 108 133 -163 140 -202 189 226 -18 177 -28 -212 -52 -11 -487 -22 -84
5313h4M6q5j73L30J56m37L29j62p6K01k12j21M58l27j8L07j42k42J78k3K78k16
5335c5j75L85l4k60J13Q5m97N67JP8j23l81L82J18j57J12j82J24J12k23O1l0k19
5358a78M92j42k59L53k94J10N2K2l07L37j34N6k82J35K39m29J94N6l20K57K17
5379A75l76K44o3k99M87j52k73M39l70l3L88m00K48k12K20l09K25j03J74j27J39
5400B2R3n06J22J99j19N40k46QK95l08j19j1m0r5J29Q0p7K34o2j01j6j75L02r9
5424E0Q4o0J35l81L49j13O9j42jL61j68j65J40j08l8K13l46K58j04k13M14m54
5446b20O6L53j52K3O1m40L41K4k99J23L59l60m6J6k7L06m33M61m6k12K35q2j09
5469e8L62m73n7K31k05J71o0j63K44K25n06N53j7L8j24j11mk87k6J38J23q6L53
$$ plain form
5313 -84 -38 -123 -296 34 190 -247 82 -80 -156 45 -167 -288 170 -157 -175 132 -10 -252 -74 -97 181 -35
5335 -35 -210 175 141 -119 -6 79 -418 149 150 228 105 -276 106 224 67 179 -3 121 233 10 71 41 -178
5358 -178 314 172 -87 266 -28 82 134 156 -151 186 52 108 -174 -39 200 -229 -35 21 -299 -42 175
5379 175 -201 43 -20 -319 168 16 -257 182 -188 -221 167 -233 15 -197 23 -286 -61 -164 10 -117 22
5400 22 115 -391 -269 -70 -189 351 105 113 408 100 -19 -30 -70 -165 -36 44 -33 201 139 38 22 -153 149 50
5424 50 134 74 209 -172 177 64 133 -9 -10 351 183 18 158 50 12 225 -121 137 33 -180 234 -220
5446 -220 -154 199 47 70 131 -309 32 56 -243 -120 239 -121 -167 -151 -178 128 -305 156 110 -102 133 51 -58
5469 -58 304 -169 -226 5 -200 -29 -89 -252 -8 217 -289 264 247 285 161 50 46 -241 -267 -129 -6 -92 261
5492B61k28k86M09k77J04J24j33J4K94l61J70P8j23L17l49j07J45m0l1J59m06
5513b66L24J7p7QR5j92L41m92K36L84q82O13M7j88P3j82j83O60m28M5O0j03m1
5536a31J37j04J16M7j57J55j55j35N9J99j40J41m01L14j14j00L63Jo0j44L33l56
5558a32O46l92k87L34j36l30M37k33K42k47q3J57m8J34M0l23K87R7l01M56j47
5579A71l60O01m03j10J90k99J07L14m79K94l6j74L09K2k13J77j90R2K8r9J36j09
5601c1j81J53J63k78J13Nn2K68rj79j8j07O3K94o18M75p3k72L34M9m50N51m53
5624b53O0K79k06j06L33q3j93j49L5N24j37k62L61m05K69K71n80L83O9k56L39
5645B93j74j60J78o0P4M6k02K8J45k96K97j40j12K28j52J86ol32L25l3n27L15
$$ plain form
5492 261 33 -253 156 -121 -17 107 -26 -12 282 -79 91 169 46 363 14 -93 52 12 -19 140 -266
5513 -266 58 75 -2 6 101 -91 250 -242 -6 378 -504 109 156 -32 41 -141 -324 336 -92 -47 13 -90 -131
5536 -131 6 -98 18 65 -92 63 -92 -227 -168 31 -109 32 -369 -55 -169 -269 94 95 35 -109 224 -132
5558 -132 514 122 -165 169 33 -297 140 -93 149 -98 -181 -24 -72 62 102 -221 66 163 -138 318 171
5579 171 -189 412 9 -101 89 -210 -103 211 -268 26 -10 -184 125 147 -66 111 -79 13 41 -58 78 -31
5601 -31 -212 -59 104 -174 -61 -56 -108 160 151 -28 -46 -153 -90 204 -414 61 -12 -284 50 99 -351 200 -253
5624 -253 -193 86 -120 -226 107 24 -169 -318 -283 241 104 -158 203 -202 67 338 -242 141 210 -46 293
5645 293 119 -41 137 77 151 197 -5 23 168 -128 169 29 -83 145 -7 179 173 -159 166 133 -394 -79
5667g9K51l7m6k45K1n0j01J94J33j23k46K87K6j19J74j96N8k9k08M61l74P7K58
5690H7m69L31O5l8K1j21q6L26j95k24L88k54J11P7k29M67k98k89M73k42J49J01
5712A51j65K76j07j36K90k90j44L90n00R5M49l22J22K66l54J60J36n37N61k09
5732A32k23K88k92M1L22j45J47j31k04K58j80j08L75n16L21J39q09P10j33k03
5752b11M50j98j98J10Qj10J50j55K3O6J01P3k60J48L1j08LJ90k03q2L18r1j74
5775a19L16m28M40k31l4J24P0j40K63j84K5J53l73J39J82m09L23l2M5J7k09L6
5797b6M10l10K9p7j69O93n29k99M47k22K28K85o70K70N6l31J72L39n97N50l43
5818i4k6J10j24L68j75k45L54j97l6M70n21k0L68l62l4oo1N50m27l7K93n3k72
$$ plain form
5667 -79 172 135 89 -156 -135 -185 -286 -92 41 -82 -328 -41 -15 -134 40 -156 -98 -127 -335 126 -248 -171 87
5690 87 -382 -51 14 -24 -3 -124 -210 116 -79 -303 85 -169 -58 19 -210 257 -41 -330 143 -99 50 151
5712 151 -14 262 155 19 309 19 -125 265 -235 -140 309 -13 109 375 21 181 317 -220 341 132
5732 132 -91 197 -95 -54 268 123 270 139 -65 193 13 -95 280 -236 85 224 -585 125 -8 -211
5752 -211 239 41 -157 -47 -39 -149 1 -154 -131 -65 36 109 -151 -3 28 -80 -77 113 -90 -172 146 55 -119
5775 -119 197 -231 209 -22 -56 68 138 -2 261 77 102 255 -118 21 203 -206 117 85 130 147 -62 -26
5797 -26 384 74 103 26 -143 550 21 -278 169 -53 175 460 -210 60 116 -215 -43 296 -301 249 -94
5818 -94 -120 -10 -134 234 59 -186 168 -29 -65 405 -116 -136 232 -130 -164 -170 -231 319 -108 -145 148 95 -177
5841a77J80n8k80L82Q3J00k28j09L32j55j2R0m66J59J58k07M90k24k11J05N6L6
5863D4O7K43n49L41j23lPpO%P3k35J44j47L37ql40K73L1k00L89m72J94K39k53
5888E1L25l25k18L15j11l02M79m86L50N9l89O22k75l65L91l04j04M01l91J42J34
5909aj71L96l70j13N03l60j92L06l19J56J60j47K96k18j68M35k99j73O03k06j49
5930c1J12P5k64K09k18o6K40k24K33j34o4M54m15k2K37l15K96R3j39K91k14l03
5952a69L54l7m35O63n36Q8O3k64L79J04j54M0k04L59J08o86Q9K56k89J99j8j76
5974b66J89p2k09L21J2l26K94q8J4K68l90r8L77k17K80j86J45J64k47j11K64l71
5996b53J14M85n51J94P2k72K82l55P2M36l65K44J90j68l2J40m12L15K6l37M48
$$ plain form
5841 -177 3 -55 -335 47 130 230 2 -107 225 70 58 148 -318 -159 -1 -208 282 58 -153 -48 8 44
5863 44 111 354 -195 146 23 20 27 20 26 26 99 -136 8 -139 198 190 -150 123 154 -46 343 -129 65 304 51
5888 51 376 51 -167 148 37 -265 214 -272 78 137 -252 370 95 -270 121 -183 -287 114 -277 -135 -1
5909 -1 -172 224 -146 -259 244 -116 -308 -2 -321 -165 -5 -152 144 -74 -242 193 -106 -279 324 118 -31
5930 -31 81 156 -108 101 -117 -183 57 -167 66 -68 -132 322 -93 -115 122 -193 103 196 57 348 134 -169
5952 -169 185 148 -287 376 -160 -72 -9 -273 106 210 56 96 -108 251 359 -327 -238 18 -271 -72 -90 -266
5974 -266 -77 -149 -358 -37 -25 -351 -57 -145 -131 137 -253 -351 26 -191 89 -97 48 212 -35 -146 118 -253
5996 -253 -139 346 -205 -11 61 -211 71 -284 -212 224 -141 103 293 125 93 233 -179 136 162 -175 273
6017B73l42R7K54l02O4J50j54J48j36k20K44J0j29L59n25M35j78o4R5L9j94J90
6039A14Nj69L37m24pK73l15j61M95l07K30J02m32K79p8j73K94m25J38L63m79K36
6061a04L88n07J99j6j40N02l48n2M35k39k24K63m95J30K13k08L71k54j93N20l15
6082g4K08j03k04J80J44k12K13j37j4J82j83J55L8j07k8L10j08r8j7n5J08l42
6104a44m8K87r8K51k48k95K70K8j92J54j49J73J96l69J95J54k90J42J21j43p1
6125g6J47k99J95K7r1j7K05j52Lj10K22m1QOl20Q4K29j65j22L12j01J1K67n18
6149b96M20j36l19M49j65k7L01k89j0K08k21J42K50m68M63p7j41J91l43O9J4k57
6171b42m7N08m31N39k49m2L93n85K24K6k23J52r2L4K14m90M28P7m83K44J7k12
$$ plain form
6017 273 -69 28 282 -20 44 194 40 188 52 -168 76 86 -43 316 -209 226 48 -16 79 118 -76 114
6039 114 119 -50 287 -137 -144 129 -186 -347 148 -159 71 173 -259 20 -58 -231 63 -362 -224 139 -340 -104
6061 -104 284 -223 -24 -40 -180 322 -26 -78 357 118 -106 157 -338 -208 5 -203 168 -86 -279 241 -74
6082 -74 134 31 -173 7 151 -61 152 15 1 183 0 155 193 86 58 368 260 162 145 90 198 -144
6104 -144 -192 95 -3 248 0 -295 -25 3 -189 -35 -184 -11 185 -184 11 165 -125 17 138 -5 -76
6125 -76 71 -228 -33 -6 -97 -114 91 -61 -58 -168 54 13 21 27 -293 -209 20 -145 -267 45 -56 -45 222 -296
6149 -296 124 -12 -331 118 -47 -74 227 -62 -72 136 -85 57 307 -161 302 225 84 275 -68 1 15 -242
6171 -242 -289 219 -212 327 78 36 429 -156 68 94 -129 23 -69 -35 179 -311 117 194 -289 -45 -28 -240
6193b40L77l45K42l5r0R8L09o35L55nj18M1o7l29J97J34l7K32k74M30j56j40J26
6216G0m0Qj07P1rp6J43k44M95r1m22N03m75k2L17q7K9j05n3L32o1n47O25k76k34
6241b56M81l18n8L51m51K51J82j25J11l14K17J41l37J07Q0PO3l8k50K63J56l23
6263f0M60o18K61n4j46J43q2l4J65J03j37J38m64M31j20j12J63n9k60M47N1m20
6285b04K07m16L37K72k78M7K24l46J3L57k12J40n8k91R4K52m43L04j85K98M3l11
6307a56K35j19O2m7R4k19K66j07PK26m12R7K72m45J83J86k17N0K17m81M13k9j29
6330e3K72k61K8j23o6K23l04J71J93k09JK73k21k1K95l13R3j23O3M73k41m64L79
6353F5j04j74L27l17M16j19l13K28k75k1N46l82lK82j01O4K2l63K99m8l04N47
$$ plain form
6193 -240 137 -208 34 -1 -91 7 316 -319 36 31 -87 -46 -113 -442 -245 -111 -148 84 -190 240 84 -56 70
6216 70 30 38 -69 2 -7 -83 60 -184 311 220 -202 301 -174 -196 121 34 63 -42 -95 237 176 -371 254 -22 -256
6241 -256 225 -93 -151 200 -251 0 182 57 168 -146 71 212 -125 -18 62 69 132 94 -156 107 263 -60
6263 -60 400 -218 43 -11 -157 -14 -96 -130 35 138 1 139 -325 106 -14 -126 37 -22 -282 165 216 -204
6285 -204 3 -413 -76 196 -82 -35 189 -157 -144 213 1 141 83 -208 -114 138 -305 -1 -186 112 155 -156
6307 -156 79 -40 22 -25 69 -150 116 9 16 242 -170 -73 199 -246 -63 123 -94 -44 173 -308 105 76 -53
6330 -53 219 -42 -14 -137 -203 20 -284 -113 80 -129 -128 145 -76 -97 198 -115 -22 -145 -82 391 150 -314 65
6353 65 -39 -213 114 -203 213 94 -219 9 -266 -287 259 -123 -126 156 55 119 141 -222 77 29 -275 272
6375B72j19o2Qj09J50m0l64L13k47J3K22P7j73N8J23k83M83n02L23j34nR9n5r4
6399d6K50j35o1pN3qO2k83J76J15j93K59j29O8j01k54J88l9J85o8R3l68M49j71
6423C5k17L19l63j44N06j49j88M68m75L05J86k80n1l4k18K85k07L34J41k91j04
6444a42M27l98J30L9p8On7%J26k53K44K05k51J75N7k27R1l4j25Mj37K76qQ6j17
6469C9j22n4J35M8j68K56q9j88K02l19J68K3L2n0q5k5K76q8m9J72j59J62j19K78
6493B76l06l4K10Pj43j4o1J30j63J32j23J48k86J45l9O7j08M42j32k53K76n54
6515c83J55M52l11P1J04k22p7M39k64j6K18j86R6j04K89k66k01M22m0m10L73k90
6537a51M07k08j91K0J17j6Q4j89L97j57j44pj04K7OR9m1J78Q8l20O9J09q9K28
$$ plain form
6375 272 153 91 99 -10 140 100 -264 49 -198 -185 37 114 -59 -1 122 -161 322 -180 143 9 4 103 48 -46
6399 -46 204 69 8 1 54 46 108 -175 1 116 -77 182 53 121 20 -234 -46 -85 100 32 125 -243 206 35
6423 35 -182 137 -226 -370 136 -13 -201 267 -208 97 283 3 -48 -82 -300 -15 -222 112 253 -38 -142
6444 -142 285 -113 17 56 -22 -16 -73 -73 53 -200 44 249 -2 173 230 3 94 60 -65 -61 -198 78 70 156 39
6469 39 -83 -137 -2 46 -122 134 45 -143 59 -260 -92 -69 -37 -87 -172 -197 79 -9 -58 114 -45 117 -2 276
6493 276 -30 -64 146 153 10 -4 -65 65 -98 34 -89 59 -227 -82 -121 -54 -162 280 148 -105 171 -383
6515 -383 -228 224 -87 -16 88 -134 -211 228 -36 -52 166 -20 76 -28 261 -5 -206 216 176 -234 139 -151
6537 -151 256 48 -143 -123 -6 -22 62 -127 270 113 -31 -38 -142 -115 -109 -10 -51 127 215 -105 -36 73 -16 212
6561B12l81K34M5L4O9l11l08M77J10k47K69l77K30P8O7k39L66l55j69J03k98R2
6583b99J69J23L4K32k31o2L66l26P5k67J92k5%K05k1j73Q8j18l22O82l39J8K55
6606B56m17M24j50l21L84j05j42K04k17K21m6p9K46j12l84N86k57k10N19n15Q
6627a07L12m86K02O7j83M57m55QJ40m8J0r0R5K84k66j16K78m76L80j14J22o2K54
6650B06j8j66J12l64M11%j92J16j88j82M02m53k1O42j93n1M2k68o3J48R8K9M2
6673H9m35L44k25J84K59l54M10p7m0l6J29l60N45o78L95j64K6j76K35k66J20N74
6695D99n60K73k31Q3k14K00o9J95l61K24j33k05L56k00J66J54l71J19M82o60K29
6716b4J57J39j01k50o2L15l07K08nj88K57j4k22J21n6j02K66k62j18M17r6r2N6
$$ plain form
6561 212 -169 65 110 144 213 -98 -406 71 181 -66 203 -174 56 134 201 -38 328 -27 -196 -93 -391 -299
6583 -299 -130 -7 27 259 28 -34 332 6 81 -186 6 -19 -19 186 165 -8 80 -38 -360 322 -17 1 256
6606 256 -161 263 113 -208 176 71 -71 133 -84 137 91 12 258 146 -238 348 91 -119 400 -115 -107
6627 -107 205 -281 -79 -12 -195 262 -193 -185 -45 -93 -83 -173 -78 206 -60 -176 102 -374 6 -108 14 -48 206
6650 206 188 22 134 -230 181 181 -11 105 -83 -265 137 -316 -337 305 112 61 103 -165 -228 -80 18 47 89
6673 89 -346 -2 -227 -43 216 -138 272 195 155 119 248 -112 433 -245 150 -14 12 -164 71 -195 -75 499
6695 499 -61 212 -19 64 -150 50 -19 176 -185 39 -94 -299 57 -143 23 177 -194 -75 407 -253 -24
6716 -24 133 272 171 -79 -141 174 -133 75 70 -118 139 125 -97 24 -32 -134 132 -130 -248 169 73 -19 37
6739C7j14J61j74j58J81R4l90N01J03l13J22j43P4K28jk57J41m2J39j19k04OJ00
6762b8j05K48r5K9J98k80L7j9k17R3K78l07M15m24K67Nl24J15J46j68kK06l70
6785c02O28n79K60K22k76K06j66l04K84K55n24K41L19k92J25j90J92q7j6J20k3
6806I3r2Q8j29K04j55J11j23J25j81M4Q0k18J47K45m95K58j1l2J39R4k72K37k99
6829a42o6N69m32P4l0O1j94J47R1Q8Kj36K1M0j24K13j49nk00K05J29r5q0O1j35
6854h7K90j28l56L61K9J6k16K18N5n2j26j39M7N5K7j22j35K84j34J36l2J0j47
6877a46J84j26J23k70J32N53l67mP8j44J0P1k83K52O2j41J23J6j38NJ65l98L17
6900G4k07p5L66j67J59r0k24K80k57K17L45l56nJ1k61J25K85k25Q3L7N6n6J57
$$ plain form
6739 37 -77 84 -90 -248 -67 27 -363 138 241 -72 50 -93 -19 209 208 -49 92 50 189 70 -134 -128 -28
6762 -28 -133 115 20 49 247 -33 4 -15 -232 -139 139 -168 247 -177 90 95 -229 -114 32 -136 -138 68 -302
6785 -302 326 -253 7 229 -47 159 -7 -311 -27 228 -296 -55 264 -28 97 -93 99 12 -4 116 93
6806 93 1 89 -40 164 9 120 -3 122 -59 -15 65 -153 -6 239 -256 2 -9 -41 98 192 -80 157 -142
6829 -142 -208 361 -71 3 -27 34 -160 -13 78 166 168 32 53 93 -31 182 33 28 -172 33 162 67 -13 48 -87
6854 -87 203 75 -281 80 109 125 -91 127 182 130 4 -135 -88 -33 -6 -128 -263 21 -113 23 -9 1 -146
6877 -146 38 -88 35 -235 -103 450 83 79 157 13 23 94 -189 63 125 -16 107 123 -15 -10 155 -243 74
6900 74 -133 -208 158 -9 150 60 -164 116 -141 76 421 65 60 71 -190 -65 220 -5 78 115 171 115 272
6923B72l28j18J82k7O6N6J51j61k91L33l39K27o4m6j30K11n3J94j50r0R8k6p4
6946a07Pn1J2J84j43j04K8R9K79l22J39J09k68J2M1l0J75kj42O3RK05k5J1m37
6971b58L51o1j61L67j74J71r2P3LL7k07m31L34Q6N0j46k8J37l18L60J67k42j7
6994AN0k21J5K24j24J48k73L45j62J9J7l5q9L17m22Q7Q4j27N3J28p6J96q3j99
7018a27J73n3j85M0J70k22L44J01l17R8k8NrK05p0j03K2J71l5O4r7j3j85J5J34
7043I8k26j1K4K92k92M8K52j13j00j42L9k7M03m12L57lk72K87l30J32J11j38J61
7066A38j82J46j49K03k14K90l98J22M0j67J54R5k07J55Pj22K38m12J97j21Q0l5
7088a42J52r8j7K42p0j32K01j53N8k48Q5o4L78m94M94j97r2L47l86l2Q0n7K56
$$ plain form
6923 272 -56 -174 8 -19 47 103 254 93 -198 135 -204 23 -41 -87 -217 -6 -59 135 -15 -105 -7 -33 -107
6946 -107 -100 -151 -139 45 -98 -202 -174 -75 204 -118 21 130 -138 -126 -85 -115 60 58 -84 -21 -12 193 168 179 -258
6971 -258 93 32 -129 238 64 235 143 216 219 256 49 -382 -48 38 88 -58 -86 51 -267 93 260 18 1
6994 1 51 -170 -155 69 -55 93 -180 165 3 22 39 4 -85 232 -190 -103 -19 -146 -93 35 -41 155 72 -127
7018 -127 46 -7 -192 -152 18 -204 140 241 -76 22 -6 -1 -10 195 125 22 44 215 180 244 147 134 -51 -36 98
7043 98 -128 -139 -115 177 -115 -67 185 72 -28 -170 -131 -158 245 -167 190 187 -85 202 -128 4 115 -23 138
7066 138 -44 102 -47 156 -58 232 -166 -44 -4 -171 -17 78 -129 26 33 -89 149 -263 -66 -187 -107 -142
7088 -142 10 -88 -105 137 67 -65 136 -17 41 -207 -122 -186 192 -302 192 -5 -97 250 -136 -168 -88 -145 111
7111A11k09O0mj26L86J19l34P1o0j38M27k36n8J86k16J70J2m00J59J67l96L25
7133A6J9k11K48j15j04M87m34L1K66k08K4n0q4L51J4k99P7K1j18K23j99p6O9m
7157e6L1k09J35j09M3L21jk99K07q0o1k2O5J9lJ82j93l4L8n5K69k05L10l63j41
7182b11L64k38N4K59k52K29m22L88k48J53j14J29l5O1j6J7k60N0J35r7R9J1J99
7205B55L0l59q8O4p6N76l69k05n4J73L6o7J45j80J13k6QO9k5M5k57J06L03k72
7229e5J78k93j15N15l41K01R1j67p1K4j61J89o6j14J95j46K97q4J8j25J63k21
7251h8K41n8j46J4J75j67K29q0j71j3Q0j26K25k6P2l63L35k24K55r7J6j22K58
7274B19j06J14j67j37J27p4K07k57J31K1K00j56j23o8k3j12J37J98k0j16p1L5
$$ plain form
7111 111 -98 -38 -42 -168 218 337 3 74 14 -124 303 67 9 195 -21 149 161 -239 -80 87 -309 16
7133 16 35 -176 72 -43 -147 340 -94 -63 203 -5 19 -31 -115 236 250 -49 28 49 -69 154 -45 -121 -52 -56
7157 -56 -25 -234 -99 -208 -165 156 155 -144 63 -17 -78 -100 -35 -16 -19 163 -30 -64 -26 -81 188 -17 293 -70 -211
7182 -211 153 -85 -31 228 -24 205 -217 171 -77 76 -38 91 56 117 101 118 -142 -92 43 -54 45 56 255
7205 255 285 -74 -162 -98 -174 402 33 -172 -226 -53 -17 -84 61 -119 -6 -32 -24 45 20 65 -192 -86 217 -55
7229 -55 123 -170 -285 230 -111 90 181 14 -57 -33 -194 -5 -71 -185 10 -136 161 77 95 -30 133 -88
7251 -88 153 95 -51 -37 138 -29 200 120 -51 -64 16 -110 115 89 161 -202 133 -91 164 67 83 -39 219
7274 219 113 227 60 -77 50 -24 183 -74 57 78 278 122 -1 -69 -92 -204 -67 131 111 -5 -76 -41
7296d1J35j81J88j56J00rO0j26J8Nj46K85j10K9R4k59j72L47l86K73K37k41L6
7319b0k16l1R3L7J32j72L1q6J11J92L1j21l9K54k90J61j95q3L56m41K71J88r0
7342G3J84k77J82k06j97K74J18p6l2j7k12K08L6j38J87o9j8j42J56r1O7J77m23
7365b36K81j39oJ70j99O1j17R2K97r3k70R8j2j83M13k60J83J60j15j14j6j21J8
7388a08P0j90L86k40J01L22m49Q8J96m1o3j57M8k6J87k09p5J53j87K71Kj09K55
7411B25l30L60j32k24M45k66O6o7l06K42j19q5M62r6j51j04K72j60j64J82l13
7432b63K97o6j52K21k47K96p6q1M6j49P4RJ22J7n1K53k40K78m85K96K0k34K83
7455A68j76J33j22J62n0j62j14J72j31pJ11R7l32K31k40J19q3J88o1J16k35K41
$$ plain form
7296 -41 94 -87 101 -55 45 36 96 -30 -12 -7 -153 132 22 51 145 -114 -286 61 -325 -52 185 -56 -20
7319 -20 -236 -267 -174 -137 -5 -177 -146 -232 -121 71 102 -19 -58 196 -94 67 -128 -211 145 -296 -25 163 73
7342 73 257 -20 162 -44 -241 33 151 75 43 26 -186 22 58 -80 107 38 20 -122 34 -57 10 187 -236
7365 -236 45 -94 -100 70 -129 -68 -185 -93 204 111 -159 -61 -73 -256 157 -103 80 240 125 11 -5 -126 -108
7388 -108 -38 -228 158 -82 19 341 -108 -20 176 135 72 -85 -37 -63 124 -85 -160 -7 -194 77 79 -30 225
7411 225 -105 255 123 -101 344 78 144 77 -229 13 -106 -191 271 175 24 -80 192 32 -132 50 -263
7432 -263 34 -32 -184 37 -210 86 10 -71 -25 -174 -100 -91 31 48 -3 250 10 288 -197 99 119 -115 168
7455 168 -8 125 3 165 115 -47 -161 11 -120 -127 -16 81 -251 -20 -260 -141 -224 -36 -97 19 -216 25
7477B5j3j50L5J66k3Q7j21K90m1l16J23P0mj20M7Q0j91P4o2k51J01K68q3k3J36
7502A04Q1j87L18m20J76J31l25K25km3P4J07l35J94j71j13L52j51J97j95l14L36
7524C9m0j03K4J64k02K15r0J19o5L5l5k8K8l9n6K8j3Q0J0N5j41j51J69J08k9r
7550G3j3j14J75k27K68l4j32J62j76O4k11J44r6K70o8j37K66k51l2o7J39J2n9
7573d4J12J73k50j66j0K05K10o0k08R9r8P1k57J49J60k29J44J20l0o7K4l2J06
7596A22k09K64k25P7j50rP9r7P5J32j96K23j01m1J03k9l6J69j48K23m01k6M08
7619B07j14k82p2J96k05K74P2l57K83J20k44Q0j88J32J48M2q6K85l28J54O3k23
7641d3L44k14j47O9j43P0RK14k23K2J14p9j30J50L7j45K36j86K14j07P2k15J29
$$ plain form
7477 25 12 -138 -103 63 40 127 6 296 255 -61 62 132 128 8 55 135 -56 18 -44 -295 -194 74 -9 -32 104
7502 104 185 -2 316 -104 72 203 -122 103 101 58 132 239 -96 98 -73 -186 166 15 212 17 -297 39
7524 39 -1 -104 -80 84 -118 97 7 126 61 96 61 33 61 22 -34 -6 -19 61 71 126 -15 -166 3 111 82 73
7550 73 60 -54 121 -106 162 128 -4 158 -18 46 -165 -21 -117 153 85 -52 214 -37 -69 -136 3 15 -44
7573 -44 68 241 -9 -175 -185 20 230 170 -38 61 -37 34 -223 -74 86 -143 1 121 91 24 48 16 122
7596 122 -87 177 -48 29 -121 -130 -51 -148 -73 59 -137 86 -15 -56 47 18 -18 151 3 226 -175 -201 207
7619 207 93 -189 -261 -65 -270 4 76 -281 2 122 -122 -42 -230 -98 50 92 6 291 -37 117 180 -43
7641 -43 301 87 -60 9 -134 -64 -55 159 -64 -42 72 -7 -137 13 50 -95 141 -45 169 62 134 -81 48
7664D8N9Nj21O9j5j04J94K4j23q3j8J58j75K09q2J96k33j75K81m02L75O3m83J44
7688a89Q5L26q8r2J12o9P7j06q5J45j47O5J83l44J1k7M01j45j29j11J11l9qJ95
7712A32j90p1L10q6p5j07J02K00p2k03j4J16J1r0J90l92K77k19J66p9N7K45j79
7735B9oMK13j09j55K27k29L9N3o3j0J16l95K02P0j6K1J15r1J1jl25K69l08M40
7760A01J51l17kj27K8J81j33l5J54RM3j18%J08p0j22J74q7J05j60K22k29J76r0
7784c8Q4Q3k58K52k86L4R6o4k4J75Q0r0L8j40j12P7J01j21J15k17L34j74Nj8J11
7809D3J75m53K37N2O7o4j65M5NK46k41P8J13j70j4K85j69k23K09j27J60j23J05
7832G1R5l57M14l91j00J72M09o77L22k68L44j23R8J52j71J49K0k66R2J08P8k37
$$ plain form
7664 48 107 112 -9 60 45 -59 135 159 36 -47 -65 93 -82 127 45 241 8 -167 114 -288 87 150 -333 -189
7688 -189 -104 222 134 42 154 85 162 56 -29 116 -31 34 217 -127 -116 -143 258 113 -16 -127 -16 -55 -63 132
7712 132 -58 -129 181 95 20 -87 15 215 143 -60 -74 42 53 -37 153 -239 38 -181 -15 -94 -37 208 29
7735 29 23 27 240 131 -24 203 -26 13 66 3 -7 109 -286 -84 -14 -30 -9 106 15 26 25 -300 -31 -339 101
7760 101 252 -65 -67 -194 -166 15 -118 -153 1 10 53 -65 -65 43 -27 -149 25 -62 43 -117 105 -124 52 -38
7784 -38 46 129 -129 123 -163 -129 -33 -97 -121 54 134 44 82 -58 -170 -93 8 -113 2 -215 119 -55 -50 -68 43
7809 43 218 -235 2 54 121 57 -108 -63 -58 188 -53 25 138 -32 -46 239 70 -153 56 -71 89 -34 71
7832 71 166 -191 223 -168 -268 -96 313 -364 -42 -310 34 -89 9 161 -10 139 159 -107 -15 93 171 -66
7854f6J2j52N1K00r8ML54l16p8J82J00k53K83n21M40j55R0j20o4J3L1N0P4P1k24
7879i2J39m05K82N1j4l7Q7K3j47L53k44O0k14J96O5j84J74j26n8N2J56k35J16
7902bK1n1M3Mj63Q9P0l7j88J70j27lJ34q4Q1J80k98J41q3J66N5n7R9j98J70l20
7928a88J35P8Q7j91L09k07k59K51K43l19k9p7L6K16k8l90K67J17J98k72J95N5
7950B27l15K27k66J70M0k67L28q0j18N1J61l28L98j14j19Mj5K66k63k11l4J18
7972a40O6j17L03r9j76R2j56j0p0NJ59j0P4N1j23K30k21K4JK13n2Kr9l5J50j12
7998e0n3M7K19j72q3q6J08j1L1J5R6j61Q0pJ84J28l02j21K25J55j94l32L25N7
8022I8l5K33k45k88L58p9K86l00l75K76J41j03L99l99K72j44q1k14K26k01j81
$$ plain form
7854 -66 -54 -206 -155 45 -53 -49 305 -11 -89 93 193 -60 223 -298 142 -13 77 -43 -107 -94 -63 -13 61 132 -92
7879 -92 47 -358 -76 -25 -39 -76 11 34 -113 240 -4 56 -158 38 103 -81 93 -33 -91 -39 117 -118 -2
7902 -2 19 -32 11 15 -148 -59 11 -26 -214 -44 -171 -174 -40 -124 -43 137 -161 -20 -103 63 118 61 160 -38 132 -188
7928 -188 -53 25 112 -79 230 23 -236 15 258 -61 -90 -167 -131 85 57 -333 -66 51 249 -23 172 227
7950 227 -88 139 -127 43 83 -184 144 64 -54 -3 158 -170 228 114 -5 -1 -16 250 -13 -224 -258 -140
7972 -140 -74 -191 112 13 -163 -71 -227 -237 -307 -302 -143 -153 -79 -28 -151 79 -142 -118 -117 96 44 46 -53 -88 62 -50
7998 -50 -103 -56 163 -9 -92 -178 -70 -81 -50 -35 61 -100 -20 -27 157 285 -17 -138 87 242 48 -284 41 98
8022 98 63 296 51 -237 121 42 328 28 -347 -71 70 -33 366 -33 239 95 14 -200 26 -175 -356
8043c56M12k1qJ31l75L25k92O3J71j08J42k37J78k47L00o1J06j17J00k10k42K81
8065f5j9M0J2L11k76k46K22RJ79k4k3l56Q4K63M0J16k88Q0k04K14L3j26L55l86
8089e5m03M17k9r9K4J76j01j18K34r9j0j4j86O1K52M1k47K67k16K25j08q1J33
8112F4j54r2M0P6L4m2P7j69J57J70o1j52J44k28M0k36K44Q9r9J41k06K25L3j16
8136b1p2J17O4J36p3k80J25j56J52r6j9P2J12O9l03K12k44K34R1p0j5r2mP7Q8
8161A04n9M8J37k85K18k0k09K1J81l28J92PM7j71o2J18j25L04j1j54J27k03R4
8184b9j73J54J80l43M20j35j8
$$ plain form
8043 -356 56 35 27 158 -217 108 -184 -121 50 -58 84 -153 25 -222 78 17 123 6 106 -104 -346 -65
8065 -65 -84 -44 -32 279 3 -243 -21 -12 167 143 120 -236 -152 111 151 267 -21 59 -145 69 102 -24 331 -55
8089 -55 -458 -41 -70 -169 -145 31 -70 -188 46 -53 -63 -77 -263 -202 50 91 -156 111 -105 120 12 -69 64
8112 64 -90 -182 -142 -66 -32 -74 3 -166 -9 161 100 -52 92 -136 -96 -332 -88 1 -98 43 -163 62 95 -21
8136 -21 -93 24 88 224 151 -129 -4 -160 -8 -104 -123 -51 61 130 -173 39 -205 29 120 50 35 -57 -61 16 104
8161 104 45 93 230 -55 163 143 -66 -45 136 -192 0 7 54 -117 -179 -61 -186 118 107 -47 80 -123 -29
8184 -29 -202 -48 132 -211 209 74 56
8191E6
$$ Imaginary data points
##PAGE= N=2
##DATA TABLE= (X++(I..I)), XYDATA
0@%%%%%%qJ6j6K4l2L2m0N7q1J04j28J60j92K29k77L29l90M61n40O30p30Q47r78
29e23J125j287J464j662J880k122K393k690L011l363L750m173M636n143N699o303
45c308O958p677Q464r323J0267j1310J2461j3732J5147j6730J8512k0541K2870
58A2058k5567K8741l2537L7167m2967N0458o0538P4875r6918J35241k19353O86573
70E47233k37711j027487J439677j019011J1980R60873j001096K76481M55572p05624
80b99113N30950k44709k10221N97209n01804Q1649L22139o42506N40020P6446
90B50060o27809O64909k62888m18594Q45842n51414j68576O83545p17441J83838
100a18528N26128p49439L21502K40222m99190M05128q5315l06178L94608j30339
$$ plain form
0 0 0 0 0 0 0 0 -8 8 -8 16 -16 16 -24 33 -48 56 -72 88 -104 125 -152 177 -213 248 -292 338 -392 455 -523
29 -523 602 -685 779 -883 997 -1125 1268 -1422 1589 -1774 1976 -2197 2439 -2704 2995 -3308
45 -3308 3650 -4027 4437 -4886 5381 -5929 6532 -7200 7947 -8783 9729 -10812 12058
58 12058 -13509 15232 -17305 19862 -23105 27353 -33185 41690 -55228 80013 -139340 547233
70 547233 309522 -717965 721712 -297299 -285319 675554 -325542 -49061 406511 -299113
80 -299113 231837 -12872 -223093 374116 -127688 -46039 276100 -366406 173614 250060
90 250060 -377749 287160 24272 -394322 451520 -99894 -268470 415075 -302366 -118528
100 -118528 407600 -341839 -20337 219885 -279305 125823 40508 -265670 128938 -1401
110a401p6386J32169k55728K05161J36707l26554K21038m1807k32321M64880k44911
121a9153l00122N69554l24179j28530N19439n62013J06311M85808o10680K53646
131i919K19058m83735M21871m1076l14070L93168k35362j8311K72353l50749K28409
142H1637L5463l25808M44003k05323k25424M92012m17946L9786M46477o30195
152b65318K66628L10936n99263M56106j4012m88088O12179k05747l03116M71935
162B42240l36099L2499K86362l86666J88686M7823j90679K73853k43268p185K85528
173A93094l61928J79239J43880m08336L51204J4460l68889L94220j12186k38078
183b13320L70510k06270q7429K68479k46164O3087J39815k17165J48316j2633
$$ plain form
110 -1401 -77787 54382 -201346 3815 140522 -186032 35006 -6801 -239122 225758 -19153
121 -19153 -319275 250279 -73900 -202430 317009 -245004 -138693 347115 -263565 -9919
131 -9919 209139 -274596 147275 106199 -207871 185297 -50065 -68376 203977 -146772 81637
142 81637 117100 -208708 235295 29972 -195452 296560 -121386 -81600 364877 -265318
152 -265318 1310 312246 -287017 169089 155077 -333011 279168 73421 -229695 242240
162 242240 -93859 -61360 225002 -161664 27022 74845 -115834 158019 -85249 -92434 193094
173 193094 -168834 10405 154285 -254051 97153 111613 -257276 136944 24758 -213320
183 -213320 157190 -49080 -136509 131970 -114194 -51107 88708 -128457 19859 7226
193G226j28903K12543j33655n5761J87729j75054O8902J01583k21971J64462M5062
204G2163j91338J99515p9380j17564K66003j76314p0200K44135k09994L7736J69651
215A44413k49835J23871R9110k04121J52786k8563r0001J61218j34717K3712J02860
226A00733j74567J46694j1314j69045K47053j31739j07832K68904k27175J1117
236d7171K13699k89839J34597J28182k86410K12099J314k04099K54190j23358
246f796j01481K22816j68904J2737J13962j67100J18807n118j10061J56242j27481
257f2377J4786J38048k24699J34509Q2619k51378K23543r714k25119K82924j02355
268G87j56046K71401j59091n3077J97120j78186M4335J00993j52015J12699j7751
$$ plain form
193 7226 -121677 90866 -42789 -98550 89179 -85875 -16973 84610 -137361 27101 72163
204 72163 -119175 80340 960 -116604 149399 -26915 -97115 147020 -62974 -25238 144413
215 144413 -105422 18449 117559 -86562 66224 37661 -52340 108878 -25839 -2127 100733
226 100733 -73834 72860 61546 -107499 139554 7815 -100017 168887 -58288 -47171
236 -47171 166528 -123311 11286 139468 -146942 65157 66471 -137628 116562 -6796
246 -6796 -108277 114539 -54365 -41628 72334 -94766 24041 18923 -91138 65104 -62377
257 -62377 -47591 90457 -134242 267 82886 -168492 55051 45337 -179782 103142 787
268 787 -155259 116142 -42949 -96026 101094 -77092 -32757 68236 -83779 28920 11169
279A1169p6630J45810j28098J7984J27455j82896J09312O0296j94514J89338k5823
290E3403j61345K28832j18976p5412K18902j95992J8763J76274k24781R6016R8662
301A14346k09518J58366N474j51308J68426p1252n1644J20362j24185N9034M3867
312F1968j39870J54781o4735j02064K19930j79842k9070K32368k54725N5599J89756
323A44096k84133J41495J07114k62391J97436N474j79224J99700q7705o5937J56178
334G2103j43457M6405P0899j47964J42045m5430r4929J89179j54003j659J77157
345A10346k29544J05622J19814k63050K01267L3441k40156K55410o0842j70348
355a38040K56198j27475q2593K04380j52671J2473J09202j36945Q8487l279p1336
$$ plain form
279 11169 -65461 80349 -47749 -29765 97690 -85206 24106 84402 -110112 79226 53403
290 53403 -107942 120890 1914 -73498 145404 -50588 -31825 144449 -80332 15684 114346
301 114346 -95172 63194 68668 -82640 85786 14534 -37110 83252 -40933 18101 61968
312 61968 -77902 76879 12144 -89920 130010 -49832 -78902 153466 -101259 -45660 144096
323 144096 -140037 1458 108572 -153819 43617 49091 -130133 69567 -18138 -84075 72103
334 72103 -71354 -24949 45950 -102014 40031 -5399 -100328 88851 -65152 -66811 110346
345 110346 -119198 -13576 106238 -156812 44455 77896 -162260 93150 32308 -138040
355 -138040 118158 -9317 -91910 112470 -40201 -27728 81474 -55471 33016 29737 -41599
366d1599J23957j14582J9184J26266j96413J09574Q5998k30813J92685J6473k20984
377a30254K35497n3437j62368K33897j19896q1005J99684j57988N931J26183j62557
388f6313Q4887L8932j30076J29704n5501o2995J45177j33931K2899J04425j76986
399i9778J28103K7306j85779K02683o5028j31367K42221j71900n4834K42922k26474
410i1925L1784J72970k39325J19317R0126k05606J49703r400j03166J49489j07345
421d3378M942R6788j45784J26605n290j55180K17988j01860r8411K42642k05126
432f6064m686K23702k46795Q0181J31506k32632J60428L6762j79761J67288n0096
443A9833p1314J44059j12756K501Q3579r9210P5947q925q7819J22581o3047l0354
$$ plain form
366 -41599 82358 -32224 -13040 113226 -83187 26387 112385 -118428 74257 90730 -130254
377 -130254 105243 51806 -110562 123335 3439 -77566 122118 -35870 -29939 96244 -66313
388 -66313 18574 57506 -72570 57134 1633 -61362 83815 -50116 -27217 77208 -99778
399 -99778 28325 55631 -130148 72535 7507 -123860 118361 -53539 -108373 134549 -91925
410 -91925 -60141 112829 -126496 -7179 82947 -122659 27044 17644 -85522 63967 -43378
421 -43378 -38436 58352 -87432 39173 33883 -121297 96691 -5169 -103580 139062 -66064
432 -66064 -70750 152952 -93843 -13662 117844 -114788 45640 82402 -97359 69929 19833
443 19833 -51481 92578 -20178 -17677 65902 -33308 42639 33714 -54105 68476 5429 -24925
455b4925J11630j39200M0086J19173j72793O9986P5599j69072J30162L4271j74112
466i9195J33157J0150j12825J16524m1164p0789J04073m4432j8272M0576o4471
477d6668N3750N903o2166P8720o0800k4618J27285j21957L66J15422j53359Q8525
489D03P0499j89971J40034J5915j34918J73014r3825p9607J91663j31212m3J07470
501F9422j55787J00440M8149j32113J04046m1285k7782J16398j24732L3578O5624
512E5958j21686J33386l2241j29796J84000p9793o5528J67357j56880O465J53006
523A14248j59809N0627N8643j24257J03880k16p7442P0572m8227J5856M9080q4476
535c1521M4207K74m1661Q5589o3229l9488Q7123n2528K885M6388q8936L6162O1889
$$ plain form
455 -24925 86705 -52495 -12409 106764 -66029 3957 79556 -89516 40646 74917 -99195
466 -99195 33962 44112 -68713 47811 6647 -64142 39931 -4501 -22773 17803 -46668
477 -46668 7082 12985 -49181 29539 -31261 -55879 71406 -50551 -50185 65237 -88122 403
489 403 70902 -119069 20965 36880 -98038 74976 -18849 -98456 93207 -38005 -38048 69422
501 69422 -86365 14075 62224 -69889 34157 -7128 -34910 81488 -43244 -9666 55958
512 55958 -65728 67658 35417 -94379 89621 9828 -55700 111657 -45223 -38758 114248
523 114248 -45561 5066 63709 -60548 43332 43116 -34326 36246 -11981 3875 52955 -31521
535 -31521 12686 12960 -28701 56888 -6341 -45829 41294 -11234 -8349 38039 -50897 -14735 47154
548D7154p7984K0277J9634n3449N6498J3107p6755L8596K3093l7388L6027j8315
560i505l2427M6112m387j2700M849k4273L5632k43l0439M5220m7321j527Q3271
573E2262q3959M986O8624r1922N8852M2944j13773P5624J2252o1441Q4766n8058
585h843k4898Q4601o2950K3576J9393p4784Q2053r127n1822O3422o0541K5034
597E114N4474r3317N5942K420o3182J07834o7377m9557J18696q9654M625Q2232
609F8250j15307M4327N5315q6806M8780j516m1701N1880k8353K340R922m1054
621c3923N5580j8802l9375O3627n1156p313P5451p6966J847N9072o4317L0564
633e711K6104o7585M0685K0304m2417K9329r789j8808L8209j3812j4964J4570
$$ plain form
548 47154 -30830 -10553 9081 -44368 12130 25237 -51518 -12922 10171 -27217 8810 -9505
560 -9505 -41932 4180 -207 -12907 -8058 -32331 3301 3058 -27381 17839 -29482 -31009 52262
573 52262 -31697 -26711 41913 -50009 8843 51787 -61986 13638 25890 -35551 49215 -8843
585 -8843 -33741 50860 -12090 11486 30879 -43905 38148 29021 -22801 40621 -19920 5114
597 5114 59588 -33729 22213 24633 -38549 69285 1908 -47649 71047 -18607 -13982 68250
609 68250 -47057 -2730 52585 -34221 14559 13043 -28658 23222 -5131 -2791 7131 -33923
621 -33923 21657 2855 -36520 27107 -24049 -31362 44089 -32877 -31030 28042 -36275 -5711
633 -5711 20393 -47192 -6507 13797 -28620 709 -9080 -27888 10321 -3491 -18455 -3885
645c885p889J2766R21j7504J7305p410k76K6638l8681Q190M0703n1516K1292L4845
659C5499p0106M5649L0129p7874N8327R141o5416O7717j2046m3730N4800k8865
671C225m964L3226m0587K4383k456k3150M9163m6618l213N5671o7337K9906L1496
684C8745q3181O9879L542p5471Q3637l5398m0676Q8850o9646j0683P5299p8058
696c3161K2982M0023p1016M5681N946m2895M3320k3476k935K6343m3859L8560
708E513j329n0093P2052l5520l8755R0016o5639j9970R2620q0639Q01P5993q3234
721c8184K4972M8308p1224L6391J8693m3578L8089j2706j2996L3675l5250J9991
733F181J3418m4955N2171j4313m0731O9831m1579k2522P4978o9127O047O6470
$$ plain form
645 -3885 -11774 992 1913 -15591 1714 -5696 -5972 20666 -18015 -9825 30878 -20638 654 35499
659 35499 -34607 11042 41171 -36703 21624 30765 -34651 33066 21020 -22710 32090 3225
671 3225 -1739 31487 -9100 15283 12827 -10323 38840 -7778 -10991 44680 -22657 7249 38745
684 38745 -44436 25443 28985 -46486 37151 1753 -38923 49927 -19719 -30402 44897 -33161
696 -33161 -10179 29844 -41172 4509 10455 -32440 10880 -12596 -15531 10812 -33047 5513
708 5513 4184 -45909 26143 -9377 -48132 41884 -23755 -43725 48895 -31744 -30943 45050 -38184
721 -38184 -13212 35096 -36128 263 18956 -24622 13467 761 -12235 21440 -13810 6181
733 6181 19599 -25356 26815 12502 -28229 41602 23 -22499 52479 -16648 -10601 55869
745E5869q6462L7488M1013q5231O0045J0588p0551P1235j8108m3127O2981l9090
757c350n405L7133m6149K8329K277l6053N0960l6012j4001O2613o9565J5640N4941
770D1358q6912M6708L1632q6832O8228M145p0838P6519k5200m0172O9861m7968
782a9471n768M9390n4614K3010K1094m8306M3590r180k9391M9466l6691J247L8676
795B3052n3945L3849J6565n9513O2643j2289n2616Q2205m1936l4337Q5014o2146
807a3454j0309P2273o8368J1590M7829o0854L0261J4212l8841L7586j8388o689
819c152L1605m2942K6007J7094n6576N5018o896n4207P4028l3005l8386P6580
831D5168n3049j3366O5573o5910J3588M3180o4405L6644J1282n0472M9921j6026
$$ plain form
745 55869 -30593 6895 47908 -37323 22722 33310 -37241 33994 15886 -27241 35740 -3350
757 -3350 -8755 28378 -17771 10558 12835 -23218 27742 -8270 -22271 40342 -29223 -13583 41358
770 41358 -45554 1154 32786 -54046 14182 18327 -52511 24008 -1192 -41364 28497 -19471
782 -19471 -25239 24151 -30463 -7453 13641 -34665 8925 -255 -29646 19820 -16871 -15624 23052
795 23052 -30893 2956 19521 -39992 22651 10362 -42254 39951 -1985 -36322 48692 -13454
807 -13454 -23763 48510 -19858 -8268 39561 -21293 8968 23180 -15661 21925 3537 -3152
819 -3152 28453 -14489 11518 28612 -27964 27054 20158 -34049 39979 6974 -31412 45168
831 45168 -7881 -21247 44326 -21584 -7996 35184 -29221 7423 18705 -31767 18154 2128
843B128k6874M6366l7289L188L2013m7278K9928M671l9497N1695k8023k2551O0333
856B8810n4623M902N4268p4132L2585L7581p4680N1687J0583o0720O1095j2830
868D526l5674N1362l1185k331L2941l8252K1544N798k7500L8599k1676j3582M1979
881B6549l8181R814K9996n0289L1242J5445m6075M2642p950l5731N3563k2808
893H217k5767M7568l1504o467L9286l6723n6K7746k5357Q133O898j7814J4087
906H247m752n12P045k3026J9489P704l3128L0120l861l6314M9877j3948l9618
919c2677N1631k2124k2269M9508l6607j1729M1644l2238Q153J2501l0517K7652
931B928m035j4268K3001k8955J3852K3366m1359K6933O78l0269N0392k7292k2387
$$ plain form
843 2128 -24746 21620 -15669 -12481 19532 -27746 2182 6853 -32644 19051 -8972 -31523 28810
856 28810 -25813 -20911 33357 -40775 -8190 29391 -45289 6398 16981 -43739 17356 4526
868 4526 -31148 20214 -10971 -13302 19639 -18613 2931 8729 -18771 19828 -1848 -15430 26549
881 26549 -11632 -1818 28178 -22111 9131 24576 -21499 21143 13193 -22538 31025 8217
893 8217 -17550 30018 -1486 -7953 31333 -5390 -5446 22300 -3057 5076 11974 -5840 8247
906 8247 3495 2983 10028 -12998 6491 14195 -18933 11187 7326 -28988 20889 6941 -32677
919 -32677 18954 -3170 -25439 24069 -12538 -24267 17377 -14861 -6708 5793 -24724 2928
931 2928 -1107 -15375 7626 -21329 -7477 15889 -25470 1463 2141 -28128 22264 -5028 -27415
944b7415N0015l9041Q596L6148n8329K8122K6440m7965L6854m320l2425M2914
956A9594j2732j3913J8646j7968J4869L332j6214J9717k1724P926K8237m2157
968a2387J5184J7889l5392L3586l41m0106L6513k302j8947K4190k1698l861K4793
981A7121j3480m825K564m950Q873R78p841m520K162J1109o322q564N657l694J968
996c764R649j1933j1079J9666j161j5331J7079r377j5494L2514r555k4776K7831
1009D269r816q863K5974k0197p165J7514m435M721q914l287J5906j3676J3273
1022E304J934l3551L8020K883l4493L6776j9749j4718N0127l7537p941L5881l5806
1035a2870K3577J0110m1194L4074l576j5961K8003k8940M964K1996k6903K1631
$$ plain form
944 -27415 22600 -16441 -7845 28303 -30026 -1904 24536 -23429 13425 9105 -23320 19594
956 19594 6862 -7051 11595 -6373 8496 11828 -4386 15331 -6393 1533 29770 -12387
968 -12387 2797 20686 -14706 18880 18539 -21567 14946 12644 -6303 17887 -3811 -7672 17121
981 17121 3641 -1184 1380 -3570 5303 6281 -1560 -6080 -3918 7191 869 -7695 -2038 -5732 -3764
996 -3764 5885 -6048 -17127 2539 1378 -13953 3126 -6251 -21745 10769 1214 -23562 4269
1009 4269 -5547 -14410 11564 -8633 -15798 1716 -2719 2002 -6912 -10199 5707 -7969 5304
1022 5304 7238 -26313 11707 14590 -19903 16873 -2876 -17594 32533 -5004 -12945 22936 -12870
1035 -12870 10707 20817 -20377 13697 10121 -5840 22163 -6777 -1813 20183 -6720 14911
1047A4911j0439j7734L8237k7798n05K7337m5208K6788K1800n1418L3837K806
1059A2614l7723M7059j5453l0663L7980j6380n143K0188k6593Q147J1968j4196
1071h195J2421j4241k790K3299k0289K811R865k2269K1383N459k8144K0277Q98
1084D85j6497K4446j1593j6844K8540j0640j1356K4126j9530k860K5851k1425
1096g297J641J4227j8584J3851L155j4311J5452j2966N419J7623l1961J9621R755
1109A5625l3998L8850p845l8401N1710j7516k6227M7087l4663n377M1960l9720
1121h515P199J9969l1533K6720n029k2193L1044k2065K198K1762l7355K2982R430
1134A4614l5317L6309j4184k2468M3800l3058l476L6848m5343J7739K4370m7603
$$ plain form
1047 14911 4472 -13262 24975 -2823 -3328 24009 -21199 5589 27389 -24029 9808 12614
1059 12614 -25109 21950 6497 -24166 13814 -2566 -7709 12479 -14114 -5967 6001 -8195
1071 -8195 4226 -10015 -12805 10494 -9795 -6984 2881 -19388 1995 7454 -20690 -413 485
1084 485 -16012 8434 -3159 -20003 8537 -2103 -13459 10667 -8863 -11723 14128 -7297
1096 -7297 -5656 8571 -10013 3838 6993 -7318 8134 -4832 587 18210 -13751 5870 15625
1109 15625 -18373 20477 12632 -25769 25941 8425 -17802 29285 -5378 -10755 31205 -8515
1121 -8515 -1316 18653 -12880 13840 8811 -13382 17662 -4403 -2205 19557 -17798 5184 14614
1134 14614 -20703 15606 1422 -21046 22754 -10304 -13780 23068 -22275 -4536 19834 -27769
1146b7769L2073O894m1140M1579q087k8951L7354j7863r558K6867k4211M895J3784
1159E867j9770J8285p644j2667K9083k2469j509K6450l3015J4356K1870m1041
1171b2204K5182J2664l7353L3712l658k7779L7365j5336j5478L2386k4078R58
1183c619K2115k8605J6405O788k3030K4207j0784r249K5637k6497O627K1366l6025
1196a4664K4375P208l7768L9183p599l2468M4078j9879j9570M0827k9821n157
1208a1255L1281l0756Q142J3345k3263J7996m957j1497K0616j9180M315J5711
1220A0498k9315K0676N949l1037L1474o960k3586L6366k0726j2106L5409l0449
1232a3807K505K6534l4630J7088J4161l3071K5938J403k4281K7524j0617j0303
$$ plain form
1146 -27769 4304 11198 -29942 11637 3550 -25401 11953 -5910 -15468 11399 -12812 -7917 5867
1159 5867 -13903 4382 -3262 -15929 13154 -9315 -10824 15626 -17389 -3033 18837 -22204
1171 -22204 2978 15642 -21711 12001 8343 -19436 17929 2593 -12885 19501 -4577 -3619
1183 -3619 18496 -10109 6296 13084 -9946 14261 3477 -5772 19865 -6632 -5 21361 -14664
1196 -14664 9711 16919 -20849 18334 10735 -21733 22345 2466 -17104 23723 -6098 -11255
1208 -11255 20026 -10730 -2588 10757 -12506 5490 533 -10964 9652 -9528 -5213 10498
1220 10498 -18817 1859 7808 -23229 8245 1285 -22301 14065 -6661 -18767 16642 -13807
1232 -13807 -11302 15232 -19398 -2310 11851 -21220 4718 6121 -18160 9364 -1253 -11556
1244a1556K2622j7709M006J0356j7124J6774m877j2483K5591j9584k439K7094
1256B0671l1805J0519K2839l7304K0037J4398l4348K5428L030k6658K7277p556
1268F528j3352K0155j3505J251Q854j5077J2326k258j1128J8672j5627j853K0416
1281A5402k4993Q491J4888k8218J8325O123k7953K5723k636k2751K7346j0750
1293a003j3465K4100j5407m181J6230j4594M039M710q892R677p945J288R648j6789
1307a2584J1846N715k2098K1750n05k2560K7070p987j5969K6759j4324q155K2511
1320A1469j6067l6J3390j5113Q323L637j0437J0412m239k230Q883r889M486M136
1334F725r748J1754n595o595J5214j2157o54J4649j8277N255J3880k0630Q757
$$ plain form
1244 -11556 11066 -6643 -2637 7719 -9405 7369 2492 -9991 15600 -3984 -6423 20671
1256 20671 -11134 -615 22224 -15080 4957 19355 -14993 10435 13465 -13193 14084 6528
1268 6528 -6824 13331 -174 1077 9931 -5146 7180 4922 -6206 12466 -3161 -5014 15402
1281 15402 -9591 -1100 13788 -14430 3895 10018 -17935 7788 5152 -17599 9747 -1003
1293 -1003 -14468 9632 -5775 -9956 6274 -8320 -4281 429 -8463 1214 -6731 -5443 4205 -12584
1307 -12584 -738 4977 -17121 4629 4124 -18436 8634 647 -15322 11437 -2887 -11042 11469
1320 11469 -4598 -4634 8756 -6357 1966 5603 -4834 5578 1339 -891 7992 -1897 2589 6725
1334 6725 -3023 8731 3136 -3459 11755 -402 -1056 13593 -4684 571 14451 -6179 2578
1347B578R590j9720J1692N731j6401R357K968r562O527n80l817J516q55M790p363
1362c549j509J1338j2221J202J3045j9557O559J5406k3687J0077R058k0894J6532
1375A800J805j8065J6552k941q207J3528j0682M52Q291q874P584l893n036J3028
1389E342j0908L220R175j9220J6246M725k2478K2646n767j5781K8349j5376j0903
1402a0730K4582j6906J393J4534j9280Q516M995p986Q938r682K236R513j3427
1415c304R985q27j4615K1155o846j3027J8850j3040k157J8273j8692J46J4223
1428A0124j5516P758M852j6877J1556L289j0658P888l089n857R805l396l966K423
1442a664k758N198j551n296O266o012Q78J2001j6223J14J7273j7990N951J3070
$$ plain form
1347 2578 12168 -7552 4140 9871 -6530 2827 5795 -3767 2760 2180 -1637 -121 -976 3814 -3549
1362 -3549 -5058 6280 -5941 -4739 8306 -11251 -4692 10714 -12973 -2896 6162 -14732 1800
1375 1800 3605 -14460 2092 -849 -9056 4472 -6210 -5758 2533 -6341 1243 -2650 -7686 5342
1389 5342 -5566 -2346 6829 -12391 3855 8580 -13898 8748 2981 -12800 15549 173 -10730
1402 -10730 13852 -3054 -1661 12873 -6407 2109 7104 -882 8056 -1626 610 10123 -3304
1415 -3304 6681 5854 -8761 12394 5548 -7479 11371 -1669 -3826 14447 -4245 -4099 10124
1428 10124 -5392 2366 7218 -9659 1897 5186 -5472 2416 -673 -6530 3275 -121 -4087 -1664
1442 -1664 -4422 776 -775 -6071 195 -5817 -4939 7062 -9161 -9047 8226 -9764 -3813 9257
1456I257k5891J3637J4853k5612J3807M268j8551K1748n278j2531J5446j0266
1468e113O103O256j7252J5280l212q825K1633k1550j45K4616k7195J2586J1116
1481A4298l1024K6909K384k6477K8293j2747j1995L0487k2651k925J9291k0694
1493f851J2539M244j9367J6849n804l545J4228k1438R113J1310k1419J8015m045
1506C829j9414K8067j0043j5482K3697j6673k227K1290k1701J487J3658j4591
1518h103P597L750j4415J1022J306p956Q659o758j536J0292q837J987L633r576
1532h935J1316m07j1984J4458p708n004J9726j7769k065K0649k0686O807J4839
1545A3237k7078J5306J1282k3251J6453j605j2840J9359r796m220J1233j3241
$$ plain form
1456 9257 -16634 -2997 11856 -13756 51 4319 -14232 7516 2238 -10293 5153 -5113
1468 -5113 990 7246 -10006 5274 2062 -6763 14870 -6680 -6825 17791 -9404 3182 14298
1481 14298 -16726 10183 12567 -13910 14383 1636 -10359 20128 -2523 -5448 13843 -6851
1493 -6851 5688 9932 -9435 7414 1610 -1935 12293 -9145 -32 11278 -10141 7874 3829
1506 3829 -15585 12482 2439 -13043 10654 -6019 -8246 13044 -8657 -7170 6488 -8103
1518 -8103 -506 3244 -11171 -149 1157 -6799 1860 -4898 -6434 3858 -4979 -2992 641 -8935
1532 -8935 2381 1974 -10010 4448 -3260 -8264 11462 -6307 -8372 12277 -8409 -1602 13237
1545 13237 -13841 1465 12747 -10504 5949 4344 -8496 10863 1067 -3153 8080 -5161
1557e161J2396l93j5682K1008j1817o329K4727k6295K877K4143l0344J3558J2228
1570A4916l0152K3470J909k2749K3353j0002r564K1048j6439Q09J0854j5716J1937
1583C674l94j1843J4067r333q15J2845j8429P723R273j9057J5818o60j8444K2442
1597F867n745j4952K1480j1735o466J9886j5564j700J4190j2661L762N965j0425
1610g098P804J9n564Q308o935J758P200j1552P932L126j2821J3833k222j1552
1624g764J7467r458o827J9454j5410j217J6185j7616O234J0323j8167J0067M545
1637G816j2487J0759l897m095Q713p882L611J317q309J2220o830p463J7307j4376
1651c596j751J8049k0648M221J6161k2471Q625J0504j9366J1692L235j3566J1005
$$ plain form
1557 -5161 7235 6842 -8840 12168 351 -5978 18749 -7546 -4669 19474 -10870 2688 14916
1570 14916 -15236 8234 10143 -12606 10747 745 -8819 12229 -4210 -3401 7453 -8263 3674
1583 3674 3280 -8563 5504 -3829 -4644 8201 -10228 -2505 6768 -12289 3529 2869 -15575 6867
1597 6867 1122 -13830 7650 -4085 -10551 9335 -6229 -7929 6261 -6400 -2638 3327 -7098
1610 -7098 706 725 -4839 3469 -3466 -1708 5492 -6060 1872 4998 -7823 6010 3788 -7764
1624 -7764 9703 245 -6582 12872 -2538 -3755 12430 -5186 1048 11371 -6796 3271 7816
1637 7816 -4671 6088 2191 -1904 6809 -1073 2538 3855 -4454 7766 936 -6527 10780 -3596
1651 -3596 -5347 12702 -7946 -3725 12436 -10035 -1410 9094 -10272 1420 4655 -8911 2094
1664B094k082n330O547m996K717N83n816Q772n669k655J0771j1718K487J0534
1678F239j5295P396O845j5366J2301J606j4111J5013l075r619J3800o818m013
1691e097J1197q227o6O720o247L492j67k175M682n459L237L050q813Q617N53j0974
1707e677J2533k745r951J4250o697o230J3403q904k687J0266q642O85N548o995
1721a843L582M56l246L237l336J767J458n850O271j709n943R986p130l645J2259
1736F314j0671r89J2076j3242K613R877j3776N461O658j1519N877K656o418M116
1750i67l57j098J006j694M697m706j270R510j0118J311J0433j3119M388R689j5452
1765g747P836O920j4221R774J752r773J0119k361m879P383m708N87L257n266M989
$$ plain form
1664 2094 12 -5318 1229 -3767 -1050 -467 -6283 2489 -3180 -5835 4936 -6782 -4295 6239
1678 6239 -9056 -1660 5185 -10181 2120 3726 -10385 4628 1553 -8066 5734 -1084 -5097
1691 -5097 6100 -2127 -2193 4527 -1720 1772 1605 -570 4112 -1347 1890 4940 -3873 4744 5297 -5677
1707 -5677 6856 4111 -5840 8410 1713 -4517 8886 -18 -2705 7561 -1081 -396 5152 -1843
1721 -1843 1739 2195 -1051 2186 -1150 617 2075 -3775 2496 787 -5156 4830 -2300 -5945 6314
1736 6314 -4357 -5346 6730 -6512 -3899 5978 -7798 -2337 4321 -7198 -1321 1335 -5083 -967
1750 -967 -1324 -2422 -1416 -3110 1587 -3119 -4389 5121 -4997 -3686 6747 -6372 -1984 7705 -7747
1765 -7747 89 7009 -7212 2562 4314 -5459 4660 2299 -2580 4803 95 682 3939 -1327 3662
1780C662j847k578O380o434J679N508r624O079K986j0795R880j080r567J2973
1794G222n257p663J3066p732l818J0778r057R3P057p685K330K050m349M327l067
1809a705l00L950p192N745J690j0051J0506k076r548J3897o674p137J5306j0352
1823c941k851J3461j3511L018R748j3332O694L723r886R574k500m718P799o494
1837c216L416L002q871J0030l565o134J4112j1797j482J6053j6769L810J2404
1850A0993j9002J0330P365j7055J1550J437j0787J1930m716m745Q209o353L355
1863B511J200p504Q794l998l674R941j0245P71J0441j2710M184N811j2456R307
1877B373K582j2522R887q63q042J1601o046n719J0718n916j967P159q433K569
$$ plain form
1780 3662 1815 -763 5617 -817 862 6370 -3254 2825 5811 -4984 4896 3816 -5751 7222
1794 7222 1965 -5698 7368 -364 -4182 6596 -2461 -2368 4689 -2996 -666 1384 -2965 1362 -1705
1809 -1705 -2005 1945 -5247 498 2188 -7863 2643 567 -8981 4916 -1758 -8895 6411 -3941
1823 -3941 -6792 6669 -6842 -3824 5924 -7408 -714 3009 -6877 2697 197 -4521 3278 -3216
1837 -3216 200 3202 -5669 4361 796 -5338 8774 -3023 -4505 11548 -5221 -1411 10993
1850 10993 -8009 2321 9686 -7369 4181 5618 -5169 6761 2045 -2700 5509 -844 2511
1863 2511 3711 -3793 5001 1003 -2671 7270 -2975 -2204 8237 -4473 -289 5522 -6934 2373
1877 2373 4955 -7567 2320 1457 -6585 5016 -1030 -6749 3969 -1947 -3914 3245 -5188 -2619
1891b619N358p277L943p85l206P588o299J70N910r743P615L858j4420J2679j74
1906B598j1961J6450p700q799J8235j0495l469J3455j4225M768Q875j2996P938
1919B674n98o398J1528q362o98Q286j1228R409J295j3457J5037n205p788J7113
1933A1608j4987j148J6583j6725M302R208j6634J0793M647j4233R945j764m862
1946c267Q192o084n55L690m741O219l685m982R172o051r84Q119j0890K032R677
1961E862j0996K668N531j0165O898L894j0358N784J703n997P028k283n277P102
1975A394k647r97M275o221L147L305n199M646l079j834Q355p268L4O861j0182
1990e410P850L884j4056J1671O75j0932J3986o292p948J5070q575k129Q800r609
$$ plain form
1891 -2619 2739 -4538 -595 -1380 -4586 3002 -3297 -3127 2783 -6960 655 4513 -9907 2772 2598
1906 2598 -9363 7087 -613 -9412 8823 -1672 -5141 8314 -5911 -1143 7732 -5264 2674
1919 2674 2076 -4322 7206 -1156 -1854 6432 -4796 4613 5908 -7549 7488 2283 -5505 11608
1933 11608 -3379 -4527 12056 -4669 -367 8841 -7793 3000 7647 -6586 3359 1595 -3267
1946 -3267 4925 -1159 -1714 1976 -2765 3454 -231 -5213 3959 -2092 -3076 5043 -5847 -3815 5862
1961 5862 -5134 -2466 3065 -7100 -202 3692 -6666 -882 821 -5176 1852 -431 -5708 1394
1975 1394 -1253 -2250 2025 -4196 -1049 2256 -2943 1703 -1376 -3210 5145 -2123 -2089 4772 -5410
1990 -5410 2440 6324 -7732 3939 4614 -6318 7668 1376 -6572 8498 -77 -2206 6594 -3015
2004c015M203L906p034N354l636l85O769r252M855K983j0550J1647k450j0665
2018g270J4082o719m997J3256j1963p29J1186j0777K876M705q856O017J114n520
2032c595L687j920P86J823l905L000j745j496O212n848j547P782o874R20O504
2047C784q929K631O321q094K664M502p122L581L335n783K325K177l012K645m07
2062F18j210J246p43K279j417k190M568k841q27M641n644J234N868p412K775L793
2078D738q011O514J059q119P727j578m702O816m145j945N232l737O27R57k110
2093f77K689l266J639K193o560N531O88p812Q640k048p578J0886m555n701J0007
2108D076o177k116P536o308q4M343l782J565j59r84J974k344K169J9l784N737
$$ plain form
2004 -3015 1188 5094 -1940 3414 -222 -607 6162 -3090 1765 4748 -5802 5845 3395 -7270
2018 -7270 6812 93 -4904 8352 -3611 -4340 6846 -3931 -1055 3650 -5206 811 1925 -3595
2032 -3595 92 -1828 -1042 781 -3124 -124 -1869 -3365 2847 -3001 -4548 3234 -3640 -2720 3784
2047 3784 -5145 -2514 3807 -4287 -1623 2879 -4243 -662 2673 -3110 -785 1392 -1620 1025 618
2062 618 -592 654 -89 2190 773 -1417 3151 310 -517 4124 -1520 -286 5582 -1830 945 4738
2078 4738 -3273 3241 4300 -3819 3908 2330 -2372 4444 299 -1646 3586 -151 476 1433 -677
2093 -677 2012 -1254 385 2578 -3982 1549 2237 -5575 3065 1017 -6561 4325 -230 -5931 4076
2108 4076 -2101 -4217 3319 -2989 -3073 1270 -2512 -947 -1106 -2090 -116 -2460 -291 -272 -4056 1681
2124A681j989m400P764m289k580Q421p200j88P339p530J861N365p339L438K842
2139C196n708L687J093k853K276r84J09Q92k229L451j686k494N631m728o47O464
2155E470o834O72O579q417K897M941q499M338K494o980N227l85l803M884k982
2170c98p73K949l713K417K52l386M534l264j112M729n614J911M170p824N238J896
2186B012q454Q350j565o836R523l908m845R400n929j722P208o291J230L466m211
2201b572K877p02j186L648m518K651K432o929O664j44p181R626l242n988J0402
2216E838n779l386R940p937Q1O892p621K971L049o234M903o37l231M629l510L29
2232B97L386n785L906P54n438O560l159l578Q021o253j803Q438q721J796O603
$$ plain form
2124 1681 -308 -4708 3056 -1233 -3813 4608 -2592 -2780 4559 -2971 -1110 4255 -3084 354 3196
2139 3196 -2512 1175 2268 -585 1691 707 816 1708 -521 2930 1244 -1250 4381 -347 -994 5470
2155 5470 -1364 -692 5887 -2530 367 5308 -3191 1147 3641 -3339 1888 1503 -2300 2584 -398
2170 -398 -1171 1778 -1935 482 734 -2652 1882 -1382 -2494 2235 -3379 -1468 2702 -5122 116 2012
2186 2012 -6442 1908 343 -6493 3030 -878 -5723 3677 -2252 -3974 3234 -3057 -1827 1639 -2572
2201 -2572 305 -397 -1583 2065 -2453 198 2630 -4299 2365 2221 -4960 4666 1424 -4564 5838
2216 5838 59 -3327 6613 -1324 -1243 5649 -1972 999 4048 -2186 2717 2080 -1151 3478 -32 297
2232 297 3683 -2102 1804 2558 -2880 3680 521 -3057 4964 -1289 -3092 5346 -3375 -1579 5024
2247E024r593L967M292q632N513J027n999N948k396k108M608m437J657J973m971
2262d127M968j068m880P929n007j767P982q155K213N817r674N759L424r545Q757
2277B626j205p278J0197m615l646Q649o527O71N290o821L741Q79m009N355l909
2292f02r5N086o973M379K535q952Q399k03q408J0334l907n935J0323n635k993
2307b647P717o008L52M660n659J945J530k951K615j976n76K826l355J633J750
2322A856n642M675M69n401O044k361m232P702m337k717O867n401n15O633p491
2337c851J373M959o264L502J222n290N101n07k891L861m016K735J764n513N968
2352B153k192m060Q854n754k677Q851p939J753O624j0134N204L744p983O644j226
$$ plain form
2247 5024 -4569 -602 3690 -4942 571 1598 -4401 1547 -849 -2957 1651 -2786 -1129 844 -4127
2262 -4127 841 -227 -5107 2822 -2185 -3952 4030 -4125 -1912 3905 -5769 -10 3414 -6131 2626
2277 2626 1421 -5857 4340 -275 -3921 4728 -1799 -1128 4162 -2659 1082 1961 -2048 3307 -602
2292 -602 -697 4389 -2584 1795 4330 -4622 3777 3574 -4834 5500 1593 -4342 5981 346 -2647
2307 -2647 5070 -938 -586 4074 -1585 360 1890 -1061 1554 -422 -998 1828 -1527 106 1856
2322 1856 -3786 889 1358 -4043 2001 -360 -4592 3110 -1227 -3944 2923 -2478 -2993 3640 -3851
2337 -3851 -2478 2481 -3783 -281 941 -4349 752 245 -2646 1215 -2801 -66 1698 -3815 2153
2352 2153 -39 -4099 4755 -999 -3676 5175 -2764 -1011 5613 -4521 683 4427 -3556 3088 1862
2367A862n077P641l756j659M913n254K905J682m688M129k400j002N301o303J981
2382B75L481o947O009K1p356P350q96n337O790l282l444O402l008k315K850j445
2398h52J50J130j261k73l75J543J71k795J792N93k427L088l75l971M043Q27m390
2415c382L750n35l642N354j002m187M858j758j246M162l690m44L363k808J838
2430F31o8k120L339j776K52J798m246L949Q13m725N420k945k584P617n696j053
2446a394N893o397K843L553o992M053J133l715L886k889n50K829k969K665j087
2461H62l110N416l187j404M498n985K769L546o844L546J054m709N491j744l929
2476c730M985j765j573L040l046N31J604j268O62j358Q76J103j958J958q8k997
$$ plain form
2367 1862 -3215 4426 670 -989 3924 -1330 1575 3257 -1431 2698 298 -704 4597 -1706 275
2382 275 3756 -3191 2818 2839 -4517 2833 1937 -3400 3390 108 -3336 3066 58 -2257 593 -852
2398 -852 -702 428 -833 -1106 -1481 62 233 -2562 -770 -177 -2604 484 109 -3862 181 1008 -3382
2415 -3382 368 -167 -3809 1545 543 -3644 1214 -544 -1790 2372 -1318 -1762 1601 -1207 631
2430 631 563 -1557 1782 6 258 2056 -2190 1759 2572 -2153 3267 322 -2262 5355 -341 -1394
2446 -1394 4499 -1898 945 4498 -2494 1559 2692 -1023 2863 -26 -576 2253 -716 1949 862
2461 862 -2248 3168 -19 -1423 3075 -2910 -141 3405 -3439 107 1161 -3548 1943 199 -3730
2476 -3730 1255 -510 -2083 957 -2089 -1558 46 -1222 -560 -1918 -1042 61 -1897 61 -27 -3024
2492c024M042p01l099L626o70k441L853j419k860L811j95k477K760j207j548L117
2508A568o93j210Q77n81J141j62r06J378j469J187J168l428K276J399m100M080
2524B525r34l763N577k457k629N578m638k9M254n318K372J634m085L382o65k395
2540a591L367k621N48J995m321L303o53k892N116l884j067N660n817R38M413o845
2556d351L961K258o129M713J4l961M976k453j750M086k970M82J582k798K900q45
2572b85j769L458k651L94K874m170K100K474n102M079Q59m925N005j114l631N478
2588C074k200k477M689k875o12L157l132J156J093k113J977j064q66L256l732
2603f69R44K559n002L500J248n853N601n87n100O013k580k760N572m268m71M255
$$ plain form
2492 -3024 1018 317 -2782 844 174 -2267 1586 167 -2693 1118 923 -1554 1206 -1 -1549 1568
2508 1568 875 -335 542 -39 1102 940 34 1412 -57 1130 2298 -1130 1146 2545 -1555 2525
2524 2525 1591 -2172 3405 948 -1681 3897 -741 -770 3484 -1834 538 2172 -1913 1469 804 -1591
2540 -1591 1776 -845 -297 1698 -2623 680 27 -2865 2251 -1633 -2700 2960 -2857 -1919 2494 -4351
2556 -4351 -390 1868 -4261 452 466 -3495 1481 -972 -2722 1364 -1606 -1124 458 -2340 560 -285
2572 -285 -2054 1404 -1247 -853 2021 -2149 -49 2425 -2677 1402 2261 -2664 2341 1227 -2404 3074
2588 3074 874 -1603 3086 211 -401 2756 -376 780 1873 -240 1737 673 -193 3063 -669
2603 -669 275 2834 -2168 1332 2580 -3273 2328 1741 -3359 2654 74 -2686 2886 -1382 -1853 2402
2619B402m778J935J904m444L795o06k834L832k652k60L119m239K554R49l808M089
2635I58j681k557N827m209p57N258n611J365M016o066L257K475n384M008K24l352
2651b229M017j839j231L510l009J141J235l115L397j148j924M125l257j97M213
2666C689n007J666L099n402L105J632n011M492l81m269N237k261k024L987l102
2681e50K11K539l296J639K42k084L010k383n24L325m067J447K569n167L392J355
2697A658n819N148k36m561N324j953k662M687l175k92L205l563J777N18k119K682
2713F19j618j282L624l415J493K372m447L164Q45m054M423j445k580N119l426
2728f08q98M533m518J357L007m568K770J107l631L170k10k030K622k038K97J400
$$ plain form
2619 2402 -2376 -441 1463 -2981 814 208 -2626 1206 -1446 -1706 1413 -2826 -272 677 -3131 958
2635 958 -723 -3280 2547 -1662 -2419 2839 -2772 -1407 2609 -3457 -200 2275 -3109 899 1123 -2229
2651 -2229 1788 -51 -1282 2228 -781 360 1595 -1520 1877 729 -1195 2930 -327 -524 3689
2666 3689 -1318 348 3447 -1955 1150 2782 -2229 2263 1882 -2387 2850 589 -1435 2552 -550
2681 -550 -339 2200 -1096 543 785 -1299 1711 -672 -1196 2129 -1938 -491 2078 -3089 303 1658
2697 1658 -4161 987 751 -3810 1514 -439 -3101 1586 -1589 -1881 1324 -2239 -462 56 -2063 619
2713 619 -999 -2281 1343 -2072 -579 1793 -2654 510 1355 -2699 1724 279 -2301 2818 -608
2728 -608 -1506 3027 -1491 -134 2873 -1695 1075 2182 -1449 1721 1511 -519 2103 65 362 1762
2744A762k035J849m65j681K677k056m65L095l238J95L323m596J626K141l748J940
2760C24J191k995K310K28k740K109n50q25J431j592M09N97j350J497p35j053K316
2777E72j830j79K401l215J258K159m117K643J295m152L668J72l349L789j294j351
2793a530K866k240J80J646j866J560n39j169L010k597N70K035l747K682J232l988
2809a895L748o88k715M613k558j324L360k903Q59J574k645J797J77j772K028j425
2825B31m7J550j985J334n12j466K631j787o18K138k703J076J683l395J555J301
2841I86k447J490L14k359J552J061j775N35M6k22J45K14k62o83Q67K99n24k92
2859a055M99n00N28Q89j638L01J808j831O13J338k925K010J323k864K384k81k021
$$ plain form
2744 1762 -273 1576 1111 -570 2107 51 -414 2681 -557 -362 2961 -1635 -9 2132 -1616 324
2760 324 1515 -1480 830 1058 -1682 427 -123 -948 483 -1109 -700 -103 -1453 44 -691 -1744 572
2777 572 -1258 -1437 964 -2251 -993 1166 -2951 -308 987 -3165 503 675 -2674 1115 -179 -1530
2793 -1530 1336 -904 -724 922 -944 616 77 -1092 1918 -679 -109 1926 -1821 861 2093 -1895
2809 -1895 1853 1165 -1550 3063 505 -819 2541 -362 497 2071 -574 1223 1400 -372 1656 231
2825 231 184 1734 -251 1083 571 -895 1736 -51 -669 1469 -1234 -158 1525 -1870 -315 986
2841 986 -1461 29 343 -2016 -464 597 -1178 -643 -597 -819 -674 -460 -722 -1405 -538 -239 -763 -1055
2859 -1055 -556 -1056 -528 361 -1277 -976 832 -999 -386 952 -1973 37 1360 -1504 880 599 -1422
2876a422L300j549j077J963j424P72P87j816J801q73m15K298l231J051K341l711
2892a205K592O01m237M657r59l243M477k915n45L765m212J267J262k493K806j451
2908A67j505K745k302M89J784l583K457M08k808L526k276j214L871l333L73K464
2924A263l921K156J570l828K517J19j888K441q20j358J832m63k34M69r66R53n4
2941b12l91J133j561K22K177k003J05J776k074R65J897l203J158K107l081J823
2957H38R07l346L099rk300K630j621k85J881k010Q41N95k238L034j461j473L410
2974B492l341M34L349m857K187J682m117L996r44l647N002k478j530L752l459
2989a479O89K226l370J744P7j732L063k326l43K417l260K034J073l836L514j30
$$ plain form
2876 -1422 1878 329 -748 1215 -209 563 1350 -466 1335 462 47 2345 -886 165 2506 -1205
2892 -1205 1387 1988 -2249 2408 1449 -1794 2683 -232 -777 2988 -1224 43 1305 -1188 1618 167
2908 167 -1338 1407 -895 -406 1378 -2205 252 660 -2148 1378 -898 -2112 1759 -1574 -1201 1263
2924 1263 -2658 -502 1068 -2760 -243 -124 -2012 429 -391 -1749 83 -380 -614 -145 -1111 -158 -212
2941 -212 -603 530 -1031 -809 1368 -635 -530 1246 -828 137 2034 -1169 -11 2096 -985 838
2957 838 1745 -1601 1498 1489 -811 1819 198 -87 1794 -216 625 1220 -1018 2016 555 -918 2492
2974 2492 -849 -415 2934 -1923 264 1946 -2171 1825 881 -2766 2236 -242 -1772 1980 -1479
2989 -1479 -790 1436 -1934 -190 -113 -1845 1218 -1108 -1451 966 -2294 -260 813 -3023 491 361
3005C61l109M132k029j750M114k878k52K999l435J528J728k960J857N39k222K387
3021A010o40j109J758j179K90O98j128R14M93j753K404j480j060L402k526o67
3037e73L181l255O84K575l959J717K150l633J941O06k266K174p56j146J643j523
3053d40M34Q69k245K681j196j816L312k268n50L273l728P79K758m461K452J272
3069A126l628L034k12k845L361j354j333K696j870K87J147j906J160J65j262K268
3085H34j968K10J948k428J389J034l019K636N01l227L554j092j974L460j958p65
3101h65K800k535M37J702j957J052M01j431J671q79m04J428j510R06R44k310J424
3118H74J77j727K302j363r70K804k329k92K465k893P12J709k956J719O99k199
$$ plain form
3005 361 -2748 1384 -645 -2395 1719 -1159 -1411 1588 -1847 -319 1409 -1551 306 845 -1377 1010
3021 1010 370 -739 1019 -160 130 828 -300 614 1107 -646 1758 278 -782 2620 94 -573
3037 -573 2608 -647 37 2612 -1347 370 2520 -1113 828 1434 -832 1342 586 -560 1083 -440
3053 -440 -6 863 -1382 1299 103 -1713 1599 -669 -1219 2054 -1674 -895 1863 -2598 -146 1126
3069 1126 -2502 532 320 -2525 836 -518 -1851 845 -1025 -738 409 -1497 -337 -172 -1434 834
3085 834 -1134 -924 1024 -1404 -15 1019 -2000 636 1137 -2090 1464 372 -1602 1858 -100 -865
3101 -865 1935 -600 -163 1539 -418 634 1035 -396 1275 396 -8 1420 -90 816 1760 -550 874
3118 874 1051 -676 1626 263 -707 2097 -232 -524 1941 -952 -240 1469 -1487 232 931 -1268
3134a268J511k95q70J084r59K44O84j342J572q99r37K036j413r63K768k249J0
3151a286K626l258J188J743k710J234P95j795J517p1j050J333r44L80O62j013
3167f49J138n76m27J469j407M54J415k057P47J412k435J820L56k248K399o45j341
3184e75K062q76r20J798j282j38J114r64M96Mn71M48n05K26L44p91Q41P8j799
3203a010J798m12j292J651j006p48J812j201m06J470j214k5Q99j492O00O73j286
3220a189Q81Op03O70n47M15M40r38J305r15q56K172j556m05K390k213K33K202
3238A392k895J304J326k514J530O89j590J479m63n66J074q74Q50j86j065J864
3254A355r39m77K058k335L75J987k770J077J431k970K542j67k315K442j174o57
$$ plain form
3134 -1268 243 -52 -922 162 -797 -553 131 -1211 361 -538 -1475 561 -852 -1815 953 -1296 -1286
3151 -1286 1340 -1918 -730 1013 -1697 -463 332 -1463 54 -17 -1067 266 -678 -298 364 -649
3167 -649 489 -87 -514 955 -452 2 1417 -640 107 1519 -916 904 1260 -988 1411 766 -575
3184 -575 1487 611 -309 1489 207 69 1183 219 715 719 148 596 91 317 661 -130 711 789 -1010
3203 -1010 788 376 -916 735 -271 -1019 793 -408 -814 656 -558 -583 316 -1176 -576 97 -1189
3220 -1189 -308 -302 -1005 -335 -882 -467 -27 -965 340 -575 -1431 741 -815 -1220 1170 -1043 -810 1392
3238 1392 -1503 -199 1127 -1387 143 832 -758 721 258 -308 766 -108 742 556 -509 1355
3254 1355 416 -61 1997 -338 37 2024 -746 331 1762 -1208 1334 1167 -1148 1294 120 -537
3270e37J952j447j87J305j540J003k48p39J009p67j85Q84j737J451O5j788J752
3287B46j60j841K686j348j494K446j503j7J673j525m14J629j265K39N43q85N21
3304d69O03p71O7K7K94O93j085L86N87j364J720l15j694K468r52j230K947k229
3322c17n10L114k913O54K122l318J792J054k599K031n01o42K062k301R59N75k043
3339g81K670j293j835L385k445o10L724m327J300K666m035K016O42k953K904q06
3355B22j684K607k186N22J485k160J076M7j326K070j391m96J882j961N20J373
3371F00k270J351R69k285J615m6j760K649q30j421J900j043n45K035j552m8J312
3388F31p75j15O63j046R00J22l19P80j233L45J531j873Q27Q84k433K367J14k693
$$ plain form
3270 -537 1415 -32 -219 1086 -454 549 301 -438 571 -196 -381 503 -1234 217 282 -1506 246
3287 246 86 -1755 931 -417 -1911 535 -968 -985 688 -837 -1251 378 -887 -648 -105 -990 -469
3304 -469 134 -637 -570 -543 -249 444 -641 -255 332 -1032 688 373 -1321 1147 195 -1035 1912 -317
3322 -317 -827 2287 -626 28 2150 -1168 624 1678 -921 1110 609 -33 2029 -272 687 1262 -781
3339 -781 1889 596 -1239 2146 -299 -909 2815 -1512 -212 2454 -1581 435 1077 -1876 1028 222
3355 222 -1462 1145 -1041 -519 966 -1194 -118 -71 -1397 673 -718 -1214 668 -1293 -773 600
3371 600 -1670 -319 650 -1635 -20 -66 -1826 823 -7 -1428 472 -571 -1116 919 -633 -681 631
3388 631 -144 -259 404 -642 258 380 61 841 -392 -47 1484 -389 438 1322 -1111 1256 1370 -1323
3406a323L171j161j558L563k925m90L056l052R97J520l116K346j68j538K268j700
3422a10J40J614k649J507K48k631L411j598j758L819k748n25L253l419P55K088
3438A397l240J919N63k544K481r22r77J577j311O61M14j519J622m71q87K154j439
3455e22p86K118j592L02J616k312J008J215k281J355L48j475J687k48j088J468
3471H13n89o55J722j220RQ46p08N10k49o13Q40n10L22P98j771R77P81k163J595
3490G35M95k311K169m2k249K648j036j292K434j801k06J494j450N80J84j018R91
3507C25o49k04J037j793J241M83k090K057l75j716K508j438j114K916k065l87
3523a264K077j990K43J525j552N13O12r71P85r4j15L71r99J089k2j071J493n74
$$ plain form
3406 -1323 1848 687 -871 2692 -233 -723 2333 -719 278 1798 -1318 1028 860 -678 1590 -110
3422 -110 30 1644 -1005 502 750 -1881 1530 -68 -1826 1993 -755 -1280 1973 -1446 -691 1397
3438 1397 -1843 76 639 -1905 576 -346 -1323 254 -1057 -396 18 -1501 121 -350 -1237 917 -522
3455 -522 -1308 810 -782 -480 1136 -1176 -168 1047 -1234 121 469 -1006 681 433 -655 813
3471 813 224 -431 1291 71 80 926 218 728 479 -134 706 196 518 1316 -455 522 1303 -860 735
3490 735 1230 -1081 1088 1046 -1203 1445 409 -883 1551 -250 -456 1038 -412 168 352 -666 325
3507 325 -324 -528 509 -1284 -43 440 -1650 407 32 -1684 824 -614 -1728 1188 -877 -1264
3523 -1264 813 -1177 -934 591 -961 -448 164 -807 -22 -116 -231 140 -859 230 208 -863 630 56
3541E6p83J988j520j76J749j698N10J165j742O57J032j570P64K49p70R57m12m39
3559A7R39p53K81K59p82Q61o15l40P57p14J55J149j738P91M14j504J273J69j746
3578a127J603l08j120J327n95o02J245j115L94L54p52N16m98R1N82o72M19J46
3596a12j010J459k34j674K014n38j246K164j252o86J880j217l78J453j013P1J019
3613G00r43Q06l57l27K91m56N45K66q07J336n50q10J698j248o16J821j504j23
3631b78J801j558K50J241k000R95M72j434J121j98n46P72q86L61L83r69R44l52
3649A19p42J387j013l97J524j530J12J318j944J028P59j896J312k6j431J616o34
3666d38r74J688o16n70J369j318M37M99j084J010n64j10J235j569Q27J041j877
$$ plain form
3541 56 -727 1261 -259 -435 1314 -384 126 1291 -451 206 1238 -332 432 681 -89 868 456 17
3559 17 956 203 484 743 -39 822 207 -133 624 -90 65 1214 -524 267 681 -823 450 619 -1127
3578 -1127 476 168 -952 375 -220 -822 423 -692 -298 56 -696 -180 -678 -587 -5 -677 -258 -112
3596 -112 -1122 337 103 -1571 443 -95 -1341 823 -429 -1115 765 -452 -830 623 -390 -319 700
3613 700 -243 563 206 -121 170 -286 259 525 -282 1054 504 -306 1392 144 -472 1349 -155 -278
3631 -278 1523 -35 215 1456 -544 451 923 -511 610 412 -134 638 -248 113 496 -473 471 119
3649 119 -623 764 -249 -646 878 -652 -540 778 -1166 -138 621 -1275 37 11 -1420 196 -438
3666 -438 -1412 276 -340 -910 459 -859 -422 77 -1007 3 -561 -671 564 -1005 -178 863 -1014
3683a014J338M14k188K321J3k407K664o91j657K558j464k97J956j605K97L51q60
3700b71J093n45k58J222j376M78P49k025J917l15j668K399q17j642K651j669p36
3717h13K393k030K10J387j886P51P40j500O65J11m43N48n60k02R55j166Q35j71
3735a76q02J308m59j077J934j320o57K327j810k2J553j875P61R28k035J252P02
3752E32j544J320m05r05J725r26l63J307j466J010L72j320J466j035m48K230k299
3769g49M19K075k846J482J169k750K136J61k202K586j307j043K366j663j48J584
3785A270j858J237k84q80J651j445P7J686k584J417N76k338K379l67k110K571
3801I98r44j517K298j447m59J992j691j8J050r99N94J2o77N93m62P28o8o52N35
$$ plain form
3683 -1014 324 738 -1450 871 884 -1523 1141 450 -1207 1351 -113 -410 1546 -59 238 589 -271
3700 -271 822 277 19 1241 -135 343 1092 -933 984 669 -999 1400 583 -1059 1592 -77 -813
3717 -813 1580 -450 -240 1147 -739 12 752 -748 -83 28 -415 133 -427 -629 326 -840 -5 -176
3735 -176 -978 330 -129 -1206 728 -592 -1249 1078 -732 -754 799 -1076 -315 613 -1422 -170 532
3752 532 -1012 308 -97 -1002 723 -203 -566 741 -725 285 657 -663 803 -232 -680 1550 -749
3769 -749 -330 1745 -1101 381 1550 -1200 936 1097 -1105 1481 174 -869 1497 -166 -314 1270
3785 1270 -588 649 365 -515 1136 -309 -232 1454 -1130 287 863 -1475 904 537 -1573 998
3801 998 54 -1463 835 -612 -1071 921 -770 -788 262 -737 -143 -131 -808 -215 -677 51 -17 -669 -134
3820a34K02p81R12q0j135J231p3j066J372n90q72J733p37o31J607r67l51J324
3838I64j336J70P51r88J051l51p81J361r42J21Q67j367J150L07j690J860r38q26
3856f17K384k126L5J820k398J492P58k470J750M9j563J816j157n26J765j617Q40
3873B35j76q05J468j008l30J229j711R09J106k101J217K53j662J744n68j078J590
3890C12m13p82J135o65k38M16l9J03j90Q2L32n78M20P8m35N61J32n63L78L34o41
3911b61O24k17n35J116m25n78J113k80o62Q62n40l13P19l35k18O03p23M60J97
3930F07n65L23k07J63L25r74P92m2q46J229o16o99J481j259j39J652j719K83Q54
3949F43j432R78J91j215R73m47p4N02p38J90K66o15J151r68k4J091j500M87R37
$$ plain form
3820 -134 68 -713 199 119 -1016 215 142 -924 448 -142 -1014 719 -18 -649 958 -9 -360 964
3838 964 -372 -202 549 -439 612 261 -520 841 -101 20 887 -480 670 977 -713 1147 209 -617
3856 -617 1767 -359 -324 1496 -902 590 1348 -1122 628 677 -886 930 -227 -753 1012 -605 235
3873 235 59 -746 722 -286 -616 613 -1098 -189 917 -1184 33 286 -1376 368 -200 -1278 312
3890 312 -101 -883 252 -413 -651 -235 -274 -171 -361 -279 53 -525 -105 -27 -462 99 231 -332 46 380 -261
3911 -261 363 146 -389 727 302 -276 837 557 -105 757 217 -96 623 288 70 673 -50 410 607
3930 607 42 365 158 321 646 -328 464 422 -424 805 189 -510 971 -288 -427 1225 -494 -211 643
3949 643 -789 189 380 -835 138 -309 -383 119 -619 -429 -163 -778 373 -595 -619 472 -1028 -541 396
3968C96j548J216O11j898J570l6j433J632o08q47J201n09J4M69n19L80o6r9N61
3987D87p05L82L73p08N27L02j283J229O3j367J468l20p41J018l94o72R62k70o49
4006b98R30j105N99M29o02M26k78m1L29o76L60M07j091J032j03j249J364n21r81
4025a069J902j246k86J419j315J36R10j371O46O35j031M61K47o58N36n31J10N78
4043G3j041J014k49o12J370q02m96J400j247j0J423j471O54P80j587J025J57j192
4061h11J555k23j039J095l24m33R11p98M95J00n57Q74q54J42Q34j428O65J006
4079A210k178J463M24j797J464J04j709J500q3j043J271n73o04R78o56L01J2m82
4097c98O79m48m30Q32o86Q5R64j636R93N06j396J063r2j352J647n75p84J448j136
$$ plain form
3968 396 -1152 64 675 -1223 347 311 -1122 510 -98 -945 256 -253 -239 230 -289 91 25 -74 487
3987 487 -218 164 537 -171 356 658 -625 604 667 -700 768 448 -293 725 331 -341 621 351 -298
4006 -298 632 -473 126 555 -47 379 101 60 389 -287 73 480 -611 421 318 -931 433 -88 -1069
4025 -1069 833 -413 -699 720 -595 -459 451 -920 -274 361 -670 -209 38 -620 -84 -615 -505 73
4043 73 -968 46 -203 -815 555 -247 -743 657 -590 -600 823 -648 6 786 -801 224 381 -811
4061 -811 744 521 -518 577 253 -180 731 -67 428 528 -29 845 -9 133 967 -461 204 1210
4079 1210 -968 495 919 -878 586 690 -1019 481 398 -645 626 53 -551 427 -229 72 84 -398
4097 -398 281 -167 -597 235 -451 -366 598 -1038 -45 461 -935 128 36 -1316 331 -244 -1028 420 -716
4116g16j4J239j253N36N48j123R55P4q66J049q91P8R61j218N56N17j377J514m73
4135I6p61J378o83o06J813j232l89J552j624M97J152j613R87op51Q95l50m53O41
4154E43n43J49L02p96O61l15l32J132r31l8R88j368K76Q90j239P18N61j366J060
4173C52p7q91O77j70o53O20L2n04Q93p77K30J49n05P24m59l76J342q45n41J450
4193F71j301J52J322j829P22N61j308J400k09p52J149p19k67J009p93K70L49p90
4211c63Q31m38k58J280r06k85R74j455Q81O98j485J154j30r11J397r52o35J612
4229A009j065j34J198j424N42L59p49P47l94n84R86n67J71J14r61J116k85n11
4247d32O37l43oN48p40p7M05m90K98L03n01N3K77n13L56K63k10j90L59k44q5L56
$$ plain form
4116 -716 -730 509 -744 -208 340 -783 172 246 -620 429 -462 -384 577 -641 -85 432 -945 569 96
4135 96 -665 713 30 -576 1237 5 -384 1168 -456 41 1193 -420 567 561 -190 705 355 -98 543
4154 543 0 149 451 -345 316 1 -331 801 -130 -168 820 -548 -272 618 -621 97 658 -708 352
4173 352 275 -616 61 -109 -762 -142 -110 -614 279 -498 -268 -119 -624 100 -359 -735 607 -238 -779 671
4193 671 -630 -478 844 -985 -263 298 -1010 390 181 -571 578 -141 -408 601 -192 78 427 -363
4211 -363 468 30 -228 1052 146 -139 835 -620 261 959 -526 628 498 -413 984 32 -603 1009
4229 1009 -56 -190 1008 -416 126 485 -264 483 89 -495 491 -76 95 209 -752 364 79 -432
4247 -432 205 -138 -144 404 -336 -413 -8 -498 -200 103 -398 -345 -68 -581 -225 38 -172 -362 -3 -247 -332 24
4269B4l62J05q3K61q1J36L77n76j37Q41p15R4O53j084N09P13r44J65N03p44Q86
4290E41n3r61J209n12k43N02o57L54L55p98R31o14j89R11r89K03O84j284J044
4309D34Q6j119J352n70m71R88q70J8O46q03J72M29r38Q86o76J92O30j147P29j06
4329a38l28L91M8o65J018q54j34Q18q62M67N19p24K21K48m45M91j50j92K56m1
$$ plain form
4269 24 -338 -233 -316 -55 -136 0 377 -199 -336 505 -210 -116 537 -547 -38 675 -269 -104 399 -345 541
4290 541 488 -473 736 224 -19 483 -174 180 535 -263 668 54 -135 776 -213 -10 674 -610 434
4309 434 520 -599 753 183 -288 700 -170 -152 494 -309 -137 292 -646 240 -436 -244 386 -761 -32 -138
4329 -138 -466 -75 -27 -692 326 -528 -662 156 -706 -239 280 -444 -223 25 -420 71 -79 -271 -15 -56
$$ [...]
8191e4
##END NTUPLES=NMR FID
##END=
