##TITLE=1H_MTPET2509
 CDCl3, 8 sc, 
 28.9.2020
##JCAMPDX= 6.0         $$ Bruker NMR JCAMP-DX V2.0
##DATA TYPE= NMR FID
##DATA CLASS= NTUPLES
##ORIGIN= UXNMR, Bruker Analytische Messtechnik GmbH
##OWNER= root
$$ XWIN-NMR		Version 3.5
$$ Mon Sep 28 10:43:05 2020 Russian Standard Time (UT+4h)  she@DPX200
##.OBSERVE FREQUENCY= 200.1315066352
##.OBSERVE NUCLEUS= ^1H
##.DELAY= (6, 6)
##.ACQUISITION MODE= SIMULTANEOUS
##.ACQUISITION SCHEME= undefined
##.AVERAGES= 8
##.DIGITISER RES= 18
##SPECTROMETER/DATA SYSTEM= spect
##.PULSE SEQUENCE= zg30
##.SOLVENT NAME= CDCl3
##.SHIFT REFERENCE= (INTERNAL, CDCl3, 0, 15.7039)
##AUDIT TRAIL= $$ (NUMBER, WHEN, WHO, WHERE, WHAT)
$$ ##TITLE= Audit trail, XWIN-NMR		Version 3.5
$$ ##JCAMPDX= 5.01
$$ ##ORIGIN= Bruker BioSpin GmbH
$$ ##OWNER= she
$$ F:/spectra/data/she/nmr/H-F/1/audita.txt
$$ ##AUDIT TRAIL=  $$ (NUMBER, WHEN, WHO, WHERE, WHAT)
(   1,<2020-09-28 10:41:46.43 +0400>,<she>,<DPX200>,
      <created by zg, POWCHK disabled, PULCHK disabled
       configuration hash MD5:
       00 E9 B6 7A A2 85 ED C7 34 08 36 98 17 FE 4E 26
       data hash MD5: 16K
       C6 FB 9E 1E CC 3B 5E D9 F9 98 B6 05 1C E9 AC D0>)
$$ ##END=
$$ 
$$ hash MD5
$$ 38 DB 74 37 1F D9 B8 3E E5 70 2C 4C 50 E2 37 43
##$RELAX= 
##$RELAX= 
##$RELAX= 
##$RELAX= 
##$RELAX= 
##$RELAX= 
$$ Bruker specific parameters
$$ --------------------------
##$DU= <F:/spectra>
##$EXPNO= 1
##$NAME= <H-F>
##$PROCNO= 1
##$TYPE= <nmr>
##$USER= <she>
##$AMP= (0..31)
100 100 100 100 100 100 100 100 100 100 100 100 100 100 100 100 100 100 
100 100 100 100 100 100 100 100 100 100 100 100 100 100 
##$AQSEQ= 0
##$AQ_mod= 1
##$AUNM= <au_zg>
##$AUTOPOS= <>
##$BF1= 200.13
##$BF2= 200.13
##$BF3= 200.13
##$BF4= 200.13
##$BF5= 200.13
##$BF6= 200.13
##$BF7= 200.13
##$BF8= 200.13
##$BYTORDA= 1
##$CFDGTYP= 0
##$CFRGTYP= 5
##$CHEMSTR= <none>
##$CNST= (0..31)
1 1 145 1 1 1 1 1 1 1 1 1 1 1 1 1 1 1 1 1 1 1 1 1 1 1 1 1 1 1 1 1 
##$CPDPRG= <>
##$CPDPRG1= <>
##$CPDPRG2= <>
##$CPDPRG3= <>
##$CPDPRG4= <mlev>
##$CPDPRG5= <mlev>
##$CPDPRG6= <mlev>
##$CPDPRG7= <mlev>
##$CPDPRG8= <mlev>
##$CPDPRGB= <>
##$CPDPRGT= <>
##$D= (0..31)
0 1.2 0 0 0 0 0 0 0 0.06 0 0.03 0 0 0 0 0.0002 0 0 0 0 0 0 0 0 0 0 0 0 
0 0 0 
##$DATE= 1601275305
##$DBL= (0..7)
120 120 120 120 120 120 120 120 
##$DBP= (0..7)
150 150 150 150 150 150 150 150 
##$DBP07= 0
##$DBPNAM0= <>
##$DBPNAM1= <>
##$DBPNAM2= <>
##$DBPNAM3= <>
##$DBPNAM4= <>
##$DBPNAM5= <>
##$DBPNAM6= <>
##$DBPNAM7= <>
##$DBPOAL= (0..7)
0.5 0.5 0.5 0.5 0.5 0.5 0.5 0.5 
##$DBPOFFS= (0..7)
0 0 0 0 0 0 0 0 
##$DE= 6
##$DECBNUC= <off>
##$DECIM= 32
##$DECNUC= <off>
##$DECSTAT= 4
##$DIGMOD= 1
##$DIGTYP= 9
##$DL= (0..7)
0 120 120 120 120 120 120 120 
##$DP= (0..7)
150 150 150 150 150 150 150 150 
##$DP07= 0
##$DPNAME0= <>
##$DPNAME1= <>
##$DPNAME2= <>
##$DPNAME3= <>
##$DPNAME4= <>
##$DPNAME5= <>
##$DPNAME6= <>
##$DPNAME7= <>
##$DPOAL= (0..7)
0.5 0.5 0.5 0.5 0.5 0.5 0.5 0.5 
##$DPOFFS= (0..7)
0 0 0 0 0 0 0 0 
##$DQDMODE= 0
##$DR= 18
##$DS= 0
##$DSLIST= <SSSSSSSSSSSSSSS>
$$ [...]
##$SUBNAM2= <"">
##$SUBNAM3= <"">
##$SUBNAM4= <"">
##$SUBNAM5= <"">
##$SUBNAM6= <"">
##$SUBNAM7= <"">
##$SUBNAM8= <"">
##$SUBNAM9= <"">
##$SW= 16.880792210976
##$SWIBOX= (0..15)
0 0 2 0 0 0 0 0 0 0 0 0 0 0 0 0 
##$SW_h= 3378.37837837838
##$TD= 16384
##$TD0= 1
##$TE= 0
##$TE2= 300
##$TE3= 300
##$TEG= 300
##$TL= (0..7)
0 120 120 120 120 120 120 120 
##$TP= (0..7)
150 150 150 150 150 150 150 150 
##$TP07= 0
##$TPNAME0= <>
##$TPNAME1= <>
##$TPNAME2= <>
##$TPNAME3= <>
##$TPNAME4= <>
##$TPNAME5= <>
##$TPNAME6= <>
##$TPNAME7= <>
##$TPOAL= (0..7)
0.5 0.5 0.5 0.5 0.5 0.5 0.5 0.5 
##$TPOFFS= (0..7)
0 0 0 0 0 0 0 0 
##$TUNHIN= 0
##$TUNHOUT= 0
##$TUNXOUT= 0
##$USERA1= <user>
##$USERA2= <user>
##$USERA3= <user>
##$USERA4= <user>
##$USERA5= <user>
##$V9= 5
##$VALIST= <valist>
##$VCLIST= <CCCCCCCCCCCCCCC>
##$VD= 0
##$VDLIST= <DDDDDDDDDDDDDDD>
##$VPLIST= <PPPPPPPPPPPPPPP>
##$VTLIST= <TTTTTTTTTTTTTTT>
##$WBST= 1024
##$WBSW= 4
##$XGAIN= (0..3)
0 0 0 0 
##$XL= 0
##$YL= 0
##$YMAX_a= 1004186
##$YMIN_a= -1129673
##$ZGOPTNS= <>
##$ZL1= 120
##$ZL2= 120
##$ZL3= 120
##$ZL4= 120
##$ABSF1= 10
##$ABSF2= 0
##$ABSG= 5
##$ABSL= 3
##$ALPHA= 0
##$AQORDER= 0
##$ASSFAC= 0
##$ASSFACI= 0
##$ASSFACX= 0
##$ASSWID= 0
##$AUNMP= <proc_1d>
##$AZFE= 0.1
##$AZFW= 0.1
##$BCFW= 1
##$BC_mod= 2
##$BYTORDP= 1
##$COROFFS= 0
##$CY= 11.3945322036743
##$DATMOD= 1
##$DC= 2
##$DFILT= <>
##$DTYPP= 0
##$F1P= 16.9975609425685
##$F2P= -3.02152046262296
##$FCOR= 0.5
##$FTSIZE= 0
##$FT_mod= 4
##$GAMMA= 1
##$GB= 0.15
##$INTBC= 1
##$INTSCL= 1
##$ISEN= 128
##$LB= 0.24
##$LEV0= 0
##$LPBIN= 0
##$MAXI= 10000
##$MC2= 0
##$MEAN= 0
##$ME_mod= 0
##$MI= 1.114404
##$NCOEF= 0
##$NC_proc= 0
##$NLEV= 6
##$NOISF1= 3.799351
##$NOISF2= 2.8
##$NSP= 1
##$NTH_PI= 0
##$NZP= 0
##$OFFSET= 15.70392
##$PC= 1
##$PHC0= -9976.158
##$PHC1= 20.2009
##$PH_mod= 1
##$PKNL= yes
##$PPARMOD= 0
##$PSCAL= 0
##$PSIGN= 0
##$REVERSE= no
##$SF= 200.130013532006
##$SI= 16384
##$SIGF1= 3
##$SIGF2= 2
##$SINO= 400
##$SIOLD= 16384
##$SREGLST= <1H.CDCl3>
##$SSB= 0
##$STSI= 0
##$STSR= 0
##$SW_p= 3612.71676300578
##$SYMM= 0
##$S_DEV= 0
##$TDeff= 0
##$TDoff= 0
##$TI= <>
##$TILT= no
##$TM1= 0
##$TM2= 0
##$TOPLEV= 0
##$USERP1= <user>
##$USERP2= <user>
##$USERP3= <user>
##$USERP4= <user>
##$USERP5= <user>
##$WDW= 1
##$XDIM= 8192
##$YMAX_p= 0
##$YMIN_p= 0
$$ End of Bruker specific parameters
$$ ---------------------------------
##NTUPLES= NMR FID
##VAR_NAME=  TIME,          FID/REAL,        FID/IMAG
##SYMBOL=    X,             R,               I
##VAR_TYPE=  INDEPENDENT,   DEPENDENT,       DEPENDENT
##VAR_FORM=  AFFN,          ASDF,            ASDF
##VAR_DIM=   8192,          8192,            8192
##UNITS=     SECONDS,       ARBITRARY UNITS, ARBITRARY UNITS
##FACTOR=    0.000296,      1,               1
##FIRST=     0,             0,               0
##LAST=      2.424536,      0,               0
##MIN=       0,             -1129673,        0
##MAX=       2.424536,      1004186,         0
$$ Real data points
##PAGE= N=1
##DATA TABLE= (X++(R..R)), XYDATA
$$ plain form
0 0 0 0 0 0 0 0 0 0 8 -8 8 -8 12 -16 24 -32 33 -46 56 -72 86 -101 118 -142 173 -202 234 -271 314 -364 420
31 420 -481 545 -620 702 -795 895 -1006 1125 -1258 1408 -1567 1740 -1929 2137 -2364 2615
47 2615 -2885 3178 -3499 3858 -4248 4679 -5157 5683 -6273 6940 -7693 8554 -9545 10708
61 10708 -12089 13762 -15828 18445 -21874 26534 -33077 42113 -79811 1004186 -252463
72 -252463 -781818 982390 -202447 -670480 702001 104257 -746592 332713 480746
81 480746 -514867 -57932 605068 -559533 -245160 903591 -432248 -533267 872682
90 872682 -321379 -517352 842006 -245491 -594596 708999 13640 -548303 369650
99 369650 174392 -438195 183625 380193 -459700 -149263 615881 -281515 -365379 602493
$$ packed form
0@%%%%%%%%Qj6J6j6K0k8M0n6O5p9J02j28J58j87K19k60L15l75M36n05N85o78P84
31D20r01J026j165J322j497J690j901K131k383K666k975L307l669M066m501M979
47B615n500O063o677P357q106Q927r836J0840j1956J3213j4633J6247j8099K0253
61A0708k2797K5851k9590L4273m0319M8408n9611P5190j21924J083997j256649
72b52463n29355J764208j184837m68033J372481n97744q50849J079305J48033
81D80746r95613M56935O63000j164601L14373J148751j335839j01019J405949
90H72682j194061j95973J359358j087497l49105J303595o95359n61943R17953
99C69650j95258o12587O21820J96568q39893L10437P65144q97396q3864R67872
$$ plain form
109 602493 -233112 -430988 680072 -109634 -570054 525769 82559 -494349 333180 169862
119 169862 -448862 158363 345357 -380663 -121110 426259 -203496 -264731 456059 -112526
129 -112526 -436160 464280 72164 -516611 339838 193856 -498712 240364 292437 -503519
139 -503519 62734 418432 -354114 -123654 415378 -229281 -247054 446947 -85085 -418342
149 -418342 399141 128136 -497764 287478 257181 -540338 201767 405516 -550463 44218
159 44218 507790 -459071 -92160 526866 -344746 -230619 526395 -157995 -371965 440547
169 440547 30176 -465402 347886 220287 -549170 223711 399899 -562119 79365 495709
179 495709 -517032 -30250 563554 -438265 -178432 556494 -273255 -289869 477640 -95320
$$ packed form
109F02493q35605j97876J111060p89706m60420J095823m43210n76908Q27529j63318
119A69862o18724O07225J86994p26020K59553N47369o29755o1235P20790n68585
129a12526l23634R00440l92116n88775Q56449j45982o92568P39076N2073p95956
139e03519N66253L55698p72546K30460N39032o44659j7773O94001n32032l33257
149d18342Q17483k71005o25900P85242l0297p97519P42105K03749r55979N94681
159D4218M63572r66861L66911O19026q71612J14127P57014o84390k13970Q12512
169D40547m10371m95578Q13288j27599p69457P72881J76188r62018O41484M16344
179D95709j012741M86782N93804j001819K59833P34926q29749j6614P67509n72960
$$ plain form
189 -95320 -382229 381912 90542 -465803 253597 282059 -489157 115619 411314 -482883
199 -482883 -5178 489919 -421771 -117910 502479 -318945 -217071 462705 -176502 -299144
209 -299144 373628 -2050 -356371 256989 159634 -391778 138941 306260 -400876 3575
219 3575 411740 -355880 -109916 443760 -279246 -195501 425307 -164190 -265127 356527
229 356527 -19495 -305000 234909 124896 -310528 105402 252983 -301996 -23589 346253
239 346253 -264711 -142058 401051 -190602 -234099 391001 -99054 -287486 333837 13865
249 13865 -316838 236200 135604 -321209 99146 251520 -282033 -44601 337376 -230665
259 -230665 -172906 393239 -155028 -280220 405040 -57135 -356963 357304 44556 -381233
$$ packed form
189i5320k86909P64141k91370n56345P19400K8462p71216O04776K95695q94197
199d82883M77705M95097r11690L03861O20389q21424J01874O79776o39207j22642
209b99144O72772l75678l54321O13360r7355n51412N30719J67319p07136M04451
219C575M08165p67620K45964N53676p23006Q3745O20808n89497j00937O21654
229C56527l76022k85505N39909j10013m35424M15930J47581n54979K78407L69842
239C46253o10964J22653N43109n91653m3497O25100m90055j88432O21323l19972
249A3865l30703N53038j00596m56813M20355J52374n33553K37432L81977n68041
259b30665N7759N66145n48267j25192O85260m62175k99828P14267l12748m25789
$$ plain form
269 -381233 269771 146884 -377097 144852 248163 -339941 15 336923 -263004 -148933
279 -148933 389121 -172695 -270047 411857 -75323 -363313 387221 32422 -417189 312681
289 312681 134146 -413069 205422 218194 -371587 76417 297749 -300163 -65897 350925
299 350925 -200609 -200208 370103 -91538 -305064 360362 6411 -377201 317133 109098
309 109098 -403087 234706 197048 -378431 124113 256695 -310318 6968 302891 -223338
319 -223338 -127470 321019 -110692 -239574 307291 4572 -319514 269746 98546 -363359
329 -363359 213136 185485 -358172 123730 244015 -309963 18676 269060 -220650 -85482
339 -85482 271949 -115619 -192468 253413 4043 -273098 207155 116814 -316341 143899
$$ packed form
269c81233O51004j22887n23981N21949J03311n88104L39956L36908n99927J14071
279a48933N38054n61816r7352O81904m87180k87990P50534l54799m49611P29870
289C12681j78535n47215O18491J2772n89781M48004K21332n97912K34266M16822
299C50925n51534M01N70311m61641k13526O65426l53951l83612O94334k08035
309A09098n12185O37793l7658n75479N02544J32582n67013L17286K95923n26229
319b23338R5868M48489m31711j28882N46865l02719l24086N89260j71200m61905
329c63359N76495k7651n43657M81902J20285n53978L28639K50384m89710J35168
339h5482L57431l87568p6849M45881k49370k77141M80253r0341m33155M60240
$$ plain form
349 143899 199200 -323124 75468 254258 -291126 -11368 281072 -216711 -99432 269762
359 269762 -117259 -176196 236388 -3993 -245507 191932 112548 -299017 120305 216295
369 216295 -310323 41997 286577 -293408 -37403 322468 -239628 -120169 327654 -140083
379 -140083 -195237 284997 -30766 -249782 221397 89274 -286969 140380 196883 -305948
389 -305948 47663 282237 -286769 -41859 333802 -240283 -120984 342489 -172520 -183830
399 -183830 324254 -75031 -243464 261269 34056 -269701 175537 130937 -280446 86291
409 86291 226278 -274663 -15365 293990 -229472 -103641 319508 -172993 -171966 320522
419 320522 -100121 -228739 276085 -11095 -255290 207694 77887 -263190 115652 161901
$$ packed form
349A43899N5301n22324L98592J78790n45384K79758K92440m97783J17279L69194
359B69762l87021n8937M12584k40381k41514M37439p9384m11565M19322R5990
369B16295n26618L52320K44580n79985K56005L59871n62096J19459M47823m67737
379a40083n5154M80234l15763k19016M71179j32123l76243M27349N6503n02831
389c05948L53611K34574n69006K44910L75661n74085J19299M63473n15009j1310
399a83830N08084l99285j68433N04733k27213l03757M45238m4600m11383L66737
409H6291J39987n00941K59298L09355n23462J25831M23149m92501J027M92488
419C20522m20643j28618N04824k87180k44195M62984j29807l41077L78842M6249
$$ plain form
429 161901 -240621 15383 228136 -201874 -74157 274779 -151919 -165377 283179 -71640
439 -71640 -215544 252539 -11156 -242845 205831 65212 -248248 121219 141005 -210173
449 -210173 26132 180323 -165026 -58763 227014 -106557 -155306 237305 -34829 -213621
459 -213621 222980 26711 -251945 191745 93927 -257586 123065 143506 -224080 47921
469 47921 188015 -182543 -53275 222218 -101246 -145359 220361 -31225 -215051 227494
479 227494 42999 -280783 191053 123529 -286431 130086 163599 -269254 70823 208995
489 208995 -227049 -35575 230462 -134292 -121974 226614 -56420 -205133 222414 39282
499 39282 -271118 184573 115448 -289792 142116 164143 -290554 76235 211923 -238557
$$ packed form
429A61901m02522K56004K12753m30010J27717L48936m26698j3458M48556l54819
439g1640j43904M68083k63695k31689M48676j40619l13460L69467J9786l51178
449b10173K36305J54191l45349J06263K85777l33571m8749L92611k72134j78792
459b13621M36601j96269k78656M43690r7818l51513L80651K0441l67586K72001
469D7921J40094l70558J29268K75493l23464m4113L65720k51586j83826M42545
479B27494j84495l23782M71836o7524m09960M16517L3513m32853L40077J38172
489B08995m36044J91474K66037l64754J2318L48588k83034j48713M27547j83132
499C9282l10400M55691o9125m05240M31908K2027m54697L66789J35688m50480
$$ plain form
509 -238557 -5304 213231 -173388 -73960 227425 -93917 -167400 216021 7504 -223299
519 -223299 178837 74775 -259918 155079 146570 -284570 86473 197615 -242060 21584
529 21584 210341 -194742 -47412 226314 -114876 -128094 203447 -22195 -180444 173645
539 173645 51439 -226049 132869 128115 -233552 69878 166967 -213101 22102 197656
549 197656 -176140 -51660 203158 -98795 -107388 177345 -34286 -149298 154733 39584
559 39584 -194521 101725 116197 -192323 44859 153197 -182145 -5982 193730 -149301
569 -149301 -73021 201125 -90907 -121867 183411 -30800 -164879 156452 42177 -192555
579 -192555 100921 106324 -192925 46772 164457 -184981 -24865 206686 -142528 -90932
$$ packed form
509b38557K33253K18535l86619R9428L01385l21342p3483L83421k08517k30803
519b23299M02136j04062l34693M14997q509m31140L71043J11142m39675K63644
529B1584J88757m05083J47330K73726l41190j3218L31541k25642j58249L54089
539A73645j22206k77488L58918m754l61667L03430R7089l80068K35203J75554
549A97656l73796J24480K54818l01953q593K84733k11631j15012L04031j15149
559C9584k34105K96246J4472l08520K37182J08338l35342J76163J99712l43031
569a49301P6280K74146k92032l0960L05278k14211j34079L21331j14275k34732
579a92555K93476N403k99249K39697J17685l49438J60116K31551l49214N1596
$$ plain form
589 -90932 216696 -93102 -143323 215405 -34821 -192517 183188 42857 -207831 125271
599 125271 100751 -206790 68059 159832 -192177 -10847 206110 -150900 -82506 224520
609 224520 -104246 -139871 228103 -47953 -188690 206789 15727 -210523 163772 74519
619 74519 -216239 101950 132730 -198173 30002 173474 -166718 -41975 205688 -124001
629 -124001 -112821 220918 -66196 -164725 205100 -12902 -193047 180855 41420 -209706
639 -209706 128034 94577 -194454 59092 133615 -161570 -7444 162431 -121708 -75990
649 -75990 179232 -65582 -131726 174401 -13535 -166805 151675 34642 -179200 113296
659 113296 75634 -172270 62461 109002 -143864 1261 133354 -97918 -59409 141679
$$ packed form
589i0932L07628l09798n0221L58728k50226j57696L75705j40331k50688L33102
599A25271k4520l07541K74849R1773l52009J81330K16957l57010O8394L07026
609B24520l28766l5625L67974k76056j40737L95479j91062k26250L74295q9253
619G4519k90758L18189L0780l30903K28175J43472l40192J24743K47663l29689
629a24001J1180L33739k87114r8529L69825k18002j80145L73902j39435k51126
639b09706L37740l3457k89031K53546P4523k95185J54126J69875k84139M5718
649g5990K55222k44814o6144L06127j87936j53270L18480j17033k13842K92496
659A13296l7662k47904K34731M6541k52866J45125J32093k31272L8509K01088
$$ plain form
669 141679 -48428 -109227 141308 3475 -153434 123781 56280 -171742 89106 95132 -165638
680 -165638 45550 124567 -142227 -6505 144278 -96953 -64628 144405 -38561 -115064
690 -115064 132856 19239 -153281 109254 72536 -178092 74892 122526 -177725 30685
700 30685 151428 -154696 -18161 166117 -114237 -67769 167189 -61193 -119356 149115
710 149115 4925 -157786 119122 65951 -182317 81764 118795 -190377 37807 163083
720 163083 -178096 -13338 185019 -144319 -60914 186928 -96987 -105893 175702 -39091
730 -39091 -146527 147897 28923 -172480 105807 88760 -183861 61643 138178 -181163
740 -181163 11690 173909 -160401 -39249 188703 -119882 -80822 179652 -70016 -115085
$$ packed form
669A41679j90107o0799K50535j37833j56909K77215o7501k28022K60848O026k60770
680a65638K11188P9017k66794J35722J50783k41231L2325K09033j82966p6503
690a15064K47920j13617j72520K62535l6718k50628K52984M7634l00251K08410
700C0685J20743l06124J36535J84278k80354M6468K34958k28382n8163K68471
710A49115j44190j62711K76908n3171k48268K64081L7031l09172K28184J25276
720A63083l41179J64758J98357l29338Q3405K47842k83915q906K81595k14793
730c9091j07436K94424j18974k01403K78287j7047k72621K45504P6535l19341
740a81163J92853J62219l34310J21152K27952l08585L9060K60474k49668m5069
$$ plain form
750 -115085 158238 -11786 -140503 121106 48201 -152997 70848 100166 -149703 23252
760 23252 136808 -136576 -24238 159573 -107698 -66900 162926 -65941 -97326 142328
770 142328 -19891 -115203 110698 28636 -124795 66408 74614 -121256 14244 112039 -102840
781 -102840 -32528 133199 -79085 -71947 141606 -44506 -104771 130494 -3829 -123266 98877
792 98877 37327 -124686 56846 76475 -117802 7518 111360 -95208 -45912 133431 -61010
803 -61010 -91836 138509 -23844 -123449 129193 15532 -145580 102002 57565 -148258 60726
814 60726 92689 -132729 12274 119870 -107902 -37247 142004 -72124 -87807 147213 -28889
825 -28889 -128107 139332 14120 -153076 118725 54159 -165369 85209 94940 -158960 40020
$$ packed form
750a15085K73323j70024j28717K61609p2905k01198K23845K9318k49869J72955
760B3252J13556k73384J12338J83811k67271M0798K29826k28867l1385K39654
770A42328j62219r5312K25901q2062j53431J91203Q206j95870J35500R7795k14879
781a02840P0312J65727k12284P138K13553j86112o0265K35265j34323j19437K22143
792I8877o1550j62013J81532J9629j94277J25320J03842k06568M9296J79343j94441
803f1010l0826K30345j62353r9605K52642j13661j61112K47582m4437k05823K08984
814F0726L1963k25418J45003J07596k27772P0655J79251k14128j5683K35020j76102
825b8889r9218K67439j25212j67196K71801o4566k19528K50578R731k53900J98980
$$ plain form
836 40020 124461 -134748 -11042 142526 -99457 -60240 152027 -58066 -107845 146650 -8354
847 -8354 -142138 127381 37365 -159071 99235 75017 -161128 61735 108418 -146373 14536
858 14536 127005 -114150 -31221 132058 -73528 -74045 129227 -29016 -110375 115169 18511
869 18511 -132987 89144 58358 -140109 59362 86968 -132415 23618 106513 -111512 -17104
880 -17104 115719 -74847 -53918 109470 -32660 -85337 97398 10661 -110003 77495 52556
891 52556 -122259 45487 84979 -116733 13956 104022 -99835 -20263 112166 -67884 -54720
902 -54720 108306 -25516 -83615 89309 18438 -102756 64065 59754 -114083 33423 93306
913 93306 -111501 -2237 115982 -91952 -36490 122103 -63133 -66168 116290 -24754 -93771
$$ packed form
836D0020Q4441k59209J23706J53568k41983L9217K12267k10093m9779K54495j55004
847h354j33784K69519r0016j96436K58306k4218k36145K22863M6683k54791J60909
858A4536J12469k41155Q2929J63279k05586n17K03272j58243q1359K25544r6658
869A8511j51498K22131l0786j98467J99471K7606k19383J56033Q2895k18025R4408
880a7104J32823j90566K0929J63388j42130n2677J82735q6737j20664J87498k4939
891E2556j74815J67746L9492k01712J30689R0066k03857P9572J32429j80050J3164
902e4720J63026j33822n8099J72924p0871j21194J66821m311j73837J47506N9883
913I3306k04807J09264J18219k07934N5462J58593j85236l035J82458j41044o9017
$$ plain form
924 -93771 98760 19396 -114000 68853 61925 -120228 34024 96838 -119237 -1225 124097
935 124097 -104707 -38565 137939 -76344 -73676 134691 -40856 -98812 119661 -345 -120662
946 -120662 92638 45548 -131310 55447 85091 -127307 15552 115163 -114900 -23359 136176
957 136176 -90835 -60434 138691 -57177 -90275 127812 -18135 -109161 104109 20699 -118221
968 -118221 72736 59570 -118678 35006 92734 -106725 -6349 112230 -85347 -39839
978 -39839 123389 -62082 -72579 121328 -25850 -94542 102161 9271 -103529 76736 41370
989 41370 -105324 42139 73972 -94831 2380 93107 -75909 -32703 104725 -49815 -65750
1000 -65750 103193 -19481 -86826 92160 11212 -99942 68424 43966 -99835 34804
$$ packed form
924i3771J92531p9364j33396J82853o928j82153J54252O2814k16075J18012J25322
935A24097k28804O6142J76504k14283K668K08367j75547n7956K18473j20006j20317
946a20662K13300m7090j76858J86757K9644k12398J42859R9611k30063R1541J59535
957A36176k27011L0401J99125j95868l3098K18087j45947r1026K13270q3410j38920
968a18221J90957j3166j78248J53684N7728j99459J00376J18579j97577M5508
978c9839J63228j85471j0497J93907j47178o8692J96703r2890j12800J80265l5366
989D1370j46694J47463L1833j68803R7211R0727j69016M3206J37428j54540j5935
1000f5750J68943j22674o7345J78986q0948j11154J68366k4458j43801J34639
$$ plain form
1010 34804 67037 -86130 1792 84101 -68955 -37095 97030 -37556 -69798 91124 -5908
1021 -5908 -90222 81210 23795 -104869 61726 55299 -105454 28893 76830 -93511 -1689
1032 -1689 92971 -73446 -36837 99160 -42093 -67251 98207 -9381 -94934 87033 27700
1043 27700 -111810 64511 59451 -116088 40714 84114 -112869 8163 105653 -90277 -27683
1054 -27683 109394 -60999 -55105 107457 -26978 -86094 96063 14850 -106359 72166 48878
1065 48878 -114278 47807 79257 -115233 17233 99876 -99658 -11012 108056 -76711
1075 -76711 -41276 106696 -42456 -66882 91598 -7104 -85584 73749 29274 -102366 49645
1086 49645 64785 -103705 20432 85091 -95878 -2767 99756 -82338 -30805 101316 -52702
$$ packed form
1010C4804L2233j53167Q7922Q2309j53056L1860J34125j34586l2242J60922r7032
1021e908q4314J71432n7415j28664J66595o427j60753J34347M7937j70341R1822
1032a689R4660j66417L6609J35997j41253k5158J65458j07588q5553J81967n9333
1043B7700j39510J76321n060j75539J56802M3400j96983J21032R7490j95930O2594
1054b7683J37077j70393N894J62562j34435n9116J82157q1213j21209J78525k3288
1065D8878j63156J62085L1450j94490J32466Q2643j99534Q8646J19068j84767
1075g6711L5435J47972j49152k4426J58480r8702p8480J59333m4475j31640J52011
1086D9645J5140j68490J24137O4659j80969R3111J02523j82094N1533J32121j54018
$$ plain form
1097 -52702 -54061 87737 -19838 -70062 70525 15274 -83440 44363 50704 -86695 17342
1108 17342 76468 -82737 -10361 91459 -66831 -33891 92622 -45386 -51817 84067 -16647
1119 -16647 -67144 64267 18540 -73126 36579 46589 -73165 11261 73179 -70943 -19058
1130 -19058 91553 -56192 -43736 94488 -36229 -62023 89253 -11478 -76789 72748
1140 72748 19313 -82751 45875 48750 -82813 15168 74262 -74289 -15920 91261 -61152
1151 -61152 -45092 101525 -40526 -69682 98524 -13092 -85011 83294 13173 -92872 62701
1162 62701 41129 -94818 30764 67654 -84648 -2372 85351 -68639 -32355 95762 -47619
1173 -47619 -60370 98283 -21200 -81369 87744 5445 -91445 68970 31067 -93243 44630
$$ packed form
1097e2702j359J41798j07575n0224J40587n5251r8714J27803O341j37399J04037
1108A7342N9126j59205P2376J01820j58290L2940J26513j38008o431J35884j00714
1119a6647n0497J31411m5727r1666J09705J0010j19754Q4426O1918j44122N1885
1130a9058J10611j47745J2456J38224j30717k5794J51276j00731o5311J49537
1140G2748n3435j02064J28626K875j31563R7981N9094j48551N8369J07181j52413
1151f1152J6060J46617j42051k9156J68206j11616p1919J68305p0121j06045J55573
1162F2701k1572j35947J25582L6890j52302Q2276Q7723j53990L6284J28117j43381
1173d7619j2751J58653j19483o0169J69113q2299r6890J60415l7903j24310J37873
$$ plain form
1184 44630 53097 -87418 15826 72665 -71361 -15971 83590 -50764 -42344 86660 -27495
1195 -27495 -64687 83179 -2205 -81672 69567 23559 -85630 48378 43853 -81964 24178
1206 24178 61299 -69971 -3399 72229 -48725 -32201 74089 -24293 -53909 69089 6
1217 6 -69871 57527 24434 -78232 39898 45712 -74704 16454 58838 -62328 -7287 67113
1229 67113 -44431 -31701 67872 -20396 -54985 61390 7221 -69579 48311 30223 -76825
1240 -76825 31404 51848 -76588 10394 67603 -65861 -13868 73627 -46828 -36806 73435
1251 73435 -24131 -57062 67264 3968 -74147 53345 32709 -82510 34556 55643 -82350
1262 -82350 13302 72629 -75505 -12297 83682 -57869 -35893 83972 -32776 -54695 75487
$$ packed form
1184D4630Q467j40515J03244N6839j44026N5390R9561j34354Q420J29004j14155
1195b7495l7192J47866q5384p9467J51239m6008j09189J34008m525j25817J06142
1206B4178L7121j31270O6572P5628j20954J6524J06290r8382k9616J22998o9083
1217Fo9877J27398l3093j02666J18130N814j20416R1158M2384j21166N5041P4400
1229F7113j11544J2730R9573q8268l4589J16375n4169p6800J17890j8088j07048
1240g6825J08229K0444j28436Q6982N7209j33464N1993Q7495j20455J0022J10241
1251G3435r7566l2931J24326o3296p8115J27492k0636j15219J17066K1087j37993
1262h2350R5652N9327j48134O3208R5979j41551K1976J19865j16748k1919J30182
$$ plain form
1273 75487 -5951 -70521 63867 21602 -80375 43678 47819 -83657 20662 68479 -77494
1284 -77494 -1906 80391 -65633 -24782 86394 -45337 -45431 81643 -20352 -60877 68445
1295 68445 5776 -71600 52298 30234 -76798 29580 52254 -73212 7055 68107 -64360
1306 -64360 -14360 74362 -50333 -33384 76795 -30728 -49531 67360 -6350 -59709 50312
1317 50312 17511 -63414 30381 38328 -62885 8111 56849 -54043 -14937 65808 -40043
1328 -40043 -32751 65739 -23081 -46244 58940 -2674 -55378 43754 18862 -56260 23549 37800
1340 37800 -51978 1632 53382 -43793 -19241 63434 -30702 -39803 65479 -13251 -53674 58986
1352 58986 5029 -60723 45547 24361 -63674 26859 43993 -58176 2098 57909 -46501
$$ packed form
1273G5487q1438o4570J34388m2265j01977J24053M141j31476J04319M7817j45973
1284g7494P5588Q2297j46024M0851J11176j31731r4J27074j01995m0525J29322
1295F8445o2669p7376J23898k2064j07032J06378K2674j25466Q0267O1052j32467
1306f4360N0000Q8722j24695J6949J10179j07523j8803J16891p3710n3359J10021
1317E0312l2801q0925R3795P947j01213P0996M8738j10892L9106Q0745j05851
1328d0043P292R8490q8820k3163J05184o1614n2704R9132k4892p5122P9809J4251
1340C7800q9778N3610N1750r7175K4552Q2675r4136r101J05282p8730m0423J12660
1352E8986n3957o5752J06270k1186q8035R0533J7134j02169O0274N5811j04410
$$ plain form
1363 -46501 -21476 67235 -31959 -43020 69950 -13253 -61225 64673 8105 -71043 51712
1374 51712 26840 -73193 33328 44749 -68653 11002 59273 -58088 -14489 68358 -40371
1385 -40371 -37837 70530 -21175 -56338 68555 -1200 -70627 59314 21352 -77043 42877
1396 42877 38004 -74837 24709 52088 -67850 1804 63503 -52892 -21412 67639 -32661
1407 -32661 -41776 66211 -11688 -58229 60251 9756 -68377 48151 29195 -71686 30484
1418 30484 44879 -65142 11264 53046 -53616 -7887 59072 -36748 -28174 57930 -14500 -43662
1430 -43662 48901 5377 -53528 39630 23982 -59647 24847 40077 -56121 7321 49221 -46938
1442 -46938 -9098 52840 -31391 -25431 50355 -13103 -38856 42942 6541 -49464 30081 26645
$$ packed form
1363d6501K5025Q8711r9194j1061J12970q3203m7972J25898n6568p9148J22755
1374E1712k4872j00033J06521J1421j13402P9655M8271j17361M3599Q2847j08729
1385d0371K534J08367r1705l5163J24893o9755o9427J29941l7962r8395J19920
1396D2877m873j12841R9546K7379j19938O9654O1699j16395L1480Q9051j00300
1407c2661r115J07987p7899m6541J18480n0495p8133J16528j8956j00881J02170
1418C0484J4395j10021P6406M1782j06662M5729O6959r5820Q574Q6104p2430k9162
1430d3662R2563m3524n8905R3158j5648q3629Q4494J5230r6198O3442M1900r6159
1442d6938L7840O1938q4231N960P5786o3458k5753Q1798l6401n6005P9545l436
$$ plain form
1454 26645 -52300 15147 40220 -51190 819 51914 -43966 -17686 56825 -29290 -31985 52711
1466 52711 -12988 -43124 46299 7150 -53573 31725 28004 -54818 14545 44354 -52545 -3792
1478 -3792 57847 -44254 -22204 63039 -31149 -37595 63134 -14570 -51411 54891 5902 -56649
1490 -56649 40397 22896 -59308 25414 42456 -57725 2736 56282 -47195 -16102 63983
1501 63983 -38183 -33090 68885 -22659 -49124 63435 -4102 -56592 53237 12335 -60839
1512 -60839 37010 31422 -58257 16171 45621 -52110 -4330 57067 -41183 -25833 61871 -25617
1524 -25617 -39879 59736 -12430 -50175 54376 5643 -56076 37731 20970 -51646 20890 32272
1536 32272 -46986 1699 44620 -36360 -19208 49738 -21618 -33227 49911 -9323 -44727 46041
$$ packed form
1454B6645p8945O7447K5073r1410N2009N1095r5880K6280P4511q6115k695Q4696
1466E2711o5699l0136Q9423l9149o0723Q5298l721q2822O9363K9809r6899M8753
1478c792O1639j02101K2050Q5243r4188o446J00729p7704l6841J06302m8989o2551
1490e6649R7046j7501q2204Q4722J7042j00181O0461N3546j03477L1093Q0085
1501F3983j02166N093J01975r1544k6465J12559o7537n2490J09829m0902p3174
1512f0839R7849n588q9679P4428K9450r7731M7780O1397r8250J5350Q7704q7488
1524b5617j4262R9615p2166l7745J04551m8733o1719R3807j6761p2616P2536J1382
1536C2272p9258M8685M2921q0980J7152O8946p1356j1609Q3138n9234l5404R0768
$$ plain form
1548 46041 5756 -49238 34034 17968 -47894 19662 30486 -42245 845 39180 -30142 -16327
1560 -16327 43866 -18975 -31895 46720 -3507 -44716 39744 11298 -47990 30601 22108 -48482
1572 -48482 17121 35000 -42147 -1885 42631 -29330 -18045 45758 -16615 -33768 46092 -317
1584 -317 -46551 39694 14408 -52429 29869 28485 -53094 15010 39211 -46734 -533 47056
1596 47056 -36843 -17838 51560 -22152 -34684 49261 -5825 -45373 43771 8920 -54445 35105
1608 35105 25615 -57128 20843 37871 -52377 5664 46264 -45661 -9987 52667 -32856 -26578
1620 -26578 52434 -16818 -39813 48249 208 -48960 38908 16653 -53316 26896 31305 -52911
1632 -52911 12124 42536 -46078 -4074 47902 -35294 -17686 49018 -22102 -29908 45868 -5304
$$ packed form
1548D6041m0285n4994Q3272j6066o5862O7556J0824p2731M3090L8335o9322J3815
1560a6327O0193o2841j2920P8615n0227m1209Q4460k8446n9288P8591q493p0590
1572d8482O5603J7879p7147M0262M4516p1961J1285O3803o2373j7153P9860m6409
1584c17m6234Q6245k5286o6837Q2298j384q1579O8104K4201q5945M6201M7589
1596D7056q3899J9005O9398p3712j2532Q3945n5086l9548Q9144l4851o3365Q9550
1608C5105r490q2743P7971J7028r0248N8041M0600r1925L5674O2654q5523O278
1620b6578P9012o9252k2995Q8062m8041m9168Q7868k2255o9969Q0212M409q4216
1632e2911O5035L0412q8614M2004N1976q3196J7608O6704p1120p806P5776n1172
$$ plain form
1644 -5304 -39493 36809 10431 -43731 25749 23915 -44616 13041 35671 -41701 -1192 42977
1656 42977 -33075 -14429 44357 -21404 -25422 41761 -7937 -33820 34750 7553 -39509 22812
1668 22812 21869 -39894 9584 32940 -36546 -4067 40664 -29593 -17578 43693 -18074 -28573
1680 -28573 39897 -4560 -35877 32156 8910 -39471 20943 22966 -39688 5832 35083 -34335
1692 -34335 -8553 41757 -26833 -21586 45115 -16331 -33111 43655 -3569 -40648 35835 10204
1704 10204 -43645 25055 22635 -43040 11403 34046 -38671 -4042 43857 -30313 -19436 47300
1716 47300 -19555 -31356 47468 -7696 -40696 42730 5505 -46368 32688 19271 -45890 19167
1728 19167 30005 -41961 5029 38858 -34636 -10859 44725 -23959 -25391 45486 -11528 -35591
$$ packed form
1644e304l4189P6302k6378n4162O9480j834o8531N7657K2630p7372M0509M4169
1656D2977p6052J8646N8786o5761m018O7183m9698k5883O8570k7197m7062O2321
1668B2812r43o1763M9478K3356o9486L2479M4731p0257J2015O1271o1767j0499
1680b8573O8470m4457l1317O8033k3246m8381O0414K023o2654M5520K9251o9418
1692c4335K5782N0310o8590N247O6701o1446j6780P6766m7224l7079P6483k5631
1704A0204n3849O8700k420o5675N4443K2643p2717L4629M7899p4170J0877O6736
1716D7300o6855j1801P8824n5164l3000Q3426l7225n1873P9056j3417o5161O5057
1728A9167J0838p1966M6990L3829p3494K3777N5584o8684j432P0877n7014k4063
$$ plain form
1740 -35591 42178 624 -43078 35341 13595 -45293 23700 24315 -42124 9721 32190 -35172
1752 -35172 -3831 37371 -25556 -18248 39350 -13611 -30161 37188 -1086 -37536 31611 10147
1764 10147 -40741 23618 20813 -40466 11877 28686 -34246 -1522 33126 -24886 -13890 34597
1776 34597 -13653 -25304 33096 326 -34527 27449 13138 -38133 18613 23328 -37443 8221
1788 8221 30996 -32969 -3921 35467 -23396 -15816 35217 -10538 -25915 31742 1940 -33672
1800 -33672 25605 15362 -38359 16412 26889 -38542 5655 34746 -33970 -5434 39405 -26846
1812 -26846 -16674 40551 -15213 -27011 36505 -1822 -34526 29653 11255 -39318 20553 23483
1824 23483 -41486 8924 34420 -38168 -3090 40303 -31120 -14383 42466 -21988 -24764 41330
$$ packed form
1740c5591P7769m1554m3702P8419k1746n8888O8993O15o6439N1845K2469o7362
1752c5172L1341M1202o2927P308N7598n2961j6550O7349l8274l6450O9147k1464
1764A0147n0888O4359k805o1279N2343J6809o2932L2724L4648n8012J0996M8487
1776C4597m8250j1651N8400l2770l4853O1976j4311n1271N6746M715o0771M5664
1788H221K2775o3965K9048L9388n8863P580N1033m5755j5377N7657k9802l5612
1800c3672N9277j0243n3721N4771J0477o5431M4197K9091o8716K8536M4839o6251
1812b6846J0172N7225n5764j1798O3516l8327l2704O4179j8398n0573N9871K930
1824B3483o4969N0410K5496p2588L5078M3393p1423J6737N6849o4454k776O6094
$$ plain form
1836 41330 -9604 -33439 34433 4312 -38019 24979 16849 -39350 14001 27729 -37627 1880
1848 1880 36310 -32093 -10009 39822 -23670 -19964 39459 -13283 -27962 35752 -1525 -33490
1860 -33490 27844 10669 -34659 16760 21115 -32615 5937 29112 -29006 -5821 34825 -21301
1872 -21301 -17409 35717 -11996 -24235 32785 -2559 -29779 26758 8584 -31366 16996 17950
1884 17950 -29698 5246 25845 -24631 -6394 30681 -17273 -16991 32130 -8828 -26622 30390
1896 30390 1994 -31447 22918 11419 -32042 14870 19729 -30796 3584 27111 -24502 -9251
1908 -9251 30848 -15863 -19530 32412 -7490 -28560 31040 3512 -34686 25429 12768 -36732
1920 -36732 17372 21323 -35223 6595 29038 -29856 -5169 33503 -22222 -16907 36351 -10786
$$ packed form
1836D1330n0934k3835O7872l0121m2331O2998q130n6199N3351J3728o5356L9507
1848A880L4430o8403K2084M9831o3492L706N9423n2742j4679O3714l7277l1965
1860c3490O1334j7175m5328N1419M355n3730L8552K3175n8118K3185M0646n6126
1872b1301L892N3126m7713j2239N7020l5344k7220N6537j8174l9950M8362R54
1884A7950m7648L4944K0599n0476J8237L7075m7954K82M9121m0958j7794N7012
1896C0390k8396l3441N4365j1499m3461M6912M859n0525L4380K3527n1613J5251
1908i251M0099m6711l667N1942l9902k1070N9600k7528l8198O0115j2661m9500
1920c6732N4104L951n6546M1818K2443n8894K4687L8672n5725N315N3258m7137
$$ plain form
1932 -10786 -28115 33967 -398 -33472 29027 9818 -39584 22508 21333 -38912 11330 27729
1944 27729 -33286 738 32882 -26628 -11621 36367 -15671 -22646 34342 -4770 -30666 31379
1956 31379 5878 -36418 24621 15817 -36986 15993 23198 -34831 6097 29625 -28136 -5798
1968 -5798 31267 -19037 -15270 32014 -10117 -25229 29326 2077 -30908 22628 10717 -32860
1980 -32860 16569 18323 -32143 6917 25106 -26164 -3716 26926 -18289 -12327 27275 -8636
1992 -8636 -21191 24224 2128 -26619 18831 11389 -29076 11617 20205 -27821 2771 24696
2004 24696 -22964 -5599 27313 -16300 -15214 27479 -5303 -22116 22886 4349 -26664 18220
2016 18220 13706 -29578 10355 23089 -27959 301 27707 -23593 -7708 30962 -17151 -16850
$$ packed form
1932a0786j7329O2082l4365l3074O2499j9209m9402O2092j175o0245N0242J6399
1944B7729o1015L4024L2144n9510J5007M7988n2038o975N6988l9112k5896O2045
1956C1379k5501m2296O1039q804n2803N2979P205n8029M0928K3528n7761K2338
1968e798L7065n0304L767M7284m2131j5112N4555k7249l2985N3536j1911m3577
1980c2860M9429J754n0466L9060J8189n1270K2448L0642m5215N962L9602l5911
1992h636j2555M5415k2096k8747M5450p442m0465M0693Q588m8026L0592K1925
2004B4696m7660J7365L2912m3613J086M2693l2782j6813M5002j8537l1013M4884
2016A8220m514m3284L9933J2734n1048K8260K7406n1300J5885L8670m8113L01
$$ plain form
2028 -16850 30980 -7130 -24286 27239 2819 -29503 21724 12958 -31834 12704 21615 -30968
2040 -30968 3675 28446 -27875 -7342 33711 -19942 -17085 33653 -12044 -24016 31863 -2188
2052 -2188 -29918 26030 8842 -32693 16769 17867 -31230 8061 25056 -29450 -2096 30689
2064 30689 -23332 -12098 32808 -15521 -20308 32215 -7076 -26314 28702 1874 -29902 22214
2076 22214 10794 -30607 13338 18943 -27277 3248 24490 -22505 -6398 28803 -16241 -15847
2088 -15847 29395 -7229 -22112 26168 596 -25795 21282 8028 -26355 13152 15655 -23763
2100 -23763 3535 20685 -18544 -5874 23289 -11702 -14386 24213 -4533 -21323 22179 3953
2112 3953 -25078 17142 10941 -25405 10167 16363 -23096 2175 21225 -18186 -7366 23520
$$ packed form
2028a6850M7830l8110j7156N1525k4420l2322N1227q766m4792M4538Q911n2583
2040c0968L4643K4771n6321K0533M1053n3653K857N0738m5697j1972N5879l4051
2052b188k7730N5948j7188m1535M9462J098m9097L9291J6995n4506K7354L2785
2064C0689n4021J1234M4906m8329m787N2523l9291j9238N5016k6828l1776N2116
2076B2214j1420m1401M3945N605m6220L0525K1242m6995J6107L5201m5044L94
2088a5847M5242l6624j4883M8280k5572k6391M7077j3254l4383L9507K503l9418
2100b3763K7298J7150l9229J2670K9163l4991k684L8599k8746j6790M3502j8226
2112C953k9031M2220o201l6346L5572O196l9459K5271J9050l9411J0820L0886
$$ plain form
2124 23520 -10752 -15790 22956 -2657 -22371 21159 5332 -26849 17032 13340 -28599 9957
2136 9957 19683 -26389 2001 23823 -21707 -6790 26295 -14492 -15985 26420 -5079 -23170
2148 -23170 23680 4418 -28057 19054 13067 -30738 12886 20770 -30014 4502 26478 -25560
2160 -25560 -4260 28556 -19228 -12358 29043 -10606 -20203 27047 -705 -26044 22271 8669
2172 8669 -28888 15703 16731 -29950 8716 23101 -27828 661 27236 -22493 -7812 28192
2184 28192 -15412 -14561 26703 -6890 -20874 23236 2633 -25150 16862 11027 -25948 9687
2196 9687 17990 -24865 2236 23107 -21210 -5878 24876 -14666 -12533 23562 -7142 -17470
2208 -17470 19772 977 -20766 14096 9449 -21857 7083 16292 -19923 -469 20206 -16321
$$ packed form
2124B3520l4272n038L8746k5613j9714M3530j5827l2181M3881l692m1939L8556
2136I957R726m6072K8390K1822m5530J4917L3085m0787j493M2405l1499j8091
2148b3170M6850j9262l2475M7111n987m3805M3624P884n0784L4516K1976n2038
2160b5560K1300L2816m7784O870M1401l9649r597M7250k7752k5339M8315j3602
2172H669l7557M4591J028m6681L8666J4385n0929K8489K6575m9729J4681L6004
2184B8192m3604Q51M1264l3593j3984M4110k0603k7783M2012n835l6975L5635
2196I687Q303m2855K7101K0871m4317J5332L0754l9542K133L6095l0704j0328
2208a7470L7242j8795k1743L4862m647l1306K8940R209l6215J9454K0675l6527
$$ plain form
2220 -16321 -7074 22565 -11555 -13411 21911 -4408 -17998 18382 3278 -20299 12836 9833
2232 9833 -20866 5833 16876 -19101 -1766 21584 -15236 -9344 23676 -9299 -15654 23485
2244 23485 -3047 -20831 20649 4643 -23573 14448 12228 -23702 7309 18095 -21489 -953
2256 -953 23154 -17503 -9560 25731 -11216 -17022 25563 -3998 -22141 23081 3153 -26111 18240
2269 18240 10940 -27095 10912 17282 -25029 2800 22065 -21286 -5307 25208 -15832 -13541
2281 -13541 26557 -8460 -20135 24739 -758 -24322 20717 6325 -26581 15535 12900 -25959
2293 -25959 7689 18941 -22659 -663 22548 -17251 -8289 23565 -11033 -15445 23529 -3037
2305 -3037 -20552 20085 4098 -22659 15029 10364 -23203 9281 15757 -20736 1316 19021
$$ packed form
2220a6321R247K9639l4120j856L5322k6319j3590L6380j5104k3577L3135l003
2232I833l0699K6699J1043l5977J7335K3350l6820N892L3020l2975o355L9139
2244B3485k6532j7784M1480j6006k8216L8021k220l5930L1011J0786l9584K0536
2256i53K4107m0657P943L5291l6947n806M2585k9561j8143M5222j9928k9264M4351
2269A8240p300l8035L8007O370m2311K7829J9265m3351J5979L0515m1040K291
2281a3541M0098l5017j1675M4874k5497k3564M5039j4392l2906M2116k635l8859
2293b5959L3648J1252m1600K1996K3211l9799Q962L1854l4598m412L8974k6566
2305c037j7515M0637j5987k6757L7688m665l3567L2484O476l6493K2052J7705
$$ plain form
2317 19021 -15535 -6046 20358 -9465 -12067 19466 -2670 -17231 16989 4411 -20278 12691
2329 12691 10262 -20718 6713 14843 -18500 516 17759 -14719 -5680 18851 -8487 -12479 17752
2342 17752 -1251 -16880 14813 5072 -19851 11144 11691 -21314 5220 16821 -18926 -1351
2354 -1351 19362 -15061 -7557 20705 -9029 -13829 19064 -1443 -18893 15822 6551 -21850 10775
2367 10775 13255 -22539 5118 18480 -21299 -815 22211 -17465 -7482 23179 -11345 -12781
2379 -12781 21894 -5098 -18010 19142 2993 -21788 14631 10895 -23038 8808 16501 -22639
2391 -22639 2712 21555 -20360 -4222 23615 -15103 -10179 23380 -8588 -15473 20928 -1138
2403 -1138 -19023 16748 6369 -21518 11139 12779 -21580 4175 18146 -19239 -2097 20573
$$ packed form
2317A9021l4556R489K6404k9823k602L1533k2136j4561L4220j2578k4689L2969
2329A2691k429l0980K7431Q130l3343J9016J7243l2478R039K4531k7338l992L0231
2342A7752j9003j5629L1693r741k4923L0995N47l3005K6534J1601l5747J7575
2354a351K0713l4423P504K8262k9734m800L2893k0507j7450L4715r271k8401L2625
2367A0775K480l5794K7657J3362l9779K0484K3026l9676R983L0661l4524j436
2379a2781L4675k6992j2912L7152j6149k4781L6419l736l3933L1846P693l9140
2391b2639K5351J8843m1915J6138K7837l8718M924L3559l1968o885L6401k2066
2403a138j7885L5771j0379k7887L2657J640l4359K5755J3971l7385J7142K2670
$$ plain form
2415 20573 -15454 -8007 21976 -9611 -13640 19941 -2908 -16703 15538 3376 -18905 11159
2427 11159 9719 -19058 4307 14925 -17057 -1813 17978 -13519 -7642 19103 -8467 -12333
2439 -12333 18170 -2659 -16227 15123 3318 -17663 10415 9221 -17158 4571 13688 -15589
2451 -15589 -1909 17406 -11632 -8522 18766 -6066 -13289 17357 -722 -16973 15016 5333
2463 5333 -19236 10293 11242 -18709 4118 15429 -16145 -1880 18516 -12211 -8521 19681 -6431
2476 -6431 -14586 18716 -180 -18671 16193 5570 -20899 11944 10941 -21300 6698 15358 -19102
2489 -19102 195 18566 -15074 -6014 19770 -10115 -11844 19695 -3838 -17574 17474 2992
2501 2992 -20974 13915 8481 -21778 9421 13899 -21240 3369 17723 -18021 -3295 18680
$$ packed form
2415B0573l6027P447K9983l1587m029L3581k2849j3795L2241j2162k2281L0064
2427A1159j440k8777K3365J0618l1982J5244J9791l1497N877K6745k7570l866
2439a2333L0503k0829j3568L1350j1805k0981K8078j194k6379K1729R117k9277
2451a5589J3680J9315k9038L110K7288k4832p223L0646j8079j6251L1989r683
2463E333k4569K9529R49k9951K2827J1311l1574J4265K0396l0727L690K8202k6112
2476f431q155L3302j8896j8491L4864j0623k6469L2843j003l2241K7998Q660l4460
2489a9102J9297J8371l3640R060K5784k9885j729L1539k3533j3736L5048j4482
2501B992k3966L4889n434l0259L1199M478l5139K4609J4354l5744J4726K1975
$$ plain form
2513 18680 -12267 -8990 18718 -6227 -14255 17174 619 -18077 14072 6790 -19503 9265
2525 9265 12037 -19045 4490 15412 -17043 -968 17393 -13108 -6264 17355 -6788 -11019 15473
2538 15473 -738 -14591 12809 5378 -16861 8631 10909 -16977 3596 14274 -15137 -1112
2550 -1112 16097 -11757 -6135 16465 -6658 -10779 14350 -493 -13816 10876 5117 -15458 6946
2563 6946 10715 -15827 2030 14968 -14030 -3569 17035 -10794 -8140 16983 -6186 -12089 15626
2576 15626 -242 -15394 12258 5466 -17034 7264 11024 -16658 2123 14963 -15576 -3144
2588 -3144 18380 -12287 -8231 19106 -7439 -12505 17821 -2588 -15507 15330 3311 -17868
2600 -17868 10902 9404 -17791 5305 14018 -16624 -315 17474 -13856 -5965 19437 -9710
$$ packed form
2513A8680l0947L277K7708k4945q028L1429j6555j8696L2149p282k6293K8768
2525I265K772l1082K3535J0922l2455J6075J8361l0501O844K3619k4143m231K6492
2538A5473j6211j3853K7400p431k2239K5492K278k7886K0573J0678k9411J4025
2550a112J7209k7854N622K2600k3123m121K5129j4843j3323K4692n759k0575K2404
2563F946L769k6542J7857J2938k8998J0461K0604k7829K654K5123k3169n903K7715
2576A5626j5868j5152K7652o792k2500K4298L760k7682J8781J2840l0539J2432
2588c144K1524l0667M056K7337k6545n066L0326k0409j2919L0837j2019k1179
2600a7868K8770j498k7195K3096Q713l0642J6309J7789l1330P891K5402k9147
$$ plain form
2612 -9710 -11011 19112 -4308 -14721 16798 1171 -16858 12945 6580 -17751 7775 11769 -16797
2625 -16797 1932 15207 -13712 -3694 17011 -10443 -8691 17702 -5825 -13023 15684 -124
2637 -124 -15199 12544 4465 -15997 8447 8974 -15251 3417 12488 -13338 -2244 14702 -9568
2650 -9568 -7199 14984 -5669 -11261 14282 -939 -14164 11841 4424 -15061 7514 8270 -14120
2663 -14120 2577 11459 -11709 -2481 13706 -8362 -7678 14489 -3556 -12005 12859 1413 -14165
2676 -14165 10882 5864 -15474 7284 9973 -14743 2024 13161 -12197 -3134 14598 -8504
2688 -8504 -7585 15165 -4111 -12204 14484 1066 -15087 11288 6078 -16501 8236 10085 -16709
2701 -16709 3956 13757 -14611 -1620 15791 -10753 -6741 16335 -6362 -10922 15503 -1074
$$ packed form
2612i710j301L0123k3420j0413L1519j5627j8029K9803o365k4331K5526L994k8566
2625a6797J8729J3275k8919J0018K0705k7454J752K6393k3527p198K8707j5808
2637a24j5075K7743q079k0462K4444N27k4225J8668R071k5826J1094J6946k4270
2650i568K369K2183k0653n592K5543j5221j3225K6005p417j9485K2575P56k2390
2663a4120J6697Q882k3168R228J6187k2068O84K2167j8045q449K4864j1446j5578
2676a4165K5047n018k1338K2758K689k4716J6767J1137k5358R063J7732k3102
2688h504R19K2750j9276q093K6688j3418j6153K6375n210k2579K4737J849k6794
2701a6709K0665R801k8368J2991J7411k6544M012K3076k2697m560K6425j6577
$$ plain form
2713 -1074 -15165 13560 4230 -17195 9575 9021 -17409 5059 12454 -16051 592 15256 -13244
2726 -13244 -4747 16525 -8855 -9116 15231 -3545 -12651 13645 1537 -15266 10766 6749 -16166
2739 -16166 6435 10343 -15213 2415 13222 -13282 -2154 14716 -9607 -6517 14791 -4930
2751 -4930 -10024 12486 -293 -12099 9865 4327 -13471 6402 8895 -13537 1926 11983 -11445
2764 -11445 -2099 13489 -8445 -5861 13408 -4658 -9127 11960 167 -11737 8539 4917 -12294
2777 -12294 4781 8793 -11912 653 12224 -10290 -4092 13981 -7450 -7893 13501 -3408 -10417
2790 -10417 12056 532 -12560 9285 4984 -13337 5018 9309 -12675 544 12208 -10856
2802 -10856 -3996 14316 -8373 -8318 15265 -4420 -11513 13774 -182 -13752 11262 4128 -14750
$$ packed form
2713a074j4091K8725r330k1425K6770n54k6430K2468P395k8505J6643J4664k8500
2726a3244Q497K1272k5380k61K4347j8776r106K6296j2108j6803K6032m017k2915
2739a6166K2601L908k5556J7628J0807k6504J1128J6870k4323L090K1308j9721
2751d930n094K2510j2779j1806K1964n538j7798J9873K493k2432J5463J0057k3428
2764a1445R346J5588k1934K584J9269j8066m469K1087j1793j1904K0276l622j7211
2777a2294J7075M012k0705J2565J1571k2514O198J8073k1431m43K1394j6909p009
2790a0417K2473j1524j3092K1845m301j8321J8355M291k1984J3219J1664k3064
2802a0856O860J8312k2689N5K3583j9685p093K5287j3956j3570K5014p134j8878
$$ plain form
2815 -14750 7707 8646 -14394 2650 12421 -12432 -2321 14704 -9468 -6633 15836 -6137 -10963
2828 -10963 15636 -1744 -13753 13269 2944 -14810 9778 6745 -15451 5750 10558 -13806
2840 -13806 735 13302 -11358 -4111 14490 -7746 -7956 14608 -3885 -11434 13434 346 -13683
2853 -13683 10638 4512 -13980 6777 7862 -13171 2710 10781 -11257 -1630 12214 -7813 -5729
2866 -5729 12135 -4180 -8917 10876 -76 -11556 9272 3943 -12680 5954 7456 -11703 1972
2879 1972 9641 -9837 -1705 10940 -7016 -5909 11298 -2898 -8857 9546 1382 -10745 7474
2892 7474 4998 -11815 4593 8702 -11507 845 10764 -9664 -2799 11952 -6744 -6118 11546
2905 11546 -3035 -9125 10538 1171 -11484 7939 5624 -12476 4706 9091 -12374 1297 11845
$$ packed form
2815a4750K2457R39k3040J7044R771k4853J0111J7025k4172K835K2469k1973m826
2828a0963K6599j7380j2009K7022j0325j7754K4588l033k2196K1201M808k4364
2840a3806J4541J2567k4660P247J8601k2236k10K2564j8493p549K4868j3088j4029
2853a3683K4321o126j8492K0757J085k1033J5881Q071k2038R627J3844k0027K084
2866e729J7864j6315m737J9793j0952j1480K0828n329j6623J8634J502j9159J3675
2879A972P669j9478Q132J2645j7956J107J7207j4196n959J8403q164j2127J8219
2892G474k476j6813J6408M109k0209J2352R919k0428O865J4751j8696O26J7664
2905A1546j4581o090J9663r367j2655J9423k315j8100J7182M385k1465J3671J0548
$$ plain form
2918 11845 -11244 -2533 13775 -8507 -6395 13355 -4497 -9695 12361 -392 -12065 9999
2930 9999 4356 -13983 6543 8535 -13785 2636 11379 -12794 -1678 13707 -10483 -5445 14472
2943 14472 -7356 -8448 13579 -2894 -11256 11355 1341 -12835 8797 5718 -13769 4897
2955 4897 9807 -12662 580 11943 -10918 -2751 13330 -8373 -6406 13768 -4386 -9200 11420
2968 11420 -310 -10896 8528 3740 -11527 5244 7698 -11150 1267 10267 -9612 -2367 11747
2981 11747 -6998 -5707 11456 -3837 -7967 10310 -327 -9877 7614 3567 -10166 4219 7043
2994 7043 -9586 1095 9200 -8386 -2878 10741 -5801 -6346 10835 -2906 -8609 9939 191
3007 191 -10126 7578 3838 -10639 4256 6939 -9813 460 9618 -8641 -3275 11026 -6045
$$ packed form
2918A1845k3089Q711J6308k2282K112J9750j7852n198K2056j2753j1673K2064
2930I999n643j8339K0526J992k2320J6421Q743k4173J1116J5385k4190N038J9917
2943A4472k1828j092K2027j6473q362K2611j0014j4176K1632l079j9487J8666
2955D897M910k2469J3242J1363k2861Q167J6081k1703J967K0174j8154m814K0620
2968A1420j1730j0586J9424m788j5267J6771K454j8848J2417R000j9879P245J4114
2981A1747j8745J291J7163j5293m130J8277j0637r550J7491m047j3733J4385K824
2994G043j6629J0681Q105j7586N508J3619j6542n45J7181j3741n703J8548r748
3007A91j0317J7704l740j4477J4895K683j6752J0273R158j8259N366J4301j7071
$$ plain form
3020 -6045 -6828 11422 -2781 -9670 10660 727 -11275 8551 4348 -11974 5300 7362 -11794
3033 -11794 1698 10481 -9781 -2617 11895 -7065 -6347 12575 -3957 -9290 12176 -180 -11839
3046 -11839 10212 3541 -13055 7357 6852 -12754 3853 9648 -11394 161 11570 -8861 -4054
3059 -4054 12456 -5595 -7332 12031 -2001 -10003 10759 1231 -12062 8533 4891 -12430 5495
3072 5495 7579 -11165 1685 9796 -9708 -2070 10734 -6732 -5515 10738 -2968 -8289 9396
3085 9396 414 -10353 7758 3820 -11345 4941 6599 -10463 1700 8511 -8664 -1323 9270
3098 9270 -6005 -4733 9466 -3016 -7415 8704 535 -9468 6353 4099 -9961 4133 6746
3111 6746 -9820 1250 9040 -8620 -1996 9904 -5737 -5013 9508 -2666 -7486 8753 840
$$ packed form
3020f045p83J8250j4203o889K0330r933j2002J9826m203j6322J7274K062j9156
3033a1794J3492Q783k0262P164J4512j8960P18J8922j6532n333K1466j2356j1659
3046a1839K2051o671j6596K0412n05j9606J6607N795k1042J1555J1409k0431M807
3059d054J6510j8051j737J9363j4032q002K0762r528j3293K0595l642j7321J7925
3072E495K084j8744J2850Q111j9504P638J2804j7466J217J6253j3706n321J7685
3085I396q982j0767J8111l938j5165J6286J658j7062J2163O811j7175P341J0593
3098I270j5275J272J4199j2482m399J6119q169j0003J5821k254j4060J4094K613
3111F746j6566J1070P790j7660O624J1900j5641P24J4521j2174m820J6239p913
$$ plain form
3124 840 -9496 6628 4745 -10391 3574 7806 -10131 646 10000 -8889 -2504 11516 -6324
3137 -6324 -6052 11393 -3125 -8315 9811 276 -9961 7889 4116 -11349 4793 7547 -11229
3150 -11229 1476 10202 -9936 -2023 11923 -8179 -4854 12172 -5086 -8110 11563 -1606 -9872
3163 -9872 9456 1870 -10921 6666 5345 -11224 3595 8510 -10424 -296 10633 -8574 -3496
3176 -3496 11554 -6282 -6580 11454 -2985 -8761 9914 429 -9990 7582 3659 -10168 4452
3189 4452 6652 -9645 847 9078 -8033 -2825 10506 -5688 -5685 10173 -2849 -7749 9258 217
3203 217 -9061 7317 3201 -9102 4221 5600 -8555 1005 7546 -6977 -2232 8981 -4548
3216 -4548 -5355 9143 -2094 -7465 8340 775 -9136 6639 3626 -9187 4130 6036 -8945
$$ packed form
3124H40j0336J6124j883j5136J3965M232j7937J0777R354j8889O385J4020j7840
3137f324K72J7445j4518n190J8126r535j0237J7850l773j5465J6142K754j8776
3150a1229J2705Q726k0138P913J3946k0102L325J7026j7258l024J9673j3169q266
3163i872J9328p586j2791J7587j321j6569J4819M915j8934J0128J0929j9207N078
3176c496J5050j7836k98J8034j4439n776J8675r485j0419J7572l923j3827J4620
3189D452K200j6297J0492Q231j7111N208J3331j6194LJ5858j3022m900J7007r041
3203B17r278J6378m116j2303J3323J379j4155R560O541j4523M745J1213j3529
3216d548q07J4498j1237n371J5805p565r911J5775l013j2813J3317J906j4981
$$ plain form
3229 -8945 702 7994 -6943 -2683 8935 -4988 -5707 9387 -1845 -8140 8618 1669 -9976
3242 -9976 6844 4267 -10280 4448 6817 -9948 1246 9045 -8110 -2154 10061 -5628 -5397
3255 -5397 10157 -2717 -7930 9433 392 -10334 8171 3675 -11301 5458 6582 -10759 2565
3268 2565 8526 -9863 -379 10350 -7768 -3807 10740 -4620 -6514 9990 -1281 -8835 8588
3281 8588 1973 -10688 6818 5361 -10769 3786 7776 -9959 851 9358 -8277 -2007 9968
3294 9968 -5695 -5435 9970 -2181 -7686 8556 1116 -9002 6158 4051 -9435 3529 6752
3307 6752 -9265 608 8458 -7580 -1933 9137 -5082 -4460 8774 -2677 -6511 7552 413
3320 413 -8256 5650 3453 -8229 2796 5964 -7950 403 8001 -6955 -2808 9085 -4495
$$ packed form
3229h945R647P292j4937M260J1618j3923p19J5094j1232o295J6758o949j1645
3242i976J6820k577j4547J4728K369j6765J1194P799j7155N956J2215j5689K31
3255e397J5554j2874n213J7363r041j0726J8505m496j4976J6759J124j7341J3324
3268B565N961j8389R484J0729j8118L961J4547j5360j894J6504j1271p554J7423
3281H588o615j2661J7506j457j6130J4555L990j7735J0810Q507j7635O270J1975
3294I968j5663K60J5405j2151n505J6242p440j0118J5160k107j3486J2964L223
3307F752j6017R873P850j6038N647J1070j4219O22J3234j1451l834J4063p139
3320D13q669J3906k197j1682J1025L168j3914Q353P598j4956M147J1893j3580
$$ plain form
3333 -4495 -4973 8836 -2087 -6764 7391 884 -8428 5533 4022 -8675 2938 6754 -7988
3346 -7988 -50 8499 -6821 -3302 9801 -4766 -5595 9653 -2240 -7768 8436 1068 -8973
3359 -8973 6469 3649 -9347 4006 6552 -9267 876 8640 -7842 -2155 10016 -6040 -5038
3372 -5038 10379 -3492 -7488 9815 -456 -9284 7685 2520 -9742 5782 5425 -9663 2373
3385 2373 7612 -8564 -942 9295 -7058 -3965 10086 -4409 -6492 9635 -1803 -8514 8771
3398 8771 1178 -9769 6220 4230 -9047 3261 6144 -8336 467 7990 -6924 -2733 9145
3411 9145 -4350 -5150 8553 -1903 -7059 7977 666 -8289 6437 3199 -8411 3720 5304
3424 5304 -7560 637 6988 -5957 -2109 7569 -3934 -4636 7664 -1461 -6874 6932 1247 -7819
$$ packed form
3333d495m78J3809j0923m677J4155o507r312J3961j511j2697J1613L816j4742
3346g988P938Q549j5320L519J3103j4567q29J5248j1893n528J6204p368j0041
3359h973J5442k820j2996J3353K546j5819J0143P764j6482N687J2171j6056J002
3372e038J5417j3871l996J7303j0271q828J6969n165j2262J5524l57j5088J2036
3385B373N239j6176P622J0237j6353L093J4051j4495k083J6127j1438o711J7285
3398H771p593j0947J5989j990j3277J2308K883j4480Q803P523j4914M191J1878
3411I145j3495q00J3703j0456n156J5036p311q955J4726l238j1610J2131J584
3424E304j2864Q197O351j2945L848R678j1503p02J2300r125n413J3806n685r066
$$ plain form
3438 -7819 5271 3260 -7978 3226 5548 -7619 85 7468 -5588 -2849 7689 -3575 -4862
3451 -4862 7574 -1024 -7733 6936 1973 -8804 5106 4584 -9018 2692 6678 -8224 163
3464 163 7992 -6999 -2840 8676 -4318 -5455 8597 -1311 -7361 7497 1317 -8860 6012
3477 6012 4174 -9545 3738 6735 -8936 1078 8034 -8029 -1651 9401 -6162 -4513 9482
3490 9482 -3063 -6658 8557 155 -8398 7025 3041 -9703 4875 5749 -9585 2250 7841
3503 7841 -8527 -508 9271 -6599 -3169 9436 -4427 -5282 8817 -1798 -7286 6936 1563
3516 1563 -8079 5100 3757 -8326 2962 6213 -8106 -27 7626 -7261 -2654 8051 -4228
3529 -4228 -3985 7859 -1950 -5875 6821 406 -7002 4742 2941 -6818 2028 5317 -6527 -16
$$ packed form
3438g819J3090k011j1238J1204K322j3167P704P383j3056K739J0538j1264j287
3451d862J2436q598o709J4669m963j0777J3910n22j3602J1710L986j4902Q387
3464A63P829j4991M159J1516j2994j137J4052r908o050J4858o180j0177J4872
3477F012j838j3719J3283K997j5671J0014O956j6063O378J1052j5563J649J3995
3490I482j2545l595J5215q402q553J5423l984j2744J4578Q74j5334J1835N591
3503G841j6368Q019R779j5870L430J2605j3863q55J4099j0615n488J4222n373
3516A563r642J3179j343j2083J1288L251j4319Q079P653j4887M607J0705j2279
3529d228K43J1844r809l925J2696o415p408J1744j801r759Q846L289j1844O511
$$ plain form
3543 -16 6936 -5518 -2525 7785 -3753 -4765 7326 -1178 -6194 6206 1085 -6711 4566 3344
3557 3344 -7398 2573 5300 -5895 -950 7064 -4980 -3288 8017 -3290 -5431 8074 -791
3570 -791 -7334 7007 1559 -7984 5053 3959 -7891 2530 6084 -6928 -97 7645 -5731 -3023
3584 -3023 8528 -3449 -5620 8285 -1383 -7460 7620 1007 -8799 6236 3685 -8947 3801
3597 3801 5897 -8246 1196 7248 -7131 -1967 8599 -4886 -4825 8694 -2479 -7061 8307 203
3611 203 -8281 6684 2416 -9214 5022 5028 -8767 2296 6572 -7601 -246 7679 -5854 -2932
3625 -2932 8082 -3460 -5319 7866 -1013 -7137 6804 1407 -7915 5045 3858 -8050 2841
3638 2841 5505 -6925 374 6444 -5368 -2163 6913 -3584 -4079 6889 -800 -5910 5928 1698
$$ packed form
3543a6O952j2454K993J0310j1538j012J2091q504n016J2400n121p796J1277j222
3557C344j0742R971K727j1195M945Q014j2044J692J1305j1307k141J3505q865
3570g91o543J4341n448r543J3037j094j1850J0421L554j3012O831P742j3376K708
3584c023J1551j1977k171J3905r668o077J5080o613r806J5035k551j2632J2748
3597C801K096j4143R442O052j4379N164J0566j3485O1J3519j1173m582J5368q104
3611B03q484J4965m268j1630J4236Oj3795J1063M276j4173P355P925j3533K922
3625b932J1014j1542j859J3185q879o124J3941n397r322J2960j187j1908J0891
3638B841K664j2430P299O070j1812L205R076j0497m95J0968p689n110J1838m230
$$ plain form
3652 1698 -7066 3907 3674 -6991 2072 5241 -6633 -253 7031 -5122 -2652 6813 -3110 -4540
3666 -4540 6220 -522 -6057 5408 1773 -6765 3403 4220 -6845 1596 5795 -6346 -605 6915
3680 6915 -5221 -2833 7455 -3274 -5174 6828 -393 -6380 5622 1659 -7472 4262 4244 -7768
3694 -7768 1963 6331 -7247 -618 7759 -5959 -2786 8215 -4143 -4982 8184 -1686 -6651 7214
3708 7214 730 -7682 5508 3821 -8440 3231 5786 -7946 693 7322 -6755 -2034 8364
3721 8364 -4751 -4041 8312 -2929 -5725 7461 -373 -6860 6197 2394 -7428 4107 4675 -7384
3735 -7384 1653 6044 -6689 -821 7302 -5339 -2953 7673 -3141 -4909 7135 -1097 -5935 5922
3749 5922 1079 -6746 4147 3136 -6715 1901 4988 -5834 -620 6185 -4615 -2756 6933 -2755
$$ packed form
3652A698q764J0973k33j0665R063L169j1874O380P284j2153K470R465r923j430
3666d540J0760o742n535J1465l635q538J0168Q17j1065Q441M199j2141N741P520
3680F915j2136K388J0288j0729j900J2002p221n987J2002l963r131J1734j8j2012
3694g768R731M368j3578O629Q377j3718L173J1001j2358q39J3166r870m965J3865
3708G214o484q412J3190j687j2261J1671K555j3732Q639O629j4077M721J0398
3721H364j3115P10J2353j1241k796J3186p834o487J3057l803r822J1535N68j2059
3735g384R037M391j2733N868Q123j2641K386J0626j0814j768J2044q232m838J1857
3749E922m843p825J0893j011r851Q616L087j0822N214O805j0800J859R689r688
$$ plain form
3763 -2755 -4735 6403 -925 -6154 5200 1243 -6382 3876 3148 -6421 1659 4928 -5461 -1033
3777 -1033 6034 -3790 -2891 6402 -2140 -4898 6310 -242 -6202 5483 1864 -6813 3931 3476 -6511
3792 -6511 1573 5607 -5723 -593 6481 -4422 -2897 6969 -2279 -5148 6776 -175 -6631 5935
3806 5935 1826 -7529 4621 4158 -7629 2319 5847 -6834 289 6522 -5372 -2588 7516 -3248
3820 -3248 -4536 7393 -1131 -6429 6176 1150 -7395 5127 3228 -7842 3178 5008 -7551
3833 -7551 1124 6511 -6000 -1279 6942 -4285 -3255 6620 -2481 -5267 6312 40 -6906 5138
3847 5138 2356 -7076 3428 4084 -6830 1540 5697 -6229 -487 6198 -4497 -2423 6519 -2539
3861 -2539 -4194 5690 -333 -5421 4835 1841 -6099 2973 4199 -6366 1250 5340 -5521 -612
$$ packed form
3763b755j980J1138p328n229J1354l957p625J0258p28r569Q080L269j0389M428
3777a033P067r824Q99R293q542k758J1208o552n960J1685l619q677J0744m55r987
3792f511Q084M034j1330N130P074j0903J525R866r248k869J1924o951o456J2566
3806E935m109r355J2150m63j1787R948L528j2681P123O233j1894K784J0104j0764
3820c248j288J1929q524n298J2605n026q545J2522j899j1070J1020J830j2559
3833g551Q675N387j2511M721Q221j1227J030R875r101k786J1579o272o946J2044
3847E138k782r432J0504O56j0914Q370M157j1926N742O685j0695K074Q942r058
3861b539j655R884o023n088J0256k994p940R072J226j0565P616M090j0861M909
$$ plain form
3875 -612 5882 -4225 -2758 6292 -2146 -4272 5327 -222 -5008 4264 1933 -5776 2572 4000 -5566
3890 -5566 877 5230 -4885 -1487 6162 -3804 -3149 6428 -2283 -4707 5971 62 -5879 4458
3904 4458 1861 -6416 3074 4032 -6037 499 5584 -5583 -1195 6943 -4175 -3580 7001 -2298
3918 -2298 -5129 6898 -387 -6453 5738 1661 -6911 3712 3962 -6718 1458 5336 -6097 -429
3932 -429 6372 -4757 -2696 6962 -3108 -4513 6912 -917 -5691 6267 612 -6560 4767 2871
3946 2871 -6697 2671 4511 -6040 275 5456 -5023 -1709 6570 -3457 -3989 6605 -1462 -5065
3960 -5065 5872 469 -5842 4593 2121 -6302 3004 3775 -5649 631 4955 -4715 -1409 5461 -3247
3975 -3247 -3104 5657 -1405 -4705 5230 552 -5625 3945 2187 -5964 2428 3659 -5430 689 4530
$$ packed form
3875f12O494j0107J467R050q438k126R599n549m786R272k331p709Q348J428r566
3890e566O443M353j0115L398P649r966O55R577q711k424J0678n909n941J0337
3904D458k597q277R490R58j0069O536N085j1167M388Q138j1118N95J0581r299
3918b298k831J2027p285o066J2191m077q572J0623K50j0680Q176L878j1433N668
3932d29O801j1129K061R658j0070j405J1425p829m774J1958n655p172J1327j896
3946B871r568R368J840j0551O315N181j0479L314Q279j0027n32J0594q067l603
3960e065J0937n403o311J0435k472q423R306P71r424O280M324r670L306O870q708
3975c247J43Q761p062l300R935m678o177R570j758q151Q392J231r089O119L841
$$ plain form
3990 4530 -4427 -1306 5528 -2828 -3347 5576 -1061 -4699 4625 802 -5361 3679 2793 -6039 2224
4005 2224 4213 -5364 371 5192 -4631 -1388 5903 -2970 -3301 5781 -1047 -5039 5167 799 -6101
4020 -6101 4015 2798 -6577 2312 4836 -6202 698 5998 -5222 -1377 6494 -3712 -3135 6522
4034 6522 -2324 -4676 5969 206 -6095 4665 2001 -6365 3208 3749 -6696 1433 5096 -5895
4048 -5895 -574 6254 -4550 -2444 6186 -2947 -3750 5748 -1073 -5046 4965 1083 -6186 3247 3151
4063 3151 -6188 1986 4464 -5462 -80 5467 -4821 -1765 6048 -3105 -3471 5563 -1218 -4046 4704
4078 4704 485 -5023 3353 2467 -5318 1617 3986 -4812 -68 4789 -3927 -1264 5371 -2509 -2989
4093 -2989 5321 -1077 -4263 4174 766 -4855 3053 2232 -4866 1258 3720 -4666 -466 4975 -3542
$$ packed form
3990D530q957L121O834q356n19Q923o637l638R324l823o163R040q86q832Q263
4005B224J989r577N735M821r823L243P291q873l31R082o828l992J0206m368o900
4020f101J0116j217r375Q889K524j1038O900N300j1220L845P871j0206N77R657
4034F522q846k352J0645n763o301J0760k664q366R573N41j0445Q129L663j0991
4048e895N321O828j0804K106Q630r133q03R498o821l973J0011l882p269R433r6
4063C151r339Q174K478r926N382N547j0288L056P813r153l66R034o781k828Q750
4078D704m219n508Q376q86p785O935K369q798M744M857q716K663O635p880m80
4093b989Q310o398l186Q437l408n621P908q21p098O124K462q386M200N441q517
$$ plain form
4108 -3542 -2014 5128 -2290 -3666 5247 -660 -4778 4414 1106 -5313 3264 2833 -5257 1113 4285
4123 4285 -4800 -495 5286 -3999 -2512 5989 -2265 -4194 5649 -832 -5165 4804 1018 -6004 3630
4138 3630 2689 -6159 2132 4167 -5366 229 5291 -4354 -1875 6020 -3141 -3501 6196 -1365 -5213
4153 -5213 5524 488 -5833 4657 2151 -6091 2945 3613 -5884 1122 4943 -5063 -726 5612
4167 5612 -3484 -2812 5741 -2240 -4034 5459 -289 -5243 4811 1650 -5952 3137 2944 -5494 1773
4182 1773 4138 -5117 -4 4783 -3876 -1794 4913 -2270 -3141 4559 -536 -4408 3846 1146 -5084
4197 -5084 2824 2669 -4849 1258 3677 -4218 -250 4212 -3316 -1614 4495 -1974 -3278 3907 -231
4212 -231 -4009 3147 1445 -4717 2288 2939 -5142 857 4220 -4455 -899 4896 -3304 -2310 5099 -1770
$$ packed form
4108c542J528P142p418j376Q913n907m118R192l308o419Q577m31q090O370L172
4123D285r085M305N781r285J487Q501q254j929R843o481m333R969l786p022R634
4138C630r41q848Q291K035r533N595N062r645K479P895r161l60R697p561l848
4153e213J0737n036o321J0490k506q242R036O68r497P006L821j0006M337O338
4167E612r096O72Q553p981j794R493n748m954J0054l161p602R089j93q438P267
4182A773K365r255N113M787q659K082O707p183q71P700n095l872Q254k700o230
4197e084P908j55p518O107K419p895L968M462p528J702O109o469j304P185m138
4212b31l778P156j702o162P005O51q081N999L363q675L556N795q200R94P409o869
$$ plain form
4228 -1770 -3311 4668 -55 -4237 3476 2031 -5019 2195 3395 -5364 593 4588 -4437 -915 5466
4243 5466 -3664 -2547 5747 -1982 -3672 5071 -538 -4597 4496 1269 -5343 2787 2803 -5247 1422
4258 1422 4178 -4867 -47 5174 -4334 -2125 5818 -2910 -3357 5602 -991 -4621 4993 253 -5203
4273 -5203 3734 2177 -5431 2345 3589 -5050 333 4622 -4271 -1202 5014 -3117 -2652 5290 -1816
4288 -1816 -4105 4873 191 -4579 3869 1421 -4968 2547 2605 -4450 1049 3758 -3645 -753 4397
4303 4397 -2962 -2113 4783 -1572 -3203 4201 22 -4212 3714 1461 -4488 2169 2556 -3916 808
4318 808 3371 -3368 -515 4004 -2549 -2384 4332 -710 -3406 3859 239 -4103 3209 1994 -4735
4333 -4735 1853 3430 -4498 418 3790 -3541 -1233 4538 -2480 -2715 4391 -995 -4017 4143 467
$$ packed form
4228a770j541P979m723m182P713j445p050P214J200q759N957L995r025L522O381
4243E466r130J117Q294p729j690Q743n609m059R093l227o612Q130J6q050O669
4258A422K756r045M820N221r508K209P943q728m47Q959o593l630R614m740n456
4273e203Q937j557p608P776J244q639N383M289q893L069O216q131M65P942p106
4288a816k289Q978m682m770Q448k448o389P515N8p055N499K709p403K892N150
4303D397p359Q49O896o355j631P404m179m234P926k253n949O657L87o472M724
4318H08K563o739K853M519o553J65O716n042k696P265l620m342P312j215o729
4333d735O588J577p928M916L372p331K308N771p018k35P106n386l022Q160l676
$$ plain form
4348 467 -4594 3099 2087 -5094 1998 3051 -5001 662 4307 -4051 -918 4617 -2907 -2398 4911
4363 4911 -1516 -3635 4638 -105 -4709 3731 1826 -5378 2456 3115 -5482 1492 4209 -4576 -106
4378 -106 5018 -3649 -1934 5379 -2208 -3085 4780 -560 -4028 4345 960 -4958 3248 2487 -5159 1768
4394 1768 3423 -4766 406 4252 -3970 -964 4883 -2505 -2319 4663 -1115 -3374 3954 305 -3949
4409 -3949 2782 1694 -4418 1624 3011 -4325 335 3981 -3242 -783 4141 -2538 -2261 4034 -994
4424 -994 -3257 3364 506 -3661 2383 1782 -4064 1120 2936 -3901 92 3886 -2925 -1340 4283
4439 4283 -2020 -2390 4251 -852 -3122 3225 341 -3638 2346 1968 -3886 1042 3026 -3907 -333
4454 -333 4010 -3104 -1772 4240 -1989 -2793 4232 -701 -3589 3821 492 -3898 3008 2041 -4146 1581
$$ packed form
4348D67n061P693j012p181P092J053q052N663L645q358L133N535p524N09P309
4363D911o427k119Q273m743m604Q440j905p204P834O59q597O974K717q785M470
4378a06N124q667J715P313p587q77P865n340l468Q373l385n918Q206p61p646O927
4394A768J655q189N172L846q222L006N847p388J86O982n778k259P328l649m254
4409c949O731j088o112O042J387p336M660L646p223K459M924o679K77O295n028
4424i94k263O621k858m167O044o01n846N184J816o837L993L794o811J585N623
4439D283o303l70O641n103k270O347k884l979N984l78n854M928J984o933L574
4454c33M343p114J332O012o229q04P025m933k888P410l329m390O906r67o187N727
$$ plain form
4470 1581 3297 -3914 147 3860 -3300 -1416 4499 -2314 -2676 4639 -1158 -3873 4662 225 -4464
4485 -4464 3547 1348 -4802 2094 2886 -4339 804 3652 -3923 -933 4532 -2886 -2331 4370 -1576
4500 -1576 -3286 4396 -460 -3994 3641 978 -4384 2352 2053 -4366 1393 2889 -3710 -43 3466
4515 3466 -2993 -1509 3995 -1469 -2782 3685 -292 -3321 3408 799 -3765 2561 1859 -3933 1114
4530 1114 3044 -3529 -45 3307 -2644 -1027 3667 -1499 -2414 3023 -118 -3304 2807 1122 -3925
4545 -3925 1988 1949 -3879 958 3129 -3299 -289 3642 -2241 -1493 3523 -1338 -2508 3364 -283 -3449
4561 -3449 2850 1175 -3826 1975 2613 -3881 736 3163 -3626 -459 3832 -2731 -1675 3983 -1741
4576 -1741 -2646 3781 -299 -3447 2994 1048 -4216 2341 2365 -4305 1218 3624 -4023 -74 4072 -3191
$$ packed form
4470A581J716p211M061L713p160J884N915o813l62P315n797k715Q535m437m689
4485d464Q011k199o150O896P92p225N143K848p575K990N465p418N55O701n946
4500a576j710P682m856l534P635k663n362O736k99o419N759J496o599L667L509
4515C466o459J484N504n464j313O467l977l029O729k609m564O326p02n792N047
4530A114J930o573L484L352n951J617M694n166r15N437l141l186O111j685n047
4545c925N913l9n828M837K171o428L010L931n883P48N016m861j170N872l647l166
4561c449O299j675n001N801O38o494M617K427o789L167M291o563J056N658n724
4576a741r05O427m080l148O441j946n264O557K4o670N523K406p647L949M146p263
$$ plain form
4592 -3191 -1574 4468 -2375 -2428 4155 -972 -3640 3399 296 -3748 2756 1907 -3852 1794 2611 -3672
4608 -3672 305 3395 -3213 -1806 4278 -2440 -2183 3820 -1563 -2797 3718 -206 -3515 2874 1009
4623 1009 -3762 1761 2194 -3183 418 2900 -3084 -706 3587 -2229 -1787 3652 -1111 -2555 3124
4638 3124 -288 -3408 2638 805 -3481 1612 2112 -3063 443 2621 -2693 -501 3433 -2094 -1898
4653 -1898 3266 -933 -2541 2844 97 -3095 2381 1241 -3359 1526 2153 -3383 468 2090 -2692
4668 -2692 -687 3250 -1608 -1789 3413 -714 -2949 3193 236 -3267 2460 1299 -3743 1642 2503
4683 2503 -3541 694 3160 -2878 -595 3757 -1916 -1853 3778 -968 -2857 3604 -61 -3560 3218
4698 3218 1166 -3757 2078 2052 -4171 943 2940 -3388 -62 3512 -2713 -1312 3682 -1832 -2252 3594
$$ packed form
4592c191J617O042o843n3O583n127k668P039l103m044O504q49n759N646Q17o283
4608c672L977L090o608J407O084o718K57O003n383j234O515l924l309O389j865
4623A009m771N523M33n377L601K482n984K378M293n816M42N439m763j444N679
4638C124l412l120O046j833m286N093N00n175L506K178n314K192L934n527J96
4653a898N164m199j608N385k747l192N476j140m600M885O27n536L851J622m782
4668b692K005L937m858j81N202m127k235O142k957l503N727j161n042N385Q61
4683B503o044M235K466o038K283M352n673O3N631m746j889O461l665l499O778
4698C218k052m923N835k6o223N114J997o328L326L574o225J401M994n514m20N846
$$ plain form
4714 3594 -503 -3297 2991 648 -3545 2300 1669 -3758 1631 2666 -3394 231 3084 -2681 -907
4729 -907 3305 -1951 -1948 3428 -549 -2853 2578 262 -3200 2207 1268 -3257 1366 2247 -3230 274
4745 274 2871 -2704 -633 3168 -1612 -1565 3330 -757 -2269 2649 539 -2790 1952 1595 -2987 898
4761 898 2466 -2938 123 2702 -2209 -736 2976 -1543 -1640 2788 -677 -2388 2475 495 -2989 1819
4777 1819 1546 -3340 665 2525 -2743 -288 3054 -2340 -1252 3194 -1571 -2038 3300 -555 -2682
4792 -2682 2888 534 -3184 2023 1486 -3400 1184 2324 -3121 -213 3270 -2614 -1278 3605 -1623
4807 -1623 -1898 3710 -842 -2828 3229 -89 -3046 2395 959 -3300 1545 2030 -3054 429 2895
4822 2895 -2686 -428 3141 -1948 -1766 3351 -1262 -2121 3045 -249 -2852 2660 615 -3160 1986
$$ packed form
4714C594m097k794O288k343m193N845o31n427N389J035o060L625K853n765J774
4729i07M212n256LN376l977k304N431k316l462N407r39m525M623Q81n477L504
4745B74K597n575K071L801m780M7M895m087j512M918k110l329M742l57m582L885
4761H98J568n404L061K579m911J473L712m519r7M428l465j711M863j980l484M808
4777A819k73m886M005J860n268K455L342n394J088M446m765m67N338l855k127
4792b682N570k354l718N207n37m886M584J140n445K908L483n884J336M883n228
4807a623k75N608m552j986O057l318k957N441j436m259M845M85n084L483K466
4822B895n581K258L569n089J82N117m613q59N166l294k603N512k045l775N146
$$ plain form
4837 1986 1650 -2920 900 2172 -2790 84 2973 -2260 -1177 3019 -1298 -2078 2871 -385 -2744
4852 -2744 2397 580 -2740 2000 1195 -2817 918 1931 -2298 -347 2281 -1731 -1162 2490 -858
4867 -858 -1812 2630 72 -2317 1918 801 -2695 1432 1571 -2677 484 2319 -2554 -447 2417 -1755
4883 -1755 -1186 2540 -806 -1878 2770 -76 -2616 2297 990 -2776 1518 1623 -2966 637 2523
4898 2523 -2507 -269 2763 -1898 -1153 3081 -1429 -2096 2646 107 -2565 2494 745 -2718 1912
4913 1912 1852 -3067 1011 2597 -2993 29 2843 -2420 -761 3030 -1742 -1618 2755 -643 -2583 2510
4929 2510 437 -2816 1714 1459 -3020 947 2017 -2904 242 2723 -2478 -778 2880 -1813 -1218
4944 -1218 2753 -1365 -1957 2522 -82 -2379 1947 953 -2811 1073 1478 -2684 233 2471 -2264 -350
$$ packed form
4837A986l36m570L820J272m962K874K889n233J083M196m317p80M949l256k359
4852b744N141j817l320M740q05m012L735J013m229J951K628m012N69L652l348
4867h58r54M442k558k389M235j117l496M127J39m248L161J835m873K107K864m172
4883a755N69L726l346j072M648k846k540M913j307l766M294J05m589L603J886
4898B523n030K238L032m661P45M234m510o67M742k539k672N059j749l463M630
4913A912o0m919M078J586n590L022K814n263J659L791m772J24M373l398j940N093
4929B510k073l253M530k55m479L967J070m921L146K481n201J700L658m693N95
4944a218L971m118n92M479k604k297M326r94l764L884M05m162K917K238m735J914
$$ plain form
4960 -350 2539 -1831 -1222 2603 -1096 -1719 2158 -183 -1795 1667 897 -2133 1101 1243 -2131 131
4976 131 2028 -1956 -389 2259 -1520 -1209 2132 -998 -1677 2105 145 -2055 1602 671 -2340 745
4992 745 1704 -2412 261 2358 -1881 -745 2135 -1351 -1584 2439 -478 -1929 2138 282 -2473 1733
5008 1733 1099 -2386 1055 1608 -2228 156 2110 -2035 -655 2531 -1282 -1431 2511 -664 -2096 2364
5024 2364 46 -2476 1884 860 -2729 1479 1754 -2467 609 2004 -2244 -48 2456 -1735 -987
5039 -987 2621 -874 -1823 2573 84 -2283 2206 468 -2672 1757 1302 -2743 797 1635 -2268 319
5055 319 2293 -1643 -673 2474 -1043 -1351 2343 -586 -1929 2104 276 -2407 1500 1130 -2310 982
5071 982 1427 -2241 506 1768 -1676 -741 2121 -850 -1259 2069 -435 -1510 1745 389 -1916 1474
$$ packed form
4960c50K889m370O09L825l699o23L877k341j612L462p70l030L234J42l374K262
4976A31J897l984J567K648l779L11L341l130o79L782j960k200L657r31l011L085
4992G45R59m116K673K097m239J136K880l486k33M023k917j451M067j856k755M206
5008A733o34l485L441N53l836K384J954m145J380L186l813j49L942l175j432M460
5024B364k318k522M360j024l589M208K75m221L076J395m248K196K504m191P48
5039i87L608l495r49M396k489k367M489j738l140M429m55m045L540Q38l903K587
5055C19J974l936R70L147l517l08L694k929j343M033j828k683L907l70l440L292
5071I82M45l668K747J262l444R35K862k971m09L328k504j075L255j356k305L390
$$ plain form
5087 1474 1148 -2049 730 1755 -1823 138 1903 -1649 -467 2186 -1005 -1367 1667 -274 -1675
5102 -1675 1651 518 -1898 1003 1135 -2297 369 1770 -2094 -218 2082 -1508 -663 2209 -925
5117 -925 -1422 2193 -244 -1794 1677 768 -2094 1245 1348 -2291 587 1835 -1985 -180 2193 -1781
5133 -1781 -563 2580 -1346 -1304 2289 -432 -1682 2180 308 -2218 1538 1009 -2267 633 1733 -2048
5149 -2048 226 1918 -1866 -611 2538 -1400 -1288 2282 -721 -1482 2218 -163 -2097 1532 438
5164 438 -1962 1172 1527 -2566 -368 1602 -1572 -493 2263 -1306 -831 2257 -943 -1766 1929 -54
5180 -54 -1799 1544 363 -1683 1072 1036 -1725 319 1635 -1209 -195 1715 -1032 -655 1810 -745
5196 -745 -1300 1642 -96 -1501 1679 559 -1477 1013 1251 -1427 325 1289 -1440 -190 1772 -816
$$ packed form
5087A474l26l197K779J025l578J961J765l552J182K653l191l62L034j941j401
5102a675L326j133k416K901J32l432K666J401l864J876K300l590Q45K872l134
5117i25m97L615k437j550L471r09k862L339J03l639K878J248l820J805K373l974
5133a781J218L143l926M2L593k721j250L862j872k526L756n29l276K900J100l781
5149b048K274J692l784J255L149l938J12L570l003p61L700k381j934L629j094
5164D38k400L134L55m093K198J970l174J079K756l569M75L088l200q23L695j983
5180e4j745L343j181k046K755l6k761K044J316k844J014J910k747L77K465k555
5196g45n55K942j738j405L180j120k036K490K38k678J752R64k729J250J962k588
$$ plain form
5212 -816 -1200 1769 -110 -1549 1597 106 -1790 1304 510 -1981 825 1216 -1806 390 1582 -1435
5228 -1435 -670 1820 -1217 -805 1816 -557 -1387 1602 -6 -2019 1282 610 -1807 941 1178 -2057
5244 -2057 569 1608 -1811 -385 1660 -1416 -854 1877 -729 -1414 1743 -115 -1827 1638 359
5259 359 -2016 1047 1019 -1925 497 1446 -1869 133 1929 -1396 -541 1925 -1002 -949 1825 -244 -1409
5276 -1409 1600 133 -1893 1408 712 -1705 448 1080 -1481 -107 1477 -1598 -275 1469 -984
5291 -984 -602 1677 -129 -1135 1560 -120 -1277 970 586 -1422 559 1111 -1405 38 1384 -988
5307 -988 -386 1533 -746 -654 1319 -341 -1345 1419 177 -1051 893 694 -1585 280 1228 -1384
5323 -1384 -306 1185 -1137 -499 1389 -651 -1079 1674 -360 -1310 1322 176 -1690 905 1002 -1634
$$ packed form
5212h16l84K969j879j439L146j491j896L094p94k491K806L91l022K196J192l017
5228a435P65K490l037M12K621k373q30K989j608k013L301o72k417K748K37l235
5244b057K626J039l419J426K045l076N62K731k606o85L157j858j712L465j279
5259C59k375L063k8k944K422R49l315K002J796l325Q55K466k927N3K774k069j165
5276a409L009j467k026L301o96k417K153O32k561J374J584l075J323J744k453
5291i84L82K279j806j006K695j680j157K247l84k008J981N52k516J443J346k372
5307i88O02J919k279R2J973j660j004K764j242j228J944j99k279J865R48k612
5323a384J078J491k322O38J888k040m28K753k034r50K632j146j866K595R7k636
$$ plain form
5339 -1634 582 925 -1550 -224 1602 -1295 -476 1555 -640 -997 1682 -355 -1135 1396 145 -1745
5355 -1745 1104 707 -1738 721 1045 -1672 279 1397 -1280 -418 1670 -869 -1023 1519 -716 -1043
5371 -1043 1572 153 -1731 1445 450 -1432 613 1049 -1548 420 1287 -1387 -1 1415 -822 -539
5387 -539 1606 -631 -932 982 -196 -1260 1171 184 -1634 675 796 -1424 499 934 -1089 -192
5403 -192 1259 -824 -459 1407 -514 -989 1266 -13 -1065 980 335 -1375 881 634 -1205 296
5419 296 941 -1063 -45 968 -944 -533 1200 -426 -449 1140 -68 -1122 898 443 -1013 589
5435 589 574 -1223 168 1075 -1118 -398 1346 -868 -635 1368 -441 -735 1038 10 -1046 714 440
5452 440 -1272 335 821 -1225 192 1018 -1099 -376 1370 -1003 -678 1259 -386 -1045 1331 -244
$$ packed form
5339a634K216L43k475J326J826k897Q19K031k195l57K679k037p80K531j251j890
5355a745K849l97k445K459L24k717J951J118k677Q62K088k539j54K542k235l27
5371a043K615j419j884L176r95j882K045M36k597J968Q67k674J386J416k237K83
5387e39K145k237l01J914j178j064K431r87j818K309J21k220J923M35k023Q97
5403a92J451k083L65J866j921m75K255j279j052K045o45j710K256k47j839J501
5419B96O45k004J018J013j912M11J733j626k3J589j208j054K020m55j456J602
5435E89j5j797J391R07k193P20J744k214K33K003j809k94J773j028j056J760k74
5452D40j712J607M86k046J417Q26k117P23J746k373L25J937j645o59K376j575
$$ plain form
5468 -244 -1382 1192 287 -1294 625 853 -1182 304 1162 -994 -39 1271 -1146 -221 1595 -805
5484 -805 -845 1471 -194 -1059 1141 99 -1307 568 262 -850 415 979 -1414 95 982 -623 -245
5501 -245 1115 -604 -526 922 -614 -624 833 -65 -1036 683 507 -1088 580 687 -985 49 881
5518 881 -635 -347 1227 -326 -697 1193 -279 -578 723 15 -843 615 558 -1146 341 705 -772
5535 -772 57 841 -885 -462 946 -326 -626 663 82 -783 739 190 -911 469 660 -858 299
5552 299 712 -787 -209 1016 -412 34 734 -317 -903 615 -313 -1164 962 339 -996 624 453
5569 453 -941 428 603 -1043 -33 859 -789 -153 937 -575 -702 878 75 -756 878 229 -879
5586 -879 444 526 -929 491 569 -1023 45 754 -773 -332 1082 -451 -255 811 -275 -802 602
$$ packed form
5468b44j138K574r05j581J919K28k035J486Q58k156R55J310k417R25J816k400
5484h05m0K316j665q65K200j042j406J875l06j112J265N64k393J509Q87j605L78
5501b45J360j719P8J448j536j0J457q98r71J719j76j595J668J07j672J034Q32
5518H81j516K88J574j553l71J890j472k99J301p08q58J458n7j704J487L64j477
5535g72Q29P84j726M23J408j272l00J289n81q65J522n49j101J380J91j518J157
5552B99M13j499N78J225j428M46P00j051n86J518r28q51K126o23j335J620j71
5569D53j394J369J75j646J010Q92j648O36J090j512j27J580q03q31J634o49j108
5586h79J323Q2j455J420P8j592J068P09j527M41J414j533J96J066j086n27J404
$$ plain form
5603 602 -39 -1239 239 270 -941 461 482 -799 238 839 -591 -141 780 -528 -276 654 -233 -506
5621 -506 793 56 -866 447 113 -791 49 438 -554 318 732 -840 -210 938 -516 -218 989 -110
5639 -110 -126 877 106 -998 -105 557 -720 184 778 -573 -156 612 -533 -796 1095 -336 -245 448
5657 448 -99 -1316 377 225 -1266 464 287 -888 156 520 -275 -14 389 -1224 -413 561 -329 -524
5675 -524 26 195 -354 521 -141 -801 259 92 -830 350 183 -456 -32 515 -421 -1047 569 -394 -689
5694 -689 466 -1034 -930 917 10 -642 23 204 -720 56 1275 -563 -87 385 -774 -72 590 -155
5712 -155 -380 514 -784 -550 178 837 -444 470 -309 -866 -228 405 -843 328 295 -275 -394 673 -496
5731 -496 -447 354 201 -444 218 319 -636 319 515 -633 -130 586 -491 225 728 -175 -487 358 -93 -431
$$ packed form
5603F02o41j200J478L1j211J402K1j281J037O01j430M50R21j308K52R30q87k73
5621e06J299p37r22J313l34r04Q40L89r92Q72M14j572O30J148j454K98J207j099
5639a10j6J003p71j104Q93O62j277R04N94j351M17P68j145k63J891j431R1O93
5657D48n47j217J693j52j491J730j77j175J044L64p95K61M03j613Q11R74q90j95
5675e24N50J69n49Q75o62o60J060j67r22J180j67o39M24N47r36o26J616r63k95
5694f89J155j500J04J847r07o52O65J81r24P76J219j838M76M72j159P02O62p45
5712a55k25Q94j298K34P28O59j281R14p79n57O38O33j248J171l3n70j19J067j169
5731d96M9Q01j53o45O62J01r55R55J96j148N03P16j077P16N03r03l12Q45m51l38
$$ plain form
5751 -431 355 -96 -348 386 353 -710 98 429 -830 33 601 -424 -19 626 -342 -258 612 -118 -587 427
5771 427 8 -652 468 284 -508 248 338 -428 157 489 -464 36 685 -249 -422 793 -11 -726 429
5790 429 130 -629 256 400 -381 -2 551 -244 -55 637 -598 -174 610 -168 -260 785 -150 -657 526
5809 526 119 -494 635 371 -468 320 191 -556 219 433 -622 -47 555 -182 -482 635 -163 -644 393
5828 393 86 -708 4 230 -596 65 584 -363 -19 523 -422 -85 299 -344 -367 286 -13 -320 544 400
5848 400 -698 329 68 -299 153 497 -283 -145 489 -554 -323 456 75 -391 656 322 -527 238 219
5867 219 -465 4 336 -569 125 408 -477 25 323 -205 -163 625 -98 -308 415 334 -619 5 332 -620 425
5888 425 261 -568 258 527 -438 -249 731 -242 -129 522 -383 -449 444 155 -319 280 405 -428 213 349
$$ packed form
5751d31P86m51k52P34l3j063Q08L31j259Q63N68j025M05O45r68Q4Q70p30m69J014
5771D27m19o60J120j84p92P56R0p66N85L32r53N00O49r34j73J215q04p15J155
5790D29k99p59Q85J44p81L79N53p95J89O92j235M24P84p78r2J045r35n07J183
5809E26m07o13J129k64q39P88j29p47P75K14j055N75O02p37l00J117p98m81J037
5828C93l07p94P12K26q26O61N19r47L44N42r45L37L84o43k3O53k99l07Q64j44
5848D00j098J027k61l67M52L44p80J38O34j043K31P79l81m66J047l34q49P65j9
5867B19o84M69L32r05O94K83q85N02K98n28M2P88p23k10P23q1r53O24L27r52J045
5888D25j64q29Q26K69r65J89R80r73J13O51r05o6Q93k89m74N99J25q33O41J36
$$ plain form
5908 349 -456 205 513 -434 -295 611 -352 -432 545 33 -754 790 -67 -650 475 307 -842 -331 627
5927 627 -1157 -126 233 -656 -733 201 -637 -504 372 -480 -761 660 149 -53 361 414 -381 -264 730 -623
5947 -623 -481 -128 -39 -374 395 -240 -421 707 -101 -559 520 131 -665 304 330 -571 175 498 -543 -75
5967 -75 476 -581 -422 653 149 -658 421 -80 -264 943 448 -1117 109 -33 -1342 481 1146 -1111
5985 -1111 -55 261 -847 -536 432 -686 -956 895 82 -546 660 341 -1048 -206 362 -621 291 614
6003 614 -352 -435 654 -468 -163 647 -171 -542 701 193 -512 658 89 -569 313 535 -617 195 831
6022 831 -585 -52 678 -427 -588 743 -324 -141 607 -195 -687 555 261 -1074 555 265 -660 61
6040 61 627 -498 -230 560 -174 -688 668 -405 -537 500 18 -819 380 418 -609 443 407 -814
$$ packed form
5908C49q05O61L08r47J39R06r63q0R77n12p87J544q57n83J125j68j149N11R58
5927F27j784J031L59q89p7R34q38J33Q76q52k81J421n11k02M14N3p95J17R94j353
5947f23J42L53Q9l35P69o35j81J128q08m58J079l89p96R69K6r01P46L23j041M68
5967g5N51j057J59J075n04q07J079n01j84J207m95j565J226j42j309J823O65k257
5985a111J056L16j108L11R68j118k70J851q13o28J206l19j389Q42N68r83R12L23
6003F14r66q3J089j122L05Q10q18l71J243n08p05J170n69o58Q82K22j152Q12O36
6022H31j416N33P30j105j61J331j067J83P48q02m92J242k94j335J629k90r25P21
6040F1N66j125K68P90p34n14J356j073j32J037m82q37J199L8j027J052l6j221
$$ plain form
6058 -814 227 578 -755 -172 478 -317 -365 505 -405 -680 713 24 -817 459 307 -720 144 686 -646
6077 -646 40 459 -595 12 881 -341 -69 647 -70 -570 640 58 -624 405 144 -690 403 693
6095 693 -639 2 850 -594 -223 750 -367 -228 824 -311 -665 506 104 -493 553 249 -837
6112 -837 401 444 -977 -138 700 -705 -167 958 -477 -548 784 -18 -727 865 421 -809 551 236
6130 236 -980 351 477 -904 -29 664 -538 -58 756 -455 -347 989 -525 -953 606 -337 -836
6147 -836 469 349 -787 219 509 -947 265 872 -1015 24 965 -670 -309 953 -348 -655 771
6164 771 -261 -966 741 166 -873 526 645 -734 38 859 -829 -36 691 -610 -255 866 -578
6181 -578 -617 988 -196 -976 696 316 -752 375 484 -725 271 696 -788 -311 632 -620 -460 808
$$ packed form
6058h14J041L51j333N83O50p95m8Q70r10k75J393o89q41J276j52j027Q64N42j332
6077f46O86M19j054O07Q69j222K72P16p17n00J210n82o82J029k61q34J093K90
6095F93j332O41Q48j444L71R73j117J39J052j135l54J171m02n97J046l04j086
6112h37J238M3j421Q39Q38j405N38J125j435p1J332q02p09J592m44j230J360l15
6130B36j216J331J26j381Q75O93j202M80Q14j211J08J336j514m28J559r43m99
6147h36J305j20j136J006K90j456J212O07j887J039R41j635L61J262j301l07J426
6164G71j032p05J707n75j039J399J19j379P72Q21j688P93P27j301L55J121j444
6181e78l9J605j184p80J672l80j068J127J09j209R96M25j484M77R43j252J60J268
$$ plain form
6199 808 -255 -693 731 -177 -955 642 314 -1086 150 677 -1047 287 607 -763 -226 925 -764
6216 -764 -515 808 51 -711 957 213 -906 763 342 -871 495 676 -1058 57 756 -849 -196
6233 -196 848 -646 -305 937 -329 -813 875 145 -800 878 347 -1220 246 407 -935 269 936
6250 936 -1092 25 1177 -481 -236 883 -411 -1124 1144 455 -855 802 -181 -1129 563 534 -983
6267 -983 392 580 -938 5 1249 -1030 -37 665 -44 -319 1036 -156 -1291 235 466 -895 652
6284 652 582 -1205 437 764 -1155 210 810 -780 -274 908 -340 -581 874 -154 -850 776 303
6301 303 -965 690 649 -949 204 891 -904 -21 632 -514 -159 1092 -620 -1044 660 -246 -1039
6318 -1039 855 160 -1105 943 483 -928 288 831 -866 -178 1019 -668 -364 1170 -369 -664
$$ packed form
6199H08j063m38J424r08p78J597l28j400J236N27j724J334L20j370N37J151j689
6216g64K49J323p57p62J668p44j119J669m21j213J366J81j734J115O99j605O53
6233a96J044j494L41J242j266m84J688p30r45J678n31j567J466J61j342J204O67
6250I36k028J117J152j658K45J119j294p13K268o89j310J657r83r48J692k9j517
6267i83J375J88j518R43J244k279R93P02p09k75J355j192j135J526K31j361J547
6284F52p0j787J642L27j919J365O00j590N06J182j248k41J455j028o96J626m73
6301C03j268J655m1j598J153O87j795Q83O53j146L55J251j712m24J704r06p93
6318a039J894o95j265K048m60j411J216N43j697O88J197j687L04J534j539k95
$$ plain form
6334 -664 952 28 -1306 652 290 -1286 638 436 -1077 202 1116 -1103 -59 905 -906 -563 1272
6351 1272 -477 -985 1273 -186 -1042 955 233 -1171 696 480 -1076 508 703 -1339 139 1267
6367 1267 -872 -506 1351 -733 -728 1423 -362 -1134 1128 302 -1183 930 372 -1202 419 926 -1168
6384 -1168 174 1161 -916 -102 1178 -418 -811 1287 -276 -1128 862 -113 -1162 1134 491 -1293
6400 -1293 486 917 -958 34 1025 -847 -292 1061 -567 -589 973 -341 -1034 1182 -136 -1047 896
6417 896 389 -1124 375 559 -1196 60 889 -869 -275 1216 -779 -620 876 -286 -911 1021 31
6434 31 -1067 728 547 -1186 431 894 -1118 109 1067 -1223 -72 1357 -539 -535 1296 -314 -812
6451 -812 916 231 -1194 755 355 -1237 536 811 -1273 -64 1053 -1020 -232 1394 -924 -686
$$ packed form
6334f64J616r24j334J958l62j576J924k02j513J279R14k219J044R64j811L43J835
6351A272j749n08K258j459q56J997p22j404J867k16j556J584J95k042J478J128
6367A267k139L66J857k084NK151j785p72K262q26j485K113n58j574J621N07k094
6384a168J342R87k077Q14J280j596l93K098j563q52J990r75j049K296o43j784
6400a293J779M31j875R92R91j872N55J353j628k2J562j314o93K216j318r11J943
6417H96n07j513J499J84j755J256Q29j758N94J491j995J59J496j162o25J932r90
6434C1j098J795j81j733J617M63k012J227R58k290J151J429j896MJ831j610m98
6451h12J728o85j425J949m00j592J773K75k084J209J117k073P88J626k318K38
$$ plain form
6467 -686 1274 -340 -967 1150 78 -1226 1186 558 -1247 714 798 -1495 164 1220 -1030 -226
6483 -226 1563 -909 -800 1386 -705 -1023 1451 -108 -1134 1184 557 -1181 748 430 -1518 422
6499 422 1091 -1215 67 1401 -1175 -382 1070 -539 -554 1304 -484 -1240 925 301 -1225 987 628
6516 628 -1076 589 803 -998 127 1029 -700 -488 1350 -417 -987 1437 -329 -1035 1024 177 -1217
6533 -1217 595 558 -1140 361 910 -994 -440 1177 -857 -384 1340 -433 -951 1196 -256 -1206 1327
6550 1327 324 -1476 687 696 -1273 364 904 -1172 -313 1359 -754 -740 1319 -664 -1023 1304 -164
6567 -164 -1204 1252 378 -1383 606 670 -1404 368 1355 -1383 128 1432 -996 -514 1400 -727
6583 -727 -980 1435 -310 -1225 1263 86 -1691 958 494 -1621 500 889 -1388 184 977 -1151
$$ packed form
6467f86J960j614o27K117j072j304K412o28j805J961Q4k293J659J056k250Q04
6483b26J789k472J09K186k091l18K474j559j026K318o27j738J929l18j948J940
6499D22O69k306J282J334k576P93J452j609j5J858j788p56K165o24j526K212l59
6516F28j704J665K14j801J125R02j729K12J838j767n70K424j766p06K059q47j394
6533a217J812l7j698J501N49j904N54J617k034M73J724j773n18K147j452r50K533
6550A327j003j800K163Rj969J637N40k076Q59J672k113J4K059j983l59K327j468
6567a64j040K456q74j761J989O4k074J772R87k738J511J304k428M82J914k127
6583g27k53K415j745r15K488j177j777K649m64k115K121L89k277J572P93k128
$$ plain form
6599 -1151 -424 1421 -815 -853 1375 39 -1304 1043 129 -1125 1027 378 -1465 928 759 -1528
6615 -1528 229 1059 -1140 -136 1453 -838 -437 1147 -236 -1200 1127 70 -1275 841 459 -1417
6631 -1417 520 1020 -1376 131 1327 -983 -468 1243 -565 -703 1349 -249 -1214 1223 114 -1272
6647 -1272 618 501 -1231 644 861 -1457 77 1343 -1076 -165 1328 -775 -780 1574 -389 -1203 1156
6664 1156 -100 -1349 1096 186 -1549 731 865 -1349 -63 1435 -1279 -387 1377 -1028 -901 1530
6680 1530 -293 -1229 1414 -9 -1607 1036 455 -1638 737 771 -1520 343 1182 -1308 -72 1596
6696 1596 -1106 -628 1517 -307 -1018 1628 -173 -1573 1456 139 -1537 1030 1043 -1583 550 1079
6712 1079 -1582 187 1454 -1085 -516 1442 -813 -1048 1556 -370 -1403 1208 305 -1708 732 804
$$ packed form
6599a151P27J845k236l8K228j336j343K347r14j254K152o49j843K393j69k287
6615a528J757Q30k199J004J589k291M01J584j383r64K327j057j345K116l82j876
6631a417J937N00k396J507J196k310N15J711j808j38K052j598r65K437j109j386
6647a272J890j17j732J875K17k318J534J266k419R11J493k103nK354j963q14K359
6664A156j256j249K445r10j735K280J34k214J286J498k714Q92J764k405J27K431
6680A530j823r36K643j423j598K643n81k093K375L4k291J863Q39k490J236J668
6696A596k702M78K145j824p11K646j801j400L029j317j676K567J3k626K133N29
6712A079k661J769J267k539N69J958k255k35K604j926j033K611r03k013K440P2
$$ plain form
6728 804 -1504 157 999 -1243 -100 1421 -777 -491 1475 -866 -911 1353 -378 -1175 1063 311 -1487
6745 -1487 930 621 -1398 486 1195 -1434 73 1487 -1217 -376 1501 -924 -1002 1357 -126 -1405
6761 -1405 1256 341 -1393 980 788 -1718 578 1147 -1511 -266 1588 -1144 -611 1478 -731 -598
6777 -598 1306 -307 -1363 1512 555 -1472 788 625 -1579 362 1159 -1506 -63 1389 -1189 -410
6793 -410 1645 -853 -1291 1673 -323 -1407 1343 88 -1581 1418 461 -1706 755 1087 -1454 202
6809 202 1347 -1263 -321 1746 -1054 -745 1766 -171 -1391 1643 -31 -1523 1030 603 -1648 798
6825 798 1091 -1819 333 1495 -1257 -303 1460 -1082 -692 1648 -557 -1376 1393 111 -1311 1397
6841 1397 467 -1499 584 887 -1431 175 1093 -1467 -30 1738 -1052 -550 1607 -394 -1021 1506
$$ packed form
6728H04k308J661Q42k242J143J521k198K86J966k341m5K264j731p97K238p52j798
6745a487K417l09k019J884P09k629J507J414k704Q41J877k425p8K359j483j279
6761a405K661r15j734K373j92k506K296N69k658J245J854k732N33K089k209J33
6777e98J904j613j056K875r57k027K260j63k204J941P97k665J443J452k578P79
6793d10K055k498m38K964j996j084K750j255j669K999r57k167K461L32k541J656
6809B02J145k610R42K067k800L09K511j937j220L034j674j492K553m27k251K446
6825G98K93k910K152J162k752R54J763k542L90K340k205q19K769j282j422K708
6841A397r30j966K083L03k318J606R18k560J437J768k790N02K157k001o27K527
$$ plain form
6857 1506 183 -1229 1020 378 -1329 856 1172 -1337 367 1493 -1242 -256 1548 -1049 -957 1472
6873 1472 -519 -953 1341 -195 -1577 1222 529 -1604 865 791 -1569 196 1396 -1602 -434 1554
6889 1554 -979 -999 1631 -418 -1112 1469 -291 -1693 1254 357 -1763 1048 906 -1800 210 1353
6905 1353 -1612 -24 1858 -1173 -741 1594 -671 -1293 1661 14 -1399 1422 449 -1786 845 841
6921 841 -1847 721 1150 -1759 -19 1548 -1468 -648 1563 -812 -1056 1932 -353 -1411 1417 210
6937 210 -1467 982 823 -1772 625 1146 -1524 215 1540 -1298 -326 1817 -856 -1022 1456 -512
6953 -512 -1440 1392 308 -1616 977 848 -1417 659 1064 -1715 109 1239 -1397 -463 1478 -895
6969 -895 -905 1555 -503 -1269 1330 257 -1513 929 821 -1526 288 1222 -1628 -307 1299 -1301
$$ packed form
6857A506j323j412K249o42j707K185L16k509J704J126k735R86J804k597R2K429
6873A472j991m34K294j536j382K799o93k133K469p4k360J765J200k998J168J988
6889A554k533k0K630k049o94K581j760j402K947q97k120K811j42k706K010J143
6905A353k965J588J882l031M32K335k265o22K954j647j413K821r73k235K631m
6921H41k688K568M29k909J740J567l016Q20K211k375k44K988k285j058K828j207
6937B10j677K449j59k595K397N21k670J739J325k838R72K143k673j66K478j968
6953e12r28K832j084j924K593j29k265K076M05k779J824J130k636R34J941k373
6969h95j0K460k058p66K599j073j770K442j08k347J814R34k850J321J606k600
$$ plain form
6985 -1301 -561 1646 -805 -1024 1513 -425 -1177 1401 307 -1664 926 658 -1944 719 1334 -1690
7001 -1690 93 1926 -1397 -638 2039 -933 -950 1603 -341 -1293 1621 161 -1514 1197 555 -1629
7017 -1629 824 1311 -1851 314 1678 -1650 -134 1741 -1128 -671 1733 -906 -1472 1720 -40 -1693
7033 -1693 1379 407 -1667 915 1106 -1923 327 1684 -1622 -275 1505 -1325 -926 1597 -882 -1246
7049 -1246 1440 -175 -1486 1273 353 -1530 900 711 -1478 1383 1478 -1355 -30 1654 -1081 -359
7065 -359 1493 -801 -1098 1352 -60 -1584 1146 263 -1526 849 1070 -1673 525 1282 -1543 -183
7081 -183 1566 -1123 -812 1736 -408 -897 1698 -8 -1261 1312 740 -1507 840 842 -1684 564 1252
7098 1252 -1350 -78 1654 -919 -656 1618 -916 -1148 1511 -222 -1547 1450 495 -1720 830 1080
$$ packed form
6985a301P40K207k451k19K537j938p52K578j094j971K590k68k602K663O15l024
7001a690J783J833l323P59K677k972j7K553j944r52K914j460j675K711o42k184
7017a629K453M87l162K165J364l328J516J875k869M57K404k639n66L192j760j653
7033a693L072r72k074K582J91l029K250J357l306J347J780k830L99K523k479l64
7049a246K686j615j311K759r20j883K430j89k189K861R5k833J325J684k735P22
7065c59J852k294k97K450j412j524K730q83j789K375K21k743K198P57k825J360
7081a83J749k689L11K548k144m89K595j706j253K573n72k247K347Kk526K248O88
7098A252k602J272J732k573K63K274k534k32K659j733j325K997r55k215K550K50
$$ plain form
7114 1080 -1899 571 1360 -1732 -69 1558 -1426 -580 1792 -989 -990 1778 -325 -1482 1458 207
7130 207 -1884 1450 1005 -1963 696 1314 -1594 -77 1721 -1547 -378 1783 -909 -986 2194 -533
7146 -533 -1492 1492 115 -1837 1177 600 -1894 988 936 -1762 147 1720 -1596 -336 1441 -1312
7162 -1312 -386 1697 -876 -1165 1264 72 -1663 1433 429 -1584 1013 1262 -1678 142 1068 -1495
7178 -1495 -190 1492 -976 -681 1849 -451 -1160 1595 -128 -1431 1381 257 -1533 891 996 -1702
7194 -1702 209 1478 -1535 -442 1522 -982 -803 1533 -585 -1523 1526 157 -1424 1160 470 -1782
7210 -1782 989 843 -1564 392 1283 -1541 -313 1669 -996 -939 1524 -641 -1501 1579 26 -1736
7226 -1736 1454 551 -1648 960 981 -1771 464 1463 -1601 -280 2044 -1419 -865 1926 -768 -1197
$$ packed form
7114A080k979K470P89l092J663J627k984Q46K372k781jK768k103j157K940j251
7130B07k091L334m45k968K659O18k908J517J798l268J169K161k692p7L180k727
7146e33r59K984j377j952L014n77k494K882n2k698J909J573l316J260J777k753
7162a312R26K083k573k89K429j192j735L096j004k013K597K49k940J820R26k563
7178a495J305J682k468K95K530k300p09K755j723j303K812j124j790K424J05k698
7194a702J911J269l013J093J964k504J79K336k118r38L049j369j581K584o90k252
7210a782K771j46k407J956Q91k824J228J982k665N7K463k165q60L080j553j762
7226a736L190r03k199K608K1k752K235R99l064J321K324l463N54K791k694m29
$$ plain form
7242 -1197 1971 -284 -1614 1426 223 -1608 1181 1336 -1683 131 1436 -1513 -80 1488 -1415
7257 -1415 -507 1960 -679 -1047 1772 -365 -1652 1510 282 -1726 1319 749 -1805 658 1172 -1851
7273 -1851 17 1436 -1288 -469 1849 -821 -862 1480 -325 -1156 1488 325 -1839 1173 751 -1644
7289 -1644 963 1034 -1498 346 1237 -1137 -329 1825 -883 -751 1826 -309 -1151 1471 180 -1478
7305 -1478 1071 730 -1470 720 1527 -1420 -153 1584 -1062 -287 1762 -996 -833 1649 -464 -1417
7321 -1417 1567 431 -1770 1134 764 -1724 451 929 -1789 -123 1771 -1438 -619 1636 -960 -994
7337 -994 1769 -331 -1559 1612 151 -1569 1110 680 -1980 675 1414 -1659 380 1675 -1560 -222
7353 -222 1792 -1116 -991 2008 -576 -1241 1611 -138 -1827 1613 527 -1836 1058 992 -1532 469
$$ packed form
7242a197L168k255j330L040j203j831K789J55l019J814J305k949J433J568k903
7257a415R08K467k639l68K819k137j287L162j228k008L045n70k554K463N14l023
7273a851J868J419k724Q19K318k670m1K342j805q31K644j163k164L012m22k395
7289a644K607P1k532J844Q91k374Q08K154k708J32K577k135q42K622j291j658
7305a478K549l41k200K190Q07k947J267J737k646P75K049k758J63K482k113r53
7321a417K984j136k201K904l70k488K175M78k718J666J894l209Q19K255k596l4
7337i94K763k100j228L171j461j720K679m30k660K655P39l073K039J295l235J338
7353b22K014k908J25K999k584o65K852j749j689L440j086k363K894o6k524K001
$$ plain form
7369 469 1298 -1600 -194 1481 -1260 -559 1851 -779 -1164 1793 -194 -1714 1457 316 -1487 1005
7385 1005 689 -1705 590 1247 -1677 128 1774 -1333 -740 1865 -809 -877 1652 -389 -1340 1484
7401 1484 140 -1526 1295 931 -1518 446 1113 -1529 -52 1426 -1395 -555 1532 -762 -1071 1907
7417 1907 -374 -1162 1364 301 -1324 991 914 -1679 535 1268 -1526 -232 1235 -1220 -745 1813
7433 1813 -850 -1272 1564 -70 -1425 1293 202 -1414 1158 737 -1737 488 1094 -1399 24 1582
7449 1582 -1300 -888 1937 -884 -1136 1780 -443 -1438 1851 315 -1715 1128 453 -1763 811 1015
7465 1015 -1967 304 1407 -1532 -448 1769 -1126 -1166 1691 -512 -1181 1963 -360 -1741 1431 449
7481 449 -1649 834 1022 -1630 426 1540 -1383 -240 1824 -1278 -579 1496 -793 -1167 1728 -137
$$ packed form
7369D69Q29k898J406J675k741P01K410k630l85K957j987j520L171j141j803K492
7385A005l16k394K295O57k924J805J646l107N93K605k674o8K529k041r51K824
7401A484j344j666K821l64k449J964O67k642J477J478k821Q40K087k294l09K978
7417A907k281p88K526j063j625K315p7k593K214P33k794J294J467k455M75K558
7433A813k663m22K836j634j355K718j091j616K572m21k474K225O06k493J423J558
7449A582k882M12K825k821k52K916k223r95L289j536k030K843o75k216K574K04
7465A015k982K271J103k939J084K217k895m0K857k203o69L144k323j381L172r82
7481D49k098K483J88k652K056J114k923J143K064l102O99K075k289l74K895j865
$$ plain form
7497 -137 -1513 1230 245 -1564 604 840 -1772 343 1506 -1405 -19 1345 -1187 -554 1538 -502
7513 -502 -1018 1403 148 -1201 1225 297 -1503 719 711 -1693 556 1335 -1597 -91 1145 -1131 -497
7530 -497 1538 -758 -1047 1299 -248 -1350 1410 457 -1574 675 969 -1539 350 1267 -1304 -313
7546 -313 1462 -1201 -664 1687 -640 -801 1587 -353 -1514 1247 89 -1672 891 934 -1627 583
7562 583 1388 -1580 -58 1819 -1250 -654 1660 -1030 -1142 1905 -180 -1414 1437 227 -1919 1190
7578 1190 560 -1668 737 1271 -1607 35 1495 -1507 -587 1915 -855 -791 1853 -561 -1157 1540
7594 1540 145 -1712 1263 459 -1710 961 874 -1470 396 1149 -1392 -283 1614 -1093 -814 1601
7610 1601 -697 -1158 1658 144 -1590 1292 436 -1497 991 981 -1116 -69 873 -1298 -533 1585
$$ packed form
7497a37j376K743r85j809K168K36k612K115J163k911J386J364k532O33K092k040
7513e02n16K421j255j349K426r28j800K222qk404K249P79k932J506J236k276O34
7530d97K035k296k89K346j547j102K760r53k031K249K94k508J889R17k571R91
7546c13J775k663N37K351k327j61K388j940j161K761j158j761K563M3k561K210
7562E83Q05k968J522J877l069N96K314k690j12L047k085j234K851j210k146L109
7578A190o30k228K405N34k878J642J460l002R20K502k770O4K644k414n96K697
7594A540j395j857K975q04k169K671q7k344J866P53k541J109J897k707K79K415
7610A601k298m61K816j514j734K882q56j933K488j0k097J047R42k171P65K118
$$ plain form
7626 1585 -623 -1135 1095 -624 -1259 969 -504 -908 474 550 -1606 739 939 -1378 126 1496
7642 1496 -1240 -262 1266 -889 -757 1588 -767 -1380 1331 -172 -1347 1099 775 -1523 653 912
7658 912 -1389 334 1201 -1348 -300 1544 -1019 -538 1748 -463 -1129 1634 -139 -1445 1361 387
7674 387 -1728 1076 1075 -1710 540 1361 -1723 145 1479 -1294 -447 1564 -767 -1134 1719 -403 -1488
7691 -1488 1548 509 -1640 931 1009 -1876 562 1209 -1955 33 1612 -1054 -280 1845 -969 -871
7707 -871 1612 -640 -975 1360 7 -1531 915 581 -1504 782 955 -1723 253 1463 -1780 -309
7723 -309 1273 -948 -675 1589 -539 -1119 1120 -129 -1037 1311 499 -1474 536 1073 -1518 214
7739 214 1140 -1255 -255 1323 -827 -740 1279 -534 -977 1237 -118 -1232 1087 352 -1457 627
$$ packed form
7626A585k208n12K230j719o35K228j473m04J382P6k156K345K00k317J504J370
7642A496k736R78J528k155J32K345k355o13K711j503j175K446l24k298K176K59
7658I12k301J723Q67k549J048J844k563M81K286k211o66K763j773j306K806r74
7674C87k115K804jk785K250Q21l084J868J334k773Q47K011k331l67K853k122j085
7691a488L036j039k149K571P8k885K438O47l164J988J579k666P74K125k814R8
7707h71K483k252l35K335j353j538K446l34k085K286J73k678J976J210l243J471
7723c09J582k221K73K264k128n80K239j249r08K348q12j973K010N37k591J732
7739B14R26k395J000J578k150Q7K019j813m43K214j355j114K319p35j809K084
$$ plain form
7755 627 777 -1340 16 1408 -1259 -497 1573 -931 -835 1564 -583 -1301 1557 -141 -1480 1190
7771 1190 707 -1750 625 825 -1521 279 1389 -1430 -602 1746 -1202 -905 1506 -764 -1075 1615
7787 1615 -296 -1668 1458 600 -1483 974 799 -1534 488 1315 -1742 -57 1908 -1344 -624 1864
7803 1864 -831 -1182 1707 -332 -1512 1035 335 -1443 1301 847 -1750 559 1198 -1560 56 1495
7819 1495 -1174 -409 1503 -980 -791 1541 -219 -1312 1468 127 -1570 1352 670 -1575 769 1149
7835 1149 -1240 261 1465 -1302 -290 1369 -918 -1032 1259 -251 -1089 1250 -48 -1580 804
7850 804 403 -1445 672 985 -1398 273 1382 -1167 -257 1424 -940 -957 1622 -241 -1121 1388 43
7867 43 -1499 1126 654 -1280 422 1397 -1579 66 1458 -1378 -580 1479 -1070 -947 1392 -229
$$ packed form
7755F27J50k117J356J392k667P62K070k504R6K399k147p18K858j698j339K670
7771A190m83k457K375K00k346J800J110k819Q28K348k948K97K411k270l11K690
7787A615j911j372L126q58k083K457j75k333K022Q27l057J685J965l252P20K488
7803A864k695l51K889k039j180K547p00j778K744m54k597K309O39k758J616J439
7819A495k669P65J912k483J89K332j760j093K780j341j697K922o82k245K344L80
7835A149k389J501J204k767J012J659k287j14K291j510q38K339j298j532K384
7850H04m01j848K117L13k383J671J109k549R10J681k364j7K579j863q80K509j345
7867D3j542K625m72j934J702R75k976J645J392k836P98K059k549J23K339j621
$$ plain form
7883 -229 -1490 1309 126 -1686 1281 583 -1500 601 1380 -1727 126 1546 -1394 -231 1951 -1270
7899 -1270 -906 2012 -551 -1102 1682 23 -1444 1271 356 -1725 934 1114 -1731 305 1403 -1423
7915 -1423 38 1692 -1324 -640 1644 -751 -1158 1561 -259 -1788 1371 485 -1824 586 1134 -1667
7931 -1667 523 1084 -1564 206 1412 -1293 -558 1674 -577 -1080 1534 -265 -1408 1366 190 -1285
7947 -1285 1087 882 -1487 655 1144 -1265 -117 1321 -999 -460 1656 -791 -1145 1617 -513 -1271
7963 -1271 1183 249 -1485 829 516 -1546 430 1055 -1341 -12 1355 -1273 -356 1548 -730 -1117
7979 -1117 1520 -207 -1178 1369 359 -1488 897 875 -1594 551 1160 -1287 134 1316 -1174 -516
7995 -516 1622 -925 -1116 1726 -190 -1465 1361 220 -1551 983 584 -1669 622 1128 -1750 9
$$ packed form
7883b29j261K799j183j812K967o98k083K101P79l107J853J420k940J163K182l221
7899a270L64K918k563n51K784j659j467K715r15k081K659J80k845K036J098k826
7915a423J461J654l016O84K284k395m07K719j820j529L159q86k309K410N48k801
7931a667K190N61k648J770J206k705P35K232k251n03K614j799j143K774j176j475
7947a285K372k05k369K142M89k409J148J438k320N39K116k447l54K762k130p58
7963a271K454r34j734K314l13k062J976O25k396J329J367k628R17J904k278l87
7979a117K637j727r71K547j010j847K385k2k469K145O09k447J421J182k490O58
7995e16K138k547j91K842j916j275K826j141j771K534l99k253K291N06k878J759
$$ plain form
8011 9 1739 -1551 -268 1802 -1120 -713 1739 -494 -1165 1549 352 -1644 1136 527 -1639 844
8027 844 1062 -1735 332 1212 -1520 -304 1711 -924 -723 1540 -685 -1081 1631 -114 -1376 1362
8043 1362 493 -1733 896 1006 -1827 457 1315 -1298 4 1697 -1030 -438 1535 -525 -1061 1458
8059 1458 30 -1211 1370 549 -1704 915 900 -1456 326 1273 -1426 -192 1681 -1178 -516 1678
8075 1678 -737 -1085 1609 -32 -1084 1121 436 -1405 664 861 -1387 537 1473 -1578 -240 1726
8091 1726 -903 -768 1736 -978 -1069 1466 -358 -1514 1198 678 -1624 922 1068 -1229 415 1294
8107 1294 -1436 -148 1596 -1099 -914 1736 -837 -737 1772 -277 -1444 1499 436 -1577 1247
8122 1247 860 -1571 417 1177 -1576 -53 1357 -1395 -605 1508 -755 -961 1770 -413 -1206 1664
$$ packed form
8011IJ730l290J283K070k922M07K452k233o71K714j197j996K780o09k166K483
8027H44K18k797K067Q80k732J216K015k635K01K263k225l96K712j745j262K738
8043A362q69k226K629J10k833K284Q58k613J302J693k727N92J973k060n36K519
8059A458j428j241K581q21k253K619j5k356J782R47k699J234J873k859O62K194
8075A678k415l48K694j641j052K205o85j841K069J97k248J924R36l051J338J966
8091A726k629J35K504k714r1K535j824j156K712n20k302K546J46k297J644Q79
8107A294k730J288J744k695J85K650k573J00K509k049j167K943j063k013K824
8122A247l87k431J988P60k753J523J410k752P90K113k263k06K731k183p93K870
$$ plain form
8138 1664 -17 -1400 1240 710 -1770 1011 1020 -1788 425 1534 -1304 -362 1705 -1180 -792 1648
8154 1648 -227 -1181 1519 196 -1455 1238 455 -1509 818 759 -1580 316 1240 -1127 -176 1380
8170 1380 -803 -667 1554 -470 -1179 1480 269 -1418 1080 598 -1530 817 1129 -1397 275 1130
8186 1130 -1279 -201 1474 -926 -781
$$ packed form
8138A664j681j383K640n30k480K781Rk808K213J109k838R42K067k885L88K440
8154A648j875r54K700j323j651K693p83j964K327n9k339J896R24k367R51J556
8170A380k183J36K221k024p09K659j211j687K498m82k128K347L12k526J672Q55
8186A130k409J078J675k400J45
8191g81
$$ Imaginary data points
##PAGE= N=2
##DATA TABLE= (X++(I..I)), XYDATA
$$ plain form
0 0 0 0 0 0 0 0 -8 8 -8 8 -16 20 -32 40 -43 56 -64 86 -104 120 -144 172 -207 244 -284 328 -380 438 -508
29 -508 585 -665 753 -854 967 -1093 1228 -1372 1537 -1717 1915 -2129 2361 -2615 2893 -3199
45 -3199 3532 -3895 4290 -4723 5203 -5735 6317 -6963 7685 -8497 9415 -10466 11675
58 11675 -13087 14762 -16786 19288 -22464 26643 -32403 40855 -54414 79480 -140197 559751
70 559751 314914 -1129673 727195 228290 -855119 559278 442120 -802774 123503
79 123503 583738 -423993 -274688 641625 -237639 -493220 772225 -83328 -807120 762231
89 762231 130497 -789188 651632 130298 -808047 567150 310693 -684339 212086 359998
$$ packed form
0@%%%%%%qJ6j6J6k4L6n2P2q3R9j20J50j90K24k64L16l79M51n28O12p08Q18r46
29e08J093j250J418j607J821k060K321k600K909l254L632m044M490m976N508o092
45c199O731p427Q185r013R926j0938J2052j3280J4648j6182J7912j9881K2141
58A1675k4762K7849l1548L6074m1752M9107n9046P3258r5269J33894k19677O99948
70E59751k44837j444587J856868m98905j083409J414397j17158j244894R26277
79A23503M60235j007731J49305R16313q79264k55581J265445q55553p23792J569351
89G62231o31734r19685J440820n21334r38345J375197k56457r95032Q96425J47912
$$ [...]
##END NTUPLES=NMR FID
##END=
