##TITLE=1H_MTPDP2509
 CDCl3, 8 sc, 
 28.9.2020
##JCAMPDX= 6.0         $$ Bruker NMR JCAMP-DX V2.0
##DATA TYPE= NMR FID
##DATA CLASS= NTUPLES
##ORIGIN= UXNMR, Bruker Analytische Messtechnik GmbH
##OWNER= root
$$ XWIN-NMR		Version 3.5
$$ Mon Sep 28 10:58:32 2020 Russian Standard Time (UT+4h)  she@DPX200
##.OBSERVE FREQUENCY= 200.1315066352
##.OBSERVE NUCLEUS= ^1H
##.DELAY= (6, 6)
##.ACQUISITION MODE= SIMULTANEOUS
##.ACQUISITION SCHEME= undefined
##.AVERAGES= 8
##.DIGITISER RES= 18
##SPECTROMETER/DATA SYSTEM= spect
##.PULSE SEQUENCE= zg30
##.SOLVENT NAME= CDCl3
##.SHIFT REFERENCE= (INTERNAL, CDCl3, 0, 15.7039)
##AUDIT TRAIL= $$ (NUMBER, WHEN, WHO, WHERE, WHAT)
$$ ##TITLE= Audit trail, XWIN-NMR		Version 3.5
$$ ##JCAMPDX= 5.01
$$ ##ORIGIN= Bruker BioSpin GmbH
$$ ##OWNER= she
$$ F:/spectra/data/she/nmr/H-F/1/audita.txt
$$ ##AUDIT TRAIL=  $$ (NUMBER, WHEN, WHO, WHERE, WHAT)
(   1,<2020-09-28 10:57:27.35 +0400>,<she>,<DPX200>,
      <created by zg, POWCHK disabled, PULCHK disabled
       configuration hash MD5:
       00 E9 B6 7A A2 85 ED C7 34 08 36 98 17 FE 4E 26
       data hash MD5: 16K
       BA B6 D0 2F 7F 03 39 90 86 E8 E5 42 C1 64 99 E3>)
$$ ##END=
$$ 
$$ hash MD5
$$ 49 46 80 A3 35 38 DB E3 8C 30 15 AA 31 F6 92 04
##$RELAX= 
##$RELAX= 
##$RELAX= 
##$RELAX= 
##$RELAX= 
##$RELAX= 
$$ Bruker specific parameters
$$ --------------------------
##$DU= <F:/spectra>
##$EXPNO= 1
##$NAME= <H-F>
##$PROCNO= 1
##$TYPE= <nmr>
##$USER= <she>
##$AMP= (0..31)
100 100 100 100 100 100 100 100 100 100 100 100 100 100 100 100 100 100 
100 100 100 100 100 100 100 100 100 100 100 100 100 100 
##$AQSEQ= 0
##$AQ_mod= 1
##$AUNM= <au_zg>
##$AUTOPOS= <>
##$BF1= 200.13
##$BF2= 200.13
##$BF3= 200.13
##$BF4= 200.13
##$BF5= 200.13
##$BF6= 200.13
##$BF7= 200.13
##$BF8= 200.13
##$BYTORDA= 1
##$CFDGTYP= 0
##$CFRGTYP= 5
##$CHEMSTR= <none>
##$CNST= (0..31)
1 1 145 1 1 1 1 1 1 1 1 1 1 1 1 1 1 1 1 1 1 1 1 1 1 1 1 1 1 1 1 1 
##$CPDPRG= <>
##$CPDPRG1= <>
##$CPDPRG2= <>
##$CPDPRG3= <>
##$CPDPRG4= <mlev>
##$CPDPRG5= <mlev>
##$CPDPRG6= <mlev>
##$CPDPRG7= <mlev>
##$CPDPRG8= <mlev>
##$CPDPRGB= <>
##$CPDPRGT= <>
##$D= (0..31)
0 1.2 0 0 0 0 0 0 0 0.06 0 0.03 0 0 0 0 0.0002 0 0 0 0 0 0 0 0 0 0 0 0 
0 0 0 
##$DATE= 1601276246
##$DBL= (0..7)
120 120 120 120 120 120 120 120 
##$DBP= (0..7)
150 150 150 150 150 150 150 150 
##$DBP07= 0
##$DBPNAM0= <>
##$DBPNAM1= <>
##$DBPNAM2= <>
##$DBPNAM3= <>
##$DBPNAM4= <>
##$DBPNAM5= <>
##$DBPNAM6= <>
##$DBPNAM7= <>
##$DBPOAL= (0..7)
0.5 0.5 0.5 0.5 0.5 0.5 0.5 0.5 
##$DBPOFFS= (0..7)
0 0 0 0 0 0 0 0 
##$DE= 6
##$DECBNUC= <off>
##$DECIM= 32
##$DECNUC= <off>
##$DECSTAT= 4
##$DIGMOD= 1
##$DIGTYP= 9
##$DL= (0..7)
0 120 120 120 120 120 120 120 
##$DP= (0..7)
150 150 150 150 150 150 150 150 
##$DP07= 0
##$DPNAME0= <>
##$DPNAME1= <>
##$DPNAME2= <>
##$DPNAME3= <>
##$DPNAME4= <>
##$DPNAME5= <>
##$DPNAME6= <>
##$DPNAME7= <>
##$DPOAL= (0..7)
0.5 0.5 0.5 0.5 0.5 0.5 0.5 0.5 
##$DPOFFS= (0..7)
0 0 0 0 0 0 0 0 
##$DQDMODE= 0
##$DR= 18
##$DS= 0
##$DSLIST= <SSSSSSSSSSSSSSS>
$$ [...]
##$SUBNAM2= <"">
##$SUBNAM3= <"">
##$SUBNAM4= <"">
##$SUBNAM5= <"">
##$SUBNAM6= <"">
##$SUBNAM7= <"">
##$SUBNAM8= <"">
##$SUBNAM9= <"">
##$SW= 16.880792210976
##$SWIBOX= (0..15)
0 0 2 0 0 0 0 0 0 0 0 0 0 0 0 0 
##$SW_h= 3378.37837837838
##$TD= 16384
##$TD0= 1
##$TE= 0
##$TE2= 300
##$TE3= 300
##$TEG= 300
##$TL= (0..7)
0 120 120 120 120 120 120 120 
##$TP= (0..7)
150 150 150 150 150 150 150 150 
##$TP07= 0
##$TPNAME0= <>
##$TPNAME1= <>
##$TPNAME2= <>
##$TPNAME3= <>
##$TPNAME4= <>
##$TPNAME5= <>
##$TPNAME6= <>
##$TPNAME7= <>
##$TPOAL= (0..7)
0.5 0.5 0.5 0.5 0.5 0.5 0.5 0.5 
##$TPOFFS= (0..7)
0 0 0 0 0 0 0 0 
##$TUNHIN= 0
##$TUNHOUT= 0
##$TUNXOUT= 0
##$USERA1= <user>
##$USERA2= <user>
##$USERA3= <user>
##$USERA4= <user>
##$USERA5= <user>
##$V9= 5
##$VALIST= <valist>
##$VCLIST= <CCCCCCCCCCCCCCC>
##$VD= 0
##$VDLIST= <DDDDDDDDDDDDDDD>
##$VPLIST= <PPPPPPPPPPPPPPP>
##$VTLIST= <TTTTTTTTTTTTTTT>
##$WBST= 1024
##$WBSW= 4
##$XGAIN= (0..3)
0 0 0 0 
##$XL= 0
##$YL= 0
##$YMAX_a= 1101837
##$YMIN_a= -821855
##$ZGOPTNS= <>
##$ZL1= 120
##$ZL2= 120
##$ZL3= 120
##$ZL4= 120
##$ABSF1= 10
##$ABSF2= 0
##$ABSG= 5
##$ABSL= 3
##$ALPHA= 0
##$AQORDER= 0
##$ASSFAC= 0
##$ASSFACI= 0
##$ASSFACX= 0
##$ASSWID= 0
##$AUNMP= <proc_1d>
##$AZFE= 0.1
##$AZFW= 0.1
##$BCFW= 1
##$BC_mod= 2
##$BYTORDP= 1
##$COROFFS= 0
##$CY= 11.3945322036743
##$DATMOD= 1
##$DC= 2
##$DFILT= <>
##$DTYPP= 0
##$F1P= 16.9975609425685
##$F2P= -3.02152046262296
##$FCOR= 0.5
##$FTSIZE= 0
##$FT_mod= 4
##$GAMMA= 1
##$GB= 0.15
##$INTBC= 1
##$INTSCL= 1
##$ISEN= 128
##$LB= 0.24
##$LEV0= 0
##$LPBIN= 0
##$MAXI= 10000
##$MC2= 0
##$MEAN= 0
##$ME_mod= 0
##$MI= 1.114404
##$NCOEF= 0
##$NC_proc= 0
##$NLEV= 6
##$NOISF1= 3.799351
##$NOISF2= 2.8
##$NSP= 1
##$NTH_PI= 0
##$NZP= 0
##$OFFSET= 15.70392
##$PC= 1
##$PHC0= -9969.374
##$PHC1= 11.4009
##$PH_mod= 1
##$PKNL= yes
##$PPARMOD= 0
##$PSCAL= 0
##$PSIGN= 0
##$REVERSE= no
##$SF= 200.130013532006
##$SI= 16384
##$SIGF1= 3
##$SIGF2= 2
##$SINO= 400
##$SIOLD= 16384
##$SREGLST= <1H.CDCl3>
##$SSB= 0
##$STSI= 0
##$STSR= 0
##$SW_p= 3612.71676300578
##$SYMM= 0
##$S_DEV= 0
##$TDeff= 0
##$TDoff= 0
##$TI= <>
##$TILT= no
##$TM1= 0
##$TM2= 0
##$TOPLEV= 0
##$USERP1= <user>
##$USERP2= <user>
##$USERP3= <user>
##$USERP4= <user>
##$USERP5= <user>
##$WDW= 1
##$XDIM= 8192
##$YMAX_p= 0
##$YMIN_p= 0
$$ End of Bruker specific parameters
$$ ---------------------------------
##NTUPLES= NMR FID
##VAR_NAME=  TIME,          FID/REAL,        FID/IMAG
##SYMBOL=    X,             R,               I
##VAR_TYPE=  INDEPENDENT,   DEPENDENT,       DEPENDENT
##VAR_FORM=  AFFN,          ASDF,            ASDF
##VAR_DIM=   8192,          8192,            8192
##UNITS=     SECONDS,       ARBITRARY UNITS, ARBITRARY UNITS
##FACTOR=    0.000296,      1,               1
##FIRST=     0,             0,               0
##LAST=      2.424536,      0,               0
##MIN=       0,             -821855,         0
##MAX=       2.424536,      1101837,         0
$$ Real data points
##PAGE= N=1
##DATA TABLE= (X++(R..R)), XYDATA
0@%%%%%%%%Qj6J6j6K4l2M0n6P2q8J10j38J68k00K40k87L39m00M67n42O27p25Q36
31D47r61J100j250J415j602J809k035K284k558K857l183L540l930M359m828N337
47B801n892O497p161P892q690R571j0545J1620j2821J4169j5691J7425j9417K1736
61A1494k4476K7767l1809L6912m3576N2691o6023Q8131j96785P09229j146470
72e82915Q3816J013221j335977N80818K97143o63136O13364k39985j81226M66457
82E1580n27638M33694J04080m48057N41731l30545j30943N66313n56483L24237
92B7969K54473o73734O06951j9745m95075P42899k97066k98625N51466l81839
102A7674j5191L47481l23916J40918O6703k16737J96527k9425q6541J19625r4071
$$ y = [0, 0, 0, 0, 0, 0, 0, 0, 0, 8, -8, 8, -8, 16, -16, 24, -32, 40, -48, 62, -76, 92, -108, 132, -155, 184, -216, 251, -291, 336, -389, 447, -514, 586, -664, 751, -851, 958, -1077, 1207, -1351, 1506, -1677, 1863, -2067, 2292, -2536, 2801, -3091, 3406, -3755, 4137, -4553, 5018, -5527, 6093, -6728, 7441, -8250, 9175, -10242, 11494, -12982, 14785, -17024, 19888, -23688, 29003, -37020, 51111, -145674, 563555, -582915, -499099, 514122, -821855, -241037, 56106, -607030, 6334, -233651, -414877, 51580, -476058, -42364, 61716, -386341, 155390, -175155, -306098, 260215, -296268, 27969, 282442, -391292, 215659, 195914, -299161, 443738, 146672, -151953, 399513, 17674, 2483, 349964, 26048, 166966, 233669, 16932, 213459, 184034, 97493, 217118, 123047]
113A23047r1613O5427P110p6047P5839K9812j49227R2721O283j31562J60580r0507
125B1863p3095J25699j71153J09069M8897j65192K28943j48503p9322K73996k95891
136a24689J31579J71301l91696L38498m5384k82397M89770l08558p1813M46170
146C52781n24111K11732K73657n58999M55711k3858m25972N46168k71102j32481
156i6474M29642m18543J44239J52322l67759L49795j52437j34681L58341m01638
166a37193J72868J89365m58761M31783r8391l57780N43468l62151j15114N03031
176C11125n02092J32358L04257m79451K87282P9106l16292K84505r7332r2362
186h8896J69282j57008J10298o117j11966J93390j59392L337J73861k19870R9467
$$ y = [123047, 31434, 96861, 103971, 27924, 103763, 133575, -15652, 77069, 83352, -48210, 112370, 21863, -51232, 74467, -96686, 12383, 61280, -103912, 125031, -23472, -102794, 171202, -124689, 6890, 178191, -213505, 124993, 79609, -202788, 286982, -21576, -93389, 352781, -171330, 40402, 314059, -244940, 210771, 186913, -239059, 307109, 36007, -96474, 333168, -85375, 58864, 211186, -156573, 193222, 40785, -93896, 264445, -137193, 35675, 225040, -233721, 198062, 99671, -258109, 285359, -76792, -191906, 311125, -190967, -58609, 245648, -233803, 53479, 132585, -183707, 100798, 3466, -88896, 80386, -76622, 33676, 27559, -84407, 108983, -50409, -47072, 126789, -93081, 6386]
197F386Q0669j92025J57014j5039j09792J49967p3777l9666R5107o5741j1581
208a8478N5851l0459l3983N4523l306o9069Q4514j5371p9302J23401q3010k8973
220d3662J34876j59153P2432Q1430j91611J74164k2899j55193K26447j33054m6310
231f2533J84399j97351R7673N1445j65404J92074j17611l3250J90935k53166J48297
242C5508Q5847k94810L07986r2736k06960L75117k72311l5913L11776l64018J55845
253E331J50437l37388K88716n1754k01561L03269k06478n613J92469k55559J58962
264D0831K1455j79409K31729j45714k2148J86788k43594J48395M8165k25042K58559
275A20015j18488j17412K80196k34847J8117K15420k72941J21136J04825k22969
$$ y = [6386, 87055, -104970, 52044, 37005, -72787, 77180, 3403, -36263, 58844, -6897, -18478, 37373, 6914, -27069, 27454, 24148, -44921, 39593, 24222, -55080, 68321, -14689, -43662, 91214, -67939, 4493, 85923, -105688, 68476, 45577, -109616, 116831, -16223, -62533, 121866, -75485, 22188, 73633, -91771, 100303, -17308, -50558, 140377, -112789, 35508, 121355, -173455, 134531, 41795, -165165, 209952, -62359, -98272, 213504, -150514, 5331, 155768, -181620, 107096, 55342, -146219, 157050, -49428, -55041, 137428, -118131, 40831, 62286, -117123, 114606, -31108, -53256, 133532, -110062, 38333, 86498, -138544, 120015, 1527, -115885, 164311, -70536, -52419, 163001, -109940, 11196, 116021, -106948]
285a06948J51584J5928j24623R9833j7128l0223K4203N662J2653n1873N0586J777
297C1431q1033R7907k9139n8452R0374n1630j4065N3053l0126K803n564J9474
309B5033j9732l5896R2411p6784j0919J19459j53253O9971Q6753j85544J56525
320F8024j6505j53515K15361j36540l9940K06918k31542J02352J00475k43240
330a28152K27057m8752j68013K60250j83611k2879K02257k35602J33211M9812
340H5578j90960K12458j25426l9953J99850k50695J31197Q6563k76684K77775
350A09703o6412j92233L26028k19053n2261K62016k77583J00763J27362k47601
360a29271J87974k0746j32776J94286j26534M673J05951j61019J09957m49j03297
$$ y = [-106948, 44636, 60564, -64059, 35774, 18646, -11577, 12626, 18288, 30941, -20932, 29654, 31431, -49602, 48305, 19166, -39286, 51088, -542, -14607, 38446, 8320, 11123, 5559, 25033, 5301, -30595, 61816, -14968, -25887, 93572, -59681, 10290, 97043, -88501, 68024, 51519, -101996, 113365, -23175, -63115, 143803, -87739, 14613, 115088, -128152, 98905, 50153, -117860, 142390, -41221, -64100, 138157, -97445, 35766, 85578, -105382, 107076, -18350, -58303, 141547, -109148, 22049, 108612, -168072, 109703, 43291, -148942, 177086, -41967, -94228, 167788, -109795, -9032, 118330, -129271, 58703, 37957, -94819, 99467, -27067, -22394, 83557, -77462, 32495, 32046, -71251]
371g1251J44850r4698j3604J10245j28592P6089K7392j07554J13757n8603m2985
382d4954J10411q9958J3090O6349q7113L7270L3113n3362K0445K4121l0806k7110
394b8504O0494l0111m8816J13478p4162m7620J41526j20234p294J26937j44433
405e8739M8141N8706j14799R3373k6435k9979P6972j01110P1087J2980j14614
416h4417J51884q5001n7002J71995j76829O0713J15993k14761J71224o066j76879
427a29146K39950j32028p2532K27489k20680O1079J35288k25519J69933L36j56969
438a02799J97130j14557l4410J51854j67655Q3974M5936j38594J49257p4629l9553
449d4046J37482j57674P2748O4206j73137J65245l1879j30733J98597j11763n3954
$$ y = [-71251, 73599, -21099, -34703, 75542, -53050, 23039, 50431, -57123, 56634, -1969, -44954, 65457, -24501, -11411, 54938, -32175, 5095, 38208, -15154, 5291, 29412, -1394, -28504, 31990, 1879, -46937, 66541, -7621, -55241, 86285, -33949, -41243, 85694, -58739, -10598, 48108, -66691, 26682, 247, -29732, 47240, -53870, 17217, 30197, -84417, 67467, -17534, -74536, 97459, -79370, -18657, 97336, -117425, 53799, 47733, -129146, 110804, -21224, -93756, 133733, -86947, -25868, 109420, -116099, 53834, 54170, -102799, 94331, -20226, -54636, 97218, -70437, 13537, 59473, -79121, 70136, -4493, -44046, 93436, -64238, 8510, 72716, -100421, 64824, 32945, -97788, 100809, -10954, -64908]
460f4908J65005j40350J7115R3753j17047N2191K6360o0133M8283j6737k933J3885
472A4484k1489K5202k1155O375J5365l6408L4967o793k3841M2784k9910r90K6231
485B4822k9343J6198o848L201R090l1137M1442k3412j7338O0331o7770K6265M3464
498D8965r7607R0089j5420q8041J44358r5677l6855J55955j57968L4140J16529
509I8468j73056R6620M0755j32093J19587l9578l9834Q2967q8389N9878L748q1379
521e2306J22344q8234k0049J31136j58862O9606P4971j71803J49362k1177j27550
532i2562J84795j07886m8220J62363j54228L5179R3317j39465Q6189P064p2728
543d6182Q3539n7347J1580M0127p7924P3036j8698n1759R0357p0519O193O1104
$$ y = [-64908, 100097, -40253, -23138, 70615, -46432, 5759, 32119, -28014, 20269, 3532, 599, 14484, -7005, 18197, -2958, 3417, 18782, -17626, 17341, 10548, -13293, 29491, -419, -1409, 24822, -4521, 11677, 4829, 8030, 17120, -14017, 27425, 4013, -13325, 47006, -20764, 5501, 48965, -48642, 41447, 26027, -62014, 82344, -13333, -50188, 105767, -52201, -18061, 98468, -74588, 22032, 62787, -69306, 50281, 10703, -29131, 53836, -34553, 25325, 29073, -52306, 70038, -18196, -38245, 92891, -65971, 3635, 78606, -93197, 56165, 34988, -92562, 92233, -15653, -63873, 98490, -55738, -20559, 72758, -66707, 19482, 26546, -46182, 37357, -19990, -8410, 31717, -46207, 26829, 8131, -43628, 46729, -23790, -17597, 43507]
555D3507q7503O0488M838o9148R1963m6732l7261R3613p0402o527O8510o2957
567a7611N563M1745l2723j0584L1754m050l6582L8401N511n4410N7025p456n4987
580c8404P1861l2107k9244N9485m6365Q965K1240l6767L5532k5907j134L6113
592B3268o1542M8458M819o3859Q2663m7894k1443Q1161r3324M3376M1065j05620
604f8872J05211l0764p3863J39411j06012p120J21858j48865O8496O2535j44021
615h2006J19346q615r4163J21495o6643j4964P2945q2572N6049q990m6007Q9017
627E4892q8086K2329P8259j36342R4572K6306j35453J43308m3588q9936J47461
638G3722r2528k5977J10429j06745K9909N2694q4960N4958j965l5941M1075l0608
$$ y = [43507, -43996, 16492, 21330, -47818, 44145, -2587, -39848, 53765, -16637, -23164, 45346, -17611, -12048, 29697, -3026, -13610, 18144, 14094, -22488, 15913, 21424, -32986, 24039, 16583, -38404, 33457, 1350, -27894, 31591, -14774, -5809, 15431, -21336, 14196, -11711, -12845, 23268, -38274, 10184, 15003, -48856, 33807, -14087, -35530, 45631, -47693, -4317, 36748, -68872, 36339, 5575, -68288, 71123, -34889, -42009, 79849, -69016, -520, 62015, -82006, 37340, 28725, -65438, 56057, -10586, -25550, 47395, -35177, 20872, 11882, -34125, 54892, -33194, -10865, 67394, -68948, 25624, 51930, -83523, 59785, 16197, -73739, 73722, -18806, -44783, 65646, -41099, -11190, 41504, -43456, 11502, 9537, -26404, 14671, -15937]
650a5937J2897O668k5759L7420l0529J049L6609n2207K9901J4948m7772M6248
662A3536j2568k5839M2823k4285p910K7297j7269l880J4242j259j8530J7602J4722
675A8682m7732M1830J3480o9221P2410j1016o6852R4739m5472m1037R2176p2449
687b0462M261N7774p5839M9262J169m6520O5881n2993Q011M8217q3118O4821J882
700B2346p3594R9133n7833k4214R1672r9233M0579M3600j01304R5871k7300o6242
712e6519J21439r3368m050J03491j28735N9163N2296j21253R5422k448p9107R2949
724C9280m4186k0578N7039n2696K6375J576k5544M4386m8466K0043L2777p3006
736d3000O3412K28p1137Q9764l5116m8520Q8822n3313k0831O6638m9728n082M3859
$$ y = [-15937, -3040, 3628, -22131, 15289, -15240, -14191, 22418, -29789, 112, 15060, -32712, 13536, 968, -24871, 17952, -6333, -14243, 13054, -4215, -8095, 6147, 4888, -13642, 3960, 18682, -29050, 12780, 26260, -42961, 29449, 18433, -48419, 46320, 848, -40189, 51987, -20462, -16201, 41573, -34266, 14996, 16165, -30355, 35526, -17467, -9456, 38761, -44357, 20464, 22346, -51248, 47885, -9948, -34162, 57510, -41723, -1144, 42456, -58848, 37023, 9723, -56519, 64920, -28448, -32498, 70993, -57742, 1421, 53717, -67536, 27886, 25438, -53669, 39280, -4906, -25484, 31555, -21141, 5234, 6810, -18734, 25652, -22814, -2771, 30006, -43000, 20412, 20640, -50497, 39267, 4151, -44369, 44453, -8860, -29691, 36947, -12781, -17863, 25996]
749B5996l2890n834K7704j1060j9586K6339N27l3831L8174n207l5477M7102j8459
762C498k2648M1753k9386N23K2995k9356K0510o458q514K2105k9703K1389L986
775A0694l1589M3115k9737q544M9723o3970L1544L1104p9663P3556j0446o6579
787e0792R6953n3568l0996R0034q1245J5624N5240q2302N3533N315n0935O0380
799B7241l7303j724L8734n6717M3281k141m4868O8009m7140r225O3024p3556L2781
812C96K9185o9119O1807j4362m1571O8457m9038k377N0862o3935L2432K0402n3976
825c0837M4181m221k9833L4583j5086p023J4182p748L294q323J3370k697j9798
838a5956L2996j9663j4431M2317l5217l513M0178l9626M341K8991k9255K328J8196
$$ y = [25996, -6894, -12728, 14976, 3916, -15670, 10669, 11196, -22635, 15539, 10332, -25145, 21957, 3498, -19150, 22603, -6783, -6260, 16735, -12621, 7889, 1431, -7083, 15022, -14681, 6708, 10694, -20895, 22220, -7517, -16061, 33662, -30308, 1236, 32340, -47323, 26233, 15787, -50792, 46161, -7407, -38403, 51631, -29614, -13990, 41250, -41052, 12481, 17796, -33139, 27241, -10062, -11786, 26948, -29769, 13512, 11371, -33497, 34512, -12628, -21853, 41171, -32385, 396, 29581, -39538, 22269, 7907, -33664, 34793, -14245, -16622, 34240, -29695, 2737, 23139, -30837, 13344, 9123, -20710, 13873, -1213, -8236, 5946, -1802, 1492, -6831, 6539, 3842, -15956, 17040, -2623, -17054, 25263, -9954, -13467, 26711, -12915, -8574, 20417, -8838, -6510, 11686]
851A1686r112j5782J9881R212m0223L2004J5183n7693N0948K570n8699O7982k1854
864F103m0778O7986m3747q418M7598n0553K0966J6332l7054L4767j8025l914K5673
877A6936l9055L2866l335l4129N4335l8012p766N2752o1755K8183K6178o4315
889c7117O1915j6268m3809P6705n3196r985O5417o9561K2507L7135o1725L9238
901A1256L221l0217L2869k2093Q190P996k5822L4215k2017j0100M2225m6462J3980
914b759L0397n2956L6396M918l9759M3580j8006j7398L5338k7073M303J6358k4671
927a1332J7154j724j0676J3778q390J788Q98j216K626q826J4916p747j3553L0111
941A7807k4056m750L5631l9369J0738K6488m1461K2160J1840k7928J9003k174
$$ y = [11686, 2574, -13208, 6673, 15885, -24338, 7666, 22849, -34844, 16104, 18674, -40025, 27957, 6103, -34675, 33311, -10436, -18854, 28744, -21809, -843, 15489, -21565, 13202, -4823, -8737, 16936, -22119, 10747, 7412, -26717, 27618, -10394, -18160, 34592, -27163, 1020, 27198, -37117, 24798, 8530, -35279, 41426, -11770, -21755, 43662, -25899, -3392, 33743, -27982, 11256, 14477, -15740, 17129, -4964, 3226, 11222, -14600, 19615, -2402, -12502, 29723, -16739, -2759, 27638, -25318, 11078, 15996, -23763, 19817, 1811, -15587, 19751, -7322, -3019, 13339, -11332, 5822, 4098, -6578, 7200, -1190, 598, 1496, 280, 2906, -5920, 8996, 1249, -12304, 17807, -6249, -10999, 24632, -14737, -3999, 22489, -18972, 3188, 15028, -12900, 6103, 3929]
953C929o731L932l562J5307k4606J0965K3509n1329L7986J4664o1810O1548j0584
966A3218n4463P6238l6591k8892O8315n4015L501L8950m8300K7920L324k4216
978a5011L0294k8692J2896J6710m1804M4470j5290l1437N8502m4226k035M9165
990C3542n9918K8019K0123n4924N3808j4638l3289N7629m2560l158M3822m9791
1002b1335K1946J9211m2451L0620j683j9562K4489j4639J837M384j0321J5792
1014H288j4679L780J6175k8723J5852R887k6951K4333k669j9511K1372p137q001
1027g984J2467l767m229L729J576p453N426P819j7065J1716N808k4732K7047o084
1041D274k1321L6135k4650q146L5693l6368J2853K2100m2555L1613J68k9625L8101
$$ y = [3929, -2802, 1130, -2432, 12875, -11731, -766, 22743, -28586, 9400, 24064, -37746, 23802, 13218, -41245, 34993, -1598, -30490, 37825, -16190, -12689, 26261, -22039, 5881, 9205, -15011, 15283, -13409, -513, 16197, -25607, 18863, 3573, -27864, 30638, -13588, -15623, 33542, -26376, 1643, 21766, -33158, 20650, 6012, -27277, 30352, -12208, -15366, 28456, -21335, 611, 19822, -22629, 7991, 6308, -13254, 11235, -3404, -1567, 2817, -7504, 8288, -6391, -2611, 13564, -15159, 693, 10580, -16371, 7962, 5293, -14218, 7154, 17, -7984, 4483, 716, -3513, 216, 1792, -5661, -235, 7584, -9481, 2235, 8043, -16689, 10358, 4274, -17047, 19088, -5562, -13708, 21985, -14383, -1530, 20570, -21985, 9628, 9796, -19829, 18272]
1054A8272k0219o266K5201k9593J8258J448j9798L3119l0647M094L1836n2199
1066b6494L6943J1007n6758O1695j8851m2430P1447m3303j6350N9981n6767J1992
1078g888L4061m7734K8488L226k4165K6114j9300O610J1609k7220K9423j2908
1090C16j7495L9771l3640J587L2038m0622J8182J4229l3773K9384m577k0610K8056
1103A2846j7436k735J9258k0634O564J0678j6452N818Q358j0349r4J0561q118
1116a735p643J9059j1371j0115K5421j8466n036K3270k1428K958J5461j8566P368
1129h23L899o226M978p385J1374p980p203K4813k6606M008K8551m1952K0754J9343
1143A9545m6396L8702k043l6145M7391k4561j4034M0413l8458J1648K0728l8358
$$ y = [18272, -1947, -8213, 16988, -12605, 5653, 7101, -12697, 20422, -10225, -6131, 25705, -26494, 10449, 21456, -35302, 26393, 7542, -34888, 36559, -6744, -23094, 36887, -19880, -7888, 26173, -21561, 6927, 10153, -14012, 12102, -7198, -588, 11021, -16199, 13224, 316, -17179, 22592, -11048, -9461, 22577, -18045, 137, 14366, -19407, 9977, 5400, -15210, 12846, -4590, -7325, 11933, -8701, -2137, 8541, -7911, -2093, 6265, -4084, -4178, 6383, -1735, -9378, 9681, -1690, -11805, 13616, -4850, -9886, 13384, -8044, -5086, 10375, -8191, -823, 3076, -3150, 1828, -5557, 5817, -2163, -9366, 15447, -11159, -7151, 21400, -20552, 202, 19545, -26851, 11851, 9808, -26337, 21054, -3507, -17541, 22872, -15586, -3938, 16790, -21568]
1155b1568L0038l732k2977L4156k4687R68K2363l1414K1228O72k1227K9822k2059
1168h417M50K4324l6459K5289N065l5232M3022j7809k2876M6325l3078n049L7146
1181B2701l7721J0126K0466k8652J4212M784j0903O420k214M415o203j99J2871
1194A0103j9097Q460J3002k4976J6287M824k0377J8913m042j0613J4391q069j436
1207b630O281o110L512q10k29n09r66N385j0158P141M564j7169J8347l748j8749
1222a5848K9698j6046j3102L3211k7750L79K6094l0512J1724J2654k2465J3996
1234B033j040m874O873r792J3128r773n592K5308k9258Q775K4197m1452K5542
1247D075J2477m2064L9921o249l0838M1809k2087r628L0096k7409R038J0275k1349
$$ y = [-21568, 8470, 4738, -18239, 15917, -8770, -7802, 14561, -16853, 4375, 5047, -16180, 13642, -8417, -7967, 16357, -20102, 5187, 10252, -24980, 18042, 233, -22643, 23682, -9396, -14445, 22701, -15020, -4894, 15572, -13080, 1132, 5916, -4987, 1433, -781, 3634, -2569, -2768, 10103, -8994, -534, 12468, -12508, 3779, 8603, -11774, 7139, 3097, -7516, 6875, -1194, -2630, 3651, -2459, 1053, 243, 14, -495, -1461, 3924, -6234, 907, 5471, -11698, 6649, 2901, -15848, 13850, -2196, -15298, 17913, -9837, -9458, 16636, -13876, -2152, 10502, -11963, 2033, 993, -3881, 2992, -6800, 6328, -3445, -9037, 16271, -12987, -4212, 19985, -21467, 4075, 16552, -25512, 14409, 8160, -22678, 19131, -2956, -12584, 17512, -9897, -859, 9416, -11933]
1260a1933K0283r490n176J8919k3688J2727P050k2592K3796r556j0678K3145k1762
1273h955O271J3322k4187K0728m316j7334K8297j9569l055K4354k7192Q582J5102
1286A2048k5204J4910O848j7593J0060K155o426J016N920j070j0187J3067j527
1299D017j5151J9899m790j4415K0765j0644p270J7055j1360o06P374n951L83R0
1313f04L126l112k242R628j3229L934J2724k2047J5445M332k4777K6840q693j8080
1327a6755L3453k2702o735K9857l0726Q815J8346k8488J7408K036j5675J6415
1339E249q784J907M840j2271J6721j3225k562K4391l0565J2240J9383l9094K8162
1352F392P009l6121L6637q567k4577L4849j8175p584K3044k0177N395O987j1766
$$ y = [-11933, 8350, -1140, -6316, 12603, -11085, 1642, 8692, -13900, 9896, 340, -10338, 12807, -8955, -2684, 10638, -13549, 7179, 2863, -14471, 13826, -5743, -8798, 15556, -11636, -3054, 12048, -13156, 1754, 8602, -8991, 1069, 3224, -3202, -2186, 3734, 2664, -7523, 5544, 4017, -11134, 8765, 3975, -10440, 10325, -319, -7589, 9466, -1894, -2500, 4874, -1077, -694, -604, 2522, -590, -2832, 6796, -6433, -2499, 10225, -11822, 3623, 7955, -16822, 10018, 1325, -16755, 16698, -6004, -12739, 17118, -13608, -4793, 13553, -14935, 2473, 4509, -11166, 5249, -3535, -1628, 3212, -9059, 7662, -5563, -8125, 16266, -14299, -2059, 17324, -21770, 6392, 13401, -22720, 13917, 5350, -19227, 15622, -2553, -10137, 12907, -7270, -1875, 5112, -6654]
1365f654J0562n697k58P419j4136J1768p69j1699J6673r963m446J3700j2043K829
1379b714O270r189P032l190k726Q030q467L909L707q734O351J469n585K544L341
1394B048l347l810R036l268r226J8056j0430j0534K5292j8613n479K6358k4768
1407h685K859J9891k4810J0301Q906j6329J1336l754j435M902r517J2768p851
1420a418o208K0510k1711L966K0494l1129J8297R174l0934L0266o782k1104L2796
1433A6217j9900o866K7286k7176Q338J4773k4700J6721K08j2363J4448q789J135
1446f68N202r116J0770p626k416J4985j9506Q585J0782k2872J7110K122j9610
1459a2258K0791n056j3999J9032q148o637J2475o333l621O022j0o101L460N254
$$ y = [-6654, 3908, -1789, -2047, 5372, -8764, 3004, 2235, -9464, 7209, -2754, -7200, 6500, -5543, -2714, 3556, -5633, 1399, -1791, -4517, 3513, -4954, -1045, 2662, -6072, 279, 1748, -3837, -1293, 2048, -1299, -5109, 3927, 659, -8567, 9489, -941, -11475, 13817, -4796, -10275, 16083, -8685, -5826, 14065, -10745, -444, 8462, -7867, 3469, -285, -1720, 3182, -6335, 6433, -1418, -7626, 12884, -8827, -4861, 15633, -15496, 2801, 11975, -18959, 11307, 4525, -16579, 16217, -3683, -10549, 16737, -10439, -2101, 12672, -12028, 4693, 4901, -7462, 6986, -1803, -668, 4534, -4582, 6188, -1438, -3854, 11131, -8375, 210, 10992, -11880, 5230, 7352, -12258, 8533, 3477, -10522, 8510, 362, -6275, 6200, -133, -3754, 2268, 2258, -3843, -383, 4871]
1473D871r559M136N894j1412O963L595j0382Q620k027l697O523o384M332K93o590
1488d824J0362p619j731J1801j3823N340P080j3644J1328l644n227J1473j2142
1501e270O504M114j6092K0313q893j3356K8613k1883l643K7260k9511Q607J8306
1514A5069k8932J5261P288j9268J5555l448n548P925p596P877n782k730J4737
1527A0408j8733P313J3474k5541J7002N997k4661K4332n507j6559K3852j2613
1539a236n867J7406j5090K461R083j1503N426J262l424K627k149K899m138J479
1553g64N198r811O475L597j2501J1908j411j0215J3951o400n366J0967o299k081
1567b752O098k735j991K444K100n329J510Q003j2215N275Q773j6933J1429M332
$$ y = [4871, -4688, -552, 5342, -6070, 893, 4488, -5894, 2726, 699, -2998, 3525, -2859, 1473, 1766, -4824, 5538, -2081, -3812, 7989, -5834, -494, 6586, -7058, 4270, 626, -4601, 6872, -5270, 1234, 5348, -10744, 9569, 676, -12680, 15933, -5950, -9593, 17667, -11844, -3237, 15069, -13863, 1398, 8686, -10582, 4973, 1525, -4023, 3902, -3694, 4183, -1599, -4329, 10408, -8325, -1012, 12462, -13079, 3923, 9920, -14741, 9591, 4084, -12475, 11377, -1236, -7103, 10303, -4787, -2326, 6757, -4746, 680, 1942, -1482, 1145, -1004, 1895, -2243, -764, 4434, -5377, 1098, 4695, -7806, 4102, 2691, -7524, 6427, 27, -5339, 5628, -671, -2752, 3346, 611, -1380, 1064, 3164, -2165, -655, 7348, -4867, 408, 9181, -7752, 3677, 8009]
1581H009j7059J6003j828j2860J6012p414l973J0450r952N350K46o183J0229r642
1595b612J989R014j5054R556K856j2908J4353p013m408J1830j2747P677K361j3493
1609h599J7300r178q054K1902j9949J703J8949k5182J0988J1340k2285J4033L365
1622F333j3990J1132k086l176K256j167M990r387N289P948j7774J2488N171k0194
1636a2167J8783p73j8408K1179o159j1988J7655q235n264J1176o537j856N149
1649B555j997j736J346K600m507J575L919p342N112K119q062P628j020o188Q072
1664D074m109k320O053m557M33J820j385N24j709L270l346o99O842r715L990P449
1680F615j5042J0800L211j6713J7378m133j3841K0297j0675n734J5877j3831K911
$$ y = [8009, -9050, 6953, 5125, -7735, 8277, 863, -3110, 7340, -2612, 2738, 2984, -3199, 7030, -2612, -623, 8391, -6663, 2893, 5749, -7159, 7194, 181, -4227, 7603, -5144, 2533, 4894, -8599, 8701, -477, -8531, 13371, -6578, -4875, 14074, -11108, -120, 11220, -11065, 2968, 6333, -7657, 3475, 1389, -1787, 469, -698, 4292, -5095, 194, 8142, -9632, 2856, 8027, -12167, 6616, 5843, -12565, 8614, 2455, -9533, 8122, -113, -5377, 5799, -738, -2594, 2555, 558, -1178, 168, 2768, -1739, -164, 3755, -3587, 1525, 3644, -4418, 3210, 2190, -3998, 4074, -35, -2355, 3698, -859, -426, 1394, 9, 533, -1176, 2094, -1252, -1951, 4891, -4824, -834, 6615, -8427, 2373, 5584, -11129, 6249, 2116, -11725, 8572, -2103, -7837, 8040, -5791, -2880]
1693b880Q006j1923Q640k604l397Q792j0896O542L436j2325J3613m980q152J6853
1707H725j3526L45J3088j6739R741L254j3910J6184p150p299J7117j4968K101
1720c037J2813j7736Q441O878j4722R843J405q619O924p25k869J112R44Q08n147
1735c687N283J294r094R707j314r428J1516k547q973J1033k550p111Q245p24o499
1750d849N965J776q123N962L782j1194P999K464j1337J0953q94j0416J3620n751
1764d3n875J2133r258J395O564r522O109M33n584Q130o393J482N003q828Q132
1779C878k591n099J1266j1030K448R809j6502J1453K877j6861J9136n749j2428
1792i393K1107j3515m778J7893j6156K842J0125j3324O503J834o203N855m702
$$ y = [-2880, 5126, -6797, 1843, -761, -4158, 4634, -6262, 280, 3716, -8609, 5004, 24, -8128, 8725, -4801, -4456, 8632, -8107, 1634, 4888, -9022, 7162, 12, -7287, 9830, -5138, -3037, 9776, -7960, 481, 7359, -7363, 2480, 3885, -4734, 2190, 1465, -1404, -292, 652, 1460, -3687, 1596, 2890, -6204, 3503, 2189, -7239, 4277, 1730, -7243, 3790, 1240, -5871, 2374, 1650, -4849, 1116, 2892, -5231, 731, 4513, -6681, 1318, 3782, -7555, 3398, 2504, -7912, 5708, -43, -5918, 6215, -3043, -1648, 4916, -4606, 1503, 1936, -3648, 4482, -1911, -429, 4574, -4254, 3878, 1287, -3812, 7454, -3576, -1128, 8681, -7821, 3632, 6509, -10352, 8784, 3035, -9393, 11714, -1801, -6579, 11314, -4842, -2000, 8125, -5199, 1304, 3138, -3065, 2790, -1912]
1805a912K780L15n160Q676o702k551J1205j1525K013R300j2903O524L689r773
1819f024P879o37n353O609l644q28M558m904K120J862l288J794J118j788k78L563
1835B759l481j436O930n646k237Q871q166J8R029j0387K803N981q278L107K432
1850B299l990K022p89J552k861k44O352r453L636P354j4565R542M478j6195J4794
1865C932j126j3132J6410p100o408J3746j1149K160P087j0520P654n88n990Q918
1879C894o657Q48N865q400O311o11n403R208p651J367O270j0432Q396M97j0565
1894g063J3711o277p285J5205j0692k490J2434j1407R61Q589r098J475M589m163
1908a511n80K463K36m570L888K829q056M950L303q671O025K270p539O044K91m915
$$ y = [-1912, 868, 1183, -3977, 4699, -2003, -4554, 6651, -4874, -2861, 6439, -6464, 60, 3749, -6024, 1855, 1218, -4135, 2474, -1170, -1998, 2560, -2344, -224, 1638, -1650, 144, 1262, -526, -804, 2759, -722, -2158, 4772, -874, -3111, 5760, -2406, -2388, 6641, -3746, -943, 5038, -3240, -133, 2299, -1691, 331, -458, 1094, -1767, -2011, 4341, -5112, -1476, 5878, -8687, 855, 5333, -10862, 3932, 2806, -10326, 6084, -1016, -7424, 6322, -4827, -2667, 4420, -6100, 1554, 966, -5024, 3894, -2763, -1915, 3950, -4450, 1861, 1250, -4153, 5055, -2596, -1229, 5041, -5391, 3005, 3502, -7063, 6648, 371, -6914, 8291, -2401, -4891, 7543, -3864, -2903, 5686, -3412, -1937, 2652, -1511, -2091, 372, 608, -3962, -74, 2755, -5301, -351, 2952, -5719, 306, 2576, -4963, 1081, 1372, -3543]
1924c543L558Q53j962Q1K059j273j126L605k495j033M214m093J299K558n266N818
1940C254j985m458Q583o391j362Q992j0235L406O481j1165O517K589p870O690
1954C046k123k555L893l313K602j861j205O114q798M018N826j2312R571J534j2607
1969h170J3968l802q948J4184q515l237J1719j0960K939N588q624N856m54l501
1983a957M893m089J421J817m368N291l092j553O043o987L083L232p935P286j174
1998A911o689R695m621m174R236o864p02P118o915J55N753m890p89M888l098k449
2014b435N145j618m726O877j860n468P835k852m423O635k059l355M002k17k882
2029a401Q44L024l255j419N902n135j358Q303q740J166P575r947M671L751r520
$$ y = [-3543, 15, 868, -1094, -1013, 1046, -227, -1353, 2252, -243, -1276, 2938, -1155, 144, 2702, -2564, 3254, 1269, -3189, 5394, -997, -2359, 6633, -3602, -196, 6285, -4880, 1637, 4226, -3644, 3046, 923, -1632, 2261, -1052, 1550, -311, -1516, 4598, -4200, -182, 5644, -6668, 2903, 4437, -8170, 5798, 1996, -6952, 7232, -1283, -4520, 7199, -3761, -822, 4766, -3858, 1998, 1544, -1957, 2936, -1153, 268, 2085, -2283, 3008, -84, -1637, 4406, -2581, 502, 3734, -4201, 3085, 1911, -4778, 4917, 296, -3878, 5358, -1506, -2208, 4910, -2005, -1850, 3903, -987, -1776, 3112, 14, -2435, 2710, 1092, -3634, 3243, 1383, -4085, 3750, 898, -3525, 3110, 1051, -2304, 1698, 1481, -1401, -557, 2467, -788, -2207, 3695, -1440, -2798, 5505, -3235, -2069, 5506, -4441, 230, 3981, -5539]
2044e539Q472k028n317Q881o784Q51O036r647O485J628q672R651l841m299R058
2059D935p422J091M836p192N638j547l752Q096q058K604N160j0721R274j15j0337
2074g510J3239n731o634J3506r226j929J0630j0603K213O339q204L853J658l992
2088b391K824q92j24M20j037K557k455l54L575m119J325K651m002K496J172l578
2104a932K475Q06k874K610k56k482L268p05l475M874j233m487P265l446m878J0216
2120E746o614l889J1250q757j374R780r510J527O030p421L168J199k056J075j909
2135a755L347j774l649R160p877j862J2423j3479K625J0873j5074O867O602j3555
2149g128R715O02q729R739m524k110O613p560M616J483o845P940l747l086Q372
$$ y = [-5539, 2933, 905, -4412, 4469, -2315, -1464, 4572, -5075, 1410, 3038, -5634, 4017, 176, -4123, 4935, -2487, -1396, 3440, -3752, 1886, 339, -3413, 4683, -3375, -771, 4389, -6332, 2942, 2827, -7510, 5729, -2, -6636, 6870, -2356, -4285, 6345, -4258, -2045, 4294, -3910, -57, 1601, -2391, 433, -459, -583, -163, -1200, 1357, -1098, -1452, 2123, -1996, -671, 1980, -2022, 474, 1646, -1932, 543, 1349, -1525, 1085, 829, -1653, 1615, 910, -2565, 2309, 1076, -3411, 3854, 408, -4470, 5746, -868, -4757, 6493, -2264, -3638, 6142, -3368, -1841, 4189, -3232, -64, 1135, -921, 154, -1755, 1592, -182, -3831, 5329, -2548, -4410, 8013, -5466, -2841, 8032, -7042, -175, 6427, -7128, 2587, 3189, -5540, 4199, -325, -2435, 4178, -3382, 1234, 2717, -4128, 3812, 65, -3021, 5351]
2164E351p319R98N286p265M224P11m322N014k701k78L123n299M484l45n220P510
2180C952l480l820P969n285j984P273n538j637O722m881j453N143l130k048N150
2195B953k821k518N430l126j930M435k857q00L214k789M69J449j524P96r66P79
2211A94L39k325L518k843M74L221m914K504K559p730P208q6p486J0707n485n201
2227e346J1477q036k055J0514r984J854O349q082L537K033l261K099j579K101
2241A621j540k159O509o203m78Q768j0567K770P553j1630O163M206j0315P363
2255B061R86o997O849k429k261L920l555J749N28k415L322k437p00L800l961R93
2271e47K070l008J829j0j217J081p60R78q70n04K074j785n81L142l163O01K486
$$ y = [5351, -1968, -970, 4316, -2949, 1275, 1986, -2336, 2678, -23, -301, 2822, -2477, 2007, 1662, -3558, 3952, 472, -3348, 4621, -664, -2648, 4625, -913, -2550, 4172, -709, -2162, 2981, -149, -2197, 2953, 132, -2386, 3044, -82, -2012, 2423, -434, -1234, 1980, -809, -340, 1109, -415, 381, -585, 194, 533, -1792, 1726, -1117, -643, 2578, -2336, 168, 2727, -5003, 2205, 2119, -5367, 5340, -145, -5346, 6131, -1905, -3960, 6554, -3430, -1576, 4773, -3309, 228, 2261, -1000, 1099, -480, 1621, 81, -2078, 4431, -1772, -2250, 6518, -4049, -1279, 6274, -5356, 807, 5013, -5302, 2061, 3047, -3950, 2899, 470, -1791, 2129, -1426, 323, 851, -1564, 1758, -679, -1379, 2421, -1540, -547, 1523, -1485, 344, 334, -883, 198, -562, 416, -454, -958, 1116, -669, -1250, 1892, -1271, -670, 1816]
2288A816l250L76K864k430j195L931k506k128N395k898l384P324m566k951P989
2303D387n570j741O963n970O01M730n115J107J968j847Q06r72J927j518j057M463
2319C162n026N40N424p610L336M246r093P110M17p588R109m129m102Q719o627
2334b112j35O429p686L191L190o146M273j54k652K967k123J207m47r40L484m670
2350b324J477M342p820N010L157q882P271O49p920P506n78o054P026k301l263
2365b704M873j950j925K695o48q48O41L27o18j28J058q18k74R42l37l53p7P63
2383F19p68m23J875j693j90J709j561M31R47j162J035j257J156P73l768M529r71
2400A281m804P424l659m422R909o753k739R926q631M88P531q777K588M300o338
$$ y = [1816, -1434, -1058, 1806, -624, -1819, 2112, -394, -2522, 2873, -25, -3409, 3915, -651, -3602, 4387, -1183, -2924, 4039, -1931, -1330, 3400, -1715, -608, 1360, -487, 319, -653, 1274, -244, -1301, 3162, -1864, -1324, 4100, -3510, -174, 4072, -5021, 2089, 2506, -5082, 4027, -102, -4204, 4515, -2112, -2247, 4182, -3504, -313, 2877, -3269, 1004, 850, -1802, 1165, -958, 249, -198, -1138, 2346, -2324, -847, 3495, -4325, 685, 3842, -5040, 2231, 2880, -5040, 2466, 1888, -4166, 2860, 559, -2704, 2169, 219, -1706, 989, 341, -507, 134, 461, -157, -285, 773, -45, -319, 623, 286, -67, -144, 619, -149, -572, 1303, -390, -580, 1129, -432, -1, 946, -216, 819, -438, 718, 1491, -2277, 2252, 1281, -3523, 3901, 242, -4180, 5729, -1024, -3763, 6163, -2468, -1980, 5551, -3226, -638, 3662, -2676]
2415b676L320L34j538J514k361K985j854k384O373n900m31P163q419K603N700
2430D429r438O288J653q061Q174k525m362P368n171o25N953o629K460L118n747
2445c115M045L46l627L263j54j761J094M15R8j345J184Q89l062K681Q46m416M179
2462A560M53m702L799J153n016L968J158n339L993J508n853M113J594n645M476
2477A220N36m959N012j591k228L648k507j33K067l496L460o92k577M756m049L38
2493a195L923n183K709J659n007M802j392k207M836m903K031K667o368N984j159
2508A197n713R284n101l574R332p927J61P946r241K813M870p565M055J222l981
2523b222L230j219J16K26j602L378l347j01M503n296J443M211o538L344K758o245
$$ y = [-2676, 644, 978, -560, 954, -1407, 1578, -276, -2660, 3713, -2187, -2618, 4545, -3874, -1271, 4429, -5009, 1279, 2932, -5129, 3045, 520, -3842, 3526, -1645, -2270, 3683, -2946, -486, 2632, -3115, 930, 1276, -2351, 912, 758, -1003, 91, 506, 604, -741, 443, 1332, -1730, 951, 1797, -2619, 1560, 2013, -2689, 1110, 2263, -2753, 1215, 2373, -2966, 1027, 2535, -3318, 795, 2389, -3256, 1220, 1756, -3203, 1809, 218, -2010, 1638, -869, -1002, 1065, -2431, 1029, 337, -2240, 2516, -1533, -1195, 2728, -2455, 254, 1913, -3094, 1708, 316, -1891, 2945, -1958, 73, 2740, -3628, 2356, 1197, -4516, 4768, -333, -3907, 5425, -2502, -2341, 5605, -3636, -823, 4047, -3518, 537, 1759, -2222, 1008, -211, -95, 131, -1471, 1907, -1440, -1541, 2962, -2334, -891, 3320, -3218, 126, 2884, -3361]
2539c361M253N63m084M371j320k063L447j940r41L045k528J23J675k076O52J646
2555A462k311N89K184l021Q96J933k924J163J539k856J149J065j191J83k15Q41
2571D86j498K85K522l891J676L054o042L698K179o814O002N7o365P451k392m160
2587c752O805m235r10M548m434J537J985l523L586k304k33L017m162K886M94l828
2603b523M632k200k003N250m754R58L455n705M181K50m421N487k685k385N870
2618C407n342O14M561o211K800K373m774K930R76l218K027O30j220k73R19L62
2634E61j939J314J289l345K609Q50l804L293P04l955K878Q04l316K553Q20l054
2650a738K052R88k863J770O55k228J821k27j370K296j619l11K319l237J684J329
$$ y = [-3361, 892, 1455, -2629, 1742, 422, -1641, 1806, -134, -1075, 1970, -558, -435, 1240, -836, -184, 1462, -849, -260, 1924, -1097, -201, 1732, -1192, -29, 1510, -1346, -197, 868, -323, -140, -355, 486, -1012, -727, 1795, -2096, -420, 2634, -3408, 290, 2469, -4345, 1657, 1714, -4651, 2800, 408, -3752, 3053, -1182, -2092, 2456, -1978, -441, 1544, -1979, 1607, -697, -930, 2087, -2075, 811, 1305, -2523, 2109, -91, -2094, 3156, -1598, -640, 2815, -2890, 1291, 1541, -2880, 2607, -78, -2463, 3407, -1935, -1321, 3240, -2971, -171, 2202, -2572, 358, 1334, -1884, 143, 773, -447, -720, 199, 561, -1378, -64, 1225, -2120, 489, 1339, -2465, 828, 1532, -2423, 455, 1259, -2057, 496, 1316, -1738, 314, 1302, -1561, 209, 864, -1364, 457, 230, -1140, 1156, -463, -774, 1545, -1692, -8, 1321]
2666A321l596L167L7k907L258j203j280K072j595O58Q6p53K421l398J923J945
2682B156n638N005P31o704P528j792o072R079m351l673Q067n342j045N407m851
2697a495J128J888k526J868j331P56N68k960L856j417l036N705l733j681N765
2712C355n136L91M351n427K718J325l903L539j373j415L222l098N77L010m238
2727b102J765J739l528K291J152k865J521J023k183O78J461j310k41J313p78p15
2743g79J540k19j370Q06J433k488O20K172l224R14K913m500J840K923n188L086
2759D79J301m493M101j026k521M519l479j30L759m997K637J740m783M554p27l712
2775b778M959k565j323L774l058R50M79j555K867l303Q84K865n411M053J271o609
$$ y = [1321, -2275, 892, 929, -1978, 1280, 77, -1203, 869, -726, -68, 18, -735, 1686, -1712, 211, 2156, -3482, 1523, 2254, -4450, 3078, 1286, -4786, 4293, -58, -3731, 4336, -1006, -2051, 3356, -1495, -367, 1521, -1005, 863, -468, 288, 856, -2104, 1752, 335, -2701, 3004, -729, -2410, 3355, -1781, -1390, 2961, -2466, 252, 1577, -2326, 1213, -160, -1575, 1647, -1451, -874, 2136, -2102, -337, 1402, -2126, 165, 1317, -1548, -27, 996, -1187, -509, 952, -358, -599, 714, -64, -779, 761, 542, -828, -22, 1411, -1077, -457, 1715, -1509, -595, 2318, -2182, -342, 2581, -2607, 479, 1780, -2713, 1388, 362, -2159, 2360, -1119, -1249, 2510, -2487, 150, 1890, -2893, 1661, 934, -2778, 2181, -384, -1707, 2067, -991, -41, 438, -1117, 1750, -1553, -669, 2196, -3215, 838, 2109, -4500]
2791d500P356j307o353Q650l821m180Q439n595j653O557n265J90L842l656Q96
2806d00J215j425M47m09J193j078q33L130k945n15L772l371n8L417l679P14L050
2823B225l878J171K177l065R44J746k578J692N03k277K167o91j135K315j541q91
2839a116K844k709O01K067l591K089J379l210K383J37k432K695j560O7J260j903
2855i99J932j079q51L019l340M54L041m936L144K019o000N440o36m841O428k780
2871A5k578N614m730M82L887n080L048N92l459L557j679j101K895k124N34R55
2887H28k236K229j203m00K285k985J931O41l854M202p29l833N459k412k554N254
2903B623l282j453M835l348j518M458k743j145L293j545j372K526r43j592K115
$$ y = [-4500, 2856, 1549, -4804, 3846, 25, -4155, 4284, -1311, -2964, 3593, -1672, -1482, 2360, -1296, -400, 815, -610, -163, -572, 621, -457, -1290, 1840, -1105, -1620, 2152, -1219, -1277, 2140, -1539, -825, 2225, -1653, -482, 1695, -1370, -426, 1320, -1258, 434, 937, -1340, 827, 136, -999, 1316, -225, -1116, 1728, -981, -380, 1687, -1904, 185, 1564, -1646, 737, 874, -1558, 1137, -423, -356, 904, -999, 933, -146, -997, 2022, -1318, -864, 2177, -2759, 385, 2404, -3596, 1844, 1208, -3633, 2795, 15, -2563, 3051, -1679, -1197, 2690, -2390, 658, 1250, -2209, 1348, -331, -1432, 1463, -661, -127, 828, -1408, 821, -382, -782, 1503, -1482, 449, 1090, -2764, 1438, 709, -3124, 2335, -77, -2631, 2623, -659, -2112, 2723, -625, -2143, 2315, -428, -1573, 1720, 175, -1197, 1329, 386, -1206, 909]
2918I09j51j979J763N58k151Q24J511k180K05K556k578q09L625k759r61L601l025
2935a041l71L710l653O68K299l098K031l5k007K876k401K89K253l638K460J252
2951A594m286L574K0l140L790j488j660K904j849L99M87j038K116k551J061K197
2967B130m371L243O72n016N529r48m666O080k445k395N043l538n48L399k965Q39
2983D3R66k086K022r48j95J025j141N97L16j402J736p34q38J495j527R59L67j574
3001i19J867q36j526K552j233j216L137k239j012L432k431j153L576k190j452
3016a643L683k245j476L864k425j418L357j763j058K225j310k88O21N66j107n7
3032d74J789j659j075L499k925m80M160m424O02L713m841K210J847m175L293n37
$$ y = [909, 758, -1221, 542, 1100, -1051, -227, 1284, -896, -691, 1865, -713, -1522, 2103, -656, -1617, 1984, -1041, -1412, 2298, -1355, -687, 1612, -1486, 545, 510, -1497, 1379, -1022, -733, 1520, -2118, 342, 1594, -2692, 882, 902, -2238, 1552, 64, -1596, 1308, -541, -142, 345, -693, 1423, -1128, -67, 2130, -2241, 1002, 1674, -3342, 2187, 1239, -3427, 2653, 208, -2187, 2856, -682, -1230, 2169, -796, 43, 1009, -1077, 945, -3, -198, 827, -314, 283, 599, -803, 933, 199, -639, 856, -671, 288, 655, -919, 948, 112, -1414, 1138, -95, -1311, 1826, -413, -1425, 2007, -424, -1577, 1999, -191, -1643, 2040, -205, -1681, 2183, -242, -1660, 1697, -66, -1124, 1101, -209, -497, 124, 690, -417, -474, 1315, -344, -1419, 2080, -845, -1325, 2835, -1589, -987, 2726, -2115, 95, 1942, -2233, 1060, 523]
3048E23k299L498k457l9K608l997K699P39l624L775p65k864M337k510r06L172
3064A890k913J023O37j449K249k214M80J537l095K543Q60m306M555r29l891N545
3080B522k672j992M524l288p31L524l083M57K032k460J062N72j435J142q3n65
3096d74P26q93M06O80r71N27nm28R09o72k9R67j347M09J036k170K003K34k872
3115a964K892k29k748M058j894k542N271l375j510M997m179m3L640l780Q66K498
3131A958l546J865N41j512J256j332J414m81j238K893k744m36M118m651J036M125
3147C266n769K455K663n563M135K50l944M055j343j694L308k944Q78J610l036
3162a673K641o43j982L548k105j281L001k401N64J604k403J261l5q83J067p33
$$ y = [523, -1776, 1722, -735, -774, 1834, -2163, 536, 1275, -2349, 1426, 661, -2203, 2134, -376, -1282, 1890, -1023, 0, 637, -812, 1437, -777, -297, 1240, -1855, 688, 1548, -2758, 1797, 868, -3023, 2522, -150, -2142, 2382, -906, -1637, 1887, -1196, -739, 1293, -1167, -105, 467, -968, 174, 91, -474, 252, -641, -235, 445, -526, 1, -4, -432, 477, -195, -224, 743, -604, -195, 841, -1329, 674, 908, -1964, 928, 699, -2049, 2009, 115, -2427, 2844, -531, -2041, 2956, -1223, -1266, 2374, -1406, -540, 1958, -1588, 277, 818, -694, 562, -770, 644, 163, -1075, 1818, -926, -1362, 2756, -1895, -859, 3266, -2503, -48, 2615, -2948, 1187, 1437, -2507, 1548, 205, -1489, 1819, -1125, -247, 1363, -1673, 968, 325, -1657, 1891, -214, -1495, 1506, -895, -331, 1273, -1130, 131, 96, -787, 280, -453]
3178d53N1R34j828J649K02k254K958j239j697L083j344j913L793j833k114L959
3194A954k275j175L267k294m97K859k197m79J942j653O19M01q42P54o45N19M30
3211F88j864J935k87j953K880j562r63K861k588P09J856l371K283M02l254M085
3227A857j775k013M254l486j9L656m518J446K672m433K422J196l106K663n40p11
3243d35P34o49R89j261k82K741l411J103K893m475K292J666m445L255Q51m445
3259b879L533N22k724K331m97j517J911q23N6L47o32J002p80l20J371j025l8J049
3277H87j380L96P26r51j14N13r1O5k40L66q5n09Q53o7j285J821j51k017K300k55
3297G82k404L136j110k302L583j658j964L387j648r46K570j999J43J186j260N16
$$ y = [-453, -402, 532, -1296, 353, 555, -1699, 1259, 20, -1677, 1406, 62, -1851, 1942, 109, -2005, 1954, -321, -1496, 1771, -523, -1020, 1839, -358, -837, 1105, -548, 71, 472, -370, 384, -261, 258, 688, -1176, 759, 472, -1481, 1399, -163, -1126, 1735, -853, -144, 1712, -1659, 624, 1026, -2228, 1857, 82, -1931, 2323, -1163, -1182, 2474, -2044, -598, 2074, -2359, 63, 1259, -1847, 816, 276, -435, 299, -350, 639, -622, -904, 1837, -1574, -471, 2422, -2053, 239, 1905, -2540, 715, 1566, -2879, 654, 1176, -1548, 783, 286, -1231, 680, -143, -87, 260, -372, 630, -150, -470, 901, -124, -162, 887, -493, -97, 629, -322, -436, 77, -14, 51, -189, 177, 92, -417, 436, 369, -916, 905, 754, -1263, 1037, 782, -1622, 1514, 404, -1898, 1685, 27, -1937, 1450, -198, -1144, 1426, -573, -430, 756, -504, 12]
3313A2k29J75N24j598J580j45j901K871j185j521L226k421k32K249k716J421Q21
3330I31k883K990p84j485L125l161M18K655l755J934J423l218K367K96k245K274
3346H82m45j486J497k50J79o19K23J044k024J267J063l089K163R80l297K734L78
3363A200l323K831J94k766K867j30k199K298l47j599J613l40o83P69m24j93O15
3380C83m04O3k78K61K30q06L75O92p58M71L24j317J407n58o45J134j177M73J182
3399A052k344J842M14k688L148r01k589L989j965j615L991l061l27K937l113J164
3415f6J222k101J497l26o21J316j630J203K15j875K436j248j300L072k568M3K510
3432A779l020J352J420l096K218Mk231K818j918k73K520k598Q80J487k773K054
$$ y = [12, -217, -42, 482, -1116, 464, 319, -1582, 1289, 104, -1417, 1809, -612, -844, 1405, -1311, 110, 931, -1952, 1038, 254, -1231, 1894, -1267, -849, 1806, -1949, -15, 1408, -1810, 557, 853, -1392, 882, 437, -1049, 448, 198, 377, -242, -19, 1025, -999, 268, 1331, -1758, 405, 1385, -1912, 822, 1200, -2123, 708, 902, -1864, 1003, 873, -1326, 972, 625, -974, 639, 299, -384, 385, -39, -232, 383, -21, 42, -236, 25, 255, -551, -176, 516, -242, 229, 553, -764, 643, 85, -560, 574, -603, -130, 1052, -1292, 550, 964, -1724, 1424, 523, -2066, 1923, -42, -1657, 2334, -727, -1054, 1883, -1230, -66, 1156, -945, 552, 226, -395, 921, -709, 494, 709, -1166, 1270, 22, -1278, 1794, -774, -731, 1779, -1241, 111, 1531, -1565, 653, 657, -1574, 1244, -674, -947, 1573, -1025, -145, 1342, -1431, 623]
3448F23M95k546K080K28k295K211k22j305Q17K60o34K93NJ0n46Q39K61j713J746
3467F07M53k748K134O68l175L123J78l980L979o0l501L634m42k986L453j291j392
3484a346K627j611k99J388j309P52k79l26J195j610P37J024k127J637K02k150
3500a495K542j081j199K859k235J29J895k768J996K31k698L213j191j900L830
3515B128k828o49L391l273P77K244k999J301P96j974J697m81n39Q41j124O48J37
3532I3j097K189j498p80K392k142K90J883k677R75J287j925Q72O75j250J034j40
3549A81o92J121j345K16J522j779N44J366k606J467Q80j939J104Q73k210J546
3565B49P17k079J179M04q12J45M10j20o18O57O63k103J611R98l464L043N15l650
$$ y = [623, 1118, -1428, 652, 880, -1415, 796, 574, -731, 86, 346, -288, 5, 10, 20, -526, 313, 574, -1139, 607, 1060, -1688, 446, 1114, -2061, 1062, 1240, -2740, 1239, 1179, -2322, 1312, 870, -2116, 1337, 46, -1346, 1281, -330, -629, 759, -550, 202, -77, -403, 792, -818, -81, 943, -1184, 453, 655, -1495, 1047, -34, -1233, 1626, -609, -480, 1415, -1353, 643, 874, -1824, 1389, 198, -1702, 2128, -700, -1349, 2042, -1231, -454, 1790, -1209, 92, 888, -1086, 611, 130, -409, 432, -692, -44, 93, -1004, 1185, -313, -1093, 1299, -843, -553, 1330, -1347, -372, 915, -1010, -138, 537, -713, 321, 181, -511, 610, -735, -519, 1003, -776, -232, 1134, -1472, -5, 875, -1064, 40, 913, -1297, 249, 966, -1113, 66, 470, -342, -197, 213, 93, -525, 132, 795, -1308, 303, 1301, -2163, 880, 1395, -2255]
3583b255L331J46l809M185o32l278M018j572r91K136j518j69P76p97O74l14k51
3600c20R15j497J222L14j803K271r96j331K549j552m03J836j962P59N81j950J877
3617E10j14j385J978j288l94K228k252Q9J586j974P33J172j518Q23R9p89P95j3
3635B86l65J58m37O08m83L47M92j139N64J128j789O17R50j552O23Q31j782J036
3653I3Q67j850J330j52p06P62m46k86J484j601L95J237k263J339O55k154J884
3670E88L1j697K078o10r44J018n07r6J90j51M89j039Q97O17k417K241L43l070
3688b039L312o49k776L956j656k259L925k067j351L007j741o83J818q43j70R7
3704a19J69K2n06J134o69j140K094j101j161K709j791r25K584k243J79K123k242
$$ y = [-2255, 1076, 1222, -2587, 1598, 966, -2312, 1706, 134, -857, 1279, -239, -408, 368, -429, 245, -69, -320, 595, -902, 320, 634, -1169, 1102, 106, -1225, 1324, -228, -631, 1205, -757, 2, 583, -1367, 510, 396, -989, 989, -299, -693, 1535, -717, -628, 958, -1016, -283, 889, -629, 194, 293, -496, 299, 286, -79, 79, -358, 250, -233, 114, 606, -533, 31, 1159, -630, -13, 937, -615, 8, 839, -943, 93, 960, -890, 440, 288, -418, 344, -102, -388, 1096, -505, -110, 1127, -1136, 203, 858, -1296, 588, 619, -1078, 1000, 390, -554, 464, -43, -139, 51, -100, 389, -650, 247, 864, -1553, 688, 1031, -2039, 1273, 624, -2152, 1804, 148, -2111, 1814, -253, -1604, 1403, -338, -1021, 797, -46, -216, -119, 50, 72, -434, 700, 31, -1109, 985, -116, -1277, 1432, -359, -1284, 1300, -943, -764, 1359, -883]
3721h83Q70P67j569J384m95p71J558j149O7Q17j037N48O38j486Q91L69j153O76
3739D2L62r24P46j8o78Q22p2l65J4r9O91r51k06J488j386J37J283j969J009J052
3759I78k306J439R06k612K117k81j329K164j544L6J704k396J341N73j919J764
3775F35k9j872K240r77j038K289j766K48R25j094P33m08j63R47j466R67Q71k561
3793a519K607n21k506L406j282j920L609j716j840L522k028j132K625j515l58
3808e68J233o17l49M88l4k60l84J200o57p68J632q40j055K025j203o71J898j474
3826d04p10K240j736L2J433j209J9O94j220J019k70p39J953j734L57J133j830
3843i72Q73J335k568J553P55j719J359m21j135J228j64p45J063n35N97m27q01
$$ y = [-883, -13, 754, -815, 569, 74, -697, 861, -288, -221, 596, -441, 107, 745, -741, 150, 519, -634, 42, 404, -520, 226, 208, -470, 352, 280, -85, -71, -170, 521, -430, -636, 852, -534, -397, 886, -1083, -74, 978, -1328, 111, 1017, -1595, 522, 241, -1088, 1076, -468, -432, 1272, -1124, 217, 790, -1129, 635, 606, -1266, 974, -3, -1041, 1248, -518, -270, 655, -439, 294, -114, -277, 670, -796, 171, 1042, -1519, 1088, 567, -1939, 1467, 185, -1735, 1874, 158, -1682, 1840, -188, -1320, 1305, -210, -568, 665, 48, -301, 187, 153, -107, -491, 709, 52, -716, 916, 76, -979, 1046, -157, -828, 1070, -404, -1114, 1126, -610, -578, 855, -354, -335, 359, -861, 158, -112, -851, 1102, -632, -275, 858, -972, -99, 1236, -1332, 221, 976, -743, 616, 195, -940, 288, 124, -621, 442, -93, 504, 77, -724]
3860g24J513j288j14K553l053J168J062k818K437P7k417K568n54j701K167j107
3876b31m05J646j541N18Q37j732J419p46n99J815j246k4J020j411O75K85p76Q62
3894C66m11j85O68r54P07J41j479J664l51j471K139r01j186K184j118j068K241
3911I86j201n66J921j325r36K126j174m13Q80j62p83N82o5p1K4M95n64n85J533
3930G02q34p34J603j077o80J909j381j28J745j759O46N75j425J478m11r65J255
3947E19p18k95J382j614O35J179k123J187M55j479J327j28q42J274r10J43K13
3964B05m60M72q45N43J304k175J111Q29k217J610L72k058K061j19j960K291j126
3981a62o46J239o67m90J264q68K98L07o47N03m71L65M01j100Q34K03q57N60K21
$$ y = [-724, 789, -499, -613, 1940, -1113, 55, 1117, -1701, 736, 813, -1604, 964, 410, -1291, 876, -231, -636, 1010, -531, -13, 824, -908, 511, -235, -834, 981, -265, -289, 731, -680, -5, 280, -496, 366, -45, -230, 438, -516, 191, 332, -1147, 517, 166, -1305, 834, -67, -1253, 931, -187, -1255, 986, -215, -781, 1140, -185, -1121, 1005, -169, -582, 298, 136, -647, -65, -130, -201, -177, 318, -246, -831, 702, -132, -866, 737, -340, -1020, 889, -492, -620, 1125, -634, 12, 587, -838, 640, 229, -736, 519, -199, -494, 888, -726, -91, 1088, -1035, 152, 607, -872, 455, 327, -515, 759, -151, -8, 205, -255, 217, -628, -85, 1219, -956, 155, 984, -1233, 377, 749, -1309, 752, 633, -1327, 964, -162, -808, 431, -236, -726, 538, -330, -32, 275, -372, 131, -340, 25, 426, -674, 160, 363, -494, 66, 287]
4000B87o77M91n74M65J63l64K14K28o13R15o93p28J427m41r52J918j308r72K258
4019A044j354o57K038j485k38J762j727L96Q66q89j45Q97o18m7q4R18m55o87J504
4038A039j473j90K109j837l11K143k192O18J290k179J278M16j457J438m03r71
4054f82J636j370Q7P03j549J720J8j526J638p81n14J307j032K97L71o62K66j48
4072b21p5O41r58P13P35k142J689M19j954J716L20k133K173o41j117J490n90o34
4090e69J283o59n00J004p26J54L05m06O70o91l5N10n83K56O33j157M93O28j160
4109e50P88J16n96N90k64j15O70r31O66j06r44J288o59p30J938j385o56K208j976
4128f48k45K373k598R17J123j824J166N72j926J094l4p2M12n72P81o48m19J593
$$ y = [287, -390, 101, -473, -8, 155, -209, 5, 233, -380, 535, -158, -886, 541, 100, -852, 1066, -242, -1214, 1044, -310, -967, 1071, -414, -652, 1110, -617, -221, 645, -244, -389, 508, -110, -157, -241, 677, 222, -465, 1039, -434, -624, 1485, -352, -663, 1480, -712, -94, 1196, -983, 295, 711, -746, 692, 289, -682, 954, -416, -329, 374, -1175, 545, 563, -963, 675, -106, -620, 687, -345, -48, 323, -339, -73, -221, -296, 345, -613, 100, 835, -1307, 382, 801, -1153, 563, 883, -1250, 923, 282, -835, 655, 65, -569, 714, 55, -445, 559, -167, -13, 292, -114, 556, -135, -170, 340, -243, 13, 646, -511, -18, 610, -550, 238, 354, -242, 348, 84, -31, 639, -292, 374, 268, -676, 612, -47, -777, 1161, -224, -880, 1328, -648, -893, 1480, -1118, -201, 922, -902, 264, 836, -1090, 4, -30, -102, 310, -262, 519, -129, -548, 1045]
4146A045j818M89J653k400M69J833k258Q41J094k210J635J81j068J679q04j095
4162g34J729j817J275j23j095R01O81j095Q84n75l72R52r51N57M9p34M16L5k29
4181b46M73n96L89N98j037O42M32j354J139M1j650J679j38j574K032l10j646J566
4199D40k92o76J178n57n74O60k20m7K32n98R28q76K81P36j510J236M52j778J454
4218D69r0j467J438k04l79Q52j332P36K03j174J434l73j082J787j155k15J864
4235A312k316O70J718k481R39J448k171J020R54j761Q59j39j26J32j12M35q06
4252d25J70J027j581P96J054j869P72J210k174J376N02j687J131J96j413J368
4268D53j21r57P32j27j28O29n49J9K60n27N02p5n08O98l12n05R86o82l9K19j06
$$ y = [1045, -773, -284, 1369, -1031, -562, 1271, -987, -146, 948, -1262, 373, 554, -514, 1165, 361, -734, 995, -822, 453, 330, -765, 136, 817, -278, 606, 31, -341, 611, -340, 217, 266, -468, -52, -17, -246, 227, -369, 20, 618, -419, 223, 655, -699, 440, 481, -1169, 510, 372, -1202, 830, 520, -1126, 440, 148, -528, 650, 93, -481, 179, -41, -88, 144, -454, 474, -402, -121, 615, -895, 341, 793, -985, 469, 379, -1088, 350, 146, -233, 619, -713, 23, 226, -948, 486, 113, -969, 818, -337, -552, 1312, -1004, -334, 1384, -1097, -158, 1290, -881, 139, 1093, -668, 191, 52, -74, 58, -54, 381, -425, -255, 772, -809, -13, 1041, -828, -56, 1154, -1020, 356, 858, -829, 302, 498, -915, 453, 332, -625, 107, -20, -148, 481, -68, -49, 211, -316, 186, 111, -397, 301, -11, -516, 470, -212, -251, -32, -138]
4289a38K55j43j92M08q15N78N35j457J214J04j324J600J75j929J853k34j500J702
4307F92q07o81J334o32l94Q16n31M40j41j72P11j017O41M02j296P87K82j110J145
4326D69j82j116J268l83m80P91r23O29J39n94R18q68r7J311j693N18J392j866
4344g67P05J012j853Q35R45j545O27M40r65P18p2p7n94J047j37r26Q34j07q37
4363g17O51P22j273Q11L71j516R94O57j650J291J87j295R59j7r77J066k79m08
4381d23M67k17J4K88l67J82j84P3O29q83O74K69j034N06N02q96P63l99j54P80
4401E90o68jO51r12N01L44j470J684m55j207J829q62r14J731j190N4R69j186M95
4420a7L05o98O89n29O9L55q94J038qj098J524o21p24R78n69m53J337j271M95P70
$$ y = [-138, 117, -26, -218, 190, -625, -47, 488, -969, 245, 349, -975, 625, 800, -1129, 724, 490, -1010, 692, -115, -796, 538, -94, -488, 328, -203, 237, 96, -76, 635, -382, 259, 661, -635, 152, 434, -676, 469, 287, -829, 439, 56, -424, 367, -556, 73, 212, -382, 536, -332, -429, 882, -811, -293, 1099, -767, -62, 950, -903, -68, 877, -668, -41, 399, -566, 152, 80, 3, -591, 456, 319, -607, 227, 120, -717, -66, 656, -617, 194, 565, -951, 43, 700, -950, 341, 528, -767, 192, 175, -802, 264, -15, -423, 44, -173, -159, 129, -238, -56, -240, -167, 462, -421, 253, 522, -512, -6, 496, -400, 363, -36, -190, 590, -78, -79, 572, -340, 161, 505, -965, 719, 264, -943, 886, 24, -890, 841, -349, -295, 674, -512, -17, 288, -410, 279, -250, -181, 174, -720, 318, 310, -788, 736, 115, -609, 369, -200, -653, 684, -587, -92, 678]
4440F78j125N07J58o21R51q44L8R83j047L60N83j248M72P80j439Q58O28j289N03
4459a14P53r64N33J30n16o4L48L7n50M97L87j036P65N60j529R40Q75k168J341
4478B25O01k055J714L37k021J750Jj431R61l6m14Q66m82j6J80n05R81j112J47
4497c09Q92j020O70M19j451R52L49j124R53k76l93O96q54M98M40j405J444Rj451
4516i61J832j090o17J771j123n17J563q73n58J412j209M10K62n14pK95N1l9l85
4535b97O78j94m79J018o61l62P81o55m14J337r65M5R00r28j5P26r28L49k2m7N56
4556D23p16N8O61r10L54P99j131N50N12j297P72L26j141O82M90q69Q44l57r6L0
4576a6j77M34m67R4O84j068N25J080k027Q91P28j777J343M17j647J314K47j481
$$ y = [678, -447, 60, 218, -403, 548, -296, -258, 725, -322, 38, 621, -627, -155, 625, -814, 44, 672, -617, -114, 639, -325, 208, 338, -178, -242, 106, 143, -407, 90, 477, -559, 206, 766, -763, 177, 1052, -1116, 225, 826, -1229, 485, 822, -1199, 551, 552, -879, 82, 46, -368, 498, 16, 0, 180, -325, 656, -456, -309, 583, -437, 233, 652, -799, 153, 502, -622, 331, 55, -338, 358, -496, 2, 442, -963, 481, 490, -961, 871, -219, -836, 935, -188, -705, 858, -15, -573, 839, -370, 40, 302, -212, -219, 76, 127, 88, -297, 381, 187, -292, 726, 65, -297, 484, -171, -585, 752, -213, -168, 732, -196, -211, 515, -413, -64, -86, -133, 423, -293, -235, 426, -484, -130, 669, -462, 88, 600, -697, 75, 401, -740, -58, 432, -437, 407, 50, -46, -16, -193, 241, -226, -132, 552, -516, 9, 1089, -938, -47, 681, -1096, 247, 664, -983, 331, 578, -903]
4594i03J164k13l22N13k72j29M03n52O31m19m7M64j079P87O52j137N93R0q28Q95
4614B91j90m39P62m26K4J91q54R60k38n88J166n22q32J284n41l57J188j088l23
4633e32R31m28l36M20J28j63J33o1p0k1L06m79m5P56n16l55O19l77m24R54p47
4654c07Q3Q44j023K21Q17j184N88P6m33P30j63o33Q30o70j22P13p89P39J80j102
4674f05J031k8r53R81j52o82R28p09K15j64K32J91m88K94M20j299J176K43j492
4693h61J127L70j610J553j21j075J324n37o65O39k4k52M38l94J26j7K9L2m01N07
4713A88J02o46N50j79k90Q06m52k06M46k57N5J67o94K79L60q10R19k89m06Q42
4733D85n45m35Q97n07m32J107p58p1Q67j196N28N97r75J46O51n15l3K8L96k35
$$ y = [-903, 261, 48, -274, 239, -33, -162, 241, -311, 320, -99, -146, 318, -761, 26, 678, -459, 134, 224, -604, 291, 101, -338, 424, -2, 22, 213, -641, 319, 81, -507, 659, 137, -695, 589, 48, -309, 879, -209, -532, 399, -29, -365, 55, 183, 20, 153, 92, 22, 1, 307, -172, -217, 539, 23, -332, 287, -90, -514, 440, -307, -224, 620, -403, -182, 635, -549, 39, 115, -318, 412, 249, -384, 446, -224, -346, 367, -422, 317, 497, -605, 426, 398, -555, 426, 274, -408, 520, -189, 26, -138, 94, 285, -203, 91, 511, -788, 388, 631, -861, 266, 636, -974, 579, 458, -617, 707, 170, -495, 144, 120, -132, 306, -88, 38, 21, 50, 82, -319, 188, 290, -356, 194, 15, -275, 531, 79, -127, 319, 62, 117, 284, -410, -131, 229, -581, 338, 49, -357, 485, -60, -495, 402, -105, -537, 570, -188, -259, 608, -588, -60, 537, -438, -292, 359, -156, -189, -161, 235, 0]
4753@k27Q38p85J18O82q83q0J161j038P4P98j180O83L92j084N54K99o59M38j74
4773g3o2O29p24N24j55q47J106m31l85P80m64m55R31n95J64O44q21K80R1k36K76
4794A77l25K37L81r27Q50q9j236J805n85j034J493o34q07J669r17o98J173p22
4812a89j24O09m86j93K97K46j24l33M59o4n32P38j42m45O02m3o52O66j67o9J39
4833A93k69j4M89p53N97j78n95Q89l73l17J201j035j82J107j097K37Q99j276L75
4852a02N08r53O16M51p01K32n0q2J3k38Q63n77l94R15p47j80J264j495N78P77
4872F98j472O07O76j091O18Q5m25L56j30k55O90o69P12m12l85P64l20n45P81k08
4892G5o39J147p41j94O01r9N9k77k55N80m68M24J85o87M91k3p11J139r3j261J227
$$ y = [0, -227, 611, -174, -56, 626, -257, -337, 824, -214, -140, 658, -522, 161, 553, -531, 23, 322, -337, 101, -73, -135, 494, -230, 294, 139, -708, 398, -33, -418, 362, -102, -557, 374, -221, -57, 587, -234, 46, 137, -99, 177, -148, 89, 470, -457, 393, 304, -932, 873, 288, -746, 747, 113, -694, 975, 58, -640, 533, -189, -313, 296, -190, -383, -86, 160, 36, -297, 162, 98, -434, 304, 162, -283, 319, 276, -376, 290, 123, 54, 193, -76, -90, 399, -354, 243, 65, -530, 359, -14, -331, 870, -165, -347, 760, -337, -100, 799, -477, -102, 406, -547, 69, 520, -181, 51, 1, -81, -68, -306, 557, -20, -414, 501, -246, -426, 838, -657, -79, 698, -774, -167, 509, -582, 36, 121, -304, 52, -78, -333, 357, -312, 400, -12, -397, 367, 47, -498, 283, 75, -564, 583, -158, -352, 249, 150, 209, -68, -323, 257, -211, 213, 398, -289, 202, 179, -532, 607, 514, -747, 480]
4913D80l27o11Q40m01m43R99m40m19P41m77l10O69o28L54m0O2J30l60K26l1n67
4934e53O79r0m05Q11o98k52Q76m20j36O88j006O67K59q27O97j37m95O60m39q5
4954b06P65p17J03M07n84K73K29m90L99p8l80J89j35L25l5j92K64l88j75J125
4974F99q83J18N34j011K01R42j161N47O91j487Q90J83q05P48j35k43K68r2k9J88
4994A63o4K41m82j92N10j41k92O87p06J42M48l99K32K89l99J51j95J05r1j51K92
5015A48J1m55O59j77n34J078p88k64O50j00o34J093j028j37P99m65k79O21j10
5034H8l48M91n4k23j06L13j88p9M56m14m36J214n84o30J127o63K4N81r69L56K74
5055B30n28L60R3l06M22m43k8N33n61M88n5m35K98R5l62O45l88j20n1q6L91k26
$$ y = [480, 153, -458, 382, -19, -462, 537, 97, -322, 419, -58, -368, 301, -327, 27, -13, 49, 179, -181, 45, 14, -553, 126, 36, -369, 442, -256, -508, 368, -52, -188, 500, -506, 161, 420, -407, 290, 153, -342, 318, -121, -206, 559, -158, -55, 352, -232, 41, 270, -220, 179, 101, -279, -90, -225, 100, 65, -127, 137, -251, -426, 699, -184, -66, 468, -543, -342, 600, -561, -14, 677, -810, 80, 263, -542, 206, 71, -172, 96, 4, -25, 163, 99, 340, -142, -334, 176, 35, -257, 430, -276, -134, 314, -85, 147, 436, 37, 188, -7, 98, 7, -144, 148, 159, -296, 363, 186, -348, 730, -58, -322, 328, 228, -406, 687, -341, -478, 321, -144, -423, 198, 88, -260, 231, 177, -46, -152, 161, -27, -106, 350, -64, -500, 714, 130, -500, 627, -36, -12, 569, -400, -44, 230, -298, 62, 155, -151, 271, -172, -200, 333, -228, 260, 205, -230, 68, 163, -199, 446, 58, -62, -113, -199, 192, -34]
5077c4o8M55p52k2J001q82LM55m96K76N62j120P85K54m73P8K39n53L36J68l55
5098a43k2K97j77j29J44L59m18n3M71n13J25L93q26K98N44p95M66L9l34J60J76
5119F2m40M89k60L59k19n45J017n69k32P95m94m94J101p04n60J425j037K3P51
5138D68p08L43L21m00p2j12L92k70l7M93m63l36R35m30o93J065q20n2R73p81R2
5159i2M44n40L42P6o46O36o9n25N77r5k60L32l94L01K33o17M21m3k57K65p3k35
5181b19L60j85r4L01p7L19l35j14K77m57p4R22j121O09N88j236N98K56q23M10
5201i5M38q55O17o1l11N41k14m9O6p8J62m0l21N91m52J22O26r89L41L33p14L13
5223b9K68m22L24O8m31L15r9N1K13n20O07j46n93P69l75l66O84o35M2N41n33J80
$$ y = [-34, -102, 353, -399, -421, 580, -302, -299, 156, -340, -64, 498, -622, 163, 417, -56, 22, 261, -292, 44, 212, -143, -165, 132, -45, -174, -30, 329, -89, -142, 329, -184, -59, 334, -492, -194, 350, -445, 21, 60, -274, -114, 62, -378, 111, -149, 210, -9, -554, 463, -106, -338, 457, -37, -531, 570, -134, -694, 731, -306, -283, 468, -240, 103, 424, 24, -48, -160, 232, -38, -75, 418, -45, -381, 554, 124, -569, 496, -324, -376, 597, -184, -92, 352, -188, 154, 230, -416, 220, 151, -374, 203, 108, -152, 180, -214, 87, 320, -297, 124, 81, -176, 89, 16, -219, 141, -44, -138, 163, 86, 405, 70, -44, 233, -224, -298, 624, -497, 112, 700, -536, 62, 318, -505, -95, 343, -512, 105, 44, -267, 274, 60, 11, 77, -1, 161, 121, -200, 391, -61, 61, 687, -302, 39, 372, -342, -29, 239, -183, 141, 209, -222, 93, -6, 45, 258, -262, 345, 199, -394, 375, 0, -366, 318, -317, -275, 266, -267, -87]
5245h7M91p00L68J3l55L02Q7l31K68l18M91l48n0O77o62k87R74p35o7Q57p34n8
5267b04Q63j072L20O10q51K52K37m87M37n0k31J01m1R8o3k68N00p8l33N91j63
5288A68l06N44k64J1l8m2O3j25k08M18k72R0J22l43J03N85p78K89K55p24P17P1
5310C36q17O88p5l49L84Q8k69m0O9%p8m1M18o55L12J91n89N95J99n15K39O0m80
5333c29L82J29l95L94k30R0P1k43L36k63j10K91k02l38Q46q28Q6N66n30j47P93
5354C69n09n9N37n43M28OMm61L72l3l90L53N16q39J74O86o26n9M45p18O9N79n56
5377b55K04J83k37M13p7l18L7J63j15j2k72M48pm06M22l3n28N87l6l28L53k61
5399g5Q5lj02L63k34k66L76l19K84M75j002M30K62p41O80j65p70O57K42l73M37
$$ y = [-87, 404, -296, 72, 85, -270, 32, 119, -212, 56, -262, 229, -119, -169, 508, -154, -441, 533, -202, -269, 588, -146, -204, 659, -413, -93, 517, -334, -82, 155, -332, 105, 55, -176, -75, -116, -18, -81, -349, 151, 73, -260, 331, 168, -138, 406, 142, 153, 115, 73, 136, 11, -197, 221, -51, 39, 161, -182, -79, 506, -272, 17, 272, -452, 265, 336, -481, 207, 132, -217, 167, 255, -14, -54, 15, 15, -63, -104, 314, -341, -29, 162, -427, 168, 367, -148, 91, 151, -329, 53, 182, -213, 181, -49, 41, 112, -131, 205, -58, -168, 123, -79, -417, 429, -399, -313, 253, -277, -424, 369, -140, -199, 338, -205, 223, 229, 233, -228, 144, 111, -279, 74, 590, -249, -75, 611, -15, -74, 371, -347, -278, 301, -255, -51, 132, -105, 308, 231, -87, -50, 113, -2, -14, -286, 162, 155, -251, 171, 138, -390, 197, 161, -167, 186, -75, 10, 7, -95, 268, 34, -232, 144, -175, 109, 584, -418, 12, 274, -467, 213, 48, -722, -65, 177, -196, 241]
5420B41q8m83N32j83L6P4j30J21m9N2J50m74N28l20l86P16j78n18P40oo46M21
5442A50M5l98K16p3m1J11k36M37l60L9L37n02L19M04n35k12N61n73J56M21j33
5463A33k5J12n12M44K5m72L27j04K38j27k94O99m85l21P44q13K98M56o07K70M72
5484D58q01M46O5p95M00K61m14N33k34%N33q00J99L53k82J77l07R2M29l77j41
5505b05M57n97L44K47m61L53k00J15J38m33K13K87o86N17J04m55O25n8p19P83
5525C69l83l50O18k50j93N02k63j15R7n2J69j42L03k44m39N64o0n14N71p9m77
5546c68M50R8m70O02m23jM91l37l57O88n17K21k78M1L90m31J43M46m23k5K84l03
5568g9o7L79l95P2L62n95N33l09o9J50Q8k2M9j01L32l93O4K75l36m5M58o82J42
$$ y = [241, 153, -330, 202, 19, 55, 129, -1, 120, 71, 123, 273, -201, 327, 7, -379, 337, 159, -359, 381, 375, -271, 150, 195, -203, 13, -60, -101, 10, -226, 211, -149, -110, 227, -275, 44, 448, -87, -299, 262, -311, -155, 266, 133, 108, 220, -292, 152, 177, -295, 32, -72, 166, 39, -255, 444, -41, -362, 382, -431, -133, 323, -284, -14, 458, -343, 103, 168, -627, -227, 34, -380, 153, -81, -81, 452, -348, -149, 204, -78, 99, -208, -116, 313, -64, -205, 252, -345, -1, 246, -215, 138, -62, 53, 191, -242, -29, 258, -428, 89, 193, -262, 363, 305, -414, 369, -14, -364, 254, 4, -189, 313, 50, -65, 32, -20, 149, 7, 310, 66, -373, 191, 131, -383, 188, 109, -368, 82, 180, -290, 312, -111, -112, 379, 42, -315, 373, -144, 77, -201, -160, 230, -201, -58, 388, -35, -60, 224, -79, -146, 233, -162, -90, 272, -323, 210, -99, -168, -18, 70, 48, 97, -4, 328, -65, -1, 274, -62, -107, 351, -331, -189]
5591a89O85r15L46J18o07P66R3o29L80L02l76L69k56n5k9j90K54k16J8J20l27
5612c38J9L46l15K51Q9j08R7m4J71N9m15L34K8l29J71N7n54O64N4m78K80N8k36
5635a39K26l5j15K82k29l17J87N22m56k16L17K23m04L36m1l15M91j18m02L76J03
5656B76l74O15l40m46M84j06k94K52Q8k31K77m87N39j72m16O85l30j34J29l00
5676b85J01L12k44L74J05p21N2N04l03J59j80J05j7K07j79j29K36m6n05N74K12
5697C32m47k16N13m56N14R6p82O53R0o65M69q6j29K2l02N12k24K17j16k4j05M39
5719C05m53O2J64l21J88M7N0J45k36p5K93k16J2J40j43j88L35l46K58K28l91K37
5741I5k34J2J34J76m16M14J2m08K79m2j09J70l50M44k33j9n4qL27O0m46M83j47
$$ y = [-189, 496, -419, -73, 45, -562, 204, 297, -332, 48, 350, -26, 343, 87, 32, 3, -187, 67, -149, -131, -11, -338, -319, 27, -288, -37, 52, -56, 41, -3, 168, 227, -188, 146, 174, -155, 16, 73, -481, 183, 237, -241, 39, 97, -139, 87, 52, -63, 219, -10, -327, -140, 382, -74, -290, 27, 250, -154, 182, 141, -174, 317, 199, -203, 173, 276, -98, 517, 177, -269, 215, 109, -185, 67, 155, -76, 201, -286, 253, 81, -335, 350, 20, -114, 15, -285, -184, 128, -116, 258, 363, -358, -306, 198, -105, 54, -126, -21, -38, 169, -10, -139, 97, 51, -454, 120, 332, -115, -331, 182, -274, 240, 336, -446, 207, 297, -368, 101, 15, -114, -92, -394, 118, -106, 111, -5, -29, -134, 305, -148, -86, 78, -243, -55, -8, 42, 187, -49, -124, 169, -47, -35, 105, -38, -226, 109, -237, 21, 249, -142, 95, -139, -127, 7, 183, -233, 181, 193, -215, 64, 22, -87, 83, -267, 177, -56, -75, -129, -137, 190, 250, -196, 287, 140]
5764A40n02K81K27k13M74m37k33L11N8KJ0j78Q4O9k01R8j22k6L82l85K67P4m93
5787c13M61r4j92K96j52k30L49k70j8mK70K24n39K24K46m05J60J15l66L15J28
5808B05n66M66J63n90N88k41q1K86m8k12L3j6%j0J5J80j69k3M31o00J62K45o44
5831d26N40p2l68L39l03l4L13j43Q3K31m18L92K35o64J72R4j03L57j42j76K27
5852A34j66j25N13o20Q6O26o65J17J61k08L70k63P9J02m43L72r2r6L46L0o92O03
5874A69j98l08O87l99k05M20l59J48K74q4j07L12n16K01k8K47j67l05J63L6j69
5895a88L59k00k22N20O1l54R4J18l27M95m25Q1k20K6Q7J60j42Q7r2J54Q2m15O59
5918C98k71l77K41O5k63K07l4p6J51j15k9J52j11k48j3L19j3j74M32q0k69J8J43
$$ y = [140, -362, -81, 146, -67, 407, -30, -263, 48, 106, 108, 118, -60, 24, 93, -108, -10, -132, -158, 224, -161, 106, 180, -313, 148, 54, -138, 158, 6, -224, 125, -145, -163, -167, 103, 327, -212, 12, 258, -147, 13, 128, -238, 77, 205, -361, 105, 268, -322, 266, 25, -56, 230, 182, -30, 3, -13, -13, -23, -8, 172, 3, -20, 411, -189, -27, 218, -426, 114, 42, -326, 13, -290, -324, -11, -154, -71, 160, -258, 134, 369, -295, -123, -29, -132, 225, 83, -93, 134, -32, -157, 356, -264, -178, 448, -217, -100, 61, -147, 223, -40, 39, 141, -302, 70, -22, -118, 228, 258, -434, 169, -29, -337, 350, -49, -254, 166, -193, -45, 229, 145, 38, 350, -166, 35, 7, 254, 87, -218, -55, -19, -188, 171, -29, -251, 269, 330, -24, 70, 188, -139, 356, -69, 12, -208, -182, -95, 65, -77, 10, -82, 72, 154, -261, 398, 127, -250, -9, 56, -207, 0, -34, -110, 41, -74, -103, 49, -62, -310, -323, -4, -17, -191, 241, 161, -108, -90, 53]
5941E3l05M14j76k30N15m21j8L55J4k96L16m14K22n9k12K86ql20K15K13K8J0j70
5964A2j63J69R9j53PK7o5L05k16l6K2j39k9M4J99k06QK61k32k11L42j7q6J85j72
5989d5m6J30L2j37r2K21k78j40L52K49l43l4J65k63M51k31k33L50k09M9L18m61
6011a95K75N0j71K0NJ04Rj60J15M8q8k6K9k24L35J37n95M72j82k44N59M6o05J87
6035i9K00k23RQ1pj24L00L5l18J61J87l18L9K90l22K85n4j41K0O7j74J47q5l3
6059g7K47j94K02k26o3L65l44j76L29j12l28N02l9rJ43l85M6K45k51L16k38J83
6081A36k09J61k9j04j46M66m68L5M37l14j79L65k20n5J21k00J16M57o01K04J14
6102H7lM1Qp1O5k24K28j55P7l5k38K48R0j86l34P66m91K25P9k84K42mm3J33k02
$$ y = [53, -252, 162, -14, -244, 271, -150, -168, 187, 201, -95, 221, -193, 29, -30, -242, 44, 36, -284, -69, 144, 172, 182, 12, -151, 18, 117, -36, -29, -2, -67, 238, 22, -14, 8, -131, -160, -116, 83, -123, -115, 146, -86, -297, 45, 28, -58, 127, -45, -91, 39, 71, -66, -158, 63, -215, -355, -3, 246, -97, -131, 34, -229, 222, -9, -242, 108, -101, -52, 266, -195, 80, 130, -41, -21, -16, 88, 97, -63, 52, 100, 12, -14, 15, -209, 126, 263, -332, 140, -42, -286, 273, 319, -286, -99, 101, -122, -113, -32, -39, -163, 137, 172, -146, 15, 202, -116, -77, 213, -109, 176, 122, -19, 1, 68, -106, 41, -44, -77, 170, -24, 178, -48, -111, 254, -90, -266, 63, -49, -377, 125, 86, 77, 220, -165, -119, 126, -125, 191, -47, 136, -73, 88, 59, -45, -191, 275, -193, -158, 279, -35, -214, 151, -69, -124, -3, -203, -87, 370, -231, -27, 87, 84, 125, 133, 62, 127, -97, 131, -24, 53, 18, -220, 28, 118, -68, -402, 364, -127, 98, 177, -107, 135, 131, 88, 221, 19]
6127A9L08j61j46K91m3o01M27J32n84K48M02l49P3N6N6j4l31J07K77l23k3J33
6149d6J05Q9k41O1K53n39K53Q8k67L61qk78J65J23j35J23j54k03M97l74J53q2
6171e6M1J28j22l7J76j55M2P4j24j55L83m14K49o8J11k3k04J49O4p9j12K17l1
6194E4J60m49R0K05M7k07L79k98p1K80k87J28J71q6j24J31j62m2K06j68o3q6l
6217a95L55l89J98P1j75K93k22Q6N2l38M26Q9q3k20J76q8M8k79l6M37j90j01k2
6240a07j48K70j99Q7J55J28l26L13j50j03J46k34N9J51l4J95k49J61rP6j72O9
6262G9p3KP3j1M9L9m77M80k30j48L94n2j19j20R0K47l18J02J6J49m06K01k2k02
6286b57L24k29J06J45j49k7K76k13r5J88M1J31k49N0m1j52J41K27k59J52l81M5
$$ y = [19, 327, 166, 20, 311, 268, -333, 94, 226, -358, -110, 292, -57, 16, 72, 128, 114, -217, -110, 167, -156, -179, -46, 59, 148, -93, -32, 221, -318, -65, 23, -244, 117, 109, -169, -4, 119, -16, 107, -47, -250, 247, -127, 26, -56, -15, 113, -9, -46, 130, -25, 17, 91, -33, -188, 195, -219, 30, -38, 73, 50, -154, -5, 59, -20, -132, 85, 54, 214, -235, -145, 60, 107, -100, 279, -19, -90, 190, -97, 31, 202, 116, -8, 123, -39, -81, 125, -43, -106, -192, -195, 160, -229, -31, 40, -135, 158, -64, 22, 74, -264, 162, 251, 168, -52, 124, 36, 84, -195, -231, 206, 16, -85, -107, -255, 15, -184, -97, 58, 186, -140, 173, 23, -80, 66, -168, -109, 42, 8, 203, -46, 115, 106, 182, 10, 79, 6, 8, 81, 70, 119, 158, -319, 161, -69, -217, 177, 125, 6, -114, -24, 223, -95, 7, 23, 172, -234, -33, -55, -257, 67, -162, -56, 89, -60, -87, 189, -24, -119, 69, 110, 241, -8, 42, 1, -151, -10, 217, -42, 110, -271, -226]
6308b26K31q9k86M09j81k8P1Q7J47l0k07J45N4k48R9K9K20K0k66J95j26m4K53
6331B29m80J42J73j86J8K73j55j01K29j97J80j12n1J46l9O3j51k8J37p5m00M97
6353A12p2m15O64l33j8K49k90M7J54J05k82L3p1K9K0J93j42k33K50L96m53J68
6375A11J11m13J73q0N7j78R4K99J0m77J13K65k27J01KJ21k11P1m3j96M84l27M00
6398B60l73K77k19k70M09r0R1J79j25j54K58k71K32m42L63l6l87J78K25j75m0
6419a10J04J13j73L31j32P7m9k31n9J87k20K57J89l99kJ46N7k25L2p8R6j6J85
6442H0k23J23L1j87L0K46j75L7J5oj85k6L85k85L10NN9k88J11j2k0J46l1k79K43
6467A04j78pJ99j54O4J59k65L37j97M6j01K3J99j97J15K9j40k48J74N8l70M55
$$ y = [-226, 5, -84, -370, 39, -142, -170, -99, -12, 135, 105, -102, 43, 97, -151, -52, -23, 197, 217, -49, 146, 20, -24, 229, -251, -109, 64, -122, -104, 169, 14, -87, 142, -55, 125, 13, -38, 108, 69, 132, -19, -47, 90, 15, -385, 112, 40, -375, 289, -44, -62, 187, -103, -56, 98, 203, -79, -46, -117, -88, -68, 125, -17, -250, 0, 396, -57, 111, 222, -191, -18, -98, -41, -219, -125, 174, 184, -293, -180, 85, -142, -41, -39, 82, -129, -58, -101, -297, 187, -140, 260, -113, 164, -55, -325, 84, -6, 85, 264, 139, -15, 243, -28, 204, -238, 125, 89, -298, -120, 105, -70, -110, -6, 107, -66, 265, 133, 210, 161, -70, -129, 58, -162, 95, 284, -115, -117, 29, 86, -139, -107, -185, -89, -105, 80, -143, -20, 11, -176, -146, 100, -75, -38, -23, -29, -214, -240, 145, -140, 170, 175, 234, -54, 57, 45, 25, 171, 140, -139, 104, -74, -81, 118, -36, 28, 187, -78, 259, 62, 108, 7, 30, 229, 32, 147, 176, 36, -212, -38, 20, -350, 105]
6489A05j52o2J85k66K84k19L0J41o6j57K39j04K48J36l32kL7j67K34Jr9K83l1
6512B66m56K63j42K13k33j97M66k45j6R1q7l5J85j21K53J21m04j03K74j58p2J79
6534D2l25J54l3J19l8J15K6j60K6R8j99J85K36l92K60j00M2k47L73j32m0J77k88
6557a01J92RJ29j26k16ML53l21K84k75J95P1k37oL7j02o6J30J80K2k11k9m8J49
6581A7j85J87n5O1O5j47J8K40j09k33Q2j78N71l12j6K7q5J04m5r6J39J2j06m4
6605h8M2M7L32l48q0L17k67j33K47j11K9J92k65J92j74K45Kl30L2L86k24J09k27
6628g5p8K83j99n7J29O7j80K99l14j2K50k96R6J42Q1n5p0Mj18q1M07k77P6m4j18
6653a40K41Q9k10l4J89p2j46Pj15J06P2k34J40J7K13o8K4k03k0J81K54j29k06
$$ y = [105, -47, -109, 76, -190, 94, -125, -95, 46, -20, -177, 62, -42, 206, 342, 10, 8, 45, -122, 112, 113, 14, 297, 266, -190, 73, -69, 144, -89, -286, 180, -65, -81, 10, -77, -112, 73, -48, 205, 326, -78, -181, 93, -65, -137, 42, -283, -129, -162, -43, -81, 34, 60, -100, -74, 24, -175, 10, 246, -146, 114, 14, 56, -191, 182, 50, 10, 187, -101, 91, 100, 229, 103, -113, -109, 244, -77, 207, -68, 127, 198, -39, -45, -8, -110, -176, -46, 134, 156, -55, -84, -132, 17, -168, 19, -36, 25, 90, -57, -39, 201, 92, -141, -59, -237, 334, 22, 6, 33, -52, 52, 7, -89, 50, 62, -44, -88, -46, 1, 333, -15, -95, 222, -45, -178, 69, -42, -13, 179, -86, 106, -68, 177, 179, -151, -119, 267, 43, 152, -75, -153, 130, -69, -126, 3, 70, -110, 189, -125, -137, 113, -183, -87, 55, 136, 81, 11, 15, -103, -184, 223, -54, 22, -22, -140, 101, 190, -20, -54, 135, 63, -83, -76, -191, -85, -13, -247, -107, -90, 123, 55, 79, -124, -144, 37, 291, 162, -44]
6676d4l8N4n6N3k37K94J73j07l05J85j28L72j66k16K12Q3l8j95L29j81N7m1Q0
6699A40k10j4J79p2l5M0j70OL27j17J31j82n2n5J35k94L13p0k26J47J50n3N3j26
6723e5L07l62Q8J03k30L0J17R8k21J76j24K70k77J60m2k31K47J27k97J99K0j57
6745e4l9L53j18p8r9j21j24M02m04Q9K75j95K08Q5r2l11J41J74L8q1J64m91M18
6768A40K10o50L24J19j44j1K13n10L44j17%Q7O8k1RJ02j19j06M7J32j92J71M3
6791A39k10j0K56k00K7q0j33J81j94O5J8M0L34k23p1Pm9J95J3N6l31L55k50N2
6815a3R6j30p3Q6k93L55q5nJ45j5k08J82k13N7o9J54r3n2J05L0L1k0J06k39L44
6840A83j32M6k03J80o6k2K15k95R3L3L7K6k3k23j27L58j62P3j79K97M9l20K66
$$ y = [-44, -82, -28, -84, -31, -268, 26, 199, 92, -213, -28, -156, 216, 50, -166, 46, 129, 91, -104, 225, 44, 101, 60, 140, -70, -84, 95, 23, -12, 28, -142, -136, 191, 74, 205, 23, -29, -84, 51, -243, 70, 0, -226, -79, 71, 18, 71, -55, 252, -110, -22, 81, -149, -119, -2, 96, -125, 51, -73, 197, -80, 80, 38, -193, 54, 181, -116, 83, 103, -54, -93, 260, 142, 64, -35, -156, -280, 122, -282, -193, 82, -113, 95, 180, 88, -223, -82, 92, 130, 49, 213, -278, 140, 350, -300, 24, 143, -1, -12, 201, -309, 35, -82, -82, 5, 73, 52, 61, 163, 44, -62, -15, 117, -75, 96, 139, -71, -81, 175, -25, 2, -78, -211, -30, -224, -159, -141, -101, 233, 10, -61, -54, -103, 92, 105, 161, -170, 185, -65, -13, 83, -47, -120, -34, -327, 28, -57, -62, 83, 68, -140, 42, -171, -114, -183, -29, -122, -174, -69, -39, -8, -28, 78, -161, 183, 51, 97, -106, 74, 8, -14, 201, -94, -1, 32, 69, 95, 72, -151, -278, 80, -82, -9, -188, 109, 158, -162, 104]
6863A04k11J75k00M77l10J13j5j81k3l1K39j69M2J47k17K33j46j40J33L3k40J92
6885Ej43K7J8L3J01n4J36k15J52oJ9l17M55k55q6o8K42J77l39J04J48J10m50L83
6909A77k42O2q4J05j77M11k48n9N0o6J23R0l17J82J89m13K61k2j49o4K90n8j97
6932a56K40q5Pl7j40N3L99l33J53m04J98Q1R8QR8j61L22k23l4m9p7L46l35J36
6956A05o0j5k60M38l17J05N6l93K56K40q6q6m5qM11m25p7R1L45m10J05p4j8K04
6980H2j12l8O6l1J05l36K14l7j59K88m2r7J72l2j66K53j40Nj01K0q4J62J8j39
7004a29K36jq9r2M7K11l72J88N0j18N4q5J57j06J21J43l45Q6j62K45O9p0p5j0
7028d7pR2q5K86l36K40k10j21K15j0J9l7Q5n3L2j92R7M7n5K09j65j42L03k45J99
$$ y = [104, -107, 68, -132, 345, 35, 148, 133, -48, -71, -102, 137, -32, 10, 157, -60, 173, 27, -113, 20, 53, -187, 5, -138, -111, -93, -60, 41, -13, 123, -92, 60, 54, 73, -244, 211, -44, -130, -198, 44, 221, -118, -14, 134, 244, -206, 177, -65, -3, -87, 18, -159, 252, 4, -55, -5, -71, 52, 142, -175, 7, 196, -217, 44, 22, -127, -191, 99, 41, -156, 84, -1, 6, -31, -171, -118, 281, -52, 101, -303, -105, -24, 74, 82, 180, 19, 341, 118, 84, 35, -42, 304, -31, 105, 45, 30, -230, 208, -109, -4, 52, -341, -85, 155, 69, -17, -62, -70, 341, -84, -161, -70, 275, -135, -30, -104, -122, 82, -30, -68, -2, -33, 72, -264, -50, -87, -246, 42, 0, -97, 75, 43, -123, 130, -10, -5, -106, -86, -170, -8, 10, -129, 107, 106, 17, -75, -28, 183, -189, -1, 49, -69, -15, -100, 57, -49, 72, 215, -130, -44, -206, 39, 108, 38, -37, -47, -54, 38, -47, 239, -97, 143, -67, -188, 27, 17, 36, -1, 84, 31, 63, -129, -32, 15, -40, 169, 4, -138, 165, -80, 119]
7053A19K41n31K37J33k66J19J61l00L1J74l08N2R1J73l1p6J50j43Nk2o5M8j14
7076a22K11k81J57R5k24M52m03K04j68K19j73J00Qr1J6j01K65m53L68j22O9P1
7098I7j93j23L36k70j3K33p7j45J19kr1J11j39J35j60L29l99J64k08J27p2J47
7120i4Q7K1J60k36l7J40r6O6J19R1k37j62L04k12J84m07N27r8j68J87q6K90l13
7143C0K1J07k52l1Q7K7J76j84mM0O1o6L29l94m1M39k80k48K04j50J78K6Q5k06
7167d6J87o5q8j13K94q6j35L3J23k08J08j4j9j16L54j55j40J77j05M5J44m6j74
7190d5j77K19j55J62J76l37p3K63k67Q9K27k10J55o7K41J07m38o3M64k99p4K48
7212A46k14Q9rk84J94j06JQ0JK8K19j61Lj06J21LO1mQ6QJ66k37k33K98n4o6k24
$$ y = [119, 360, -171, 66, 199, -67, 52, 213, -87, -56, 118, -190, -138, -47, 126, 95, 19, 169, 26, 31, 9, -56, -8, -122, 89, -192, -35, 60, -164, 288, -115, 89, -79, 140, -33, 67, 75, -16, 0, -101, 164, -289, 79, -43, 26, 97, -96, -219, 117, -153, -166, 67, -10, -155, -36, -38, -129, -18, -157, -22, -182, 147, -252, -88, -296, -169, -241, -94, -7, 14, 174, -62, -99, 41, -55, 11, 130, 221, -16, -178, 126, -86, 98, -309, 218, 120, -48, 139, 53, 343, 30, 51, 158, -94, -125, -38, -11, 165, -19, -23, 17, 78, 12, 341, -53, -94, 345, 65, -183, 21, -129, 49, 75, 160, -46, 141, 76, -12, -125, 169, 83, -52, -19, 104, -104, 4, -10, -29, -145, 209, 54, -86, 91, -14, 31, 175, 129, -45, -222, -3, -158, 4, 180, -157, -230, 33, -234, -145, 82, -128, 27, -40, 201, 308, -130, -193, 271, -28, -102, 146, -68, 21, 12, -272, -78, -184, -183, -103, -102, -74, 145, -16, -13, -119, 2, 5, 66, 62, 148, 156, 322, 85, -148, 150, 96, 30, -194]
7239a94K38k1j10j70L87j0l68J77J43j75L2J44Kj26Q8J6k0n0J47J03r7n8k05P2
7263e5rr5J90K10l70k0J37L3j29j0K80q0k09J57j91J95N8m22M60l88J91J5J67
7286A15k01j03L77k77P0J65k68k09L47J65k44O5k38Q0R7k37K86p7J6j10N7N5j21
7309a90L3J30M91n78L75l44j0J96l72K39K65k50M2j83J50nJ44j73p8J02L9R9k14
7332i2k6L99l53K37k26j18N27l44j23N59l48l50R0J73LJ3j07J07P5j97J45n4j91
7355b01L94m04L29L95o44K88N8j97J18j5k75j17rK25L4p6J40N7k9M2O0j60J54
7378A67m07L57j05l49R4J88J07l24L67k53K07Ll00K19j3R3j33j43K52J8Nj99M
7401a45K0M1O7m4Q0jQo0R6k88K16k2K05j06j72J06j33J0Qo5O5K50m16L27k0k61
$$ y = [-194, 44, 23, -87, -257, 130, 120, -248, -71, 72, -103, -71, 73, 75, -51, 37, 53, 33, -17, 130, 233, 136, 78, -127, -55, -64, -159, 31, 241, -129, -149, -12, 21, -108, -118, 162, 82, -127, 30, -161, 34, 92, -330, 130, -258, -67, -52, 115, -86, -189, 188, -89, -19, 146, -122, -331, 16, 181, -63, 2, -236, -156, -59, -296, -10, -87, -71, -181, -124, -69, -190, -157, -27, 464, -114, 261, -83, -93, 103, -269, -30, 235, -15, 27, -156, -6, -11, 133, -40, -118, -16, 23, 122, -92, -118, 281, -72, 165, -61, -179, 348, 4, -119, 440, 92, -258, -168, 5, 8, 21, -86, 21, 96, -101, 44, -10, -201, 193, -211, 118, 513, -131, 157, 215, 18, 136, 121, -154, -271, -280, -55, -21, -97, 43, 100, 71, 113, 173, 13, 167, -240, 117, 12, -337, -243, -55, 52, -272, 95, -158, 49, 52, -248, -29, -42, 51, -82, -225, 27, 45, 50, -149, -145, -125, -84, -17, -61, 19, 18, 26, -34, 62, -226, -10, -32, 173, 67, -105, 1, -132, -122, -114, -179, -114, 136, -280, 47, 27, -234]
7427b34K33j00M2J17M8k63J76l8j28L31j23j39J14J11k94l2K99J10k91P4L1j75
7449a31J51j47K88k77K09k29K52j61j66R2K92J12j95p3N5o6L20q7k07K22k42l5
7471b3L0j27O0K10k10J09J51l78q2K37l4L6j24J8J52l72J36J71q1J5L99l94J06
7494ER3m21L19j84L17r9j71J73J1k67L57k85nM4J64qp1k3j45J04j23L90j01q7
7518a3L2k8j27n0M88k52n3j06M5J69o%j67J06K3r4l7K13l39J51J48q7k8Jn6J24
7544E7l77M00j73k0O8rl47M26L7q3J17m1m25O30j70k80K45n2K3l5j5j9j20K77
7568A14l52J91q2K56l21j25M49J0j07J16l71J55o5K3Q5N9j61J37k18L98j20j94
7590a23J77j82J19j1M1mm2j11L22j72M0kJj00J36m6J31k19o1J80o8J17M2j57Q5
$$ y = [-234, -1, -101, -59, 58, 106, -157, 19, -19, -147, 184, 61, -78, 36, 147, -147, -179, 120, 230, -61, 13, 44, -131, 20, -127, 161, -116, 93, -136, 116, -45, -211, -119, 173, 285, 90, 17, 72, 6, 326, 239, 32, 254, 12, -23, 7, -120, -60, 150, -60, 49, 200, -178, -260, -23, -57, -21, -145, -127, 25, -347, -211, -40, -121, -106, 293, -101, 5, 98, -323, -4, -188, 129, 30, -141, 32, 43, -224, 133, -152, -157, -113, 51, 43, -28, -51, -196, -92, -215, 175, 74, -13, 19, -9, -136, -186, 302, 50, -3, -109, -64, 105, 99, 99, -68, 38, 61, -33, -70, 143, -196, -45, 103, 16, -12, -11, -67, 57, -320, 80, -93, -113, -45, -54, -401, 25, 62, -21, 96, 55, -370, 260, 90, -190, 55, 3, 26, -9, -24, -43, -163, 114, -238, -47, -129, 127, -194, -319, 130, 140, 33, 149, -222, -67, -132, -109, -24, 35, -126, 11, -207, 191, 71, -123, 54, -128, -9, -20, 21, 17, -25, -136, 186, 14, 54, 52, 53, -47, 89, 43, 174, -45, -106, 74, 6, 123, 165, 8, 93]
7615I3J34k28j31J76j51K72L3m19J36L42k23J32k57K12p1k13J5J34q0J1J5p4M5
7638i7J76k61N37j32k01j02J39J5O4m2k18J21J32K7P0l85J11J55j83J31m9o8Q5
7661B5J61J05k87O3q5qJ66L7l34K76P3m18L08K49k77n2j98R1L76k07M2j07NN6
7685F0j34n1L30k15L4J45p7k86J67J82j57J12j22K8j13K06K03k85lJ51k76K90
7707A89m8k26M1J64l74M98r3k50K04k17R2N6k03L1j25L16K0m8K4K9j96Q2N0j11
7731i5k91M97j71j2K6J53l24K32J19l53K80j91K69j63J59j89K78k9k69o0m1R3
7753h2J91J29j93K09k57q5K79r7k95O8L8N1n4K39j22k5N8p3Q4J2j07k62L17J04
7777A27k10o1L69l93J46q6n5K99j62J07Lj50k3J59j70J72p7k4l7J02j19K84k81
$$ y = [93, 227, -1, -132, 44, -107, 165, 198, -221, -85, 257, 34, 166, -91, 121, 50, -163, -148, -14, -94, -83, -68, -142, -97, 79, -182, 355, 223, 22, -80, 59, 74, 138, 96, -122, -1, 131, 158, 228, -157, -46, 109, -74, 57, 8, -60, 25, 186, 291, 4, 67, -18, -26, 140, 177, -157, 119, 192, -226, 82, 331, 54, 2, -196, -105, 271, 64, 106, -1, 4, 60, -74, -125, 205, -10, 24, 169, 92, -194, -27, 155, -2, 110, -12, 16, -97, 109, 312, 27, 24, 175, -101, 189, 141, -85, -44, 120, -254, 244, 151, -99, 105, -112, -20, 36, -167, -136, -261, 55, 75, 27, 51, 80, -116, -34, 16, -95, -386, 111, -60, -72, -46, 107, -217, 15, 134, -219, 61, -130, 139, -24, 135, -54, 224, 195, -74, -134, -175, -82, 109, 238, 45, 254, -3, -88, 191, 94, -201, -133, -95, -44, -98, 141, 19, -6, 52, -21, 63, 75, -32, -294, 23, 127, -83, -144, 225, -168, -22, -108, -163, 136, -26, 81, 84, -66, -89, 70, -100, 72, -5, -29, -66, 36, -83, 201, -80]
7800h0J72k55K28k20J7K63m2Q4l79J07l5J13Mj41L62r5k06K23j36J33k30J15J50
7823A52j69j55K31j88M2K23j15o3K8p6J41q9o4J71J13k33J08Qj18R6j01N4n1J33
7847G8K98l71m8J46k20J01j2l3k80K05j1K76j84q5o2M0r0K29J19j52K51l43L53
7870B05q7p2K10j71j75L26m31K74J08k45L38l45j00N5J71o3L10qk50j1j8O6Nn2
7894D0r4j06L40j29J6j02J44j48J1O7j41J38n6k08K78j29K93k83N9N2J93lk38
7917fR7m6K8Qpj06j03J79J82k13lL7j95J12J63k19qK63q9nj51m6J19k0q3L49o30
7944c93N16J96n01L11k24J9K1P7j54J27k92K11J36j63J14L32l85K42n8j70R1m24
7966c71M22P7%n4%j89L82l70%Rj15J01j82L73J01j51j19K46j79n8K62j0k24J17
$$ y = [-80, 92, -163, 65, -155, -138, 125, 83, 167, -212, -105, -140, -27, -23, -164, 198, 103, -103, 120, -16, 117, -113, 2, 152, -17, -172, 59, -129, -87, 136, 21, -42, -14, -90, 51, -38, -102, 69, 182, -51, 57, 65, -53, 43, -58, -4, -55, 78, 376, 5, -43, 103, -117, -16, -28, -61, -341, -136, -147, 129, -55, -140, -202, -162, -252, -23, 96, -56, 195, -148, 205, 118, 46, 256, 85, -90, 236, -195, 79, 187, -58, 280, -65, -165, -110, 61, -2, 308, 300, 50, 39, 21, 87, 92, 40, -54, -160, 180, 51, 67, -35, 109, -39, -28, 39, -102, 36, -20, -228, 50, -79, 214, -69, -10, 42, 235, 232, -6, 91, 45, 73, 81, 74, -32, -135, 44, 226, 13, 10, 47, -148, -36, 127, -92, -100, 163, 74, 69, -82, -128, -9, -29, -112, 237, -393, 123, 319, -182, 129, -95, -76, -55, 22, -132, -5, -297, -86, 50, -113, 1, 333, -52, 190, 132, -38, 53, -371, 51, 128, 128, 74, 74, -115, 267, -103, -103, -94, -209, -108, -290, 83, 184, 33, -86, 160, -19, -77, 185, 175, -49, 68]
7990F8o8R3q1l9k1K02j84j4K92n85L60Q7j51M6j46P7R5l21O39l04K35k15j91J7
8014a09J25k68L17K05l74K74J11m90K84k9j61J62k6p1J14LP7k74J59L5p6K0L14
8037C22l48K54j92q8r9L19pj62J17R1p4m3m8m6J41j52K81l35L34k03l31K26J85
8060A42Op1L4j03QJ32j12N0R1k52m8J79j83J9M65l56r5K4J08M7j87K47k18qK75
8085A94k07n9J8M0o9k5J39J61qJ17l12J14j02n3J5J40j17M1j92j6L12q8j76j31
8109b64M23J01j86j05R0j20P0j23j97K26J40N1l1k17N1K01k06K08m3O8k59J6J28
8132B2l18J97r8L99k70n2K58j07p6K02k59N7J18Kj66R8k0L7n4K93m45M16l85P0
8156h1J29L8k49L32J1k20Nj15O5J03J70o8j88J59L6r2J44j91R5n0n6j10N6N4k01
$$ y = [68, 0, 93, 12, -27, -48, 154, -30, -44, 248, -337, 23, 110, -41, 5, -141, -64, 31, -290, 349, 45, 280, 65, -126, -109, 16, -252, 65, 270, -104, 170, 281, -209, 75, 46, -115, 47, 21, -50, 64, 67, 144, -130, 29, 64, -12, 8, 322, -26, 228, 36, -52, -151, 168, 161, -1, 116, 207, 133, 90, 42, -4, 137, -15, 266, -69, 265, 62, -269, -43, 142, 148, 77, 111, 8, 16, 148, 36, 86, 177, -75, -123, 56, -127, -108, 357, 1, -94, -70, 38, 85, -102, 145, -73, -81, 194, -13, -72, -54, -14, -83, -108, 31, 192, 184, 301, -11, 103, 1, -52, -37, 103, -14, 27, -165, -181, 131, 43, -133, -264, 159, 260, 74, -31, 59, -61, 9, -114, -311, -85, 55, 106, 75, -142, -91, 110, -96, 112, 69, 137, -122, -106, 22, -296, -99, -197, 202, -68, -120, 138, 31, -45, 157, -102, -45, 73, 75, -91, 7, -13, 24, -30, 263, -182, 234, -151, -81, 48, 86, -163, 169, 180, -40, -35, -150, -85, 18, 188, 120, -68, 91, 127, 35, 179, -12, 83, 33, -23, -133, -77, -23, -224]
8181b24m3J48K19j48L47k40k70J95q4M8
$$ y = [-224, -267, -119, 100, -48, 299, 59, -211, -16, -100, -52]
8191e2
$$ Imaginary data points
##PAGE= N=2
##DATA TABLE= (X++(I..I)), XYDATA
0@%%%%%%qJ6j6J6k4L2m0N6q0J04j28J53j85K24k65L21l84M52n29O17p17Q29r54
29e10J095j255J431j624J836k072K334k622K940l285L661m074M525n020N560o148
45c228O791p494Q261r100J0022j1038J2159j3400J4782j6329J8071k0052K2325
58A1770k4959K8060l1771L6302m1975M9309n9188P3251r4924J32735k16278O90390
70E52722j1583q82007J442705j073538j29050R12355q27313K48329K46178o02156
80a23358N49574l14697l1387M12325o10268K73205Q2871m94154O12787k99288
90E7610j71132N43224o40442K08749M33468p10192N03607J06130o32142N54165
100B53045q3849l21203M87361k20919p6820K59012k35611J17253J06636j74216
$$ y = [0, 0, 0, 0, 0, 0, 0, -8, 8, -8, 8, -16, 16, -24, 32, -48, 56, -72, 81, -104, 120, -145, 176, -208, 244, -285, 332, -385, 444, -510, 585, -670, 761, -863, 973, -1099, 1235, -1387, 1553, -1732, 1929, -2145, 2380, -2640, 2920, -3228, 3563, -3931, 4330, -4770, 5252, -5786, 6373, -7027, 7755, -8574, 9497, -10555, 11770, -13189, 14871, -16900, 19402, -22573, 26736, -32452, 40799, -54125, 78610, -137668, 552722, 541139, -340868, 1101837, 28299, -100751, 811604, -15709, 232620, 478798, -123358, 426216, 111519, 80132, 492457, -117811, 155394, 238265, -255889, 356898, 57610, -113522, 429702, -210740, -1991, 431477, -278715, 224892, 331022, -301120, 253045, 169196, -152007, 335354, 114435, 37615, 296627, 61016, 178269, 284905, 110689]
110A10689J09596k2228j06966R4234N4144o4835K8037O1359j33718J8002R6394
121B44708j54362Q5307K1765j72135J43329p8493l1119J53753k03411J00209J8083
132A27634k33483K65637j40124j24280L12947l48538Q7461K39555m20550L43516
142A09775k660l83077M93086k86718j66676N25959m98832J20828L56782n71080
152c02613L87305R0569m37350M77363k08799j72556L92153l62349J50919J53413
162A68055l43997L64640j71444j40243M11070m21222J45057K49724n22797M11861
172A50704M092m30417N59049k57072k30408N12067m10488J2081L37505l99211
182a52098J63139J08370k46861K03129p3611l2671J19095j69084J38027k4924
$$ y = [110689, 220285, 198057, 91091, 185325, 239469, 174634, 202671, 264030, 130312, 148314, 244708, 90346, 175653, 197418, 25283, 168612, 90119, 59000, 212753, 9342, 109551, 127634, -105849, 159788, 19664, -104616, 208331, -140207, -52746, 186809, -233741, 109775, 107115, -275962, 217124, -69594, -236270, 289689, -209143, -88315, 268467, -302613, 84692, 175261, -262089, 215274, 6475, -166081, 226072, -136277, 14642, 168055, -175942, 188698, 17254, -122989, 288081, -133141, 11916, 261640, -261157, 150704, 154796, -275621, 283428, 26356, -204052, 308015, -102473, -90392, 247113, -152098, 11041, 119411, -127450, 75679, 2068, -30603, 88492, -80592, 57435, 32511]
192C2511j35610K20970j45287m4599J93400j91341N8302J07420j71776J16891
202D0881J2090j12162J10688k8548n3661O9485j5636m1199M2090K3053o8015M1911
214B0977M0986j05165Q2141P440j07555J43835p9127n1501J63035j71983N3490
225c427J16822k17185J60948J5637j82132K15120j07290n5363J75308j89053J00043
236B9428L8739j67222K15406j37849m5721K38252k90026J32790J44547l42558
246a84214L02246l7163k69258L81729k16711r8422L35279l28511R8877J83788
256A67640l27170K45701j6168k03969K73411j79729j4904J88244k36371J49171
266D5856K1762j79972K32393j51084l1539K03259k53748J37882P4862k50375K61076
$$ y = [32511, -103099, 117871, -27416, -72015, 121385, -69956, -11654, 95766, -76010, 40881, 52971, -59191, 51497, 22949, -30712, 38773, 23137, -18062, 24028, 47081, -20934, 20977, 61963, -43202, 38939, 46379, -61176, 82659, 3532, -47969, 115066, -56917, -3427, 113395, -103790, 57158, 72795, -109337, 105783, -1507, -56870, 118438, -70615, 29428, 68167, -99055, 116351, -21498, -67219, 171033, -118993, 13797, 158344, -184214, 118032, 80869, -188389, 193340, -23371, -121793, 213486, -115025, -16148, 167640, -159530, 86171, 70003, -133966, 139445, -40284, -55188, 133056, -103315, 45856, 67618, -112354, 120039, -31045, -62584, 140675, -113073, 24809, 99671, -150704, 110372]
277A10372p3964j67751K89888j91242n2361K33986k25392M7474J35140j73193
287f7043P3077M5592p4447L8728K227K707l0178R061M3595q4099N5552L5538r8760
300d8450Q0430j956o1642O8753k3001k1922J4289k192P016m1753O2439r991p8096
313e6076J26077q1501m3343J60236j64129L7905J15722k06355J49514J8452j73546
324a17044K29880j22696p4769K23767k31586Q0641J31344k62351K05114j1446
334E0854j87371K59774j47138m1260J95155k27450J17032M5714j83102K25925
344A08133j37109n6514K33982k68152J17629J44680l10090K54327j8655k44243
354a76012L13882j55334r6706K62088k35558N2768J42538k15516J55478q353j26304
$$ y = [110372, 36408, -131343, 158545, -32697, -85058, 148928, -76464, -28990, 106150, -67043, 6034, 51626, -22821, 15907, 18134, 20841, -9337, -276, 43319, -40780, 14772, 50310, -48450, 31980, 30024, -31618, 37135, 14134, -7788, 6501, 4309, 11325, -30428, 32011, 22020, -56076, 70001, -11500, -54843, 105393, -58736, -20831, 94891, -111464, 38050, 56502, -117044, 112836, -9860, -84629, 139138, -92448, -11807, 119537, -142814, 62300, 50854, -136517, 123257, -23881, -65141, 130014, -97436, 19596, 65310, -117792, 108133, -28976, -85490, 148492, -119660, -2031, 142649, -167441, 86886, 68231, -176012, 137870, -17464, -114170, 147918, -87640, -34872, 107666, -107850, 47628, 39275, -87029]
365h7029J62570j21740P628J08276j47620J03081L696j07039J40319q1002k0924
376c9784J05853j27344O1632L0568j04441J13865l3948n7289J01491o7609j1296
387b8302O9361n8740J529L5761k5308k5106M3311R970o8599Q0715l396j04393
399g3197J30309l9568r6890J55246q8281m7320J32402j13162L3338N5961r2086
410d3248Q0932n1135j4351Q7763j26915Q4822L0026j45877J69433p2249q0945
421h1744J97719j80118L1363J41523k30952J58754L2885k06163K37335r7385j07305
432a04088K35424j93245K8501J46999k18334J37286K2096j53347J83488r5039
442a0259m0841J47254j55412P6443M3216j33666J48306p9003m8065J53253j62213
$$ y = [-87029, 75541, -46199, -38571, 69705, -77915, 25166, 28862, -78177, 62142, -18860, -39784, 66069, -61275, 357, 30925, -73516, 40349, 6401, -50888, 50603, -17006, -28302, 41059, -17681, -16152, 19609, -5699, -30805, 12506, 22476, -46123, 34592, 31196, -73197, 57112, 17544, -79346, 75900, -12381, -59701, 72701, -40461, -7123, 48838, -43248, 37684, -13451, -27802, 59961, -66954, 17868, 47894, -97983, 71450, -799, -81744, 115975, -64143, -32780, 108743, -122209, 36545, 69430, -136733, 100602, 3217, -104088, 131336, -61909, -33408, 113591, -104743, 32543, 54639, -98708, 84780, -10259, -51100, 96154, -59258, 17185, 60401, -73265, 75041, -3962, -52027, 101226, -60987]
453f0987O2540R6006j92889J48774R745j59101J79220o4175q6014J46712r4481
464a4650j4376Q6221p7889K6460J9090l5057K7497k1678J0572J470j7795K8683
476A8548l0434J0813K1350m0169L3424m421k9324L8420k3457l366J4810j5559
488i365J8970k4649J7386J1819m4076N4583k8452k9853P7244p9139K2790O1912
500D9170j19882R9381L949j22150J60829p3421q0159J74966j33858r237J35295
511H4883j51606O1790N2453j07782R3460m2305j7353P2574j02270P7282M472j02102
523g6504J44995q5853m5900J56633j57852M7063J00357j82162J34078J2027j50450
534a03568J76114p2986p7402J59283j21147N802R0153j10006O2171J855n1258
$$ y = [-60987, 1553, 97559, -95330, 53444, 63189, -95912, 83308, 19133, -66881, 79831, -14650, -29026, 57195, -20694, 5766, 24856, -10201, 17296, -4382, 6190, 7660, -10135, 18548, -11886, -1073, 20277, -19892, 13532, 9111, -20213, 18207, -5250, -8616, 6194, -9365, 9605, -15044, 2342, 14161, -29915, 24668, -3784, -33637, 43607, -35532, -12742, 49170, -70712, 28669, 32618, -89532, 71297, -2124, -82283, 92683, -41175, -50412, 84883, -66723, -4933, 47520, -60262, 33198, -9107, -26460, 46114, -56156, 21126, 25598, -76504, 68491, -17362, -63262, 93371, -64481, -17418, 82939, -99223, 34855, 46882, -103568, 72546, -440, -77842, 81441, -39706, -33904, 56249, -53757, 8414, 10269, -40989]
545d0989P2747o5453J9974M3504q6152P3650j2715n8156Q9377o4970n6O3360q7612
558e3491N7057J5435q3286Q9402k2733n9258Q7086l9172l0911O0748k6682k2256
570b8061L2430N084l4239J9628K8553n3634K7537L3065o9290M9770J5637o4416
582c7936O1387j5383k9901M7295l6077J3568J0089l1774M5638l8941J317M9513
594C8795p6022M9367J3773p3803Q6854m7061k9993R2679r9441L8175N4249j21843
606g4271J09513j6832r9955J49239r1928l5244J37051j38936L9137Q5327j39155
617g6054R1732J0902q8502R9445n4875o468N5075p6896O9924k1241n3044J13438
629F3436r8997M280J09707j47640P4508N9905j49285J24484n844j07293J32087
$$ y = [-40989, 31758, -33695, -13721, 29783, -56369, 17281, 4566, -53590, 35787, -29183, -29239, 34121, -53491, 3566, 19001, -64285, 25117, 2384, -56874, 30212, -8960, -39871, 20877, -5805, -28061, 4369, 9453, -24786, -5158, 23395, -30239, -2702, 30363, -38927, 10843, 26480, -37936, 23451, 8068, -21833, 25462, -10615, 2953, 13042, -18732, 26906, -12035, -10718, 38795, -37227, 12140, 25913, -47890, 38964, -8097, -38090, 54589, -44852, -6677, 47572, -74271, 35242, 18410, -81545, 67694, -24234, -59478, 77573, -61363, -22226, 63101, -76054, 15678, 26580, -61922, 37523, -17352, -23820, 31255, -45641, 24283, 3042, -50002, 63436, -35561, -31281, 78426, -69214, 5294, 65199, -84086, 40398, 34554, -72739, 59348]
640E9348n8142m5033J01537q0557J0340M8761o2793L7309m098j8859K9679l1818
652a4326K2007k59k8815M5682l4473o640M4677n2329K1604K1936m6711L7373k081
665G645k9556L1843q992j5133J7465k14j4082N494K1895l4684Q780M2803o6949
678c3685L2188M0399q7894O4550J5351q5922Q8511k1457n5452Q6789n7224k453
690a6299N2337o8220M7450l851m3263P1366o0650O420O0958r3070O3064J3021
702B9263q4022R9840n0262l5348R6936r5855L3896N2455j10362R7715j4848q5115
714f5707J29393q0854k8258J16551j17806L1280P2284j11867O7637J5854p1872
725d3365P1290l0279j4813L8903m2672L4282j3202k2559N7634n9685J4932N0806
$$ y = [59348, 1206, -43827, 57710, -22847, -12507, 36254, -26539, 10770, 6672, -12187, 17492, -14326, 7681, 7422, -21393, 24289, -10184, -16824, 27853, -24476, -2872, 19064, -27647, 9726, 7645, -21911, 9932, 940, -14193, 3272, 3058, -11024, -5530, 16365, -18319, -9539, 33264, -33685, -1497, 38902, -48992, 15558, 30909, -55013, 33498, 12041, -43411, 43378, -13846, -16299, 36038, -32182, 15268, 11417, -31846, 39520, -21130, -14710, 46248, -46822, 16242, 29263, -54759, 45081, -5181, -40529, 56407, -39448, -5552, 46903, -63459, 34256, 19408, -65707, 63686, -17168, -45426, 71125, -46681, -15401, 56883, -54984, 12653, 28507, -43365, 27925, -2354, -17167, 21736, -20936, 13346, 144, -22415, 35219, -24466, -9534, 41272]
737D1272q5993N5893K3016q6617P8062o524o4521P4752k2325l8694N5182k0669
749B834k3712L2300m232k3121J7423J3708l4393J9134J9625m5266L1863J0932
761A7095m3416L8964o335k5844L5609k2635J268J6150k3605K3053j4480l825K6150
774A8149l7160K5194N253l8709N3340l2988j7582O5165p1551K4132M7997r1187
786d9947O7994R086q2327R2764l3851m6788Q9180o6877K025N6556p1695M1992
798H112O102m2998N5112l9554J572M0220o1342M6606J446n3805P3813m2178k0032
811b6926O8081o8163K3064L5645o8778N5617n556m6593O6807m1710j0881N4064
823C4671n7346J8639K8486m6959K8355M575k4462K1107o497k596J99J003R043
$$ y = [41272, -44721, 11172, 34188, -52429, 25633, 19109, -45412, 29340, 7015, -31679, 23503, 2834, -20878, 11422, 7190, -15931, 1492, 15200, -19193, -59, 19566, -25700, 6163, 17095, -26321, 12643, 6308, -19536, 16073, -6562, -5294, 10856, -12749, 10304, -4176, -8001, 18149, -19011, 6183, 11436, -27273, 26067, -6921, -24503, 40662, -30889, -6757, 41240, -49947, 18047, 27133, -55194, 37570, 3719, -43069, 46111, -20766, -18741, 37815, -33880, 8112, 14214, -28784, 26328, -13226, -11654, 28566, -32776, 13830, 15276, -38529, 35284, -6894, -26926, 41155, -27008, -3944, 31701, -37077, 18540, 12984, -33609, 33198, -8512, -19393, 34671, -22675, -4036, 24450, -22509, 5846, 10421, -14041, 7066, 569, -2027, -1828, -825, 8218]
836H218k2155J9803L529l1535L7687j1636k8406M6506k2969k0101M1335k2911
848b635j1264K5081q120j4177J1298J6600l2008Q575L5697n2639J8489L9805o8079
861c3377L9310K4049o8942N8605l909m7846O0064l0417j4861M3615m1392J6101
873A000J1979k9387L3810k5458K543K7608m7136L7410J06m3155N9854l4319j8030
886b3175N9553o1526K2675L3453p0649O1008n913n6154P6946l9268k6017O8042
898C8975n6327N878L9216m7366K5962J032j7896K5152k6679J7406O150l2732M2427
911B1198k1643k0373N0631m3588M179L6991n0155K7030J2135l9191L5912r195
923C931j8727K8828k1443K611J4049j9379J2371j220o974P149m514L641n300N071
$$ y = [8218, -13937, 5866, 9395, -22140, 15547, 3911, -24495, 22011, -958, -21059, 20276, -2635, -13899, 11182, 3062, -11115, 183, 16783, -15225, -6650, 29047, -23592, -5103, 34702, -33377, 5933, 29982, -38960, 19645, 15736, -32110, 27954, -2463, -17324, 26291, -15101, 1000, 12979, -16408, 17402, -8056, -5513, 22095, -25041, 12369, 12475, -30680, 29174, -5145, -23175, 36378, -25148, -2473, 30980, -39669, 21339, 15426, -40728, 36218, -3050, -29067, 38975, -17352, -11474, 27742, -19624, 6338, 7370, -10526, 14626, -12053, 5353, 11503, -21229, 21198, -445, -20818, 29813, -13775, -9596, 27395, -22760, 4270, 16405, -22786, 13126, 3931, -14796, 14032, -7411, -4800, 9249, -10130, 2241, 1021, -5953, 1196, -3318, 323, -4977, 94]
937I4L803j9291K1904l039k4068L7309k0609j6328M1975l3726j151L2221l2586
950a3492Q669J2919j6963Q793l079Q123q709r054L3308l6491L778M4877o1811
963b9132K6749L4603p3213N3693J1665o6301O7325j8879l8484O0319l7787k831
975a2273L2969l8440K3095l772j5798L4661l7285J5810K0933n2157M7924p059
987H608m0459O1343l8309j3497N3082n5795K2763K7068n8235M8346o858l8859
999c0802N6422l1803j2121M3827m3150J0594K4066l3299K1247p02j3918J5476
1011E837j1898R028j159j0492K1063j9531j463K4891k7316J0035J4779k7959J6678
1024B493N325j6825J3491j59q216L819K773m896N96R393j2002j96J5589k2255
$$ y = [94, 3897, -15394, 6510, 3471, -20597, 16712, -3897, -20225, 21750, -11976, -13127, 19094, -13492, -4823, 8096, -8867, -74, -3153, 4970, -3739, -12793, 20515, -15976, -12198, 32679, -29132, -2383, 32220, -40993, 12700, 24365, -41936, 25389, 6510, -31974, 28345, -9442, -12273, 20696, -17744, 5351, 1579, -14219, 20442, -16843, -1033, 19900, -32257, 15667, 8608, -31851, 29492, -8817, -22314, 30768, -25027, -2264, 24804, -33431, 14915, 8057, -30802, 25620, -6183, -18304, 25523, -17627, -7033, 17033, -16266, 4981, 4279, -9639, 5837, -6061, 2967, 1808, -8684, 12379, -7152, -8615, 16276, -11040, -1005, 13774, -14185, 2493, 7818, -9007, 4484, 4325, -3891, -72, 2701, -2195, -1599, 7794, -4208, -4404, 11185, -11070]
1038a1070J1379J3716l1528K6607j129k9348L8741j7994j5423L8859l6288O438
1050g040K7942m1273K6290N057k9479L2016j7750m046K2846k8727K2179m465k3435
1063a9885M3074l5321m42M4061o0381L0366K5980o6577N7012r43n5685O6695k8047
1076i3k8284N7760m1494P92L1111l6913J9927R35j5273K3746k3871J0618J2074
1089A1035l3175L4681r313k5329M2026k7526p789L4829l4154J0932J8163l2537
1101a8157K2991k54j9001K4544j3203o693J9164j4518j668J3511r822l279J0391
1114D006l409j0429J4416k72j8527K1636l929j9192K6014j0659j2077K3317j5205
1127d310k650J3536j1138M636k412K231L555j5031K0538q648j6758L5737k6865
$$ y = [-11070, 309, 14025, -17503, 9104, 7975, -21373, 17368, -626, -16049, 22810, -13478, -7040, 20902, -20371, 5919, 10976, -18503, 13513, -4237, -8283, 14563, -14164, 8015, 3550, -19885, 23189, -12132, -12574, 31487, -28894, 1472, 27452, -39125, 17887, 16944, -38741, 27954, -93, -28377, 29383, -12111, -11319, 19792, -17121, 2806, 3741, -11532, 12214, -11657, -1039, 11035, -22140, 12541, 3228, -22101, 19925, -7601, -15390, 19439, -14715, -3783, 14380, -18157, 4834, 4580, -14421, 10123, -3080, -9773, 9391, -5127, -6795, 6716, -3106, -6385, 4006, 597, -9832, 4584, 4312, -14215, 7421, 3492, -15700, 10314, -345, -12422, 10895, -4310, -6960, 6576, -4562, 74, -2338, -107, 3448, -11583, 8955, 307, -16451, 19286, -7579]
1140g579p425M0154m2693J1456K9697m9023L2504P416m0106M2975j6796j8236
1152a7656L9468l4521P696K2794l6582K6895k049k2441L2297k2741k24K2227k9802
1165a4639K0286L64k1765L2164k4013j098K8806m0199K4024J2129m2428M1237
1177A4868p018l2422M4685k1935j4892L5927k6744k5J8801j6985M958K328j191
1190C55K88n676J2841j0213n058K1087k0678K282J8338k3468J0284Q936j8109
1203h791J2735q5r087R466m492n89L027l430K139k217M532m580j497J0714j5366
1218g521O966J0300k3995J9908L255k8060L0993q921k0693L4235k0494q374K6951
1231A4550k3077L760J1998j3928Q886n198K563L719j5056K2594j2325j3317L4863
$$ y = [-7579, -15004, 25150, -17543, -6087, 23610, -25413, 7091, 14507, -25599, 17376, 580, -17656, 21812, -12709, -5013, 17781, -18801, 8094, 6045, -16396, 15901, -6840, -7064, 15163, -14639, 5647, 6011, -15754, 16410, -7603, -8701, 20105, -20094, 3930, 16059, -26369, 14868, 7850, -24572, 20113, -1822, -16714, 19213, -7531, -7556, 11245, -5740, -782, 1546, 355, 643, -5033, 7808, -2405, -7463, 13624, -7054, -4772, 13566, -9902, 382, 9318, -8791, 3944, 3859, -5228, 4238, -254, -843, 2184, -1246, 893, -1324, 3208, -1372, -2869, 7845, -7521, -555, 9745, -14250, 5658, 8913, -19147, 11846, 2925, -17768, 16467, -4027, -12401, 14550, -8527, -4767, 7231, -6697, 2189, -3009, -446, 3273, -11783, 10811, -1514, -14831, 20032]
1244B0032l1010n05L5212m2740J6924K2995m5173L2399M353l2715L5037j4138
1256F71j1480K4961k1993Q743P959j8641K0230j2005n060K1742k4543J1644Q626
1269A0854k3627K2657p890j1452K4295k1402M728J3969k6172K1644j167k1109
1281a4672K8348j5554r952K6179k1842J030J9055k0912M388R496r929J240M217
1294A092L89q735O535O451j6818J2247O549k1149J6220K010j7109J8123l987r686
1308g868J2048n342j942L218O79L4m624P868m959n618J6690j4785k43J8302k5717
1323a2259J3220J1159k9112K6592k096k6216L3635j5823j2998L1542k5519J552
1335f323J8579k2853J2254K353j0136J1497j1633P488K315j5560K4497j5933j0054
$$ y = [20032, -10978, -11483, 23729, -19011, -2087, 20908, -24265, 8134, 12487, -20228, 14809, 671, -10809, 14152, -7841, 902, 8861, -9780, 10450, -1555, -6615, 15127, -9416, 2228, 10854, -12773, 9884, 1994, -9458, 14837, -6565, -1837, 12132, -14040, 7604, 6437, -14672, 13676, -1878, -11830, 14349, -7493, -6463, 12592, -8320, -3932, 5564, -4365, -3125, 1092, 1481, -7254, -719, 5732, -11086, 1161, 7710, -13439, 2781, 4791, -12318, 5805, 1818, -7868, 4180, -1162, -3104, 114, 793, 827, -3797, 4071, -888, -6506, 10184, -4601, -4844, 13458, -12259, 961, 12120, -16992, 9600, 7504, -18712, 14923, -900, -13898, 17644, -7875, -6323, 12256, -10597, 1657, 4010, -6126, 5371, -6262, 1226, 3541, -12019, 12478, -3455, -13509]
1348a3509L2909l2120M883K9214m0266J8851J7089l8641K8811K271k5751K7231
1360A0972j0567r217J7686j3098M552L497q455J0385r427K144R879j5866J0910
1373C395J647j3812J5403n595o237J1569q577J362L743p226Q071l753k939P908
1387D959q576K284N802p023J609M064k636m208N805K082j1118J1595J470j8455
1401a2346K1257l467j9384K7582j1809j4194K7642j7662m873K1079j8600M273
$$ y = [-13509, 19400, -12720, -7837, 21377, -18889, -38, 17051, -21590, 7221, 9492, -16259, 10972, 405, -8812, 8874, -4224, 328, 3825, -4630, 5755, -3672, -1528, 8351, -7515, 3395, 5042, -8770, 6633, 1038, -5199, 6370, -2207, -845, 2898, -4328, 3743, -10, -2949, 4959, -3617, -1333, 4469, -2554, -945, 3119, 483, -3725, 2080, 4162, -6956, 4639, 6109, -12346, 8911, 5444, -13940, 13642, 1833, -12361, 15281, -2381, -7254, 13825, -4775, -502]
$$ [...]
8191C22
##END NTUPLES=NMR FID
##END=
