##TITLE=1H_MTPA2509
 CDCl3, 8 sc, 
 28.9.2020
##JCAMPDX= 6.0         $$ Bruker NMR JCAMP-DX V2.0
##DATA TYPE= NMR FID
##DATA CLASS= NTUPLES
##ORIGIN= UXNMR, Bruker Analytische Messtechnik GmbH
##OWNER= root
$$ XWIN-NMR		Version 3.5
$$ Mon Sep 28 10:50:56 2020 Russian Standard Time (UT+4h)  she@DPX200
##.OBSERVE FREQUENCY= 200.1315066352
##.OBSERVE NUCLEUS= ^1H
##.DELAY= (6, 6)
##.ACQUISITION MODE= SIMULTANEOUS
##.ACQUISITION SCHEME= undefined
##.AVERAGES= 8
##.DIGITISER RES= 18
##SPECTROMETER/DATA SYSTEM= spect
##.PULSE SEQUENCE= zg30
##.SOLVENT NAME= CDCl3
##.SHIFT REFERENCE= (INTERNAL, CDCl3, 0, 15.7039)
##AUDIT TRAIL= $$ (NUMBER, WHEN, WHO, WHERE, WHAT)
$$ ##TITLE= Audit trail, XWIN-NMR		Version 3.5
$$ ##JCAMPDX= 5.01
$$ ##ORIGIN= Bruker BioSpin GmbH
$$ ##OWNER= she
$$ F:/spectra/data/she/nmr/H-F/1/audita.txt
$$ ##AUDIT TRAIL=  $$ (NUMBER, WHEN, WHO, WHERE, WHAT)
(   1,<2020-09-28 10:50:00.37 +0400>,<she>,<DPX200>,
      <created by zg, POWCHK disabled, PULCHK disabled
       configuration hash MD5:
       00 E9 B6 7A A2 85 ED C7 34 08 36 98 17 FE 4E 26
       data hash MD5: 16K
       C7 47 00 C2 D1 CB 36 B6 8D 0B DA 37 5A F7 B3 CD>)
$$ ##END=
$$ 
$$ hash MD5
$$ 05 B5 DA 71 19 4F 28 65 07 5D 25 76 C5 F6 2F D4
##$RELAX= 
##$RELAX= 
##$RELAX= 
##$RELAX= 
##$RELAX= 
##$RELAX= 
$$ Bruker specific parameters
$$ --------------------------
##$DU= <F:/spectra>
##$EXPNO= 1
##$NAME= <H-F>
##$PROCNO= 1
##$TYPE= <nmr>
##$USER= <she>
##$AMP= (0..31)
100 100 100 100 100 100 100 100 100 100 100 100 100 100 100 100 100 100 
100 100 100 100 100 100 100 100 100 100 100 100 100 100 
##$AQSEQ= 0
##$AQ_mod= 1
##$AUNM= <au_zg>
##$AUTOPOS= <>
##$BF1= 200.13
##$BF2= 200.13
##$BF3= 200.13
##$BF4= 200.13
##$BF5= 200.13
##$BF6= 200.13
##$BF7= 200.13
##$BF8= 200.13
##$BYTORDA= 1
##$CFDGTYP= 0
##$CFRGTYP= 5
##$CHEMSTR= <none>
##$CNST= (0..31)
1 1 145 1 1 1 1 1 1 1 1 1 1 1 1 1 1 1 1 1 1 1 1 1 1 1 1 1 1 1 1 1 
##$CPDPRG= <>
##$CPDPRG1= <>
##$CPDPRG2= <>
##$CPDPRG3= <>
##$CPDPRG4= <mlev>
##$CPDPRG5= <mlev>
##$CPDPRG6= <mlev>
##$CPDPRG7= <mlev>
##$CPDPRG8= <mlev>
##$CPDPRGB= <>
##$CPDPRGT= <>
##$D= (0..31)
0 1.2 0 0 0 0 0 0 0 0.06 0 0.03 0 0 0 0 0.0002 0 0 0 0 0 0 0 0 0 0 0 0 
0 0 0 
##$DATE= 1601275799
##$DBL= (0..7)
120 120 120 120 120 120 120 120 
##$DBP= (0..7)
150 150 150 150 150 150 150 150 
##$DBP07= 0
##$DBPNAM0= <>
##$DBPNAM1= <>
##$DBPNAM2= <>
##$DBPNAM3= <>
##$DBPNAM4= <>
##$DBPNAM5= <>
##$DBPNAM6= <>
##$DBPNAM7= <>
##$DBPOAL= (0..7)
0.5 0.5 0.5 0.5 0.5 0.5 0.5 0.5 
##$DBPOFFS= (0..7)
0 0 0 0 0 0 0 0 
##$DE= 6
##$DECBNUC= <off>
##$DECIM= 32
##$DECNUC= <off>
##$DECSTAT= 4
##$DIGMOD= 1
##$DIGTYP= 9
##$DL= (0..7)
0 120 120 120 120 120 120 120 
##$DP= (0..7)
150 150 150 150 150 150 150 150 
##$DP07= 0
##$DPNAME0= <>
##$DPNAME1= <>
##$DPNAME2= <>
##$DPNAME3= <>
##$DPNAME4= <>
##$DPNAME5= <>
##$DPNAME6= <>
##$DPNAME7= <>
##$DPOAL= (0..7)
0.5 0.5 0.5 0.5 0.5 0.5 0.5 0.5 
##$DPOFFS= (0..7)
0 0 0 0 0 0 0 0 
##$DQDMODE= 0
##$DR= 18
##$DS= 0
##$DSLIST= <SSSSSSSSSSSSSSS>
$$ [...]
##$SUBNAM2= <"">
##$SUBNAM3= <"">
##$SUBNAM4= <"">
##$SUBNAM5= <"">
##$SUBNAM6= <"">
##$SUBNAM7= <"">
##$SUBNAM8= <"">
##$SUBNAM9= <"">
##$SW= 16.880792210976
##$SWIBOX= (0..15)
0 0 2 0 0 0 0 0 0 0 0 0 0 0 0 0 
##$SW_h= 3378.37837837838
##$TD= 16384
##$TD0= 1
##$TE= 0
##$TE2= 300
##$TE3= 300
##$TEG= 300
##$TL= (0..7)
0 120 120 120 120 120 120 120 
##$TP= (0..7)
150 150 150 150 150 150 150 150 
##$TP07= 0
##$TPNAME0= <>
##$TPNAME1= <>
##$TPNAME2= <>
##$TPNAME3= <>
##$TPNAME4= <>
##$TPNAME5= <>
##$TPNAME6= <>
##$TPNAME7= <>
##$TPOAL= (0..7)
0.5 0.5 0.5 0.5 0.5 0.5 0.5 0.5 
##$TPOFFS= (0..7)
0 0 0 0 0 0 0 0 
##$TUNHIN= 0
##$TUNHOUT= 0
##$TUNXOUT= 0
##$USERA1= <user>
##$USERA2= <user>
##$USERA3= <user>
##$USERA4= <user>
##$USERA5= <user>
##$V9= 5
##$VALIST= <valist>
##$VCLIST= <CCCCCCCCCCCCCCC>
##$VD= 0
##$VDLIST= <DDDDDDDDDDDDDDD>
##$VPLIST= <PPPPPPPPPPPPPPP>
##$VTLIST= <TTTTTTTTTTTTTTT>
##$WBST= 1024
##$WBSW= 4
##$XGAIN= (0..3)
0 0 0 0 
##$XL= 0
##$YL= 0
##$YMAX_a= 912416
##$YMIN_a= -758268
##$ZGOPTNS= <>
##$ZL1= 120
##$ZL2= 120
##$ZL3= 120
##$ZL4= 120
##$ABSF1= 10
##$ABSF2= 0
##$ABSG= 5
##$ABSL= 3
##$ALPHA= 0
##$AQORDER= 0
##$ASSFAC= 0
##$ASSFACI= 0
##$ASSFACX= 0
##$ASSWID= 0
##$AUNMP= <proc_1d>
##$AZFE= 0.1
##$AZFW= 0.1
##$BCFW= 1
##$BC_mod= 2
##$BYTORDP= 1
##$COROFFS= 0
##$CY= 11.3945322036743
##$DATMOD= 1
##$DC= 2
##$DFILT= <>
##$DTYPP= 0
##$F1P= 16.9975609425685
##$F2P= -3.02152046262296
##$FCOR= 0.5
##$FTSIZE= 0
##$FT_mod= 4
##$GAMMA= 1
##$GB= 0.15
##$INTBC= 1
##$INTSCL= 1
##$ISEN= 128
##$LB= 0.24
##$LEV0= 0
##$LPBIN= 0
##$MAXI= 10000
##$MC2= 0
##$MEAN= 0
##$ME_mod= 0
##$MI= 1.114404
##$NCOEF= 0
##$NC_proc= 0
##$NLEV= 6
##$NOISF1= 3.799351
##$NOISF2= 2.8
##$NSP= 1
##$NTH_PI= 0
##$NZP= 0
##$OFFSET= 15.70392
##$PC= 1
##$PHC0= -9970.683
##$PHC1= 13.8009
##$PH_mod= 1
##$PKNL= yes
##$PPARMOD= 0
##$PSCAL= 0
##$PSIGN= 0
##$REVERSE= no
##$SF= 200.130013532006
##$SI= 16384
##$SIGF1= 3
##$SIGF2= 2
##$SINO= 400
##$SIOLD= 16384
##$SREGLST= <1H.CDCl3>
##$SSB= 0
##$STSI= 0
##$STSR= 0
##$SW_p= 3612.71676300578
##$SYMM= 0
##$S_DEV= 0
##$TDeff= 0
##$TDoff= 0
##$TI= <>
##$TILT= no
##$TM1= 0
##$TM2= 0
##$TOPLEV= 0
##$USERP1= <user>
##$USERP2= <user>
##$USERP3= <user>
##$USERP4= <user>
##$USERP5= <user>
##$WDW= 1
##$XDIM= 8192
##$YMAX_p= 0
##$YMIN_p= 0
$$ End of Bruker specific parameters
$$ ---------------------------------
##NTUPLES= NMR FID
##VAR_NAME=  TIME,          FID/REAL,        FID/IMAG
##SYMBOL=    X,             R,               I
##VAR_TYPE=  INDEPENDENT,   DEPENDENT,       DEPENDENT
##VAR_FORM=  AFFN,          ASDF,            ASDF
##VAR_DIM=   8192,          8192,            8192
##UNITS=     SECONDS,       ARBITRARY UNITS, ARBITRARY UNITS
##FACTOR=    0.000296,      1,               1
##FIRST=     0,             0,               0
##LAST=      2.424536,      0,               0
##MIN=       0,             -758268,         0
##MAX=       2.424536,      912416,          0
$$ Real data points
##PAGE= N=1
##DATA TABLE= (X++(R..R)), XYDATA
$$ [...]
2550d717O546Q66p392Q220l218l842Q215p063J259N482q881N786J778q240Q796
2565C595k375n917R250n473k417Q222p940K322M399p554N729j95n737P646m356
2580h01k477Q270q403K125N939r122N139K869q358O933j32o007P391l700j944
2595b278N762o037K123L332o658N358K84n869P261l174l478P323n457p7N198o543
2611b930L446J880n942N933j494m588P353m403j717O574o283J130M667o621L147
2626A52K345n529M674j235k391M573m045R10L271n485L900J410o560O157o74n249
2642c776O733k794k862N775m151m44L924m355K310P69l503M145k187j605N032
2657C011n096R21M212n981K751K718n364M003%l757M271j843j287L513l295Q34
$$ y = [-4717, 1829, 2695, -4697, 3523, 305, -3537, 4678, -2385, -1126, 4356, -4525, 1261, 3039, -5201, 3595, 1220, -4697, 4553, -920, -3337, 4885, -3055, -733, 3666, -3888, 1841, 1646, -4091, 3555, -801, -3278, 4992, -3411, -1286, 4653, -4469, 670, 3539, -4819, 2114, 1982, -4025, 3366, -334, -2278, 3484, -2553, -430, 2902, -3756, 1602, 1886, -3983, 3278, 104, -3374, 3949, -1508, -1585, 3613, -2930, 516, 2396, -3546, 2387, 893, -3695, 3658, -745, -2462, 4112, -2171, -1041, 3626, -2995, 152, 2497, -3032, 1642, 407, -1984, 2589, -1456, -546, 2725, -2760, 1140, 2550, -4010, 2147, 1473, -3776, 2957, 163, -2699, 3076, -1075, -1519, 2405, -1950, 360, 1129, -2374, 1771, -416, -2021, 3011, -2085, -1164, 3048, -2933, -182, 2536, -2828, 1175, 1175, -2582, 1689, -154, -1441, 2072, -1223, -389]
2673c89K390m261L048L74l237L646j385j506K810k062J36K077l269K616l50k989
2689b351M723k725j866N053l629p19M472m493L58L347l364R75J656j863M66j72
2705a32K72j22r91K150j328j350L474k444j058L736k978o28L517l137L10K129
2721A420k559J177R23k144J758n24n79R48o41K18J61r80J237r01L20J065k300
2738a401J834L44k636K423J37k722L379p01k492L325j152j895K637r38p74J195
2754E63l26k96m73O19O02k206K408J59k965L052M6l229L610r40k774M002k019
2771a67j089L327k902K31K018k211J169K09j367J895j338m01J716k160Q60J389
2787A179k697J992J31k485L528j992j246M065l439LL617m800J375L314m651K253
$$ y = [-389, 2001, -2260, 788, 1162, -2075, 1571, 186, -1320, 1490, -572, -436, 1641, -1628, 988, 638, -2351, 2372, -353, -2219, 2834, -795, -1514, 2958, -1535, -1177, 2170, -1194, -219, 1437, -426, 40, -132, 140, 18, -973, 1177, -151, -1501, 1973, -471, -1529, 2207, -771, -1399, 2118, -1019, -709, 1420, -1139, 38, 961, -1183, 575, 51, -528, 420, -221, -3, 158, -822, 415, -486, -166, 899, -1401, 433, 777, -1859, 564, 701, -2021, 1358, 657, -1835, 1490, 338, -1557, 1080, 142, -632, 563, 237, -59, -532, 87, 689, -1517, 891, 1050, -1915, 1137, 1183, -2046, 1564, 624, -2150, 1852, -167, -1256, 2071, -831, -600, 1418, -793, 376, 585, -782, 1113, -225, -626, 1090, -1070, -210, 1179, -1518, 474, 605, -1880, 1648, -344, -1590, 2475, -964, -961, 2656, -2144, -769, 2545, -2106, 147]
2803A47J437l824L058l97j873K769k028N87J302k858K930m37l563N112k875k137
2819b650N835m473m36M977n504J414L413n435L500Q78m192M590j869k114M729
2834B663l754l1M081n260L003J187m463M451j600k594N205m032J15M266n956L115
2850C96K387o582O045n79n515O801k681l489O742m682k96M466n316K466J218l965
2866b584M830k517j827N500n442R71M972p288L620L110p426N758K61n872O606
2881B672k852k661O362n245N86M176o025L645J467n720N855j874l424O383m256
2896i11r89N217n797K341K387n329M996r41m331O865m091k284P277o743Q20N349
2912C836p112L170K916n962M801l84m143N552l297o00M115n374K870J997n709
$$ y = [147, 1584, -2240, 818, 421, -1452, 1317, -711, -124, 1178, -1680, 1250, 813, -2750, 2362, -513, -2650, 3185, -1288, -1724, 3253, -2251, -837, 2576, -2859, 641, 1519, -2673, 1917, 48, -2066, 2663, -1091, -1122, 2959, -2301, 702, 1889, -2574, 1877, 277, -2317, 2888, -1144, -1029, 3237, -2719, 396, 2783, -3799, 2246, 1667, -3848, 2953, 272, -3217, 3525, -1157, -1453, 3013, -2303, 163, 1381, -2584, 2246, -271, -2098, 3402, -2040, -1069, 3903, -3385, 235, 3345, -4081, 1677, 1938, -3934, 2672, -180, -2841, 3521, -1724, -1138, 3038, -2987, 658, 2125, -3595, 2260, 386, -3038, 3345, -911, -1900, 3317, -2480, -139, 2248, -3081, 1915, 974, -3357, 3508, -583, -2867, 4410, -2333, -1513, 3836, -3276, -106, 2810, -3152, 1649, 1265, -2878, 2674, -623, -1223, 2892, -2482, 388, 2385, -3324]
2927c324N212m64m879O784l169k992O572n285r1N108o285L281K140n686M903q28
2943I97m035O209m379r94N648n719J603L569n842M013P30n035N597k083k468M955
2959B766m118J51M021n640L285J848n788N427p51m542N778l084j480N048m559
2974a638J391K726n169L981l05l927N755l088k055N868n177K62M883n949K472
2989C0K517n194L881j17l298M278k887l55L496m389K458J375m580M387o70l696
3005b764N161k661j593M512m199R48K584m270L227N27m009M021j334k353M423
3020B220l042m83L602l476R03J956l072K134m57j544K518k211M69K071l489K304
3036D03R31l494L530p63k700L472j316j624L020k095j60K099k267J192N21j822
$$ y = [-3324, 1888, 1424, -3455, 3329, 160, -2832, 3740, -1545, -1636, 3472, -2813, 468, 2608, -3078, 1825, 997, -3038, 3171, -1208, -2202, 3446, -2273, -670, 2899, -2943, 1070, 1800, -3235, 2362, 279, -2189, 2766, -1352, -1201, 2820, -2820, 465, 2313, -3475, 1952, 1201, -3341, 2437, -647, -2127, 2921, -1638, -247, 2479, -2690, 1291, 986, -2941, 2814, -274, -2329, 3539, -1638, -1376, 3507, -2442, 30, 2547, -2647, 1234, 1117, -2181, 2097, -790, -1145, 2351, -2038, 420, 1795, -2785, 1602, 932, -2764, 2397, -264, -1857, 2655, -1544, -596, 1988, -2282, 945, 1472, -2537, 1484, 150, -2203, 2220, -822, -1305, 2297, -1179, -276, 1680, -1392, 742, 285, -1259, 1259, -952, -483, 1588, -1901, 403, 1334, -2160, 1370, 607, -2093, 1379, 63, -1561, 1459, -636, -796, 1303, -964, 228, 749, -1073]
3052a073K118j199p73K187j969L42J929k734J381M75j702J866p10p64J486j352
3068d92M59J107k074J581K37j941J844m49j350K241j367j43J118j452P08N36j388
3085h25J593r59m41J568j140l59J400j692O26R62j281R10n21k27R30j713J126
3102d3Q23k182K196j54k227K833q61j823K660j481r73K171j268k26J458j711J248
3119D40j37q93J511j822P66J422k826J824Q74l011K770k31k458L402j769r89K813
3136A686k769O69K070l102J617J198k986K579m74k178L232j930q2J482k148J399
3152B63M40k456L364k025j364M212l595j75M123m890J593K860m982L149J408m211
3168b286L261m78k073L106k576M74J912l124K446J30l105M329k073k168M684l681
$$ y = [-1073, 1045, -154, -927, 1260, -709, -367, 1562, -1172, 209, 684, -1018, 848, 138, -626, 860, -492, -33, 1074, -1000, 581, 818, -1123, 721, 272, -1078, 1163, -204, -347, 771, -681, 27, 563, -825, 768, -191, -632, 936, -204, -563, 837, -855, -229, 733, -548, 362, -159, -386, 544, -1169, -43, 780, -1402, 794, 640, -1587, 1246, 385, -1438, 1222, -259, -1232, 939, -329, -555, 903, -808, 440, 303, -590, 921, -901, -135, 1287, -1539, 285, 1159, -1852, 918, 687, -1771, 1631, -138, -1127, 1686, -1083, -414, 1656, -1446, 171, 1369, -1617, 962, 488, -1690, 1542, -388, -470, 1012, -1136, 263, 703, -1753, 1611, -414, -1778, 2434, -1161, -1336, 2787, -2103, -510, 2350, -2632, 517, 1925, -2286, 975, 497, -1576, 1530, -1046, -572, 1340, -1784, 662, 792, -2313, 2016, -57, -2225, 2459, -1222]
3184a222k27M346n058J908K739n141L797p9l431M440k236j843M484l834N86K874
3200B103m065K419Q85l263L765j594j680L800l958P59L331m929L033J623n500
3215c271N031o77m037N352k220k512N194l660o4K763l401K075N86l026L560j708
3231a5j550L826l818O36L357m695K224K525n487L839N61m057M707k041j965M505
3247B552l706L34L009m156K325J226l744L213o39k290L730k636k29L000l934J815
3263a30J777m233L958m36l686N254k561k426N529m105n04M377m517J089K597m061
3279b078K641M27k555L044j813m39K350l270K216J267m268L842l18l596M890k333
3295Gj996M587l544m46M024m400J754K100m372L396j18l365M265k138j329L592
$$ y = [-1222, -1449, 2897, -2161, -253, 2486, -2655, 1142, 1063, -2368, 2072, -164, -2007, 2477, -1357, -771, 2103, -1962, 457, 1342, -1921, 1844, 250, -1430, 2370, -1588, -829, 2502, -2427, 606, 2229, -3271, 1760, 1083, -2954, 2398, 178, -2334, 2860, -800, -864, 1899, -1502, 573, 1159, -1867, 1693, -15, -1565, 2261, -1557, -921, 2436, -2259, -35, 2490, -2997, 842, 1403, -2654, 2053, 12, -1953, 2552, -1154, -820, 2189, -1967, 358, 1584, -2160, 1053, 414, -1876, 1854, -782, -1011, 1989, -1945, -130, 1647, -2586, 1372, 936, -2750, 2504, -57, -2483, 3046, -1059, -1563, 2814, -1703, -614, 1983, -2078, 563, 990, -1565, 1479, -334, -773, 1577, -1693, 523, 1790, -2478, 1364, 1046, -2550, 2340, 7, -1989, 2598, -946, -1392, 2632, -1768, -14, 2086, -2286, 1110, 992, -2373, 1892, -246, -1575, 2017]
3311B017l020K85K149k947J934N63k663L026j901q76L143k800Q63K175m466K814
3327B96J429m420L695m8l052L589j470j637L425k606K43K069k992K260n01j897
3343a617K757j441j118L036k173k84K535k926J049J134k443K411o06j469K166
3358A011j557n31K498k560J061J480k749J782M38j953K045o19j385J986j096j40
3374b89J103j518P88O19j660J757n94j300J897p20j092K248j665r7J349j647Q52
3391C1J80q05J133n01m33R84j243O17J028j913P67Q43j664J136L49j564J436j71
3409B10q64J087n01j91O24q64P45k67n44J022o73j37Q78q53R9Q08j007M56P3m60
3429c59P31m04k61Q81j157M31O71j039N92N07q14K52K61o02N69l92L12N0n60R09
$$ y = [2017, -1003, -718, 1431, -1516, 418, 981, -1682, 1344, -557, -1433, 1710, -1090, -227, 1948, -2518, 296, 1725, -2695, 1000, 952, -2100, 1489, 19, -1618, 1807, -799, -556, 1513, -1479, 781, 280, -1617, 1140, -301, -1419, 1617, -556, -840, 1695, -1231, -182, 952, -1491, 920, 314, -1155, 1011, -546, -1077, 1421, -1139, -78, 1402, -1347, 435, 873, -1080, 965, 346, -1039, 947, -149, -289, 814, -704, 84, 703, -957, 800, 206, -1094, 803, 83, -1009, 1239, -426, -523, 826, -821, 31, 211, -594, 539, 38, -395, 589, -654, -37, 991, -922, -155, 688, -976, 160, 509, -1055, 381, 210, -654, 433, -68, -259, 365, -499, 246, -21, -565, 457, -216, -353, 525, -328, -229, 579, -428, 28, 101, -359, 372, -32, -293, 588, -569, -138, 533, -506, 86, 593, -221, 31, 292, -310, 259, -133, 179, 229, -331, 578]
3449E78p90k18J185j077j9J048j158M05N97j020M20L05q68J134n88k10R84j349
3467f41N08N99j243J091%j009J128n65k15Q60j068N42O38j594J778n67j127J879
3485I94j320m70J669j574L28J861k747J509O19j713J076o9o78J363j237J63J166
3502I40j932J445M08k071K117p77j196K249j588l13J866j967P83J008k208K192
3518I56n14j808K834j582q53K728k624L67J885k550J148R95k306J973m54j034
3534h39J924j628j74J669k273J641N49k279K356o72j851K790j289j346L048k778
3550a152O86K030l125K070O03l014K789o61k029L379j862q99K792k610M90J726
3566A213k515J893r4j822K577j512o85K709l250J201K187m017K594J049l727L767
$$ y = [578, -212, -430, 755, -322, -341, 707, -451, -46, 551, -469, -49, 256, -612, 522, -66, -276, 708, -641, -133, 466, -777, 314, 314, -695, 433, -132, -347, 513, -555, -13, 625, -969, 809, 242, -885, 994, -326, -796, 873, -701, -373, 1488, -1259, 250, 869, -844, 232, 163, -515, 848, -389, -226, 940, -992, 453, 861, -1210, 907, 130, -1066, 1183, -405, -718, 1148, -819, -36, 972, -1236, 956, 442, -1366, 1468, -114, -967, 1761, -863, -496, 1389, -1161, -13, 982, -1324, 649, 195, -839, 1085, -543, -717, 952, -1321, 320, 869, -1410, 946, 274, -1577, 1213, -76, -1422, 1626, -1152, -466, 1564, -1561, 509, 1112, -1902, 887, 226, -1803, 1576, -286, -1185, 1607, -1003, -513, 1213, -1302, 591, 497, -1325, 1252, -260, -945, 1764, -1486, -285, 1902, -2115, 479, 1528, -2199, 1568]
3582A568p21k847L933k112j417L357k783O40J936l079J862L55k371L260j766j181
3598a366L371l347Q14K375l626K294N76l357L763j259k165M024k625p95L571l934
3614a686J285K264m037K872O14l338L370j091j780L302k452j12K412l254K181
3629E50M21l095L820j468k324M238k649j068L543l382R09K709l996K325N75k654
3645a546K921j505q85K766k633O12K119l845K679N34l488L588r59k263L939k635
3661f01m05L190l573J237J740l440K601K19k825L255j259j602K826k084M9K046
3677A374k672J587K34j586K169j178j004K849k592p0K764l720J616J872l604K559
3693E98P44l005K469m28j680K475j344k89J479j718J032R3j572J893q22r46K046
$$ y = [1568, 847, -2000, 1933, -179, -1596, 1761, -1022, -382, 1554, -1525, 337, 692, -1679, 1581, -185, -1366, 2005, -1342, -528, 1847, -1779, 515, 1091, -2266, 1497, 238, -1927, 2097, -528, -1323, 2248, -1686, -401, 1863, -2174, 698, 1312, -2026, 1344, 253, -1527, 1775, -677, -789, 1623, -1631, 550, 971, -2124, 1696, 228, -2096, 2142, -507, -1575, 1968, -1414, -505, 2204, -1792, 533, 1108, -1546, 1375, -130, -1015, 1751, -882, -270, 1849, -1996, 683, 1217, -2271, 1317, 358, -1905, 2034, -601, -1006, 2184, -1389, -152, 1588, -1852, 749, 968, -1857, 1398, 139, -1463, 1363, -721, -672, 1374, -1298, 289, 523, -1063, 1106, -72, -1076, 1773, -819, -889, 1875, -1845, -229, 1643, -1961, 598, 1342, -1663, 806, 378, -1302, 1173, -171, -460, 1019, -699, 333, 426, -1146, 747, -75, -1021, 1025]
3710A025j656J4K118k605J077J051k208J460K66j950K633j159j289K516j799j91
3726f97K107k092O37J024j828J081j34p35J352j220L21R98j517J152K54j738J947
3743I12o23j405K411j612m30K015j589MJ099j443Q62J7j002J051k12m71R93j002
3761d25M71M74j231J024j0j250J619n89n79J133j051L07N73j103Q98J17j109J225
3779D94o08n46J547j258J08J061j288N43J37o36R48p03P6O97j136M22M75r90Q37
3798A80L85j318J190j54q11R36o85J83M46n49P30l47q47J124o56l23J483j327
3816c60J45J023j388Q11L06j058J230n34n02J352j497P7J087j447J175J20j459
3833i19J390l05r29J624j362j22J534j782R76L45j530J812m80j474K249j326l95
$$ y = [1025, -631, -617, 1501, -1104, -27, 1024, -1184, 276, 542, -1408, 1225, 66, -1223, 1293, -506, -697, 1410, -682, -45, 979, -849, 232, 98, -637, 715, -505, -184, 814, -703, 449, 703, -1035, 912, 289, -1116, 1295, -317, -747, 1268, -321, -317, 782, -661, 201, 218, -784, 267, 55, -416, 577, -425, 46, 520, -711, 313, 303, -947, 672, 83, -496, 637, -414, -107, 466, -637, 261, 378, -731, 494, -114, -660, 887, -371, -263, 798, -490, 53, 190, -446, 502, -201, -125, 572, -564, -142, 333, -657, 180, 565, -753, 437, 283, -528, 408, -277, -94, 352, -197, 533, 186, -661, 463, -193, -516, 967, -360, -215, 808, -580, 231, 537, -521, 709, 175, -327, 1025, -472, -395, 692, -755, 420, 540, -919, 471, 166, -763, 861, -501, -623, 911, -871, 105, 450, -1080, 732, 252, -1222, 1027, -299, -694]
3850f94J799j913M53J363j918J037J36j222J466p17k30J412j534M72J255k221
3866a056J423L27k020K273p95j098K012j306l33J651j828N56J167k013J411N7
3882D28j276J767r78j134K433j911K06J717k059Q50Q48j941J940r27q50K187j737
3899d37J24K034k806R40J633l183K169K86k508K728o84j374K381j663j12J455
3915I83j955J388K14j982J955k06j681K403j479m03K168k415Q06J272k445J894
3931E17j34j699K343j262q54K529k413L54K408l447J778J259l063K425j30k132
3947a521K794j637k78J936k086P58J069k324J740K03k248K936j348j242K475j951
3963g24j8K253k456R08Q12k278K425p13j546K664j949k42K469k738R47J542k752
$$ y = [-694, 1105, -808, -355, 1008, -910, 127, 263, -959, 507, -210, -440, 972, -562, -90, 1165, -1056, 367, 694, -1326, 947, 152, -946, 1066, -240, -573, 1078, -750, -194, 973, -1040, 371, 428, -848, 919, -59, -1193, 1240, -671, -465, 1252, -807, 43, 891, -1050, 890, -37, -887, 1300, -437, -313, 1721, -1085, -145, 1488, -1695, 474, 760, -1748, 980, 296, -1078, 1303, -360, -472, 983, -972, 416, 630, -1352, 603, 397, -1284, 1119, -360, -763, 1405, -1010, -204, 1068, -1377, 517, 383, -1316, 1027, -235, -1089, 1440, -973, -619, 1789, -1658, 120, 1379, -1684, 741, 611, -1521, 1273, -364, -642, 1294, -792, -34, 1035, -1289, 451, 654, -1594, 1342, -6, -1248, 1227, -724, -742, 1511, -945, -37, 775, -1503, 922, 209, -1337, 1327, -622, -864, 1605, -1133, -186, 1356, -1396]
3980a396K075L05k341K132q03j134K085j457lJ783k333J469K87k029K508j174
3996b6j207K624j504r62K828k596O56J461k502J554P6j585J941m92j408J986j434
4013e90n5J663k110R05J187k104J643P3j818K330j234m21J607k032R44R63k212
4030a261J925L0k003K308o74j670K477j240p28J952j736M00J251j716J312l26
4046C01j105K026j450l37J880k279P34J367k383J430P69k031J723k07j656K267
4062A049j047o72J702j725N71P65j494J178J78j367J578r22k99J310j536O89P78
4079G36j593J274J5j346J617o61j088K097j270k09J415j585J86J052j351Q94M5
4096B28m48N67l90l6O77j250Q56K99j360J397k72j035J444r18m32J543j102j35
$$ y = [-1396, 679, 984, -1357, 775, -28, -1162, 923, -534, -537, 1246, -1087, 382, 669, -1360, 1148, -26, -1233, 1391, -113, -1075, 1753, -843, -187, 1274, -1228, 326, 402, -1183, 758, 266, -1142, 844, -590, -645, 1018, -1092, -187, 1000, -1104, 539, 612, -1206, 1124, -110, -531, 1076, -956, -12, 951, -1261, 664, 694, -1309, 999, 325, -1345, 1132, -108, -836, 1116, -620, -220, 1031, -685, 627, 301, -804, 1222, -228, -565, 1315, -964, -230, 1137, -1246, 184, 953, -1078, 645, 438, -1218, 1049, 2, -670, 1032, -693, -122, 643, -851, 327, 505, -862, 716, -206, -505, 805, -731, -42, 736, -857, 417, 432, -914, 703, 42, -1046, 1051, -219, -428, 987, -598, -412, 640, -711, 183, 228, -220, 347, -43, -79, 598, -652, 204, 503, -857, 540, 268, -767, 677, -241, -673, 870, -232, -367]
4114c67J248j448N85O52j307Q46l71j14N52n15L92J23n83L97M3m25O31n47R7P83
4134F72j056M78P49j439O47M45j015R57l62n56L36K52k14J49q5J03o7k37N03n63
4154c03K28O57j083N80M90j148Q14K12j006N98J87q74J030k51l90N40l38J82J04
4173B29n06M44k78j36N92n59L48K76r86Q11j7q12Q49k19k82Q44p51k69J197j335
4193e60K08J110j516O39O87j131P33r6j53M72n32Q0L00q74R54k30p17J438q21
4212io15J349j024l96J830j782M51J122j540Q21J26r14J190q68j86J125j366R75
4230B89L75j589J285J43j577J858q30p28J767j428J12R45j618J348M12j644J437
4247E57k77j187J870j287j31J273j714R25O92j408J263m16j073J956j250l65J963
$$ y = [-367, 881, -567, 18, 670, -637, 209, -162, -276, 276, -239, 153, 276, -307, 90, 133, -292, 339, -208, -111, 672, -384, 94, 843, -596, 51, 496, -519, 438, 76, -480, -144, 108, -106, 43, -42, 61, -6, -243, 260, -303, -75, 582, -501, 79, 569, -579, 235, 447, -559, 39, 226, -648, 382, 131, -259, 281, -57, 125, 229, -277, 167, -111, -247, 345, -214, 134, 410, -576, 235, 218, -594, 255, 36, -246, 598, -153, -422, 775, -560, -352, 758, -758, -119, 568, -563, 170, 74, -79, 393, -139, -59, 241, -633, 321, 91, -626, 812, -9, -624, 725, -299, -695, 1135, -647, -196, 926, -614, 207, 333, -581, 609, -259, -445, 680, -686, 289, 664, -925, 360, 503, -1074, 784, -46, -774, 993, -435, -323, 622, -996, 352, 764, -880, 557, 280, -907, 963, -324, -455, 818, -896, 29, 721, -687, 576, 160, -913, 1043, -207, -572, 1391]
4264A391k229N89J488k285J092R64k178J820k1j622K124j287j22J296j770R94
4280B44O78k206J884n46j057K314j541o48K205k029K4J768k336J373N71j745J522
4297D75l61j183J990j132m09J913k072O78J149k389J814k8j614K054j061n76J778
4314A026j772N38J254k042J229M40j968K189m89j542K160j173o91K175k116O98
4330h4J181k284J517j35j334J893q39p37J735j510M89J443k572J470O13j946J737
4347F37k39j217J608j166j03J586j991R69O07j924J603K22j699K176j233q33J918
4364I21j542R3J234j522Q74P38j745J478n37r69J813j139o90J953j883J090Q07
4381I74j933J104K08j800K274j016n77J609j323J54J193k113J453P94k062J803
$$ y = [1391, -838, -249, 1239, -1046, 46, 1010, -1168, 652, 631, -991, 1133, -154, -276, 1020, -750, 244, 922, -1284, 600, 54, -1003, 1311, -230, -878, 1327, -702, -678, 1090, -1246, 127, 698, -1047, 475, 114, -1069, 921, -211, -620, 1293, -779, -101, 1048, -1341, 473, 445, -1169, 885, -176, -752, 1026, -746, -208, 1046, -996, 233, 673, -1295, 894, 405, -1137, 1023, -150, -841, 1334, -782, -84, 1097, -1187, 330, 195, -1139, 754, -85, -822, 913, -597, -108, 1335, -1237, 233, 846, -1100, 637, 398, -819, 789, -377, -480, 1106, -885, 84, 691, -1233, 370, 592, -1107, 1069, -164, -997, 921, -621, -528, 706, -816, 58, 796, -949, 529, -8, -977, 836, -303, -993, 960, -923, 167, 974, -959, 145, 353, -1447, 827, -189, -766, 843, -480, -326, 867, -1246, 207, 1001, -1061, 742]
4397G42j97j402J515p84n71J667j266M24N76j344J296o9j316J408r26n71J702
4414H84j460N84P26j549R19M40j354J316n72n54J218o07j81P41j100N66L84j130
4432g29J049lp98Q63m92k61P08q06L46L94p85Q70j6r09J193o40n99J209p60j43
4452c09J032j089K75O86q43M08k37j63M65k85m0K15n21N22L97q86R06l52n23Q65
4472E23m82n69R03m95J23M73p34M48J53p25P43m36k81P87l62J19m4n34M76L1k44
4493a27K89m60K56M32o52L60L18p18M88k27m62P69J25o32L23M4k39J73j03k8K25
4514A54k39K57l13L0M14r53O66O31j354P25N5n19N18J03m30M14j5n46N86o55K62
4535b09K25n16P76k12m72O47l87J15M69o96L96L55r81R52l28o91J339r88k31J108
$$ y = [742, 545, -857, 658, -126, -697, 970, -296, 128, 704, -640, 656, 587, -729, 679, -247, -818, 884, -576, 8, 734, -815, 104, 544, -810, 506, -66, -620, 598, -9, -190, 551, -549, 17, 401, -729, 320, 317, -481, 382, -110, -371, 337, -469, -123, 271, -514, 356, 340, -569, 624, -16, -615, 594, -166, -309, 723, -366, -91, 595, -248, 160, -77, -240, 225, -60, -100, 115, -406, 116, 513, -373, 533, 181, -342, 523, 41, -528, 375, -120, 3, 476, -258, 190, 343, -382, 361, -75, -356, 431, 69, 188, 144, -390, 86, 117, -127, 162, -298, -42, 390, -262, 98, 416, -302, 186, -41, -503, 266, 391, -241, 82, 126, -113, 60, -43, -71, 154, -85, 172, -141, -111, 303, -650, 16, 647, -707, 18, 73, -446, 72, 175, -255, 159, 144, -402, 184, -471, -209, 16, -500, 276, 64, -408, 239, -148, -33, 436, -260, 136, 491, -490, 462, 134, -557, 782, -206, -437, 671]
4555F71r03O2P23r53N12O60j230O76j83j52M74o80K56N64j257J157k90o13J349
4574H43r54o79J782j270M4J122j123J79Q96j341N75L22j233J477p84l82J025p56
4592b57K55N64j024N18K59r96J241p50l54J253j178K25J187j698P98M72j535J577
4610E57j01j218J204j04j020J269q81k59J302j484J062j68n90J054r39L4J450
4627A168j685L36J141j802J014P07k020J685J64j705J479n52m47J260q46o9P15
4644E43j119Q14q0j140J815p76o91J471j338K03J242j480O38M64j453J410j69
4661C54j274J736q14q37J879j406j25J432j528M87O87j517J408k47p63J292j010
4678b46j04J045j519Q87N33j684J600L1j764K205r21p43J844j695k7J486j664
$$ y = [671, -232, -170, 553, -400, 112, 772, -458, 218, 35, -117, 357, -323, -67, 497, -760, 397, 107, -506, 843, -111, -790, 992, -278, -234, 888, -235, -56, 840, -501, 74, 396, -837, 640, -144, -526, 499, -257, -2, 562, -462, 56, 315, -681, 560, -190, -544, 709, -469, -244, 943, -755, 43, 515, -1020, 557, 456, -762, 442, 338, -682, 587, -294, -553, 749, -735, 327, 159, -431, 623, -316, -282, 1168, -517, -181, 960, -842, 172, 879, -1141, 544, 708, -997, 482, -70, -517, 743, -103, -172, 543, -576, 238, 158, -982, 833, 57, -634, 837, -501, -298, 944, -536, 102, 566, -887, 523, 354, -920, 816, 2, -835, 1044, -362, -487, 945, -583, -96, 591, -926, 482, 235, -528, 764, -246, -350, 695, -824, 63, 596, -1088, 512, 543, -1221, 984, 63, -680, 1164, -531, -558, 928, -736]
4695g36N97Q60j553J271j48r34J500j038m62J406j529O85Q73j625J503k26j331
4712h87J850j078p01J725j441L97J141k088J444L28j524J337p5j316J913j176
4728a51r9Q61j266Q96K58j303J209r1j335J781o24p22J503j348K26J013j784J357
4746C81N21j763J241k46p42J280p44l52J230j339M71N49j422J269m5r29J374q04
4764g0n99J568j312Q9J015j545J234Q2j138J083m45o31J264p94k31J052j188Q11
4782B45K95j246J161k70l96P32n93k21J021j210L34P95j311Q15O0q95O23K29o73
4801e05J034o85J84L18j005P05N09j022N90M3o46R12p44j61J018r42M25L96q52
4820d28L70J86o01R33p02j20Q12o18K1L36n90P78k80n66O66m33P8M74m48J18K52
$$ y = [-736, -139, 721, -832, 439, 291, -643, 857, -181, -643, 763, -766, -81, 792, -833, 670, 444, -887, 963, -115, -816, 909, -532, -135, 1006, -1082, 362, 690, -834, 503, 428, -888, 1025, -151, -250, 611, -655, 241, 499, -804, 405, 314, -1021, 760, 136, -586, 917, -431, -205, 808, -976, 381, 902, -861, 380, 134, -608, 672, -72, -424, 806, -533, -62, 487, -935, 334, 289, -640, 734, -70, -669, 899, -413, -324, 691, -854, 380, 462, -676, 407, -38, -669, 595, -199, -430, 622, -566, 245, 540, -706, 455, 185, -211, 521, -72, -293, 728, -482, -148, 647, -664, 151, 211, -684, -61, 168, -505, 529, -156, 28, 346, -659, 46, 555, -467, 123, 166, -480, 432, -312, -473, 545, -397, 28, 424, -428, -58, 128, -473, 460, -242, -362, 450, -168, -147, 189, -401, 377, 97, -469, 197, -236, -158, 316, -132, -14, 238]
4841B38n01M62k5o00N68P1n94Q22m99K2L90n18J34K46k01K21k83k0N34o91L02
4862G8K99p74P17Po42O37j14l44O11m76R6J01m82L69O1l15O86n63l2P22q20o8
4884b46P31p33J86N05q59O29j67m48P25n96R8P96r91N12P1l59M01p4m59Q83q71
4905b66P1N58n69J06L54j039J135n09l39J256j028k59J220r90k09J035j122N76
4923a9O09q54L82j6l91P29p53J56Q08j041P38k38p41J207n72n74J265r41r6J103
4943G61j035K14O58j227P54J06q90R64j37n20J015r06L29M78r99O27O9q06Q27
4962B82l35l00P24r54M84O91j390R71M81j586J000M01j317J441m45q50J430j000
4980b72k87J047j024O20K08r81J182n06l54R62j044J75J047j443O34P35j390J002
$$ y = [238, -263, 199, 174, -426, 142, 213, -381, 441, -58, -36, 354, -164, -30, 216, 15, 236, -47, -67, 467, -224, 78, 377, -397, 320, 327, -315, 322, 208, -136, 475, -1, 95, 196, -286, 83, 144, -171, 515, -48, -80, 642, -178, -246, 485, -248, -62, 443, -416, 213, 46, -402, 323, -273, -175, 621, -370, 142, 213, -146, 255, 181, -278, 605, -266, -195, 363, -206, -100, 254, -785, 350, -159, -498, 758, -270, -529, 691, -299, -508, 527, -595, -19, 590, -264, 118, 102, -289, 440, -313, -157, 651, -390, 348, 110, -631, 576, 4, -570, 695, -246, -342, 761, -274, -60, 598, -629, 125, 231, -659, 305, 168, -352, 663, -243, 86, 564, -435, 192, 261, -545, 282, -53, -353, 371, -583, -99, 592, -798, 173, 654, -932, 68, 469, -848, 593, 148, -702, 728, -272, -559, 488, -536, 84, 292, -689, 493, -13, -367, 595, -449, -274, 773, -670, -36, 699, -691, 311]
4998C11K87j618J544l46r08J782j303p6J127j287L15Q08j351J004M2q41J098o89
5016a01M0P82j171P67J90j328J408k30j375J984r71q67J821j426K63J146j573
5033f41N63O76j287J253k70j020J331r31P5O44n79L51N47j399Q83J7q86J443p95
5052b5m70J260j207J52R66j269P68L83j097R23k35j102J683o97k92P86p29K99
5070I7J69p53Q38j62o66R55n78k43Q15r78L78R19j292O10M23r64P97L8r38J185
5090F50n30l52N61l76o9L88o34Q50m58o65J198p14j94R24o26l91J297j291M00
5109c2M41q69O23J23q71R93m09m47R75p99J14M05n78N62j83l59L01j40K6O32p16
5130b08P1M53p83P58P2j180J310l44n71R91n42m07P77n08k24N56l28L26j6n30
$$ y = [311, 598, -1020, 524, 178, -730, 1052, -251, -327, 800, -487, -172, 636, -715, 289, 331, -510, 588, -101, -61, 721, -450, 317, 507, -821, 587, 357, -1018, 966, -5, -872, 949, -477, -214, 932, -641, -78, 598, -689, 564, 294, -726, 605, -326, -251, 393, -186, 165, 712, -687, 196, 213, -673, 770, -25, -495, 765, -442, -290, 676, -593, 175, 558, -539, 384, 149, -953, 730, 33, -259, 527, -202, 97, 266, -487, 351, 189, -477, 478, -100, -343, 472, -506, -128, 791, -501, 109, 532, -432, 365, 403, -535, 650, 120, -232, 329, -47, -116, 272, -362, 488, 30, -635, 563, -151, -345, 579, -47, -438, 859, -432, -32, 409, -460, 163, 286, -585, 408, -1, -448, 527, -272, -158, 247, -331, 231, 48, -311, -10, -150, -124, 508, -208, -137, 316, -467, 291, 363, -817, 493, 149, -422, 569, 27, -380, 397, -111, -335, 221, -107, 219, 203, -327]
5150c27P66n34qP28r60L83K41n42N69j02n67O98m21m30R25o84j6R18r28P2L50
5171A31l85L97j8k40J69k35K76M4m02L64j35p8J00K24m39O11o29m6P03n42J08
5192b2L02o33K99J91l72L33K0m09M05k96K13O5k36K70n9l37M95l11q5L73k42m4
5214h0L05m40K73L0l05N4P6M6L10k42Rj07j49N07k61L6n8j1L0L06n24L06J39l33
5238h3K42o4l38K07J61j67K34l02K54Mj89M03R9m66J48n9r7J34l72K99L02n42
5260a92L75J24p66M44J21k24J87R8n06M03k6n9J75k97J62o1k90O35l39l19N82
5281B27k54k63M68o73M41N21p59K82l1j89N39j74l06O15o51J22N24p87N34N0o14
5302c78P83m70p7M79m56p7O69p42P72l38n86N51L4n79Q98j60p20R26r19M01N58
$$ y = [-327, 439, -95, -103, 625, -335, 48, 289, -253, 316, 214, -353, 345, -76, -506, 419, -265, -281, 637, -291, -219, 131, -254, 143, 125, -115, 54, -181, 95, 139, -263, 101, -34, -112, -12, 212, -227, 384, -245, -291, 412, -130, -22, 280, -353, -54, 137, -235, 98, 118, -291, 114, -182, 31, 96, -140, 130, 71, -266, 229, -82, -167, 206, -36, -80, 225, -215, 58, 88, -217, -163, -87, -41, 269, 27, 36, -71, -220, 287, 26, 62, 4, -7, 23, 329, -195, 111, 250, -83, 159, 95, -243, -36, 125, -42, 192, -110, 144, 148, -41, 362, 461, -5, 143, 84, -13, 121, -251, 48, 350, -192, 183, 307, -459, -15, 106, -118, 69, 167, -339, 64, 38, -21, 154, -143, 19, -42, -332, 303, -36, -355, 227, -27, -290, 178, -495, -54, 467, -292, -10, -41, -230, 309, 135, -171, 444, -207, -85, 439, -348, 186, 236, -378, 405, -65, -142, 337, -119, -196, 473, -269, 503, 165, -421, 130, 164, -415, 483, 323, -397, 529, -390, 11, 569]
5323E69r63N40K48q26O25k13r7N81p87L80N18j116L61N54r03R33j33q40J115p88
5343b42p0Q14r15L27O51r49P15L6q93R02n72j29R33r24P8O05q01N43J81p94P97
5364B93k62p50J110p08j39J247j314N28O77j127O76J24p96P32j95l12N86n69K23
5383B4M24r76N64K11r86J231m90n87J323q64j21P95q40K46N60j006P68O2j067
5402g29J241m39m98Q51o82K95K57p59M76K73q41Q70k71o67J008q27L28Q65j221
5421d70K86O80j223Q75J08r04R64j81m89N86n02j65Q68p99N04j93l04M75j16k23
5441b23R11r45j28J098j086K16P50r34L51L72r11Q78k16n59R32o72M5N18p12K59
5461e6L28o20N55j23l85N69l32p4O85j029P11J13j030Q49J8p40R70m07m41J111
$$ y = [569, -394, 146, 394, -432, 193, -20, -117, 464, -323, 57, 575, -541, -180, 374, -529, 404, 271, -569, 546, -242, -312, 502, -413, -86, 565, -384, 331, 367, -526, 376, -196, -325, 608, -316, -238, 367, -434, 109, 290, -504, 293, 31, -719, 391, -317, -456, 791, -523, 5, 682, -445, 231, 355, -441, 291, 96, -216, 370, -199, 24, 448, -528, 36, 247, -739, 492, 2, -585, 738, -126, -247, 548, -292, -46, 514, -492, 276, 338, -729, 512, 73, -425, 426, -256, 39, 296, -463, 13, 286, -555, 315, 44, -623, 385, -442, -114, 751, -470, -184, 496, -727, 148, 256, -648, 316, 135, -354, 232, -270, -435, 433, -366, 138, -55, -359, 116, 0, -223, 688, -257, -385, 713, -373, -157, 593, -341, 10, 382, -529, 349, 133, -426, 506, -166, -121, 397, -315, -56, 272, -348, 207, 84, -301, 268, -64, -138, 547, -482, 229, 342, -688, 161, 179, -561, 409, 2, -439, 672]
5481F72q30j14O27p29L30K92o13M94j43r0N02p13K91K35n90L08K46n63O58k73
5501cl51O49j31o07P48m72j70O78n90J79K09m79N28k56m7M33p68N52J96n78K10
5522g0Pp5M71l44k07O26n23O5J75k21l7M78n21J9J45k13M72m0l0q1m9p0N9k32
5546a96N42l39k10M97n51K72J20m02M20Qk50J01J04j60K15m1k74L00k58L02k85
5567h5Q4K74n07J04K40k71K80j52q7L33J30o54N27j46k60L84k25k99M38j39j4
5588d5L64m33N6R5O6J13k78m8M10o43K48L39l57J32K89o76M81q1m44Q79k83m65
5610b81N29k56l4M40p96M29n7QN04l28k62J45m08M01K83n88M91J33m32N75l83
5631A13l41Q61n19k68M51m72K72P0k81K16J49m53N46o62J84K51m18M67lm24M48
$$ y = [672, -158, -272, 355, -374, -44, 248, -365, 129, -14, -104, 398, -315, -24, 211, -379, -71, 175, -388, 270, -3, -354, 295, 164, -443, 305, -167, -337, 341, -249, -70, 139, -340, 188, -68, -115, 318, -450, 102, 298, -280, -70, -63, -138, 333, -11, -218, 408, -115, -50, 125, -96, -133, 345, -176, -157, -12, -225, 247, 207, 177, 96, 47, -23, 36, -196, 346, 7, -203, 294, -257, 15, 135, -267, 153, 161, -89, 12, 116, -44, 171, 130, -144, 156, -102, 200, -85, -1, 273, -234, -130, 110, -161, 119, -33, -120, 213, 343, -311, 216, 70, -190, 194, -31, -330, 108, -31, -45, 319, -114, -58, 37, 103, 216, -62, -110, 300, -343, -95, 244, -113, 19, 308, -368, 113, 32, -412, 467, 184, -281, 248, -8, -42, 398, -398, 31, -26, -18, 486, 158, -104, 41, -367, 34, 317, -271, 220, 353, -79, 496, 113, -228, 633, 114, -154, 297, -175, 97, 167, -114, 102, 251, -202, 344, -318, -134, 117, -301, 166, 163, -261, 187]
5652A87j53l49N73l52l19R11r72L98O02r44M21K81o81N19Ln53Q28k86l08O10p53
5673c37L39J95p07R27j78n56O34l82k5N95j079N84M44p44M21L8l87L90On42P48
5694C84o15L6L91n62L03J35m37O56l54l11Q20m31j62L63l94K71K29o18L66J17
5714A87n79M27J38k71K52j60j62L10n86L95K15n70M87k05J16K89k87m52J148r95
5734c03J52N00j073R00M54j043N28J92r06R86m36l37O70n09N35k9o71M64j9k74
5754b19L23l14k81R03l60j28N79q91M97O6l50L98q9n36Q41n65p5Q63j029L64L97
5775C94o31O39l03k81M28k58j86P06j112N45M45p71P60j6o82N01k26k10N46m38
5795a50j21M43n40K80K04m51O27M1p10N73l35k53N43l27J50K36p39P67km57O35
$$ y = [187, 34, -315, 258, -94, -413, 498, -474, -76, 526, -418, 3, 284, -397, 122, 125, -428, 400, 114, -194, 416, -337, 2, 197, -510, 417, 239, -317, 317, -65, -90, 505, -574, 10, 454, -290, 131, 169, -218, 172, 178, -364, 384, -231, -195, 196, -366, -63, 72, -365, 291, -63, -374, 446, 15, -147, 216, -178, 93, 322, -296, 70, 187, -392, 35, 173, -98, 154, -6, -168, 142, -444, -49, 166, -404, 83, -122, -6, 283, -4, -456, 692, -303, -151, 349, -724, 176, 630, -413, 115, 307, -599, 387, -49, -386, 284, -225, 310, 281, -390, 74, 55, -219, 104, -210, -491, 412, 52, -76, 503, -388, 109, 175, -175, 223, 134, -402, 439, -126, -201, 662, -367, -3, 394, -237, 402, 99, -182, 246, -12, -198, 508, -604, -59, 386, -385, 375, 359, -323, 178, -48, -258, 288, -150, -271, 172, -368, -88, 116, -335, 292, 333, -377, 196, -139, -392, 151, -176, -26, 210, -529, 238, 236, -221, 414]
5816D14m23m60Q10l84q5L08l04j71O40n43M71l28m52O92l79j64P89n09Q9N9m54
5837c84L60K84m70O17m82l87Q34n43O8L54m47l3M06m49N40n06P2L86k16l5K89
5858B58n18L96J60p52P09k58p2L16m18N1M72n20r8L71k56K17Q2j57R6m3k18M33
5880B51k76J23M4q2o1Q8l18J61M7N3n3Ml4L33k04j32J01j41Q1R7m9J87j19j57
5904e6J28j12n9J85k22L6K70k80K32J33k52k2N2j34K21k64J07O5k47N11k60J28
5926A60l31R2K79j75N7K10l40p7J73K10k61J66j08o4M6o8Q2K22p02P73m92j12
5948b60O26n12J1J05j33R7J65k02K16J7l56J49p8M40k46p9L83l23j34K88k61r5
5970a82N07m95lM90n72L99Q3l49K62lk66L64j99q4j79J2R1pK8j06M79m98O28m52
$$ y = [414, -9, -469, 341, -43, -128, 180, -124, -295, 345, -198, 273, -55, -507, 185, -194, -358, 431, -78, 11, 70, -384, -24, 260, -210, 407, -75, -462, 372, -171, -103, 251, -196, -229, 177, -272, 268, -238, -166, 220, 4, -31, 258, -260, 136, 296, -456, 253, -5, -77, 239, -179, -128, 344, -176, -274, 97, -159, 58, 140, -17, 79, 36, -182, 251, -25, 98, 142, 60, -1, 87, -231, -70, -23, 30, -23, -19, -53, 280, 76, -56, 45, -96, -15, 82, 33, 220, 101, -56, 72, -40, -99, 86, -136, -100, 170, -110, 122, 255, 3, -19, 33, -101, 120, -144, -37, 28, -219, 292, 32, 160, -171, -79, 200, 25, 82, 292, -48, -125, 48, 258, -3, 163, 55, -9, 37, -31, 51, 273, -429, 344, -148, -260, 366, -146, -135, -30, -163, -66, 99, -103, 113, 130, -226, -77, -155, 285, 39, -40, 343, 20, -114, 174, -87, -182, 325, -170, -173, 317, -255, 144, 227, -122, 140, 137, -129, 235, 36, -48, -227, -215, -124, -131, -103, -209, 270, -228, 400, -52]
5994e2J05J91m56J75J65k56L23j04o65O96J8m13M04j39n0N11o25K07J16m82L99
6015F8p5J47l1l17O9M11k77N0nk20L34J25o01L44j99k6L85q3m28O87o94Q0N72
6038C16p21M14L72n49L73j86l8K95m50O9M67l81j22K76m14M01j76l77O69o4k81
6059a07L22m21K34M96j000L80M57j78J27m36j63P11n34l3N91q79L93j3k47Q17
6079E17m65j84L79l86k0K74m40J98L67o59N26N4m87Q5J59j00K78k38O3N12n34
6100a01J94J98m44K27m8q9J95l87J50L94n91M99L79r73P15m4n00N33m61P9M33
6121C58k96o3L62m68J52j19m08P54j03n14P70m33m7L75o91O18K51o91K03K6m66
6142d30N51j01j39K36k15l5L25n64M37j24m37N82R1l92K98k86m8M08o01L49J63
$$ y = [-52, 53, 244, -212, -37, 128, -128, 195, 91, -574, 122, 140, -273, 131, -8, -58, 453, -172, 35, 151, -331, 68, -7, 140, 109, -208, -139, 272, -5, 45, 40, -180, 154, 279, -322, 22, -177, -203, 182, 99, -329, 358, -336, -256, 316, -405, 9, 381, -168, 205, 19, -19, 276, -174, -105, 362, -19, -141, 135, -279, 122, -54, -431, 238, 174, -107, 215, -206, 28, 524, -476, -96, 361, 183, 310, -126, -289, 422, -112, -145, 446, -433, -40, -53, -300, 517, 52, -132, 247, -139, -159, 115, -325, -127, 240, -419, 107, 161, -326, -241, -82, -182, 96, -142, -79, 433, -101, 93, 291, -153, 74, 26, -63, 132, -255, -105, 289, -302, 197, 576, -397, 318, 274, -226, 307, -154, -75, 358, 62, -1, 361, -107, 45, -74, -482, 272, 169, -345, 425, -8, -55, 320, -371, 247, 498, -193, 10, 36, -430, 121, 20, -119, 117, -98, -133, 192, -372, 65, -59, -496, 86, 177, -215, 83, -203, -251, 157, -444, -95, 68]
6163F8k63L85j58j40J59j21j71L75kl08L65l05P9K42l85J16N6m9j48N1J77J58
6185A81m49K45Q7l54L82o3o3J78j66j90J84L09k90K13k96K61n8j18J69J38n55
6206b55K95K2r5K35k81j52J77J17Q8j27p2J57m71L27M4J52l79M14j91O3J47j78
6228C7J64j66k79O18l04j80K43j68Rq0P9O2N6p9J94l39J08n1j13OK14j48K56k78
6252a39J03P2j59K10K03k74L2J30l70J3K57q5L56n00R3J90M5j27J41k69K98k15
6274EL6L4j36J47j04j2R4J61o33M73r2l57N06O3m02K81m41K71J41j12j05J30J63
6297A11K0j82l1k5K44j45q1p7j40J36N8n0R2r6M04l26L9j10n9M74j93m15L81O9
6321I8k14J04N9K6K32m15K80K4m87M14l39K45R8l5j71J85j57n9L60l24M1J30k43
$$ y = [68, -195, 190, 32, -108, 51, -70, -241, 134, 132, -176, 189, -116, -37, 205, -180, -64, -8, -57, -205, -154, 23, 181, -268, -23, 64, -290, 92, 29, -34, 144, -22, -212, -28, 281, -9, 204, -92, 169, 111, -7, 162, 300, -255, 40, 62, -33, 202, -79, -231, -54, 63, 151, 24, -48, 109, -362, -35, 9, 161, -218, 196, 5, 68, 215, 37, 201, 35, -244, 374, 70, -110, 133, -35, -26, -106, -27, 35, 91, 12, 206, -133, -25, -76, -189, -183, 31, -117, 139, -139, -36, 36, -123, 87, 290, 16, 48, 178, -192, -179, 78, -7, 349, -151, -58, 132, 177, 50, 191, -78, 220, 5, 41, 75, -61, 86, -18, -30, 64, 225, -408, 65, -27, -384, 122, 185, -217, 64, -377, -106, 35, -77, -182, -52, 111, 131, -51, -82, -107, 137, -8, -89, -166, -306, -170, -112, -162, -70, -166, 238, -88, -49, -159, -218, 256, 63, -352, 29, 98, -116, -12, 47, 73, 305, -110, 170, 194, -293, 121, -218, 27, 125, 90, -81, 104, -53, -112, 248, -76, -35, 95, -148]
6344a48J88j78o3L83j76k56M87l22L64k12m40M03j00K26j58j79K64R9l48J50K33
6365B17m98K66J15k93K27j04k46K60K02k80L79l97K14l8k55L59r8p2R1l05p8M33
6387I9j52j03J42k91N26j50k82K92q8j32Q3l53L98K79n59J24K61k56L60k43k86
6408c31O16k73l6J22l85L54P8m41N60k65k62K71m4k35N72l55J03L52m99N1K51
6429B04m53M34Q7m12M44n30j97N20l02K85j5k12K99j01r7L29l94l59Q20n83J55
6450g8K55m40L06K8m07L15k0j83J90J45k53l6k19K80M16m20J22j3j68L50k02j54
6472a86M51m18J41J11l01o9L72m25L58Q3k26K62l13j0J52l0r4L26l36L61l42k09
6494c42N16L8k84K67j8k92K80l38K88j72r8L39M3j55J83k19k93N32m59J43K62
$$ y = [-148, 40, -138, -201, 182, 6, -250, 237, -85, 279, 67, -373, 30, -70, 156, -2, -181, 83, 182, -166, -16, 217, -281, -15, 100, -193, 34, -70, -316, -56, 146, -134, 245, -152, 62, 24, -231, 128, 30, -42, 49, -256, -334, 99, -53, -156, -14, -305, 221, 71, -211, 81, -7, -139, -56, -409, -11, 268, -291, -167, 94, -162, 198, -45, -331, 285, 12, -24, 98, -287, 67, 145, -296, 264, -1, -263, 8, -36, -271, 301, -54, 49, 401, -98, -47, 204, -249, 185, 272, -140, 304, -226, -423, 97, -205, 80, 65, -147, 152, 51, -46, 283, -111, -470, 350, -233, -78, 177, -263, 43, 71, -336, -21, -41, -224, -34, 111, -142, -178, -397, -117, 299, -121, 1, -12, -180, 170, -32, -186, 265, -153, -12, 99, -202, -271, 101, -324, 34, 117, -109, 153, -160, -170, -18, -48, -142, 184, -152, 209, -133, -342, 174, 212, -72, 195, 177, -115, 165, -173, 115, -57, -155, 184, 227, 72, 255, 36, -257, 275, -184, -41, 221]
6515B21l94K78J42l75J00l3L55j84o0L3r4j67M23k23k87K78L5k40L39j36j98L65
6537A78O4l08K38l44Q1m6k5L99k11m2K70j36k44Q7J22j12R3l05M26K2l50M65l48
6560b6J17n2j79M80k55k72L93j15k30K17j59j94L78r8O7m5M4J11Q6k38K31k24
6582C7J32P9l96J69j26O8K02j42n5J05o7J88p0r8j55J49k15J83Mj19Jqo1K17k1
6607Aj57J36n7k52M36j81J01l9j03J11k69L31Q7n3j27P5j37J01k62K37m7j87M66
6630B11j00k18J90K5p7m8J6L7P5l58Q0M2K18j40j28p5L95l3m9J27l01J26J07n1
6654G1j84J41j33%o9J94k42K54Jj69L5J38l01nQ7M17k76j68K63j24K60K5l15K12
6678A12j08n3l6m9K70j19j86J45L5m0P4P3LJ40l75K22l28R0M17n21J56L73l88
$$ y = [221, -173, 105, 247, -128, -28, -61, 294, 110, 50, 83, -11, -178, 245, 22, -265, 13, 48, -192, 147, 11, -187, 178, 242, -66, 172, -172, -91, -137, -162, 237, 26, -16, 254, 118, -126, -39, 83, -29, 64, -241, 185, 207, -143, 322, -26, 91, 39, -140, 340, 85, -187, 206, 91, -139, 78, -81, -275, 103, 5, 72, 27, 71, 182, 268, 30, 261, 37, 169, 248, -148, 21, -105, -37, 165, 23, -32, 73, 6, 194, 124, 26, -129, 20, -195, -12, -8, -127, -126, -134, -195, 22, 1, -156, -20, -77, -329, 107, -74, 27, -12, -115, -4, -273, 58, 145, 92, -35, 40, -97, 4, -258, -21, -68, -255, 211, 111, -107, 83, 108, 31, -17, -1, 36, 111, -247, -167, -125, 93, -47, -175, -250, 145, 112, 63, 190, -111, 15, 122, 71, -113, 28, -105, -105, -174, 20, -222, 32, 33, -136, -101, 37, -264, -269, -182, 235, -41, -209, 54, -70, 190, 215, -100, 112, 4, -49, -85, -134, 136, 17, -169, -24, 11, -29, 45, 118, 121, 261, -114, 108, -220, -130, 287, -234, -78, 295, -93]
6701i3K05M0q1j39J91j73J06k09J50n9m7O9J98k55K09K94n34K40q0o7L01k97J93
6724A62J37k57j6J65k42J77l7q5N7Ok8K18l01k35K70j36J59Q6k54K56o8j06J83
6747A11m06K50L03k92L8J78l54K90r9k12L98k67l1K60k93J40J31l10K19k93J92
6768d7K14k11k61O15n67J13J46k82J91q0J78k2M6k05K39j56j60N78m14r7L15l44
6790b11L73j3j50OJ09l88M44j52j7J35k69L42k2l35K89j71L1j9K6l38N23j63n4
6813b4J16k80K75J03m54M03M8l64M30n43L30p3j63L63J23m86L28j93o6L67l27
6834h7J04J78l72P6K94m37K00R5j18K97l47j55L68l0j51K21l61o2L63j84L17j15
6856I4k35J54N8j64J02K2m3K15m18K71j42J62J02l0j63OJ12q3J5p3J38l8j53L80
$$ y = [-93, 112, 152, 71, -68, 123, -50, 56, -153, -3, -62, -109, -40, 158, -97, 112, 406, -128, 112, 32, -35, 266, -31, 162, 299, 42, 26, 191, -51, 126, 89, 4, 61, 67, 39, 257, -44, -279, -9, -145, 14, 100, -154, 102, 34, -72, 111, -295, -45, 258, -34, 4, 182, -172, 118, 19, -193, 205, -62, -93, 167, -126, 14, 145, -165, 54, -239, -47, 167, -44, -305, 310, -257, -144, 2, -280, -89, -169, 9, -13, 33, -172, 67, -89, -249, 329, -85, -182, 133, -211, 162, 149, -1, 5, 114, -274, 170, 18, 1, 136, -133, 209, 187, -148, 141, -30, 1, -18, 8, -330, 193, 30, -24, 92, -188, 87, 190, -264, 139, 187, -177, 253, -290, 40, -33, -196, 167, 290, -196, 132, -61, -127, 240, -87, 17, 195, -177, -101, 193, -244, -44, 51, -67, 230, -117, -272, 96, 66, -85, 136, -225, -287, 76, -108, 209, 94, -141, 13, 71, -93, 9, 31, -12, 203, -215, 56, -86, 76, 178, 148, -15, -9, 103, 20, 35, -38, 100, 62, -91, 289]
6880B89j11k38J47m85K92L97l46m3R6M0J97j77n13N79p7r3K11k45k1J51j33J28
6902D5km9m7j46o8M67k29k9J18j27j4K0O7lN2M5j61M7K90n06P2J23R7k4j18J64
6928H4o4P2j23Q1L5J0ll5J5j61M9N2M0O4k66J96J36n17M88O4j81J69k39j52LO2
6954a21K33j46J29rj02p4J24N0j64J32o7O5j75j60L50L2j32L4j75J51p0L1n8J4
6978a08O0Q5J05k91K22q3J77k39Q8k0l9J7mk2L5J51j41O8j14J2J7l6p9K91r8j05
7004e1K59l42J13J27j19nrK12O1o6j21K1k06L69k31J01j42J02R0O6l59R7Q2k30
7028a81J48K49j43j57K86k74J68k27J47K2J14k38J34Q4P1o3k30n4O2L18k93P8
7050B1j81R1k92M86j67l09N37j92J1O3nk30m5J72K72k58j7j10M18m36J1L87k56
$$ y = [289, 178, -60, 87, -398, -106, 291, -55, -98, -2, 38, 235, 58, -455, 124, 47, -46, 165, -80, -101, 50, -83, 45, 43, -6, -53, -199, -267, 200, -29, -58, 60, -67, -81, -61, 6, 3, 55, 100, -61, -14, 276, -230, -158, -35, 62, 38, -80, 84, 20, 92, -31, 50, 85, 95, 92, 57, 72, -89, -40, 12, 52, 116, -150, 46, 182, -335, 153, 217, 36, 205, -34, -186, -183, -121, 112, -34, 95, 86, -16, -90, 34, 84, -80, 52, -15, 50, -125, -285, 65, 97, -35, -1, -176, -25, -95, -64, -122, -108, -48, 37, 142, -149, 73, -10, 167, -72, 16, -4, -43, -26, -30, -52, -17, 134, -7, 61, -53, -41, -24, -60, -139, 152, 54, -51, 208, -134, -21, 106, -13, -18, -27, 185, 246, 180, 59, 80, -126, 243, 12, 113, -29, 73, 163, 229, -130, -33, 49, -181, -33, 216, 73, -84, 202, -72, 96, -131, 16, 38, 152, -86, 48, 132, 203, 140, -90, -144, -82, 236, -57, 21, -160, -69, -361, 125, -42, -351, 186, -6, 5, 68, 63, -167, -212, -40, 232, -26, -43, -153, 265, -171, -160, 227, -29]
7073b9K52k43j09K75j65R7l8j31K11n4k01M62l23k6K3J0r8J72j57K45L5n10K00
7096a02J39K48p6l19o5Q4J26p5j6k16R2J37k7J50n3L7J07M3l23J21p4K36j95j75
7120a96K85O5m14K32N5l22K60N7M0N2L1j1p6kk1m5r3L22k90M2R4j59J63K00l22
7145e3K16j2l50K38O9k73L28l85K8M58l45J80j30k30L82J0j12M3k25J1K51l83
7167b84M04m4k81K30j79L9J1J82m8n9o2J48J7k49K89j22j04M58k24r1J21k11O8
7190IK29l58m4J64J34j21o8P9J62p3k13K01k79K18j25O6j89Q8k82M39l4j52R7
7213e2N9l90M23J15J92m55J57P2j41j33M39k39m9L55m97J28K65k82L37j22N4K69
7235E05m65k65J00k02L98l1o6J57J63l89k20M54j81J52j33K58m34ML93J00k02
$$ y = [-29, 223, -20, -129, 146, -19, 78, 40, -91, 120, 66, -135, 327, 4, -22, 1, 11, -87, 85, -72, 173, 208, -302, -102, 37, 285, 209, -110, -175, -91, 35, -40, -56, -272, -180, -43, -70, 80, 27, 64, 171, 214, -109, 12, -62, 174, -21, -196, 89, 154, -260, -28, 27, -295, -35, 22, 62, 114, 145, 134, 58, 56, 35, -10, -103, 219, -71, -29, 65, -94, 69, 269, -53, 163, 151, -199, 39, 108, -165, 163, -222, -194, 264, -81, 99, -31, -261, 121, 131, 19, 62, -163, -152, 99, -284, 120, 76, -205, 25, -154, -115, -104, 78, 30, -29, -91, 57, 74, -175, 114, -8, -112, 346, 122, 31, 152, -59, 9, 238, -120, -164, 0, 134, 13, -55, 24, 186, 113, -100, 101, -178, 40, -85, -19, -208, -120, -402, 37, 3, -149, -52, 7, -383, 40, 155, 347, -108, 49, 121, -20, -153, 286, 47, -2, 353, -144, -16, 249, -33, 304, 182, 236, 505, 40, -225, -125, -327, 71, 40, -26, 131, 294, -95, -315, 139, -42, 110, -23, 235, -199, -195, 198, 298, 96]
7256I6P9l66O7K68R5l34J47j72J92R3k21j13J65Q7J31r6n9r7r0j08J49o4kK13
7280F0q6j1L5K16j97J17r2J7N5j63j0p3J80J62m42L27j11K0j6J56qk20J26J33
7304A75j60j77K81k50j6K45R9l52L28k65J49K49l83J18n4j06K02J93k91L05k75
7325A5j53J94j84M01k82R9L9k60K04L3r4m9m1k18M07l46J99P8L2m10K91J95m9
7348A01Q6k36J48k90K45%k2l01L53k35O9K37l37J46J12j1K42m58K7K83k76P4L2
7371a1k24L68m5k5M9j63N9K14o0k1k3m71L87K18j33P9j14j09K90j86r2P0j25m8
7395a16K14j70J90l80L17J80l67J3L77j54J62l20p5L24J0k54RN0k44M45j84%p6
7418d9K07j03m49M52L9o8lR5k18JO9Ll1J85j85J87Q7n21N89k52j83K33J49j06
$$ y = [96, 175, -191, -124, 144, 239, -95, 52, -120, 72, 165, -56, -169, -4, 83, 214, 118, 59, -38, -128, -236, -87, -151, -153, 60, -26, -37, -2, 214, 17, 134, 42, 59, 114, -49, -59, -132, 48, 210, -232, 95, -16, 4, -12, 144, 136, -84, 42, 175, 15, -162, 119, -131, -147, 98, 197, -155, 173, -92, 57, 306, -77, 41, -13, -119, 83, 276, -15, 290, 15, -138, 56, -128, 273, -9, 90, 129, -131, 73, 106, 12, -37, -78, -296, 111, -235, -36, 42, 74, -336, -45, 150, 101, 187, -49, 99, -191, 54, 54, 32, -269, 84, -151, -82, 155, -182, -36, 76, 65, 307, -151, -124, 159, -117, -43, -11, -235, 133, 88, 63, 112, -51, 8, 222, 162, 141, 118, -353, 34, 252, 119, 198, 84, -25, 265, 79, -13, 57, -68, -116, 98, -72, 118, -262, 55, 235, -132, -119, 258, 104, 266, -54, -129, 195, 205, -49, -40, 10, -234, 211, 27, 27, -49, 158, 55, -394, 58, 97, 29, 26, 121, -97, -96, -27, -24, -55, 130, -55, 132, 219, -302, 287, 35, -148, 85, 234, 128]
7442A28j35j8J30K86k68j87K53j21K4k20K67j54l7J98M4p7j70Q0p4K36k87K4K28
7465A50r8K8j23Q9Q0lm71M81j6J43m54J27J52J57j87pml00Q9J62K49j54r1k7p7
7490a05p1K51l97J28K7L49k01m3j02J61p7J43k61L05j75J52K13m63K14k14J40
7511b6O2j81k5K36j97K20k37O9J14kn7L04j51r2J48k07J18l8r8Q9K33k18q3M62
7535D43n51K54k16J3K10k72J71Kk37J23P5J86l54K43J10l20M3L18m70N6K53Rk16
7558a27J95j27M0j4J0K03j94j94J41j72M0K28l3j49K21J35l48J53o7J67o7l70
7580c29L78P3k31Q0K05k92K32m8m6l15N1K22J89k73K50M2k86M2q4m9L21j58J4
7603a2R2j42J25K70J1l25j11K90j71Q3m26L76K8M1J75k92l3Q3l07K40m0O0j99
$$ y = [128, -7, -25, 105, 391, 123, -64, 189, 68, 92, -128, 139, -15, -52, 146, 190, 113, -57, 23, -51, 185, -102, -78, 150, 52, 80, -43, 46, 126, 123, -348, 133, 117, 260, -194, -67, 85, 242, 55, 48, 44, -256, -167, -5, 244, 90, -1, -28, -105, -176, 75, -322, -194, -167, 182, -19, -62, -164, -3, -80, 63, -198, 107, -68, 84, 297, -166, 48, -166, -26, 36, -145, -170, 66, -131, 89, -148, -79, 35, 33, -24, 280, 129, 37, 185, -22, 96, 58, -40, 49, 282, 64, -19, 443, -108, 146, -70, -57, 153, -119, 52, 54, -183, -60, 15, 201, -153, 90, 200, -120, -77, 241, -229, -173, 80, 89, -127, 68, -59, -19, -33, -23, 180, -14, -208, -67, -239, -199, 29, -4, -153, 68, 203, -145, 8, -59, 108, 41, -329, 49, 122, -109, -29, 176, -116, 116, 68, 22, -293, -242, -20, 169, -104, 146, 188, -98, -56, -140, -189, 132, -26, -12, 80, -62, 63, 333, 344, 19, -92, 198, 27, 110, -316, 60, 88, 129, 304, 12, -21, 62, -245, -5, -45, 15, -184]
7626a84K70j63j9P1q7K32j38r1N3m6R2K7k69L05j57j5J69q0L2p6M8J05j70J44
7650E3J99j29l63K02j59J44K3Kp9J33M8O5m4k54R9K1j72J66K5k32L13ok4J6K04
7675B51k43j00J0OM21k12N5j23K12k86N2L6Qq5P8L4k80K11Kr9j33L17l38M17l8
7700A73n5k51L7j97K20k5K03N0P5j07l06J08R4r6R6L9R7j11L1O2k85K71k08q6
7724a71J63q9q5L8M9o6J70q0J01m8K15j30j03K4j09J7J48J39j71R9l6k85J07k1
7748a24j03K28J0j36L36j39J3jj33J2L33l38J9L93j47j88J71k37J52n3n5m3p9
7771a09J88k04l6J97q7j90L70k61O1J86n2k21L9O1J44p6j61K35K16l02m2Q3KJ
7795D2k6l29M56k37J93k18m6J76r8M3P6M3l85N23j96K9n5j95K6L2M3O7J41k40
$$ y = [-184, 86, -77, -96, -25, -112, 120, -18, -109, -56, -102, -10, 17, -252, 53, -104, -119, 50, -30, 2, -74, -26, 79, -91, 53, 252, 123, -240, -38, -197, -53, -30, -28, -107, 26, 74, 139, 95, -159, -60, -39, -211, -45, -20, -252, 61, 55, 31, 47, 251, 8, -92, -82, -76, 345, 133, 188, 65, 277, -9, 43, 79, 87, 2, 80, 114, -166, 45, 47, -52, -185, 132, -206, 211, 173, 118, -133, -96, -293, -73, -98, 105, 155, 230, 123, -183, -75, 19, -77, 19, 58, 155, 44, 75, 137, -148, 123, -85, -171, -8, -97, -182, -144, -95, -161, 9, -71, 30, -18, 197, 67, -36, -12, -121, -104, 44, 183, 12, 111, 75, -210, -103, -124, -227, 1, 11, -125, 211, 72, 85, 84, -49, -37, 296, -42, -23, 370, 223, 35, 206, -31, 121, 68, 13, -30, -109, 79, -125, -161, 36, -51, -241, 129, -132, -71, 115, 63, -158, -119, -58, 86, 10, -151, 84, 300, -2, -44, 39, 41, 42, 16, -313, 143, -94, 99, -119, -165, 11, -87, -44, 32, 75, -310, 213, 17, 46, -9, -204, -178, -146, -103, -36, 105, -135]
7819a35K59k74L4K04j2O9l1j04j8j58N1M18l72oJ67n02M50J89k89K16j25j47J22
7842Fp7P1J56j10or1o0K19j63J66n9m1J20j30p5K42j17l05Q4J41O6j40K15j26
7866a4K02j14P5j87j19M0Q8j1j10J56m4L46k72j98J84j07N3K55l71K13j58J92
7888I9l06J14K1r3l3K70j05J12j35O2j47n9K94k08J14j94K26J04k65J51J26k57
7910a09J7j0q5J65J14j03Q1l2J0r2Q1L9k38N5J24k01Q3N1J41k61J10J58j88R5
7934Ej67L23P0j43j5K1j16j50K22p9r4J76j01J31n30K32K26P9o4q6r4kO5K99k15
7959go1K00r0j78L10l79J10M6j67J77L02l69L18k83R0L4j35J67k7k79K34Q8m9
7982E2Rk00L60j21p8J06j94J40j38K49k10J0J76k24M1J84k10K4J08o6Mm7k1qk55
$$ y = [-135, 124, -150, -116, 88, 76, 145, 114, 10, -8, -166, -115, 303, -69, -75, 92, -410, 40, 229, -60, 156, 31, -116, 6, -71, 0, 156, 46, 40, -51, -111, 108, -55, 111, 52, 11, 131, 1, -74, 168, 51, -254, -170, -29, 37, -103, 112, -14, 188, 74, 149, -38, -157, -117, -29, -40, -150, 6, -38, 308, 36, -162, 22, -85, -32, 223, -148, 65, -93, 99, -207, -93, -72, -165, -198, 72, -33, 79, -56, 6, -141, -200, 94, -114, 0, -194, 32, 136, -129, 22, 148, -109, -92, -102, -187, -22, 92, -11, 70, 38, 48, -44, 37, 76, -162, -107, 17, -184, -101, -50, 91, -170, -60, 98, -90, 5, -162, 161, 231, 88, 73, 94, -22, -172, 50, -29, -123, 53, -48, 83, -447, -215, 11, 90, 26, -60, -154, -156, -91, 208, -7, -68, 132, 42, -136, 174, -205, -95, -49, -216, -39, 263, -106, 212, -71, 19, 53, -82, 85, 58, -221, 13, 101, 52, 61, -139, 221, 100, 22, 128, -66, 74, -64, 185, -25, -15, 161, -63, -22, 162, -48, -24, 84, 18, 22, -25, -46, -54, -309]
8007c09J84M2L38p4k32j75K76j89R5m1J25J9J9j24p9J64OR1k8j06M2j57L5lj58
8032b39J7J23L6P8k00K36m3P4j45j97K88l8m2q0K29l2j41k52N69l27R7o7K83k49
8056b2q9K04m4n4p8M6k4P2J44l26J32R4n7r3P2l7k6J29J00j17j18L02j68k65K40
8081A7j39K22j38R3k19J54q3J15j52J04L9j26N6K7j11K73j3j1N5l3k79K78o8q6
8105b5q0J43o6L6j7K82k18J52K08n31Q5j22R7K0J83j86K50k42j46K35q7M4K4O4
8129A03j12k05M1K31n3QJ78q4qQQ4r7L3j76J93j3k76J30P1k49L03k34K53rl06
8154a86L58k56J39k20J95J6L33o41L51j3o8p3M4m13L86J53K9j18K0n3J2j65M01
8177B31k02P7k77O9M2%r0J3R1q8K06l5j69K81
$$ y = [-309, -125, -83, 255, 181, -51, -226, 50, -139, -44, -85, 40, 59, 78, -46, -125, 39, 45, 136, 108, 2, 44, -113, -78, -81, -239, -222, -99, -63, 15, -185, 51, 8, 82, -63, -260, 28, -10, -52, -132, 97, 65, -76, -328, 241, -86, 11, -56, 227, -22, -111, 93, 49, -5, -83, -37, -61, 11, 155, -171, -39, 55, -2, -95, -23, -60, -86, 43, 143, 26, -92, 210, 42, -223, 17, -122, 100, -38, 55, -164, -10, -93, 22, -130, -26, 13, -113, -57, -30, -141, 132, 119, 108, 163, 130, -149, 129, 61, -25, -105, 38, -28, 8, -9, 273, 55, 207, 415, -116, -31, -153, -56, -36, 147, -39, 211, -31, -177, 58, -29, 15, 39, 103, -9, -214, -173, 58, 5, 13, 191, 107, 99, 107, 191, 94, 127, -49, 144, 131, -145, -15, 56, -193, 110, -124, 129, 120, -186, 172, -84, 55, -165, 30, 46, 379, -262, 89, 76, 8, -65, -21, -434, -48, 105, 134, 16, 36, -17, -5, -170, 231, 29, 106, -171, -102, -60, -60, -150, -137, -46, -134, 72, 37, -132, 149]
8191A49
$$ Imaginary data points
##PAGE= N=2
##DATA TABLE= (X++(I..I)), XYDATA
0@%%%%%%qJ6j6K4l2M0n6P2q8J06j30J60j96K36k85L43m08M83n65O58p64Q84j021
29e47J175j344J529j734J962k215K498k808L144l513L918m358M842n374N951o580
45c454P267q018Q841r741J0728j1816J3017j4346J5822j7475J9339k1458K3885
58A2591k6698L0009l3967L8796m4834N2632o3123P8022j00904J40622k27533P06976
70E62589k47804j073053J556644j089911j48424J075592q97609J30971M37012
79C06007o88754N44206j20671k13076N04610n42444J40382M11918p31021N10844
89A22001R5087o59308P87716k86882m81234R27705o74842r3243Q19741r45341
99c88600K73173N88837r43767N88980K23032p86229O37477r5102m05466N76760
$$ y = [0, 0, 0, 0, 0, 0, 0, -8, 8, -8, 16, -16, 24, -32, 40, -48, 58, -72, 88, -108, 128, -157, 186, -222, 261, -304, 354, -410, 474, -547, 628, -716, 813, -921, 1041, -1174, 1324, -1484, 1660, -1853, 2065, -2293, 2549, -2825, 3126, -3454, 3813, -4205, 4636, -5105, 5623, -6193, 6824, -7522, 8300, -9175, 10164, -11294, 12591, -14107, 15902, -18065, 20731, -24103, 28529, -34594, 43428, -57476, 83146, -144387, 562589, 314785, -758268, 798376, -291535, -439959, 635633, -261976, -131005, 306007, -382747, 161459, 40788, -172288, 332322, -210122, -69740, 342178, -388843, 122001, 217088, -442220, 345496, 58614, -422620, 505085, -169757, -263000, 556741, -388600, -115427, 473410, -470357, 118623, 341655, -444574, 192903, 97801, -307665, 269095]
109B69095l16925j04819L34955l71223K23170J01330l60060M13518j93223k42439
119b46621N56982m19016o0749N18177o21212J93149M03283o62247M40115J39304
129B41165n87847N52042j30232l40821N30029l32300p0744L65160m19778J93968
139F42J56232l84112L67766q0922k87434M33636k49541j17869L95332l84334P9864
150g0740K72266m15209K90082P0883l54205L82171j76035j81567M02095l31916
160a12175L6527K78335l92793K32570Q3123l16401L39585j20795j87613L30323
170A70686k46629j2963K52849l09155J38245J29265k90549K44510k600k20767
180a47108K68480j29001j11552K44140j82920K3782J27638j80565J37469l2224
$$ y = [269095, -47830, -152649, 182306, -188917, 34253, 135583, -224477, 189041, -4182, -246621, 310361, -108655, -169404, 348773, -272439, -79290, 323993, -338254, 101861, 241165, -346682, 205360, 75128, -265693, 264336, -67964, -138708, 226452, -193326, 642, 156874, -227238, 140528, 59606, -227828, 205808, -43733, -161602, 233730, -150604, -70740, 201526, -213683, 76399, 147282, -206923, 175248, -787, -182354, 219741, -112175, -75648, 202687, -190106, 42464, 125587, -190814, 148771, 27976, -159637, 170686, -75943, -88906, 163943, -145212, -6967, 122298, -168251, 76259, 73659, -147108, 121372, -7629, -119181, 124959, -57961, -34179, 93459, -87106, 50363, 18139]
190A8139j09288K03273j64683o895J95504k52192R9787J50206k69323J56917P4601
201I6046k18239J65569M362j35366J41891n7492m8915J00847q4830M4142L4010
212D2025r2475R6902l8461o1507J15471q8078Q066P9632j29323R6387J3445j26176
224h4092J57642o5823q6803J77532j25574l6352J62633j45028O180J04657j08323
235d3351M4208K6850m9042M5367m4049K1031K6373q7382J01871j7329j07159J57642
247G5030p2169p9394J67558j17754k1710J35509j43404M3692P4053j26067Q9645
258B4989j4270n9234J05480r0434J5737Q0949j31049Q0947K8691j25231J36542
269E3117l7926q4912J40571r3916j2566J01227j25287O9692M0724j33148J36016
$$ y = [18139, -91149, 112124, -52559, -59454, 136050, -116142, -16355, 133851, -135472, 21445, 96046, -122193, 43376, 47738, -87628, 54263, -3229, -52144, 48703, -36127, 8015, 42025, -50450, 46452, 7991, -53516, 61955, -26123, -18057, 61575, -67748, 28639, 42084, -84092, 73550, 7727, -79076, 98456, -27118, -63470, 99163, -45865, -39685, 64972, -43351, 857, 27707, -21335, 24032, -20017, 1014, 27387, -59995, 41876, 24547, -82612, 75030, 2861, -76533, 91025, -26729, -48439, 87070, -56334, -12642, 61411, -64656, 24989, 10719, -48515, 56965, -33469, -17732, 63217, -67832, 13115, 41806, -83425, 53117, 15191, -69721, 70850, -23066, -35632, 65595, -59692, 10000, 50724, -82424, 53592]
280E3592l0423j02805J62064r7773m1029J41743j29750K5355Q0826j25402Q8867
291B5265o932q4536J39477r5849k4465J43420j56411L8900J15144j80836R4297
302G474P0623j68534J22602Q154j08416J17248n4218k6161Q4641r7097N5724L0167
314D2207j14972J29859m4594r7800J77630j12899n1440J77342j59221J0736J39697
325I6545j78358Q0951P3704j60103J29369j1750j04908J44372q8799l2936J32419
336H0506j39221M2088Q7678j49817J05242J3576j16027J35611o1659m8519J26344
347G5802j26801L8044Q5994j66086J26776K1931j66423J84924m9255j31013K01754
358I5647j03802p1931J78944j35337L10J13670j33720O8796K5132j00995J15729
$$ y = [53592, 23169, -79636, 82428, -15345, -56374, 85369, -44381, -19026, 61800, -63602, 25265, 18333, -66203, 73274, -22575, -47040, 96380, -60031, -21131, 94013, -86823, 7474, 78097, -90437, 32165, 40319, -68097, 49151, -5067, -31228, 53413, -43684, 12040, 42207, -72765, 57094, 12500, -85300, 92330, -20569, -72009, 105333, -53888, -43152, 96545, -81813, -862, 72842, -87261, 42108, 30358, -74550, 69822, -18977, -51913, 80506, -58715, -16627, 71051, -78766, 26476, 40052, -75975, 59636, -2023, -50542, 75802, -50999, -12955, 73039, -93047, 33729, 55660, -110763, 74161, 24906, -106107, 95647, -8155, -80086, 98858, -36479, -36169, 77501, -56219, 12577, 37709, -63286, 52443]
369E2443n9396m6330J34194j27535K2415J11703j63475Q7167N7232j53466J30175
380D5127j4481j08215J46564q4321l5956J31858j36502M4518Q4411j54485J12014
391C0532K0925j42088J53715m6098r7159J63236j05842l0324J34663j36458M0238
402a4660P7191j31679R7913K196r8386J28197p1172l8164J21801j18819K6956
413a8626Q4576j32925P8341L1840j11652J09532l4566n9409J15858r4675Q308
424b3398R5062j36983P3226N6803j53466J26641Q023j40177J50213l5176r4640
435g3872J35306o2780l9876R0647p0353J6053L1776n6622N5338k9764k4684P5035
447D6204p4747J0362P3453j02526M6842N2317j12390Q3848J3305r9848J09623
$$ y = [52443, -6953, -53283, 80911, -46624, -24209, 87494, -75981, 11186, 68418, -85048, 45127, 30646, -77569, 68995, -15326, -51282, 80576, -55926, -11408, 73003, -81482, 30532, 51457, -90631, 63084, 16986, -80173, 83063, -22779, -53103, 81560, -54898, -14660, 62531, -69148, 28765, 30961, -67425, 60772, -10400, -48564, 73237, -45582, -18626, 65950, -66975, 11366, 43206, -68446, 41086, 6520, -52889, 62969, -31706, -23398, 71664, -65319, 7907, 64710, -88756, 37885, 45908, -94269, 55944, 20768, -73872, 61434, -1346, -41222, 49425, -20928, -4875, 26901, -29721, 25617, -4147, -28831, 46204, -28543, -18181, 55272, -47254, -412, 51905, -60485, 23363, 36668, -63180, 46443]
458D6443l3957p0997J20309p7747l0808J15783j07578J1736R1144j09609L8948
469f333N4726q9554M5861J9466n1876M0259j4397m446J5950l7349N0674j8624
481D357n0238R6470n8498m8613J31113r8747k9721J38679j26823M624J14970j28038
493e0465L5029P0020j04769N5478K0995o3616O0315k1481j9568M3828m2048J6154
505a28J8531m3805M0291j1355k8783N5865m9314N235N6608q3155M2666M3908j03070
518e6506P6686K1649j07110R8989o697q7139R9462k4892n8393P7106k7783l2287
530b6915M6744j8973q187J1531m942R335k0378J6067J5250m9113L6273K0509o8688
543d1487N6538J3838p7376P2292n378o3700P6326k3045m0770O2177l4480j3021
$$ y = [46443, 12486, -58511, 61798, -15949, -46757, 69026, -38552, -26816, 64328, -45281, -6333, 48393, -41161, 4700, 24166, -27710, 12549, -1848, -6294, 9656, -27693, 22981, 4357, -45881, 50589, -7909, -56522, 74591, -24156, -53877, 84802, -42021, -37397, 77573, -50465, -15436, 54584, -50185, 5293, 26288, -37328, 22987, 1506, -18062, 25766, -16282, -128, 18403, -25402, 14889, 3534, -25249, 30616, -18698, -13463, 43145, -40010, 2656, 46564, -56506, 20180, 41829, -65281, 33708, 27011, -60128, 39334, 14442, -43951, 33155, 5372, -26915, 19829, 856, -7331, 4200, -742, 8593, -11785, 4282, 19532, -29581, 6692, 27201, -41487, 15051, 28889, -48487, 23805, 18427, -45273, 31053, 8008, -32762, 29415, -5065, -18086]
555a8086L9839l7080J1939J6123k7746K1537j970j5949K0013j0536l007J2479
567G556j6628J3876l292j5162L1399k5912q941M7259m3575l985N2657n4077L831
580a4994M5344m7982Q047L0579k7568k85J6118m638j0381L070J3622j6964l129
593i161K5759k1636m586K6190j9252p108K3821j5188p910J9900j2625l307R898
606D795o044J074J855j144J348l102L549j738m870O667n024K417L718q949J2256
621F808n296j0157J7296r386j0341K0213j0506j0333K0751q929j0859J6956k115
634D102j1679R016M192q203l989R969J28j8594K1924L388l2269L3733K616m0805
648b6471L8694l76l6154L8951j1024j9332L0599j8846r19J4817k0486J7680l245
$$ y = [-18086, 21753, -15327, -3388, 12735, -15011, 6526, 4556, -11393, 8620, -1916, -4923, 7556, -9072, 4804, 1512, -13650, 17749, -8163, -17104, 30155, -13420, -17405, 35252, -18825, -14994, 30350, -17632, -9585, 20994, -6574, -6859, 9259, 4621, -5760, -2690, 10932, -6032, -9161, 16598, -5038, -9624, 16566, -2686, -9794, 14027, -1161, -9071, 10829, -1796, -5103, 4795, -1249, -175, 1680, 536, 1884, -1218, 2331, 593, -4277, 2390, -2634, -217, 3501, -5448, 6808, 1512, -8645, 8651, -735, -11076, 9137, -1369, -11702, 9049, 120, -10739, 6217, 4102, -7577, 1439, 5631, -2572, -6561, 3408, 3536, -15058, 6866, 10254, -22015, 11718, 14334, -26471, 12223, 11847, -24307, 14644, 3620, -15712, 14887, -3959, -4878, 9939, -10547, 7133, 3888]
661C888j9877L3136k0906j1042L7268l4223O250K8073l9587K2777Q687l6844L9219
674A6819j8237j8895M8776m5951Q388M2970o2084L2070K5076o3876N0507Q36n0246
687c3847N7033k2373k2298M4298l7069J2375K0238m2630M0877r615l6725O1975
699C2239m1192j8871O8493o1094L921N4612o6677K6378K7577n7782M6585q381
711E808l1346N4529m3079J925M7089o6152L3046L1282p5471N6870P769o5183O6772
724B3859j7372l8055O1594l7506o014M2703n1475K7590J4406n4233N7493j7217
736E773m0267P0348m4110j6223O5223o3241J3775M3730o7369M3557P241n2900
748c4463O3541l1204k6285O9802o2257M529O1006q1276L6188L6768q0313N9348
$$ y = [3888, -15989, 17147, -3759, -14801, 22467, -11756, -5506, 22567, -17020, 5757, 14444, -22400, 16819, -1418, -20313, 28463, -17488, -9100, 33870, -28214, 3856, 28932, -34944, 15563, 16399, -33847, 23186, 813, -21485, 22813, -14256, -1881, 18357, -24273, 16604, 6989, -29736, 32239, -8953, -27824, 40669, -20425, -16504, 38108, -28569, -2191, 25386, -32396, 14189, 5808, -25538, 28991, -14088, -12163, 34926, -31226, 1820, 33102, -42369, 14501, 22270, -42913, 23859, 6487, -31568, 30026, -7480, -13494, 29209, -22266, 5324, 19730, -34503, 22990, 5773, -34494, 35854, -8256, -24479, 40744, -22497, -8722, 35008, -32361, 11196, 18437, -34463, 29078, -2126, -28411, 41391, -20866, -16337, 44669, -36607, -419, 36349, -43964, 15384]
760A5384P287o0721O4901k2270k8820N4502m8021J1423L1052n8074M8739l759
772A1623m9117P2904l8303l1117P9646o3168m780O5495p5297K7277L5922o9567
784c8482N1309K528m9901O3788l2173k2603O4045o0475Q424N0220o9336L4662
796B006K4758o0461N0795p907l7888N6142l7674l752M4287n8591L3695K0770o5814
809c9634O1647m839n7821P6001l4102l5271P3950n5830m023N5052o0984K6066
821B12K5316n5680N0498j1535l7962O1349m2660r056N3899n9429K0678L4251o2384
834c2503M3765O860m8591N4160k4245j9967N0133m8703J2070L4509n9109M1401
846I780J0898n7524O1200j6272m2723O4650l5303j7694N2010m3818Q291K8012
$$ y = [15384, 22671, -38050, 26851, 4581, -24239, 30263, -17758, -6335, 24717, -33357, 15382, 11623, -37494, 35410, -2893, -34010, 45636, -17532, -22312, 43183, -32114, -4837, 31085, -38482, 12827, 15355, -34546, 29242, -2931, -25534, 38511, -21964, -13540, 36680, -32656, 2006, 26764, -33697, 17098, 9191, -28697, 27445, -10229, -13981, 30306, -28285, 5410, 26180, -39634, 22013, 17174, -40647, 35354, 1252, -34019, 39931, -15899, -19922, 35130, -25854, 212, 25528, -30152, 20346, 8811, -29151, 32198, -10462, -19518, 34381, -25048, -4370, 29881, -32503, 11262, 18122, -30469, 23691, -554, -20521, 29612, -19091, -7021, 27488, -31621, 9780, 20678, -36846, 24354, 8082, -34641, 30009, -5294, -22988, 29022, -14796, -6505, 21507]
858B1507m2656K9949j263k9226M1822k6867r483M1421m2065R281L1308m4763K5064
871D029J1536l6417L4693j1371j9461L5583k9590K411L1190m2613K0832K1996
883B2818m7250L2087Q504l9486L4275k635k5277K8690j0389r036J6222j3867Q810
896C466m69j1523K1152j6879n488K7880k9062L586K9030l7145J3437K1769l7728
909a7974K0525R996k9941K3958r23j8188K2893j1877m356J5659j7057P309O335
922F359j4716J1665j636p988J0629p598K629M898j1666J4699o614j2177K4132
935A2616j6036j1150L2147k2346r318L2782k3595o146K5330j7691n764J6706o368
948A167p745P649N221j0408j606J6899j4094n687K2195j7389m958K1513j7163
$$ y = [21507, -21149, 8800, 7537, -21689, 20133, -6734, -16217, 25204, -16861, -7580, 23728, -21035, 4029, 15565, -20852, 13841, 2470, -16991, 18592, -10998, -8587, 22603, -20010, 822, 22818, -24432, 7655, 16159, -23327, 10948, 8313, -16964, 11726, 1337, -7699, 8523, -5344, 3466, 2997, -8526, 12626, -4253, -9741, 18139, -10923, -7337, 21693, -15452, -2015, 19754, -17974, 2551, 12547, -17394, 6564, 5641, -12547, 10346, -1531, -5887, 9772, -7285, 24, 6359, -8357, 3308, 1672, -6316, 4313, -3285, -656, 4242, -7424, 7275, 661, -11516, 12616, -3420, -14570, 17577, -4769, -14087, 18695, -4900, -11046, 14284, -3407, -9171, 7535, 1167, -6578, 1071, 6292, -4116, -5722, 11177, -2917, -8604, 13591, -3798, -8756, 12757, -4406]
961d406l697J9729j6151J225J2378j4169O137L093r296P833j649m086P088n235
975a206K013J340m792O692p488L599O231j6174J3873L511k2374K2938m13k5279
989a7529L0229p186k2492L0016j0944j6534K3906r061q338J2957n849K124m012
1002b713J274J0096k0530J3435J1283l2125K4748Q208l6686L3423r67l0920L6572
1015A5098j4200j5900L1471k3466J84K0543k6064J5055O081k2968K4363r096j2219
1028a1118K3222j9435L820J5019k4889K0488O52k4949L4404j8446j5660M1071
1040B4179l4828j817L8534m3681J2369K8347m4115K4719J2249l4061K8134m993
1052E036j7559K4167j6720J498J4180k3557K0107p00k4084L4020j7146j6763L9836
$$ y = [-4406, -8103, 11626, -4525, -3300, 9078, -5091, 1046, 4139, -5157, 2676, 1027, -3059, 4029, -1206, 807, 2147, -2645, 4047, -3441, 158, 6389, -9785, 4088, 7599, -14775, 8163, 7750, -17529, 12700, 5514, -16978, 13038, 2094, -14440, 9466, 405, -7933, 5024, -825, 1299, -2713, -1439, 8657, -11873, 1562, 12845, -19280, 5468, 13676, -23010, 10413, 9446, -21474, 15098, 898, -15002, 16469, -6997, -6813, 13730, -12334, 2721, 8802, -14166, 10197, 1101, -11118, 12104, -7331, -3511, 11508, -13381, 7107, 7759, -17190, 17214, -1232, -16892, 24179, -10649, -12466, 26068, -17613, -5244, 23103, -21012, 3707, 15956, -18105, 10029, 5036, -12523, 11644, -5076, -3578, 10602, -12955, 7152, 6452, -17632, 16388, -758, -17521, 22315]
1065B2315l0545m749L7137l9892J1041K5302m1679K6898N976l3395L6701j4487
1077F23j9059L9238k9953j418L2793l8925J5564J8672l7545K7224O16k6121L2311
1090A4020j8094o958L0427l5009J5178J9582m3503L5480K620m1452M8020j5842
1102D469k9330M9979l2260q073L9454m0115J4984J8130l7967L2661n369k7435
1114b0872M3560k7961j0258M3125m3639Q896L1860m6866K5431J3357l9385L6569
1126A3817r300k2111L8372l0556K748K9478m4030K6687J2387m5702M3958p076
1138H672l6492N1166k5056j7771M4590l7085M002K8447l9444K3308P577l4036
1150b2122L8577j6210k0132M3519l4274k126L7246m2698J6188K1668m1353L0340
$$ y = [22315, -8230, -12979, 24158, -15734, -4693, 20609, -21070, 5828, 11804, -21591, 15110, 623, -18436, 20802, -9151, -10569, 22224, -16701, -1137, 17535, -20010, 7214, 7830, -18291, 14020, -4074, -11032, 19395, -15614, -436, 19146, -24357, 11123, 13743, -27709, 20311, 4469, -24861, 25118, -7142, -15215, 24239, -15876, -892, 17238, -20729, 11932, 6563, -20872, 22688, -5273, -15531, 27594, -16045, -7149, 24711, -22155, 3276, 16633, -22752, 13817, 4517, -17594, 20778, -9778, -7030, 22448, -21582, 5105, 17492, -28210, 15748, 8672, -27820, 23346, -1710, -19481, 25109, -11976, -7974, 20473, -18971, 4337, 11914, -22122, 16455, 245, -19887, 23632, -10642, -12768, 24478, -18220, -2032, 19636, -21717, 8623]
1162H623j11k8359L7223k2435o851L2873l8090J5314K1817m4649L3428N755m0506
1175b5968M2951j2086k5867M1655k5592p160L0800l1586J2828J3016l0761K9666
1187A1896q008k1022L6764k5350o277L3904l5232R138K3117l6690K2299O002k7565
1200a7024K8852j1177j2574K7579k4283L839K1068l1379J8068J0028l1221K7677
1212I453k875k3226K9014j2461j1326K4494j9478K975J3670k1092J5638m49j6622
1225a2285K3207j2576r095K4652k0940J37K0969k4876R581J0947k1217J5682n60
1238C626j3444J8559j1105m274J8310j9730N988J3149k2501J3476N715j9280J6564
1251E053j686j1466J5064q795q12R146j2961J0373l54j2238J7038q874q204K0408
$$ y = [8623, 8512, -19847, 17376, -5059, -11910, 20963, -17127, -1813, 20004, -24645, 8783, 14538, -25968, 16983, 4897, -20970, 20685, -4907, -12067, 18733, -12853, -25, 12991, -17770, 11896, 3888, -17134, 19630, -5720, -11997, 21907, -13325, -4187, 18930, -17760, 4539, 10541, -17024, 11828, 651, -11923, 15656, -8627, -4788, 16280, -15099, 2969, 12997, -18224, 9453, 6578, -16648, 12366, -95, -11421, 13073, -6405, -3430, 10240, -10852, 4786, 4337, -12285, 10922, -1654, -10749, 13903, -7037, -6900, 14069, -10807, -1226, 9721, -11496, 4186, 3626, -9818, 8741, -2364, -6638, 11672, -8058, -2070, 11079, -11422, 2054, 7769, -11511, 5053, 3367, -8099, 6965, -1830, -2642, 6504, -6457, 3916, 3562, -8676, 8362, -512, -8716, 11692]
1265A1692j5504k735J8669j8256L917J1289j6251Q675K870j0159R737m518j983
1278b557Q413j0396N200M153j0951R835k437o613J0509p047p20P996j0694P113
1292A804J606j0424J2845n765p767J5304r644m383J4077j0608l38Q308q004K495
1306d94J274j400J705n461P069n19r626J3273m053j0602J7166q615p894J6910
1320H733j1325k477J2409j1366L037N622r495Q179l086m279R874r464J845P847
1334F054j1953P254L156j1296J1955m145n517J2083j2202L011R835j7372J1678
1347B541M661j8709J8580k288j6395K1084q506j0226J8086j0827k236J0678j1117
1360d674O379m30o813J3375j2628O71J5585k1801Q502J4329k5815J4985R246k4698
$$ y = [11692, -3812, -6547, 12122, -6134, -2217, 9072, -7179, 1496, 4366, -5793, 3944, -574, -2557, 5856, -4540, 660, 4813, -6138, 3697, 1260, -5353, 5156, -1891, -2611, 5385, -5309, 1804, 3410, -7014, 5831, 66, -7701, 7603, -2041, -6424, 7653, -2955, -3293, 5015, -2989, -494, 780, -620, 1085, -4376, 2693, 2174, -7452, 5821, 1768, -8834, 8332, -283, -8177, 8733, -2592, -5069, 7340, -4026, -989, 4633, -4862, 3317, 231, -4048, 5826, -3638, -1793, 6054, -5899, 1355, 4511, -6785, 5170, 1025, -4492, 7591, -4611, -1600, 8235, -9137, 2541, 7202, -11507, 7073, 4785, -11610, 9474, 968, -9258, 8828, -1999, -4235, 6443, -4674, 1705, 1275, -5538, 7837, -4791, -4120, 11465, -10336, -1834, 12495, -13320, 1665, 10911, -13787]
1374a3787J9757m90j6575J8692q874n311J4441j4811O654P551j7534J5751j113
1387D351j5075J9789r715p642J8384j5696K144J2638j8754J3324J861j7231K1961
1400A0339r862j2358K6379j9138m824K5316k4527L681J9421k4915J0685Q975j8602
1413i430J3386j609q230J2837j1167L469R063j8629J6060O89k0257K5072q702
1426B552j7310K9249j7468q818K8221k4569K858K0074k6231J3012P876k2879K0380
1439F947l834j5226K3393j4663l952J9314k0541P732R751j9760J6361k656j3556
1452a0690K1591j5760k025K1340k6885J1669J5250l1598K2016N958k9312K8441
1464I995m604k1652K9584j3913r206K2470j8725L368J1398j8205J3650j072j2819
$$ y = [-13787, 5970, 5480, -11095, 7597, -1277, -6588, 7853, -6958, -304, 7247, -10287, 5464, 4351, -10724, 9065, -650, -8292, 10092, -5604, -3460, 9178, -9576, 3748, 5609, -11622, 10339, 477, -11881, 14498, -4640, -9464, 15852, -8675, -4994, 14427, -10488, 197, 9172, -9430, 3956, 2347, -5883, 6954, -4213, -744, 8319, -10310, 5750, 6439, -13818, 11254, 2552, -14758, 14491, -2977, -11795, 16426, -8143, -5285, 14789, -11442, 1570, 9446, -13433, 6947, 3113, -12113, 11280, -3383, -7335, 11979, -8562, -830, 8921, -10839, 5522, 2866, -10690, 10901, -4859, -6884, 14456, -12429, -760, 14490, -17108, 4908, 10866, -18446, 9995, 5391, -16261, 13323, -590, -9796, 12674, -6051, -2683, 8715, -9490, 4160, 3088, -9731]
1477i731K0014j3876k869K0250k2929P270J4881k5892J6529N349k3357K3381o290
1490B730j5089K5453j6543l918K1091k2168O350J3898k3796J5129M763j9739J9180
1503G341n105j0343J7218j2677K31J1480j6723J1697K169j6936K0621p538j2848
1516a1413K4081j5352o437K2390k0364J435J6972k0899R658O984j6387J4642l518
1529A792r526J6378j2825m79J4520j8610Q194R153j9169J4489J509j5348J6531
1542F609o075p510J5522j3339K043J1381j7371J0963M384j7087J7229l663j2830
1555i744J9046j0496o534J7435j4156J921J0433j4555R036K441j2315J3596o241
1568a33o542J5709j3672N77J3696j6840O592Q951j6510J1031J974j2354J2797
$$ y = [-9731, 10283, -3593, -6462, 13788, -9141, -1871, 13010, -12882, 3647, 8996, -14361, 9020, 2730, -12359, 13094, -3449, -7367, 13724, -8444, -2094, 11804, -11992, 3137, 7900, -11839, 7341, 2236, -8107, 9111, -3566, -3335, 8145, -8578, 3119, 5288, -11648, 8973, 1435, -11413, 12668, -2684, -9121, 13269, -7095, -5660, 11312, -9587, 71, 7055, -9332, 5310, 1792, -7734, 8644, -4181, -4660, 9860, -8750, -556, 8597, -10572, 3917, 5426, -9922, 6609, 534, -6976, 8546, -4793, -2750, 8631, -8740, 2223, 6607, -10480, 6749, 3086, -9744, 9302, -1194, -7728, 9707, -4449, -2528, 7905, -6650, 2386, 4827, -7488, 6108, -133, -6675, 9034, -4638, -4061, 9635, -7205, -613, 8338, -8172, 2859, 4833, -7521, 5276]
1581E276n598m502J1456j1671M965O812j5097J2593P02j5272J7472n511j1217
1594i592J7923j0072m524J4235j1632J679P220j0585P394q10o820J1156q397j029
1608c854J0654j2004M234P606j3262Q208K509j0671J0422l825m314R466q459K087
1622a203O977j0872O603L045j1401J0319r84q313J0092l546m497P420m129k39
1636g28K957l924L425j944j609N472o150J331N815q121L334M916q724M394K931
1651C375p150M805N13l499K952j296L52J131l114L251l60l968N219k293k797N022
1667B143k212j729K993j266n05L96j10J074k767J898J875m766L327J988n665M361
1683A035R65n120M216n23k377L250k611J148J250l459L865j162k703M909k811
$$ y = [5276, -322, -4824, 6632, -5039, -74, 6738, -8359, 4234, 4936, -10336, 7136, 1625, -9592, 8331, -1741, -6265, 7970, -3662, -1983, 5237, -5348, 2046, 1236, -5584, 5572, -2825, -3854, 6800, -5204, -970, 6636, -6626, 1582, 4091, -6580, 3842, 17, -4297, 5169, -3290, -1203, 5774, -5098, 1505, 4550, -6851, 3468, 2484, -5829, 4263, 717, -3780, 3640, -489, -728, 2229, -1695, 1730, -214, -1823, 3649, -2501, -1170, 4645, -3476, -142, 4774, -3950, 444, 3375, -3775, 1030, 1543, -1956, 996, -300, 52, 1183, -1931, 1320, 960, -3008, 2211, -82, -2879, 2143, -69, -1798, 1195, -71, -576, -180, -290, 784, -1983, -85, 1790, -2976, 351, 2339, -3326, 1035, 2000, -3120, 1096, 573, -1804, 1446, -1165, -17, 1233, -2226, 1639, 477, -2226, 2683, -128]
1698a28j884M669l749K98K504k899K395j222j092M294n172J512N044r309N566
1713H27L969j1055Q505J945j0202R247o68p721Q749l565k448M927m517L128Mm437
1729c312P270n126k350R979j0222J251Q999j2304O048M878j1616R572j74r475
1743f582J2104o929l816J2404j1900K433R472j4188P918M300j2654J1053j721
1756A894p516J1336q480Q77P429j2182R435J152j3137J6380n732j1319K0330j3083
1770b616n220J9350j7234K075J3333j7312Q512M818j3298J2857n089n991J4258
1783H443j3623L671J0169j8258J3173L281j8323J9338n162j3253K1136j3131m242
1796f781J7538j8011N932J0548j9565J4275J356j5892J8923q212q395J8361j4562
$$ y = [-128, -2012, 2657, -1092, -794, 1710, -1189, 1206, -16, -1108, 3186, -1986, -474, 4570, -4739, 827, 4796, -6259, 2246, 4191, -6011, 3236, 2568, -5153, 3596, 31, -2417, 2510, -2007, 1121, 1125, -3312, 3958, -1168, -3518, 6461, -3761, -2510, 6489, -5815, 233, 5111, -6505, 3067, 2893, -6582, 5522, -1407, -5223, 7181, -4719, -2286, 7186, -7002, 916, 5216, -7438, 3615, 1894, -5622, 5714, -2766, -1889, 5540, -6642, 2793, 3945, -9192, 7188, 1456, -9863, 10467, -2616, -7836, 11514, -5720, -3645, 9688, -7624, 888, 5706, -7592, 5265, 176, -5815, 8443, -5180, -1509, 8660, -9598, 3575, 6856, -11467, 7871, 2709, -10544, 10592, -2539, -6781, 10757, -7254, -1322, 9226, -10339, 3936, 5292, -10600, 8323, 111, -8284, 10077, -4485]
1809d485N49J2715j6655R475L514j4536J6890p487p797J8670j6954J276J7190
1822A2365k2768R793J1910k3905J6061L769j9493J8913m538j0710J6823j1152
1834b932l88J1076j5146R723K198j3960J7325q000q783K0012j5887j349J8311
1847A2200k1006P436J1971k1853J5306K005j7632J9839p265j0299K0005j4427
1859c720j231J5584j8137P467P629j6760J3871j779j0295J5428j1280o35J2987
1872I129j7734J0417O116k0070J8956k114j7692K3531j0118j1377K3296j6112
1884c772l109J7951j7948N504Q606j5053J1499j709q778J4048j0587m69J2267
1897H450j6392Q514O355j6911J5281k055j3314J8639r910o511J8571j6902L063
$$ y = [-4485, -3936, 8779, -7876, 1599, 5113, -9423, 7467, -20, -7817, 10853, -6101, -4825, 12365, -10403, -610, 11300, -12605, 3456, 7225, -12268, 6645, 2107, -8603, 8220, -2932, -3320, 7756, -7390, 2333, 4531, -9429, 7896, -104, -8887, 11125, -4762, -6111, 12200, -8806, -1370, 10601, -11252, 4054, 6059, -11573, 8266, 1001, -9298, 10707, -3720, -4951, 10633, -7504, -37, 7592, -9168, 4703, 2924, -7371, 8057, -3223, -3858, 9129, -8605, 1812, 7928, -12142, 6814, 4700, -12992, 10539, 421, -10956, 12340, -3772, -6881, 11070, -6878, -1374, 7232, -7821, 3678, 1969, -6809, 7239, -3348, -3817, 8450, -7942, 572, 6927, -9984, 5297, 3242, -10072, 8567, -1343, -7854, 10717, -6185, -3122]
1910c122J3303j9415J0376O279j7340J4513q34j2358J5054o941m309J1034j0097
1923c857L779M199r804R816l402o624J3992j1772p50J4246j6800N935R977j7500
1937h565J0254M866j5139J3152j935r170J2392p221j551Q240r364M169L698r330
1951e504Q777j674o714J0405o892j684Q426q945M013L001q276Q012j863o303J0638
1966E417p113k384J0407j0055J567P809r854L624L919p031N065o07l096M725m017
1981a624J119K850n879N400j73n497O602k157m385O875l766j336M733l830J081
1996A3J744l141K762j687j107M585n445J737L881o100K888K738n783M082J059
2011B226m527L652q66j522K280k226J620Q0k386L601j644k436M635l526j73L932
$$ y = [-3122, 10181, -9234, 1142, 7421, -9919, 4594, 3760, -8598, 6456, -485, -4794, 6240, -3857, -78, 4121, -5683, 4133, 731, -5893, 8099, -3673, -4423, 9823, -6977, -1042, 8935, -8565, 1689, 6555, -8584, 4568, 2633, -6537, 5855, -1366, -2917, 5323, -4041, 128, 3826, -5504, 3273, 1599, -5115, 5290, -1602, -3286, 5140, -3805, 208, 3209, -5067, 2945, 1082, -5221, 5417, -1696, -4080, 6327, -3728, -2161, 5648, -4206, -582, 3337, -3694, 1371, 764, -2332, 2393, -1624, -505, 2345, -3534, 1866, 1693, -3804, 2798, 641, -3744, 3131, -635, -1971, 2762, -1068, 13, 1757, -1384, 1378, -309, -1416, 3169, -2276, -539, 3342, -2758, 130, 2868, -2915, 1167, 2226, -2301, 1351, 485, -1037, 1243, -983, 637, 717, -1669, 1932, 288, -2148, 2487, -1039, -1212, 2720]
2027B720m385J747J317l449L532j583j716M785m889M53N127p079K888M124p394
2042c802M276J932n580M207l91k502L004k667K013J66l593N942l422l167Q315
2057D731o545j526Q855q959J863O419q919M473K666p028O536j610m070O737n549
2072a926Q33N111q399N627J760p876Q056k031n321Q722o118p46P015q637M883
2087I53K427q529Q919k323p235J1681o737l748J1104r637R67P620j0013N222K789
2102C460q193Q185l334m039R351r001J793P538j1559O759L779j1307R826o83q975
2117f400J1492n640l630R705r479K971N556j0278P961L19q684J1137n141n630
2131e741J2444r808k11R762j1300M638N188j0706Q376m14p671J0404o064k359
$$ y = [2720, -1665, 82, 1399, -2050, 1482, -101, -1817, 2968, -1921, -1468, 3659, -3420, -532, 3592, -3802, 474, 2406, -3174, 1033, 642, -1860, 1144, -1523, 490, 656, -2937, 3005, -417, -3584, 4731, -1814, -3340, 5515, -3444, -1581, 4838, -4081, 392, 3058, -3970, 2566, 956, -3114, 3623, -1926, -1093, 4018, -4381, 1246, 3006, -4870, 3186, 1155, -4166, 4556, -1562, -2308, 4707, -3930, 953, 3380, -5149, 3770, 1447, -5788, 5893, -844, -4592, 6512, -3125, -2158, 5462, -4551, 671, 3460, -4733, 3452, 118, -3921, 5430, -3571, -1778, 5760, -5799, 960, 4739, -6568, 3258, 2575, -6400, 5092, -548, -4178, 5527, -3952, -981, 4575, -5703, 2258, 2577, -6107, 5030, -111, -5741, 6703, -3105, -3316, 6446, -4854, -216, 4972, -5734, 2642, 2228, -5443, 4961, -1103, -3462]
2145c462R344j0048L583O198j1863Q433J487r974J1110m152n580J0863q409j74
2159b644Q683j0879N621M282j1823J0362p12r754J2377n161n649J1435q150m68
2173b480P645r251M758K303p866Q592l692m423J0492r430M12R939j2714N319O900
2188F504j3704R341J830j0962J1049l166o403J0859p249j000Q596j0417M917L693
2202C888r875R114j457p578J1203o285k898R794r808L293N501j0874Q757j36r132
2217f493J2027n679n733J3281j0197j163J1379j2289L927O282j0644P103J051
2230B852p348Q538m767j577P269r307N094L653j0623R925q63r726J2366m811o837
2245f162J2493q049j953R208r046K931M147p855O281l54n683Q497n789j265P285
$$ y = [-3462, 5882, -4166, -583, 5615, -6248, 2185, 3672, -6302, 4808, 656, -4924, 5939, -2470, -2644, 6039, -4840, 781, 5063, -6760, 3602, 2890, -6864, 5513, 352, -5297, 6138, -2012, -2480, 5165, -4086, 672, 2975, -4891, 3701, 9, -4414, 6078, -3352, -2940, 6999, -5715, -396, 6504, -7200, 2141, 3971, -6991, 4058, 892, -5511, 5348, -1901, -2901, 5695, -4722, 195, 3888, -5987, 3127, 1670, -5908, 5295, -990, -3888, 5906, -3902, -609, 4892, -5982, 2775, 2639, -6493, 5534, -145, -5878, 7403, -2794, -3957, 7422, -4867, -940, 5342, -5302, 1801, 2852, -4496, 4042, -725, -2302, 4967, -4340, 754, 4407, -6216, 3709, 2846, -6880, 5486, 675, -6162, 6331, -1718, -3671, 5537, -3509, -578, 3569, -4286, 1995, 1641, -4042, 4455, -1334, -2599, 4686]
2260D686q369K868M878q873O284Q57p284Q575l884l611Q905p751N12P312r370
2275d265L941M728r597O468J924p869P105j400l881N224l351J32K429m026M208
2290A770j358l350P392o053j328Q334q177M75Q047r559K666O154r048M531K638
2305C134o246M679o6l730M044k132m80K669l478K521M20l174L765k103j235L954
2321B542m107J197K884n512M003J234o261O546j268n215P102k962l938O969l528
2336c14k639N507l124o58K379j100m00J3M21N06k436K759R1m060M883j143l758
2353c073N846k301l448N585k716k174M607l196J50K415k680J324J66j341J652
2368H16j031k74J337j751J335M4j247K160j929P2K335l468J461K400m665L261
$$ y = [4686, -3683, -815, 4063, -4810, 1474, 2331, -4953, 3622, -262, -3873, 5032, -2719, -2207, 5105, -4265, -324, 4404, -5193, 1275, 3199, -4670, 2435, 1035, -2846, 2378, -973, -841, 1588, -2438, 1770, 412, -2938, 4454, -1599, -2927, 5407, -2770, -2295, 5752, -3807, -1141, 5013, -4035, 496, 3134, -3112, 1567, 1501, -2229, 1815, -317, -797, 1872, -1606, 915, 1335, -1839, 1926, -177, -1412, 2542, -1565, -368, 2516, -2996, 1007, 2241, -4020, 2526, 1258, -3957, 3145, 183, -3755, 3214, -314, -2953, 2554, -570, -1228, 1151, 51, -349, -336, 85, 591, -1845, 914, 1005, -3055, 1828, 685, -3073, 2773, 472, -2976, 2609, -107, -2281, 2326, -870, -720, 1695, -985, 339, 505, -836, 816, -215, -489, 848, -903, 432, 476, -771, 1389, -540, -468, 1867, -1601, -140, 2260, -2405, 856]
2384H56J091m354L651l61k919L470r17j277J404r36J055j275k69K735l714J334
2400d26L080n127K512K292n502L733J339m824M248p45k467L423k448M86J743l066
2416a749K536l73k792M426k735j313M494m176Q58L337n107L057J078m660M869
2431A750j640k853N769m363k90M950n656J559L352n193L458N09l648M290k220
2446b26r44L819m623K306K072n799N628p68n822Q149l329m165Q174n549j721O940
2462D142o023P69L900n624M056k46l276M978l727m96N255o738K618L925p623N463
2478A353J117o793O953j959m427P643n313p31O222p411L139L839p864O075R2o251
2494d316P404l201l189O899n396N83M385o678M731O43n844P515l658l738Q835
$$ y = [856, 1947, -2407, 1244, 883, -2036, 1434, 517, -760, 644, -292, 763, -512, -781, 1954, -1760, -426, 2654, -2473, 39, 2331, -3171, 562, 1901, -2923, 1325, 580, -1887, 1536, -912, -426, 1317, -1749, 787, 414, -2378, 2048, -687, -2000, 2494, -1682, -824, 2513, -2594, 463, 1541, -3119, 1750, 110, -2743, 3026, -1337, -1627, 3323, -2333, -774, 2578, -2615, 843, 1352, -2296, 1994, -226, -1170, 2649, -1974, 332, 2404, -3395, 2233, 1465, -4357, 3792, 463, -3702, 4472, -1077, -2798, 4142, -1881, -1112, 2788, -2836, 1220, 974, -2302, 2676, -1051, -1547, 3708, -3030, -412, 3513, -4110, 1353, 2470, -4323, 2630, 671, -3756, 3887, -1426, -2157, 4065, -3346, -207, 3632, -4232, 1843, 1935, -4316, 3088, -113, -3302, 3597, -1799, -1216, 3169, -3509, 1222, 1865, -3979, 3536, -122, -3860, 4975]
2509D975p260m59Q593r993L544N396r505O170J669p586P374k347l737P117o183
2524b232J170M969p867N927R02p850Q695k883n206R405o713j125P993q655L112
2539c58M320q857O943Q5o920R138m769l670R205p828P15O784q851M747K657p947
2555d606P378k115m508Q355o339m69O962q855M259L944r400P501J48p454R192
2570C993m057l626P883o504J067N055p785N493L45o359Q064l652m108Q884o850
2585b157m52P914q460K465M749q168N262J163n941O408k809k540O138n516J261
2600f83M327p137M752J486o777O727j796m408P216m742r14N496o055K655K945
2615C092o787N587k49n596P192k945l548O916m985r79N644n341J503K635m823
$$ y = [4975, -2285, -2744, 5849, -4144, -600, 4796, -4709, 1461, 3130, -4456, 2918, 571, -3166, 3951, -2232, -1062, 3907, -3960, 1967, 2869, -4981, 3714, 831, -4375, 5030, -1683, -2808, 5185, -3470, -358, 3962, -4895, 2048, 2133, -4787, 4351, -418, -4088, 5117, -2711, -1996, 4788, -4063, 684, 3341, -4606, 2772, 657, -3851, 4504, -1835, -2304, 4658, -4197, 62, 4006, -5394, 2107, 2255, -5199, 3993, -64, -3690, 4193, -2311, -1244, 3811, -3974, 1519, 1864, -4495, 3569, -83, -4191, 4693, -2157, -2609, 5305, -3155, -690, 4059, -4109, 1153, 2316, -3625, 2783, -26, -2566, 3572, -1944, -683, 3644, -3493, 1259, 2745, -4032, 2695, 899, -3509, 3707, -1035, -1949, 3547, -2508, 147, 3092, -3695, 1892, 1643, -3953, 3239, 294, -3254, 3662, -1323, -2302, 3342, -1999, -496, 2139, -2684]
2630b684M097j157k468M868m234j46N077o349K606L799p205M928J173n969N868
2645B204r97l877M835k628r19L347l875K319J004m077M827j908k949N735m183
2660a142j034N547n327J381L312n030K845R23l813L880j161k033L839l047P9L037
2676B256l891K071J039l447K969m17j955K718k124N95J973l377K645M50l930M036
2692A611q77l350M916k007k630M419k360j501L466k139l23J085m94L51r22J115
2708C60N54k481K640k45k947L566r49k603L626j538j705L432k135o72K582k289
2724h04O81O13j259J179m80l54P15p88O65k66n97J485j284J52J838k700J177J671
2742A644l450J952J293l307K707M38k968K378n2j795J614j76n04O2K9R26j656
$$ y = [-2684, 1413, 256, -2212, 2656, -1578, -1724, 3353, -2996, -390, 3409, -3796, 1132, 2305, -3664, 2204, 1207, -2670, 2165, -463, -1382, 1965, -1910, 409, 1413, -2664, 2163, 255, -2694, 3041, -1142, -2176, 3371, -1956, -575, 2737, -2293, 552, 1475, -2338, 1542, 381, -1652, 2187, -860, -781, 2256, -1635, 436, 1475, -1972, 997, 580, -1375, 1343, -781, -186, 1787, -1590, 1055, 1505, -2425, 1611, 734, -2616, 2300, 293, -2337, 2082, -278, -1779, 1687, -452, -775, 310, -184, 167, -755, 360, 914, -1567, 1073, 828, -2119, 1447, 498, -2105, 1521, -17, -1722, 1710, -425, -1097, 1485, -804, -123, 490, -769, 410, -70, -424, 291, -497, 168, -98, -695, 790, -494, -342, 1496, -1204, -27, 1644, -1806, 146, 1439, -1868, 839, 1277, -1691, 687, 635, -1160, 454, 278, -226, -164, -135, 791, -865]
2759h65P15J726k925J318J924l971K527J273m049K971O77l071K848n70k079K687
2775A136j415m26J579j789R59M28j722J944p81q39K159k226P21J572k731J905
2791D74O16l466L892j278k542M605k657j670M649l886k91L770l545R21K003l133
2807a538J977k03j247K077j809O71J707l838L130N69m393N191j511l793N811k912
2823a11k077N423m602M45L962n337K728J625m464M306j419k753M835l432n92M349
2839B886m981K471J794m778M298j254l215N727l900j009N487o122J953M188p505
2854c960M625J863o366N740r11m341N869l157j190M445m904K416J658m546M829
2869B070j666l569O538m441j705O767o621J654N004p389L848J862n878N443j043
$$ y = [-865, -150, 1576, -1349, -31, 1893, -2078, 449, 1722, -2327, 644, 1321, -1750, 1098, 528, -1551, 1136, -279, -705, 874, -915, 44, 472, -1250, 694, -87, -926, 1233, -993, -272, 1300, -1431, 474, 1090, -2376, 1516, 238, -2304, 2301, -356, -2026, 2623, -1263, -1554, 2216, -1329, -408, 1595, -1538, 439, 236, -1011, 1066, -743, -72, 1635, -2203, 927, 1496, -2897, 2294, 783, -3010, 2801, -111, -2188, 3235, -1367, -922, 3040, -2297, 431, 2056, -2408, 1898, 479, -2274, 2561, -871, -1463, 2886, -2095, 376, 2170, -2608, 1690, 436, -2779, 2948, -952, -1961, 3526, -2596, -643, 3545, -3960, 665, 2528, -3838, 1902, 991, -3350, 2519, -638, -1828, 2617, -2287, 129, 1787, -2759, 2070, 404, -3165, 3373, -1068, -2773, 3994, -2627, -973, 4031, -3358, 490, 2352, -3526, 1917, 874]
2884H74l975O486m866k54N305o168K651K607o012N108l37m879O396l411j312N279
2900C492n610J752L325o373M810M71n865P265l056l789P673n358j218O517o001
2915a965J172L755n772L932J00l849N089l238j014M827n350J868L372o419M508
2930A016J116o180O530j746m117O610m299p72M863n310K078K754n617M687m77
2945A136m272N925k971k256N768n058M11M450n836L001J739n018M894j500k980
2960b567N625m232l00N051o309K432L439o476M686M13m913N312j848k430M944
2975B827m028O34L328n491L809K99m668N897k050l465O265m248j088N199n202
2990a982J259L031m520L012K38l205M117k456r84M056m501J818K399n295M159
$$ y = [874, -3101, 3385, -1481, -1735, 3570, -2598, 53, 2660, -3352, 1756, 1419, -3460, 2936, -475, -1787, 3492, -2118, -366, 2959, -3414, 1396, 1867, -3998, 3267, 211, -3578, 4095, -1263, -2481, 4036, -1965, -793, 2962, -2810, 1122, 1222, -2627, 2462, -776, -1790, 3037, -2313, -445, 2927, -3492, 1016, 2132, -4048, 2482, 736, -3381, 3229, -1070, -1842, 3021, -2289, -211, 2543, -3074, 1613, 1136, -3136, 2789, -182, -2438, 3330, -1728, -1317, 3133, -2703, 298, 2037, -2981, 1913, 413, -2567, 3058, -1174, -1474, 3577, -2732, -300, 3139, -3337, 1349, 1762, -3151, 2161, 313, -2117, 2827, -1201, -567, 2761, -2730, 1079, 1378, -3290, 2607, 557, -2908, 3357, -891, -1979, 3220, -1982, -723, 2308, -2212, 800, 1038, -2167, 1950, -506, -1490, 2566, -1935, -117, 2282, -3013, 1146]
3005A146J23l899M673j845k257M437l587M03L031m411K447J366m076L664n97l264
3021b646M514j938j532L412l018O83J838k722J971k77j422K752k383p9K827l607
3037a627J371J913l744K685N65l120L081k73j859K409j898O6J534k155J389M21
3053G58j903J996n34j436K373j788k60J971j776M54J016j808J518o75m89J580
3069I97j473L04J305k367J304Q57k136J845k53j444J638m11q05J454j647Q37J53
3086A58r24J490q82p29J587q37m66J787j793O66L46j066Q76n92L4J288j790O05
3104b42J644k718J327J294k743K077M21k573K502p10j463J854r19q2R20j336J415
3121F68o24r69K306j892k24K341k865J256J568l400K376M55k842L326j280j795
$$ y = [1146, 1269, -2630, 2043, 198, -2059, 2378, -1209, -806, 2225, -2186, 261, 1627, -2449, 1215, 618, -2646, 1868, -70, -1602, 1810, -1208, -525, 1313, -1409, 562, 285, -1137, 1615, -768, -847, 1980, -1627, -256, 1657, -2087, 598, 1163, -1957, 1124, 851, -1008, 1401, -497, -431, 1103, -1052, 337, 758, -1145, 851, 317, -1119, 1254, -534, -794, 1177, -599, -145, 871, -937, 581, -94, -583, 997, -476, -172, 1133, -1234, 70, 927, -1209, 636, 383, -1061, 577, 166, -639, 815, -832, 5, 158, -766, 724, -158, -887, 700, -137, -603, 1184, -609, 57, 403, -663, 213, -379, -345, 943, -847, -242, 1402, -1316, 11, 1305, -1438, 639, 1060, -1513, 989, 279, -1184, 670, -249, -331, 589, -747, 668, 44, -925, 1381, -511, -735, 1606, -1259, -3, 1565, -1835, 541, 996, -1846, 1480, 200, -1595]
3137a595L247k163M9K247l308J426J479l043K329k21j884K614j314o69K256k684
3153a234J682N01l056L895j733k526M734k793j867N373m337j3M111m467J356K099
3169A725l488K496p0k055L076k383K99K275l721K520Q37m335M733j386l016M835
3185B342k730j341M762m751J210L092n065L378R96m415M364j420k695M462l147
3200i58k36L454l821J639J862m007L760j499k015M483l685l47M126m758J662K859
3216B519n534L588J431n004M756j161l024M458k519n33K798l230J875P48l345
3231b177L896j496k684M893l416p58M686m968J418K953m953L096J351m699M256
3246A398p86k642M282l120n46L494l757J575K149m078K941l26k236L591k507o59
$$ y = [-1595, 1652, -511, -462, 1785, -1523, -97, 1382, -1661, 668, 447, -1437, 1177, -137, -806, 1450, -1234, 448, 949, -2107, 1788, 55, -2471, 2263, -530, -2397, 2976, -1361, -1374, 2737, -1730, -374, 1725, -1763, 733, 663, -1392, 1684, -699, -400, 1875, -1846, 674, 1511, -2824, 1909, 523, -2493, 2342, -388, -1729, 3033, -1718, -508, 2584, -2481, 897, 1893, -2522, 1842, 422, -2273, 2189, -958, -1194, 2260, -1561, 78, 1940, -2067, 1693, 194, -1821, 2662, -1023, -1370, 2756, -2002, -340, 2519, -3015, 573, 2004, -3000, 1756, 595, -2429, 2029, -490, -1023, 1775, -1455, 420, 1168, -2177, 1719, 223, -2461, 2432, -984, -1742, 2944, -2024, -606, 2347, -2606, 490, 1841, -2858, 1398, 612, -2030, 2252, -868, -1414, 2080, -1677, -102, 2047, -2031, 910, 584, -1652, 1939, -568, -1227]
3262a227L428l955J409K191m585L636P85m698N069j220l344N115k890j745M365
3277B334l413L30K858l755J894M88k249L227k318o44L388l922J392K574m639K930
3293D75J329m622M715j252l207M690k545j165M069m077J023K708m521L172N42
3308A334l532L396j030j876L422k565K04K048k914J924J55k142L023j383j737
3323a673L883l138m07L956m521J651K416m129K474Q14l324L016n64j980L000k002
3339e28j05J980k819J771Q95k629K508n66k042L057j663q79K704k449O92J180
3355A107k308J872j10j912K700j365j112K445k085M86J603k359Q75J127k104J640
3371E00K33j794J820j052n70J634j506N99R17j649J285K34j726J869n60j098J693
$$ y = [-1227, 2201, -1754, -345, 1846, -2739, 897, 1682, -3016, 2053, 833, -2511, 2604, -286, -2031, 2334, -1079, -749, 2109, -1646, 248, 736, -1513, 1714, -604, -1248, 2140, -1782, -390, 2184, -2455, 475, 1804, -2818, 1897, 645, -2562, 2128, -417, -1582, 2487, -1590, -567, 2141, -2380, 792, 1334, -2198, 1198, 168, -1708, 1714, -851, -647, 1401, -1513, 411, 566, -1576, 1447, 64, -1673, 2210, -928, -1335, 2621, -1900, -249, 2167, -1962, 512, 1326, -1998, 1018, 454, -1526, 1474, -528, -633, 1347, -1472, 299, 1194, -1435, 1073, 507, -1535, 1522, -141, -1020, 1684, -765, -73, 1107, -1201, 671, 561, -1351, 1349, -16, -1128, 1317, -768, -282, 1321, -1038, -163, 964, -1140, 500, 733, -1061, 759, -293, -863, 771, -735, -136, 781, -868, 417, 651, -1075, 794, 234, -864, 829]
3388H29j042k43J068j138M81N14j322J289l98p26J659j532K00J449j795L83J567
3405A243j770L41P97j154P78p8o83R74n21R3L85q57Q36k03r89J281m25o07R21
3424C62p10M23N27j002N90J12j017J354o66n69J451j276J8J138r83J35M05m85
3442a93K29L27l15q2j31J97j9j09N00k66q63J220n86m54J323j299J32R14r34L51
3462e8K68p03P45n02n8P97j073L36Q51j300J102j41o76Q60k98m68Q64j040M33
3481f1N59j585J575j30j494K157r98j017K536k133j7J746j850P04O44j346J219
3498E09l21r17J801j638K52J731k495J136P79k114J846Q9k005K336j089o64J865
3515A101j979P09J324k697K247j5k319K728q89j464K618j996m90K488k428P43
$$ y = [829, -213, -456, 612, -526, -45, 469, -853, 436, 38, -688, 971, -561, -361, 1088, -707, -324, 1243, -527, -186, 611, -543, 235, 157, -526, 448, -73, 20, 405, -452, 384, 181, -808, 473, 48, -559, 362, -348, 75, 602, -400, 190, 302, -715, 639, -27, -596, 855, -421, -403, 735, -248, -113, 292, -193, 36, 363, 48, -34, -165, 32, 13, -96, 404, 138, -725, 495, -91, -545, 778, -521, -389, 525, -409, -58, 210, -493, 252, -250, -308, 489, -584, -248, 603, -697, 405, 264, -412, 448, 150, -318, 546, -494, -61, 498, -1087, 488, 358, -1136, 1021, 23, -994, 1542, -591, -608, 1138, -712, -8, 636, -710, 509, 188, -729, 1072, -566, -314, 1417, -1078, 58, 837, -1277, 569, 658, -1347, 989, -100, -764, 1101, -878, -169, 1155, -1542, 705, 690, -1629, 1099, 210, -1254, 1364, -632, -1122, 1366, -1062, -319]
3531c19J421j997J397m07j193K139j532j5J694k447J176J410k904K130K82k629
3547a794L037j164j556L161k530J99K508l088J331J345l109K518K37k831L170
3562A434j341j331K827k075P6J680k105J048M13k139K883j568q82L261l215L45
3578f89K669l692J685K187m440L165M21l269L526j553j508L147k202J8K201l202
3594a536J933P79l065L111j033j631L061k259m01L171l755J481J668l557K919
3609H86j69k897L975k044j405M124l786M54L044l937J804J723l819K914k58k367
3625a758L153j936j52K558l926K319J324l939L866n85l181M306k157j570L667
3640A989k955O3K871l271J515R08k861K938j242j110L081k649j83K979l757J923
$$ y = [-319, 1102, -895, 502, 95, -1098, 1041, -491, -506, 1188, -1259, -83, 1327, -1577, 553, 835, -1794, 1243, 79, -1477, 1684, -846, -647, 1861, -1227, 104, 1449, -1660, 858, 1095, -1736, 1434, 93, -1238, 1589, -486, -410, 1270, -835, 213, 626, -1513, 1370, -198, -1080, 2181, -1034, -689, 1980, -1712, -27, 2160, -2280, 885, 1306, -1963, 1563, 10, -1498, 1649, -553, -535, 1666, -1536, 397, 1176, -1889, 1222, 189, -1442, 1619, -640, -1041, 2130, -1625, -144, 1524, -2033, 886, 717, -2180, 1795, -249, -1654, 2470, -1316, -862, 2182, -1755, 49, 1772, -2047, 867, 609, -1758, 1395, -541, -693, 1865, -2061, 258, 1582, -2357, 1509, 924, -2257, 2049, -108, -1678, 1989, -966, -903, 1968, -1303, 212, 1120, -1741, 1197, -45, -1155, 1926, -723, -906, 2073, -1684, 239]
3656B39J488l659K951m06k320L507j989j200L376l125O14K580l713J750J159k878
3672a626K616l68k485L291j960j39J893k418J333M48k300K907q83k094L762k411
3688d34r57L632l495P38K323l206J327J509l015K140J03j888K177j163j83J388
3704I96k047J315N76k144K049m77j541K553j733n25K297k095L51J650k538K026
3720G13Q5k338K535o65j574K389j285q55K129j715L36R95j480R41j2q02J331j025
3738b97K14R98j850J163O51k305J913J79k019K129n75j063J692r21o18J532j448
3755f25O41M81j088J018o50m61J545j381M57P57j518Q71N57j351J060j02q15J569
3773I65j456J82J061j438P88M42j343R55J64r61J077n44j10O59o15L55J16j033
$$ y = [239, 1727, -1932, 1019, 613, -1707, 1800, -189, -1389, 1987, -1138, -524, 2056, -1657, 93, 1252, -1626, 990, 622, -1863, 1428, -532, -671, 1222, -1196, 137, 585, -1715, 1192, 309, -1785, 1977, -434, -1391, 2241, -1254, -516, 1807, -1399, -72, 1437, -1578, 562, 665, -1223, 954, -209, -392, 996, -1051, 264, 840, -1304, 745, 268, -1273, 1280, -453, -978, 1319, -776, -425, 1225, -1313, 713, 798, -1540, 995, 330, -1244, 1145, -140, -995, 1134, -581, -245, 750, -730, 211, 199, -603, 728, -297, -83, 915, -935, 228, 879, -1426, 487, 666, -1353, 776, 201, -862, 830, -91, -709, 823, -625, 16, 497, -591, 427, -223, -684, 861, -520, -63, 694, -824, 47, 604, -747, 313, 211, -604, 965, -491, -309, 752, -686, 102, 544, -799, 156, 320, -641, 436, -108, -218, 441, -174, 181, 297, -736]
3791g36J142o17j19J298j521L89J166j683P60K33j000Q45k42m94J090p69O8N60
3809C70j182J180j00j025J194m19o60J334j014k8R21j181O78M42j116J068m40
3826B2p31J377j446O07R48j273O64L97j468J337m21q26J577r89k85J350j630Q65
3844G5N28j670J529Kj464K086j022q07J571j299M17R55j700J126n4j103J568p50
3862a2p22J739j488Q5J526k015R63Q41j876J374K14j524J964j090m71J436j852
3879i08O08R47j573R59Q24k288K031k45j244K074j546l43J696j753R72N90j982
3896a181J755k38j302K101j575l41K326k632O25J828k935J622Q89k364K143l17
3912D04j603K445j485l11J677k111Q34J184k459K405l46k077K917j402j138K287
$$ y = [-736, 406, -211, -330, 968, -553, -164, 1002, -681, 79, 312, -688, 157, -85, -579, 511, -258, -190, 370, -812, 368, 268, -757, 437, 18, -642, 692, -322, -350, 571, -610, 68, 510, -606, 462, 22, -709, 668, -778, -171, 777, -496, 168, 565, -903, 434, 13, -813, 764, -225, -510, 840, -790, 75, 603, -1067, 462, 464, -1000, 1086, 64, -743, 828, -471, -54, 901, -799, 327, 273, -830, 738, -12, -734, 1005, -483, -398, 1128, -887, 76, 917, -959, 415, 629, -895, 1069, -21, -492, 944, -908, -300, 647, -926, 33, 857, -1431, 600, 355, -889, 1185, -361, -704, 992, -761, 211, 801, -1181, 574, 336, -966, 1135, -440, -781, 1545, -1087, -462, 1366, -1569, 53, 942, -1422, 721, 404, -1199, 1246, -239, -550, 1127, -984, -150, 1034, -1425, 980, 634, -1443, 1474, 72, -1066, 1221]
3928A221j781J09K142k858J615M68k502K649q02j520K865k563P5K452k498R44
3944A6J355k760J944M2j992K626j401r63K186j818M43J462k584K048K11k441K840
3961A214p97j638K735j944m07K167k264J033Q24k362K430p12j939L026j421j256
3977a311K725k120j31K491k940J235R86k177J974l51j295K049j545O6J545k435
3993a234J519P94k503K246k2k038K550j227j500K662j828n5J863k138Q63Q48j986
4010a186J802k27j679K648j700k72J822k122P06R03j800J464K37j690K062p38
4026B30j186K228j753o8J903k426J293J300k706J632O6j750K101p80p74J559j311
4043d42L35P89j630J355K26j803K020j109m79K030j917Q5J568j904P67R33k031
$$ y = [1221, -560, -451, 1691, -1167, 448, 916, -1586, 1063, 261, -1259, 1606, -957, -882, 1570, -928, 16, 1371, -1389, 555, 597, -1395, 1231, -170, -1133, 1053, -765, -322, 1140, -1444, 604, 815, -1626, 1214, 417, -1221, 1514, -430, -837, 1330, -934, 99, 923, -1439, 991, 279, -1660, 1366, -55, -1311, 1414, -706, -837, 1654, -1286, -51, 935, -1242, 732, 381, -914, 1135, -410, -344, 1201, -1234, 285, 1079, -1424, 822, 800, -1238, 1312, 85, -1415, 1247, -581, -636, 1227, -911, -48, 800, -1186, 616, 389, -1290, 1358, -342, -614, 1208, -914, -208, 695, -1105, 359, 596, -1094, 968, 230, -956, 1272, -481, -549, 1354, -1072, 221, 1521, -1185, 447, 513, -1237, 864, 84, -690, 869, -442, -107, 682, -948, 407, 633, -1170, 850, -259, -738, 1292, -625, -540, 1028, -876, -109, 824, -1207]
4060a207J548K43j287J408p00q31J865j756N92P38j336R71K67j287J514q10n99
4077f67J577j342K89Q21j687J159L31j598J689j99j221J539p81q72J857j278K13
4094a70Q67j384O57L94j021J163n31j65P03j132O64O57j676J364K83j714J445
4111D04k78q25J394o51o84R44o33K14M79q73P23r7n33P76n43j54P36p75N43j7
4131A50n91J134o76m46R75p37k54P77p23J60Q61j101N77j9l04L44p8Jk19J40L84
4152C55o95L49L76p14l8R33j042K59Q37r70L57O14r49M81L41p91N73l05k63M43
4172A51k65M23k73k74M99j61m43P71p64J07Q18r75N18K97j143J278j25j031J260
4191F68q26l52J169q64j96J104j036L3O43p72O57k38k11N48o73M18J31r20Q37
$$ y = [-1207, 341, 584, -703, 705, 5, -826, 1039, -717, -125, 613, -723, 248, 515, -772, 742, -68, -667, 910, -432, -143, 678, -1009, 150, 481, -1117, 572, 373, -848, 691, -90, -962, 895, -383, -170, 697, -687, -30, 364, -657, 506, -25, -190, 513, -619, 45, 702, -974, 390, 673, -1041, 404, 126, -699, 695, 44, -640, 304, -329, -115, 364, -509, 214, 117, -416, 360, -183, -337, 399, -376, 167, 150, -441, 693, 17, -429, 546, -191, -445, 332, -391, -231, 630, -471, 106, 87, -217, 127, 49, 50, -169, -29, 355, -340, 9, 385, -329, -367, 566, -476, -217, 620, -350, 7, 621, -328, 153, 494, -297, 276, -29, -292, 151, -114, 309, 36, -238, 261, 100, -343, 428, -336, -229, 589, -386, 132, 429, -714, 564, 439, -592, 668, -158, -510, 659, -205, -401, 703, -333, -300, 343, -429, 228, -10, -221, 327, -346, 72, 203, -717, 120]
4210A20N17j654J491K5j546J720p02n13J217q81j08R93j344P62K0r06J481j023
4228c31j25J559j860N14J208j914J301L83j800J669m43j053J942j365j9J312j654
4245f76P49R15k087J632n2j687K238q49q85J649j614K11J409k018J680m18j511
4262a314K317j060r83K307j798r2J617j964R88Q84j769J238q8j120J692r57m47
4279e49J560j773P03J030k338J736K66j971K356r77j068K266j846J68J664k393
$$ y = [120, 637, -1017, 474, 499, -1047, 673, -29, -542, 675, -206, -314, 679, -665, 97, 117, -789, 692, -331, -456, 1103, -757, -243, 965, -949, 352, 735, -1065, 604, 161, -892, 1050, -315, -334, 978, -676, 73, 988, -1099, 533, 481, -1206, 1032, 183, -702, 947, -667, -456, 953, -1065, 615, 197, -1314, 1003, -57, -1040, 1267, -531, -623, 994, -970, 18, 902, -867, 371, 283, -837, 855, -102, -549, 1011, -762, -59, 971, -1367, 369, 635, -1336, 1020, 43, -1025, 1241, -605, -437, 1227, -1166]
$$ [...]
8191A08
##END NTUPLES=NMR FID
##END=
