##TITLE=1H_MTMA2309
 CDCl3, 8 sc, 
 23.9.2020
##JCAMPDX= 6.0         $$ Bruker NMR JCAMP-DX V2.0
##DATA TYPE= NMR FID
##DATA CLASS= NTUPLES
##ORIGIN= UXNMR, Bruker Analytische Messtechnik GmbH
##OWNER= root
$$ XWIN-NMR		Version 3.5
$$ Wed Sep 23 13:03:49 2020 Russian Standard Time (UT+4h)  she@DPX200
##.OBSERVE FREQUENCY= 200.1315066352
##.OBSERVE NUCLEUS= ^1H
##.DELAY= (6, 6)
##.ACQUISITION MODE= SIMULTANEOUS
##.ACQUISITION SCHEME= undefined
##.AVERAGES= 8
##.DIGITISER RES= 18
##SPECTROMETER/DATA SYSTEM= spect
##.PULSE SEQUENCE= zg30
##.SOLVENT NAME= CDCl3
##.SHIFT REFERENCE= (INTERNAL, CDCl3, 0, 15.7039)
##AUDIT TRAIL= $$ (NUMBER, WHEN, WHO, WHERE, WHAT)
$$ ##TITLE= Audit trail, XWIN-NMR		Version 3.5
$$ ##JCAMPDX= 5.01
$$ ##ORIGIN= Bruker BioSpin GmbH
$$ ##OWNER= she
$$ F:/spectra/data/she/nmr/H-F/1/audita.txt
$$ ##AUDIT TRAIL=  $$ (NUMBER, WHEN, WHO, WHERE, WHAT)
(   1,<2020-09-23 13:02:12.01 +0400>,<she>,<DPX200>,
      <created by zg, POWCHK disabled, PULCHK disabled
       configuration hash MD5:
       00 E9 B6 7A A2 85 ED C7 34 08 36 98 17 FE 4E 26
       data hash MD5: 16K
       8E DE 89 A1 1A BA 0C C1 E6 F6 A6 95 18 05 7E F2>)
$$ ##END=
$$ 
$$ hash MD5
$$ 89 80 77 B4 1A EE 22 83 EF 35 29 2A CA F7 3F 6D
##$RELAX= 
##$RELAX= 
##$RELAX= 
##$RELAX= 
##$RELAX= 
##$RELAX= 
$$ Bruker specific parameters
$$ --------------------------
##$DU= <F:/spectra>
##$EXPNO= 1
##$NAME= <H-F>
##$PROCNO= 1
##$TYPE= <nmr>
##$USER= <she>
##$AMP= (0..31)
100 100 100 100 100 100 100 100 100 100 100 100 100 100 100 100 100 100 
100 100 100 100 100 100 100 100 100 100 100 100 100 100 
##$AQSEQ= 0
##$AQ_mod= 1
##$AUNM= <au_zg>
##$AUTOPOS= <>
##$BF1= 200.13
##$BF2= 200.13
##$BF3= 200.13
##$BF4= 200.13
##$BF5= 200.13
##$BF6= 200.13
##$BF7= 200.13
##$BF8= 200.13
##$BYTORDA= 1
##$CFDGTYP= 0
##$CFRGTYP= 5
##$CHEMSTR= <none>
##$CNST= (0..31)
1 1 145 1 1 1 1 1 1 1 1 1 1 1 1 1 1 1 1 1 1 1 1 1 1 1 1 1 1 1 1 1 
##$CPDPRG= <>
##$CPDPRG1= <>
##$CPDPRG2= <>
##$CPDPRG3= <>
##$CPDPRG4= <mlev>
##$CPDPRG5= <mlev>
##$CPDPRG6= <mlev>
##$CPDPRG7= <mlev>
##$CPDPRG8= <mlev>
##$CPDPRGB= <>
##$CPDPRGT= <>
##$D= (0..31)
0 1.2 0 0 0 0 0 0 0 0.06 0 0.03 0 0 0 0 0.0002 0 0 0 0 0 0 0 0 0 0 0 0 
0 0 0 
##$DATE= 1600851731
##$DBL= (0..7)
120 120 120 120 120 120 120 120 
##$DBP= (0..7)
150 150 150 150 150 150 150 150 
##$DBP07= 0
##$DBPNAM0= <>
##$DBPNAM1= <>
##$DBPNAM2= <>
##$DBPNAM3= <>
##$DBPNAM4= <>
##$DBPNAM5= <>
##$DBPNAM6= <>
##$DBPNAM7= <>
##$DBPOAL= (0..7)
0.5 0.5 0.5 0.5 0.5 0.5 0.5 0.5 
##$DBPOFFS= (0..7)
0 0 0 0 0 0 0 0 
##$DE= 6
##$DECBNUC= <off>
##$DECIM= 32
##$DECNUC= <off>
##$DECSTAT= 4
##$DIGMOD= 1
##$DIGTYP= 9
##$DL= (0..7)
0 120 120 120 120 120 120 120 
##$DP= (0..7)
150 150 150 150 150 150 150 150 
##$DP07= 0
##$DPNAME0= <>
##$DPNAME1= <>
##$DPNAME2= <>
##$DPNAME3= <>
##$DPNAME4= <>
##$DPNAME5= <>
##$DPNAME6= <>
##$DPNAME7= <>
##$DPOAL= (0..7)
0.5 0.5 0.5 0.5 0.5 0.5 0.5 0.5 
##$DPOFFS= (0..7)
0 0 0 0 0 0 0 0 
##$DQDMODE= 0
##$DR= 18
##$DS= 0
##$DSLIST= <SSSSSSSSSSSSSSS>
$$ [...]
##$SUBNAM2= <"">
##$SUBNAM3= <"">
##$SUBNAM4= <"">
##$SUBNAM5= <"">
##$SUBNAM6= <"">
##$SUBNAM7= <"">
##$SUBNAM8= <"">
##$SUBNAM9= <"">
##$SW= 16.880792210976
##$SWIBOX= (0..15)
0 0 2 0 0 0 0 0 0 0 0 0 0 0 0 0 
##$SW_h= 3378.37837837838
##$TD= 16384
##$TD0= 1
##$TE= 0
##$TE2= 300
##$TE3= 300
##$TEG= 300
##$TL= (0..7)
0 120 120 120 120 120 120 120 
##$TP= (0..7)
150 150 150 150 150 150 150 150 
##$TP07= 0
##$TPNAME0= <>
##$TPNAME1= <>
##$TPNAME2= <>
##$TPNAME3= <>
##$TPNAME4= <>
##$TPNAME5= <>
##$TPNAME6= <>
##$TPNAME7= <>
##$TPOAL= (0..7)
0.5 0.5 0.5 0.5 0.5 0.5 0.5 0.5 
##$TPOFFS= (0..7)
0 0 0 0 0 0 0 0 
##$TUNHIN= 0
##$TUNHOUT= 0
##$TUNXOUT= 0
##$USERA1= <user>
##$USERA2= <user>
##$USERA3= <user>
##$USERA4= <user>
##$USERA5= <user>
##$V9= 5
##$VALIST= <valist>
##$VCLIST= <CCCCCCCCCCCCCCC>
##$VD= 0
##$VDLIST= <DDDDDDDDDDDDDDD>
##$VPLIST= <PPPPPPPPPPPPPPP>
##$VTLIST= <TTTTTTTTTTTTTTT>
##$WBST= 1024
##$WBSW= 4
##$XGAIN= (0..3)
0 0 0 0 
##$XL= 0
##$YL= 0
##$YMAX_a= 1102077
##$YMIN_a= -986069
##$ZGOPTNS= <>
##$ZL1= 120
##$ZL2= 120
##$ZL3= 120
##$ZL4= 120
##$ABSF1= 10
##$ABSF2= 0
##$ABSG= 5
##$ABSL= 3
##$ALPHA= 0
##$AQORDER= 0
##$ASSFAC= 0
##$ASSFACI= 0
##$ASSFACX= 0
##$ASSWID= 0
##$AUNMP= <proc_1d>
##$AZFE= 0.1
##$AZFW= 0.1
##$BCFW= 1
##$BC_mod= 2
##$BYTORDP= 1
##$COROFFS= 0
##$CY= 11.3945322036743
##$DATMOD= 1
##$DC= 2
##$DFILT= <>
##$DTYPP= 0
##$F1P= 16.9975609425685
##$F2P= -3.02152046262296
##$FCOR= 0.5
##$FTSIZE= 0
##$FT_mod= 4
##$GAMMA= 1
##$GB= 0.15
##$INTBC= 1
##$INTSCL= 1
##$ISEN= 128
##$LB= 0.24
##$LEV0= 0
##$LPBIN= 0
##$MAXI= 10000
##$MC2= 0
##$MEAN= 0
##$ME_mod= 0
##$MI= 1.114404
##$NCOEF= 0
##$NC_proc= 0
##$NLEV= 6
##$NOISF1= 3.799351
##$NOISF2= 2.8
##$NSP= 1
##$NTH_PI= 0
##$NZP= 0
##$OFFSET= 15.70392
##$PC= 1
##$PHC0= -10129.1
##$PHC1= 11.8009
##$PH_mod= 1
##$PKNL= yes
##$PPARMOD= 0
##$PSCAL= 0
##$PSIGN= 0
##$REVERSE= no
##$SF= 200.130013532006
##$SI= 16384
##$SIGF1= 3
##$SIGF2= 2
##$SINO= 400
##$SIOLD= 16384
##$SREGLST= <1H.CDCl3>
##$SSB= 0
##$STSI= 0
##$STSR= 0
##$SW_p= 3612.71676300578
##$SYMM= 0
##$S_DEV= 0
##$TDeff= 0
##$TDoff= 0
##$TI= <>
##$TILT= no
##$TM1= 0
##$TM2= 0
##$TOPLEV= 0
##$USERP1= <user>
##$USERP2= <user>
##$USERP3= <user>
##$USERP4= <user>
##$USERP5= <user>
##$WDW= 1
##$XDIM= 8192
##$YMAX_p= 0
##$YMIN_p= 0
$$ End of Bruker specific parameters
$$ ---------------------------------
##NTUPLES= NMR FID
##VAR_NAME=  TIME,          FID/REAL,        FID/IMAG
##SYMBOL=    X,             R,               I
##VAR_TYPE=  INDEPENDENT,   DEPENDENT,       DEPENDENT
##VAR_FORM=  AFFN,          ASDF,            ASDF
##VAR_DIM=   8192,          8192,            8192
##UNITS=     SECONDS,       ARBITRARY UNITS, ARBITRARY UNITS
##FACTOR=    0.000296,      1,               1
##FIRST=     0,             0,               0
##LAST=      2.424536,      0,               0
##MIN=       0,             -986069,         0
##MAX=       2.424536,      1102077,         0
$$ Real data points
##PAGE= N=1
##DATA TABLE= (X++(R..R)), XYDATA
$$ [...]
3150d2N130r985M597N611j0312M655N679j0247M540N582r937M307N414r281L602
$$ -42 5088 -4897 -300 5311 -5001 -346 5333 -4914 -374 5208 -4729 -422 4992 -4289 -687
3165f87N452q546K618N937q103J675O546p862Q33P249p945L78P691p981J79P742
$$ -687 4765 -3781 -1163 4774 -3329 -1654 4892 -2970 -2137 5112 -2833 -2455 5236 -2745 -2566 5176
3181E176p720n6P517p095n42P273o126j388P222n221k404P482m502l486Q044m194
$$ 5176 -2544 -2600 4917 -2178 -2720 4553 -1573 -2961 4261 -960 -3364 4118 -384 -3870 4174 -20
3197b0m218Q452m062m559Q661m002m651Q435l651m676P923k907m924P430k058
$$ -20 -4238 4214 152 -4407 4254 252 -4399 4036 385 -4291 3632 725 -4199 3231 1173
3212A173n491P131j106o302P236m68p034P449j71p507P703j40p518P602m4p357
$$ 1173 -4318 2813 1707 -4595 2641 2173 -4861 2588 2417 -5090 2613 2473 -5045 2557 2513 -4844
3228d844P133L04p176O334J131p245N590K055p668N195L035q347N027L733r005
$$ -4844 2289 2593 -4583 1751 2882 -4363 1227 3282 -4386 809 3844 -4503 524 4257 -4748
3243d748N140L983r093N087M021r060M954L936q598M396M175q114L557M619p974
$$ -4748 392 4375 -4718 369 4390 -4670 284 4220 -4378 18 4193 -3921 -364 4255 -3719
3258c719K864N391q142K364O130q457K191O369q684K317O295q514K331N971p999
$$ -3719 -855 4536 -3606 -1242 4888 -3569 -1378 4991 -3693 -1376 4919 -3595 -1264 4707 -3292
3273c292J994N741p302J317N802o616L75O219o232m68O799o097r69P251o252j129
$$ -3292 -1298 4443 -2859 -1542 4260 -2356 -1981 4238 -1994 -2462 4337 -1760 -2729 4522 -1730 -2859
3289b859P339o152j135P081n763j250O724n103j624O228m078k342O097l208l230
$$ -2859 4480 -1672 -2807 4274 -1489 -2739 3985 -1118 -2742 3486 -592 -2934 3163 -45 -3275
3304c275O329k614m086O780k415m573P067k398m728P020k314m586O694k002m535
$$ -3275 3054 440 -3646 3134 719 -3854 3213 815 -3913 3107 793 -3793 2901 899 -3636
3319c636O089j203m820N551k07n529N446N82o321N678R76o971O024J089p250O171
$$ -3636 2453 1250 -3570 1981 1774 -3755 1691 2273 -4048 1630 2606 -4365 1659 2748 -4502 1669
3335A669J077p151O004J124o956N475J570o741M798K263o959M280L116p405L987
$$ 1669 2746 -4405 1599 2723 -4233 1242 2812 -3929 869 3132 -3827 453 3569 -3836 151
3350A51L702p790M004L954q075M162L933q044M114L746p674L808L660p104L206
$$ 151 3853 -3937 67 4021 -4054 108 4041 -4003 111 3857 -3817 -9 3651 -3453 -247
3365b47L746o533K415M208o353J676M894o402J209N466o744J147N679o833J220
$$ -247 3499 -3034 -619 3589 -2764 -1088 3806 -2596 -1387 4079 -2665 -1518 4161 -2672 -1452
3380a452N526o694J261N174o085P48N048n269j06N283m709r93N752m488j631O284
$$ -1452 4074 -2620 -1359 3815 -2270 -1522 3526 -1743 -1849 3434 -1275 -2268 3484 -1004 -2635 3649
3396C649m574j947O687m699j981O575m539j941O228m092k065N765l359k457N455
$$ 3649 -925 -2872 3815 -884 -2865 3710 -829 -2770 3458 -634 -2699 3066 -293 -2750 2705
3411B705k500l190N501j840l991N806j633m330O045j624m557O210j607m528O041
$$ 2705 205 -2985 2516 676 -3315 2491 858 -3472 2573 949 -3608 2602 995 -3533 2508
3426B508j497m410N554r70m315M891k63m548M410N86n164M278J377n906M462J670
$$ 2508 1011 -3399 2155 1185 -3130 1761 1498 -3050 1360 1946 -3218 1060 2437 -3469 993 2663
3442B663o384M795J720o611M880J654o431M597J786o126M001K296o028L304L011
$$ 2663 -3721 1074 2794 -3817 1063 2717 -3714 883 2669 -3457 544 2840 -3188 116 3127
3457C127o233K907L640o702K945M036p119L138M020p269L364L732p019L305L481
$$ 3127 -3106 -199 3441 -3261 -316 3720 -3399 -261 3759 -3510 -146 3586 -3433 -128 3353
3472C353o482K852L558o097K272L768n669J532M222n564J040M721n778R06N062
$$ 3353 -3129 -277 3281 -2816 -544 3224 -2445 -913 3309 -2255 -1215 3506 -2272 -1366 3696
3487C696o041R71N104o075R61M897n650Q24M547n001L36M338m222m08M543l666
$$ 3696 -2345 -1374 3730 -2345 -1384 3513 -2137 -1313 3234 -1767 -1431 2907 -1315 -1723 2820 -846
3503h46j282N037l469j872N503l543k122N654l585k033N528l398k025N193k933
$$ -846 -2128 2909 -560 -2432 3071 -472 -2594 3060 -525 -2558 2970 -428 -2453 2740 -193
3518a93k194M733k154k678M490j336l351M561q46m062M973p51m497N403q69m535
$$ -193 -2387 2346 192 -2486 2004 668 -2683 1878 1032 -3030 1943 1192 -3305 2098 1229 -3306
3534c306N395r00m372N063o67m184M577j74m304M128M58m657L901J191n272L902
$$ -3306 2089 1189 -3183 1880 1213 -2971 1606 1432 -2872 1256 1714 -2943 958 2149 -3123 779
3550G79J689n773M117J779o024M274J767n981M224J664n778L907J771n338L244
$$ 779 2468 -3305 812 2591 -3433 841 2608 -3373 851 2515 -3263 644 2415 -2923 321
3565C21K240n285K672K837n447K267L470n697K125L786o063K302L751o098K361
$$ 321 2561 -2724 -52 2785 -2662 -395 3075 -2622 -497 3289 -2774 -472 3279 -2819 -458
3580d58L623n830K235L401n329J729L511m872J010L951m695L50M562m846Q8N000
$$ -458 3165 -2665 -430 2971 -2358 -629 2882 -1990 -980 2971 -1724 -1374 3188 -1658 -1570 3430
3596C430n146K8N186n255J49M974n093J06M777m618j10M438m022o22M409l399
$$ 3430 -1716 -1688 3498 -1757 -1608 3366 -1727 -1621 3156 -1462 -1572 2866 -1156 -1778 2631 -768
3612g68j268M648l089j796M922k950k196N274l014k272N272k950k193M907k685
$$ -768 -2036 2612 -477 -2273 2649 -301 -2497 2777 -237 -2509 2763 -187 -2380 2527 -158
3627a58k129M589k199k387M209j448k801L962p30l534M199l62m008M301j71m328
$$ -158 -2287 2302 103 -2284 1925 477 -2324 1638 908 -2626 1573 1211 -2797 1504 1333 -2995
3643b995M555j29m428M529q3m304M150K99m356L751Q21m510L312J535m985L270
$$ -2995 1560 1431 -2997 1532 1449 -2855 1295 1594 -2762 989 1810 -2700 612 2147 -2838 432
3659D32K087n437L289K404n832L410K498o011L579K363n842L433K312n574L024
$$ 432 2519 -2918 371 2775 -3057 353 2851 -3160 419 2782 -3060 373 2685 -2889 135
3674A35K507n293K513K859n172K019L348n305J955L739n812J894L792n761J834
$$ 135 2642 -2651 -138 2721 -2451 -432 2916 -2389 -434 3305 -2507 -613 3179 -2582 -748
3689g48L905n594J797L603n249J518L587m812J050L724m489M67M086m292j03M514
$$ -748 3157 -2437 -640 2963 -2286 -768 2819 -1993 -943 2781 -1708 -1241 2845 -1447 -1550 2964
3705B964m295l67M793m427n05M990m444n38M811m070o84M526l576r88M285k981
$$ 2964 -1331 -1698 3095 -1332 -1837 3153 -1291 -1829 2982 -1088 -1772 2754 -822 -1810 2475 -506
3721e06j552M437k526k142M679k352k561M990k312k818N194k356k788N002k193
$$ -506 -2058 2379 -147 -2289 2390 38 -2523 2467 155 -2663 2531 175 -2613 2389 196
3736A96k730M682j807k768M289j283l077M126o53l509L950k91l756M117o5m319
$$ 196 -2534 2148 341 -2427 1862 579 -2498 1628 975 -2534 1416 1125 -2631 1486 1421 -2898
3752b898M227L33m559M121M73m547L952O20m465L597J005m441L084J597m627K728
$$ -2898 1329 1662 -2897 1224 1697 -2850 1102 1722 -2743 854 1859 -2582 502 2099 -2528 200
3768B00K223n034K636K648n320K581K858n555K668K886n485K580K821n241K270
$$ 200 2423 -2611 25 2673 -2647 -66 2792 -2763 -95 2791 -2694 -114 2707 -2534 -264
3783b64K965m990J780L278m831J241L778m952R32M212n162P86M476n298Q52M498
$$ -264 2701 -2289 -509 2769 -2062 -821 2957 -1995 -1063 3149 -2013 -1227 3249 -2049 -1197 3301
3799C301n362Q35M419n090N89M391m732K41M345m334k38M490l966p34M782l838
$$ 3301 -2061 -1226 3193 -1897 -1308 3083 -1649 -1408 2937 -1397 -1635 2855 -1111 -1845 2937 -901
3815i01j196N084l734j399N084l676j431M966l464j454M720l042j597M359k407
$$ -901 -2097 2987 -747 -2146 2938 -738 -2169 2797 -667 -2121 2599 -443 -2040 2319 -88
3830h8j990M175j910k467M193j453k936M406j255l295M557j189l408M506j005
$$ -88 -2078 2097 187 -2280 1913 460 -2476 1930 675 -2620 1937 748 -2660 1846 841
3845H41l472M302p63l369L767j58l623L537M42l989L239J082m486L315J376m818
$$ 841 -2631 1671 908 -2461 1306 1148 -2475 1062 1504 -2485 754 1836 -2650 665 2041 -2777
3861b777L385J550m965L366J650m912L148J887m966K890K102m762K327K528m693
$$ -2777 608 2158 -2807 559 2209 -2703 445 2332 -2634 256 2358 -2404 -77 2451 -2242
3876b242J913K992m881J689L300m996J542L528n100J490L721n139J426L602m944
$$ -2242 -329 2663 -2218 -529 2771 -2225 -683 2845 -2255 -765 2956 -2183 -757 2845 -2099
3891b099J262L635m564P71L762m305K99M041m076k67M408m052n35M756m227o93
$$ -2099 -837 2798 -1766 -995 2767 -1538 -1239 2802 -1274 -1541 2867 -1185 -1720 3036 -1191 -1884
3907a884M980m246p61M897m011q47M646l573j164M576l124j605M665k838k044
$$ -1884 3096 -1150 -1911 2986 -1025 -1872 2774 -799 -1963 2613 -511 -2116 2549 -289 -2333
3922b333M822k563k449M979k445k588N060k435k582M949k314k581M706j920k704
$$ -2333 2489 -74 -2523 2456 11 -2577 2483 48 -2534 2415 101 -2480 2226 306 -2398
3937b398M360j472k878M066r11l141L915n72l445L863j92l776L910K6l889L716
$$ -2398 1962 490 -2388 1678 767 -2374 1541 969 -2476 1387 1195 -2581 1329 1355 -2534 1182
3953A182K29l902L535M90l963L265P44l864K813J297m037K369J902m229K075K396
$$ 1182 1411 -2491 1044 1534 -2429 836 1580 -2284 529 1826 -2211 158 2060 -2169 -94 2302
3969B302m511K049K585m730K029K826m813J901K934m622J659K885m363J187L257
$$ 2302 -2209 -160 2425 -2305 -276 2550 -2263 -362 2572 -2050 -391 2494 -1869 -682 2575
3984B575m316Q46L541m251L88M051m421K77M270m541J74M361m420L2M316m294
$$ 2575 -1741 -895 2646 -1605 -1217 2834 -1587 -1310 2960 -1581 -1407 2954 -1466 -1434 2882 -1412
4000a412q2M286m007l44M243l715p43M433l472j136M632l338j455M796l207j705
$$ -1412 -1494 2792 -1215 -1559 2684 -1031 -1774 2659 -813 -1949 2683 -655 -2110 2686 -521 -2226
4016b226M943l200j756M925l086j805M732k787j902M454k310k226M339j906k340
$$ -2226 2717 -483 -2239 2686 -400 -2205 2527 -260 -2162 2292 -18 -2244 2095 189 -2151
4031b151M541j706l047M148j097l165M263j066l291M309r55l224M005p08l235
$$ -2151 2390 684 -2363 1785 688 -2477 1786 720 -2571 1738 783 -2441 1564 856 -2379
4046b379L673k18l357L405J21l522L086P02l888L078J033m117L048J169m280L027
$$ -2379 1294 1076 -2281 1124 1245 -2277 809 1511 -2377 701 1734 -2383 665 1834 -2446 581
4062E81J313m266K846J435m155K539J667m006K040K082l979J645K419m018J356
$$ 581 1894 -2372 474 1909 -2246 293 1960 -2046 -6 2076 -1903 -258 2161 -1857 -501
4077e01K895m212J170L106m359J138L263m313J035L259m108P29L222l777M37L343
$$ -501 2394 -1818 -648 2458 -1901 -763 2500 -1813 -778 2481 -1627 -898 2324 -1453 -1016 2327
4093B327l519j5L544l393l68L873l351p23M152l365q24M261l461q53M273l351
$$ 2327 -1192 -1207 2337 -1056 -1424 2449 -902 -1625 2527 -838 -1662 2599 -862 -1715 2558 -793
4109g93r32M136l020j162M082k726j508M180k408j937M329k246k179M376k137
$$ -793 -1725 2411 -609 -1771 2311 -415 -1923 2257 -151 -2088 2241 -5 -2184 2192 55
4124E5k381M556k204k423M617k082k420M333j836k466M091j458k545L796j012
$$ 55 -2326 2230 26 -2397 2220 138 -2282 2051 215 -2251 1840 382 -2163 1633 621
4139F21k783L615o41l063L606l91l260L528j65l364L472j12l323L381j8l236L082
$$ 621 -2162 1453 812 -2251 1355 964 -2296 1232 1067 -2297 1175 1063 -2260 1121 1103 -2133 949
4156I49K00l171K676O47l187K348J032l347K071J462l523J950J681l677J919J894
$$ 949 1149 -2022 654 1301 -1886 462 1494 -1853 218 1680 -1843 107 1788 -1889 30 1924
4172A924l848J804K018l651J530K163l547J246K272l306P84K640l366N66K951
$$ 1924 -1924 -120 1898 -1753 -223 1940 -1607 -361 1911 -1395 -611 2029 -1337 -771 2180
4187B180l445L02L212l505K48L316l567K36L294l458J30L226l193p7L165k890
$$ 2180 -1265 -963 2249 -1256 -1008 2308 -1259 -1023 2271 -1187 -1057 2169 -1024 -1101 2064 -826
4203h26m00L269k724p72L507k606j033L633k518j186L824k591j305L879k492j343
$$ -826 -1226 2043 -681 -1453 2054 -552 -1585 2048 -470 -1656 2168 -423 -1728 2151 -341 -1684
4219a684L779k448j235L451k039j378L351j598k100L581j374k242L499j088k535
$$ -1684 2095 -353 -1588 1863 -176 -1554 1797 199 -1901 1680 306 -1936 1563 475 -2060
4234b060L696j111k640L694j018k691L560q84k498L233o46k520K944k60k659K758
$$ -2060 1636 525 -2115 1579 561 -2130 1430 546 -1952 1281 635 -1885 1059 799 -1860 898
4250H98M4k780K600L61l039K620N50l188K676N90l240K519O38l042K336P84k944
$$ 898 942 -1838 762 1123 -1916 704 1254 -1934 742 1332 -1908 611 1249 -1793 543 1327 -1617
4267a617J980R93k893J720J295k969J490J559l057J319J922l192J210J977l186
$$ -1617 363 1356 -1537 183 1478 -1491 -1 1558 -1499 -180 1742 -1450 -240 1737 -1449
4282a449J127K012l064R77K069k908P69K063k649M14K268k471K7K455k420j70
$$ -1449 -322 1690 -1374 -397 1672 -1236 -467 1596 -1053 -639 1629 -842 -815 1640 -780 -950
4298i50K727k502l22K824k440m61K960k543l99K861k361n09K837k173p37K829
$$ -950 1777 -725 -1047 1777 -663 -1124 1836 -707 -1106 1755 -606 -1115 1722 -451 -1188 1641
4314A641j929j096K921j656j346L049j630j514L163j584j722L348j685j660L322
$$ 1641 -288 -1384 1537 -119 -1465 1584 -46 -1560 1603 19 -1703 1645 -40 -1700 1622
4329A622j618j558L015j373j636K935j092j828K792q48k019K780o29k226K778
$$ 1622 4 -1554 1461 88 -1548 1387 295 -1533 1259 411 -1608 1172 543 -1683 1095
4344A095m76k285K768m91k286K710m06k220K519k77k191K387j11k162K070J80
$$ 1095 619 -1666 1102 611 -1675 1035 629 -1591 928 651 -1540 847 736 -1426 644 824
4360H24k157J773N17k359J686Q33k579J769Q08k532J628R43k580J598J005k493
$$ 824 -1333 440 957 -1402 284 1117 -1462 307 1115 -1417 211 1154 -1426 172 1177 -1316
4376a316J431J032k326J072J325k283Q07J633k296N41J827k458N08K047k527N59
$$ -1316 115 1147 -1179 -107 1218 -1065 -258 1375 -921 -380 1447 -1011 -503 1544 -983 -424
4392d24J927k482M13J993k304L06J900k064M2K009j912k37K204j850m65K300j714
$$ -424 1503 -979 -566 1427 -877 -571 1329 -735 -693 1316 -596 -833 1371 -479 -944 1356 -358
4409c58o63K459j817o53K439j727p70K496j692q04K422j442j059K359j222j109
$$ -358 -1021 1438 -379 -1032 1407 -320 -1090 1406 -286 -1090 1332 -110 -1169 1190 -32 -1141
4425a141K284j047j332K339q91j632K564p81j823K556p40j825K588p94j747K481
$$ -1141 1143 96 -1236 1103 212 -1420 1144 363 -1460 1096 356 -1469 1119 325 -1422 1059
4441A059p62j701K337n11j761K120k14j943K104%k160K082P6k135K092R9k248
$$ 1059 297 -1404 933 422 -1339 781 567 -1376 728 728 -1432 650 726 -1409 683 782 -1466
4458a466K078J75k192J990J84k108J836L00j951J441O01k009J520O07k112J234
$$ -1466 612 787 -1405 585 769 -1339 497 797 -1154 287 888 -1121 399 1006 -1106 128
4474A28R20k127J056J119k268J150J136k184R90J207k129Q60J163j933O80J274
$$ 128 1048 -1079 -23 1096 -1172 -22 1114 -1070 -80 1127 -1002 -142 1021 -912 -232 1042
4490A042j775L23J481j651L0J749j770r5J954j819j85K008j805k26J985j681l49
$$ 1042 -733 -410 1071 -580 -550 1199 -571 -666 1288 -531 -716 1292 -513 -739 1246 -435 -784
4507g84K020j586m57K016j456o71K038j224r56K207j205j093K290j145j242K474
$$ -784 1236 -350 -807 1209 -247 -918 1120 -104 -1060 1147 -58 -1151 1139 -6 -1248 1226
4523A226j182j347K507j119j303K333r67j454K365p93j584K333o70j657K224m79
$$ 1226 44 -1303 1204 85 -1218 1115 148 -1306 1059 266 -1318 1015 345 -1312 912 433
4539D33j800K258l66j985K313k35k082K365l24j962K187k48j882K062j07j903
$$ 433 -1367 891 525 -1460 853 618 -1464 901 577 -1385 802 554 -1328 734 627 -1276
4555a276J908L9j886J687K64j951J622M36k094J588O01k238J573O73k198J487
$$ -1276 632 671 -1215 472 736 -1215 407 843 -1251 337 938 -1300 273 946 -1252 235
4571B35P18k098J326P52j988J123Q79j948R04J177k006P19J329j985N55J457k011
$$ 235 953 -1145 181 933 -1055 68 947 -1001 -97 1080 -926 -207 1122 -863 -308 1149 -862
4588h62N30J542k025M04J610j930K64J616j811J69J573j624j04J712j481l42J897
$$ -862 -332 1210 -815 -411 1199 -731 -467 1149 -662 -493 1080 -544 -648 1064 -417 -759 1138
4605A138j496m92J981j369p17K084j325p25K038j302p76K079j167r31K017r68
$$ 1138 -358 -850 1131 -238 -955 1129 -196 -921 1117 -185 -961 1118 -49 -980 1037 69
4621F9j086J978p77j326K093o58j470K097n50j663K259n42j817K325m72j847K330
$$ 69 -1017 961 184 -1142 951 293 -1177 920 370 -1293 966 424 -1393 932 460 -1387 943
4638I43m81j893K247k52j967K224k23j951K033J02k275K305K00k492K062K45k216
$$ 943 462 -1431 816 564 -1403 821 598 -1353 680 782 -1493 812 1012 -1480 582 827 -1389
4655a389J897K25k358K201L84k284J808K39j991J902L26k203J438Q16k334J504
$$ -1389 508 733 -1625 576 960 -1324 484 723 -1268 634 960 -1243 195 1011 -1323 181
4671A81Q32k150J188J070k351J275J040k221J083J199k249R93J220k028O99J318
$$ 181 1013 -1137 51 1121 -1230 45 1085 -1136 -53 1146 -1103 -110 1110 -918 -219 1099
4687A099j926M78J471j830K55J662j872P9J822j810o7J915j800k60K078j761k82
$$ 1099 -827 -349 1122 -708 -453 1209 -663 -584 1238 -572 -639 1276 -524 -784 1294 -467 -749
4704g49J991j523o26J837j211p42K149j200r77K156j067j190K237r74j390K421
$$ -749 1242 -281 -907 930 -281 -1023 1126 -74 -1051 1105 38 -1152 1085 111 -1279 1142
4720A142j039j437K427r30j490K390q19j594K365o46j739K327m53j903K282k67
$$ 1142 103 -1334 1093 163 -1327 1063 244 -1350 1015 369 -1370 957 504 -1399 883 616
4736F16k127K358j77k207K376n5k342K319J00k456K335J47k435K217K63k461K029
$$ 616 -1511 847 670 -1537 839 784 -1558 761 861 -1595 740 887 -1548 669 932 -1529 500
4753E00N46k530J847P18k571J776Q95k658J698J070k759J623J151k803J631J162
$$ 500 1046 -1484 363 1081 -1490 286 1181 -1477 221 1291 -1468 155 1306 -1497 134 1296
4769A296k711J475J256k640J248J415k537J035J545k525Q42J721k471O03J956
$$ 1296 -1415 60 1316 -1324 -76 1339 -1198 -163 1382 -1143 -301 1420 -1051 -448 1508
4784A508k531M82K082k515M21K026k349K71K039k181O5K118k095j37K204j937
$$ 1508 -1023 -541 1541 -974 -553 1473 -876 -605 1434 -747 -682 1436 -659 -796 1408 -529
4800e29l55K275j768o73K376j565q68K405j446j056K547j372j178K462j152j327
$$ -529 -884 1391 -377 -1050 1326 -239 -1107 1298 -148 -1204 1343 -29 -1207 1255 103 -1224
4816a224K402r84j484K317o98j663K284m27j999K338j78k256K451j31k394K526
$$ -1224 1178 194 -1290 1027 329 -1334 950 523 -1476 862 684 -1572 879 748 -1646 880
4832H80r8k519K577L5k551K447K25k684K271M75k779K195P82l019K202R48l227
$$ 880 782 -1737 840 875 -1676 771 996 -1688 583 1058 -1721 474 1256 -1763 439 1387 -1840
4849a840K233J084l299K135J187l245K064J209l271J973J278l138J700J541l218
$$ -1840 393 1477 -1822 313 1500 -1745 319 1528 -1743 230 1508 -1630 70 1611 -1607
4864a607J598J591l084J350J744l006J247J837l052J051K046k988Q19K136k903
$$ -1607 -9 1582 -1502 -152 1592 -1414 -167 1670 -1382 -331 1715 -1273 -454 1682 -1221
4879a221P19K136k754N49K187k600L05K312k462n2K479k240l91K636k141n07K719
$$ -1221 -502 1634 -1120 -571 1616 -984 -679 1633 -829 -881 1598 -642 -1033 1603 -538 -1045 1674
4896A674k160o86K844k132p58K796j843j022K754j545j312K823j421j518K832
$$ 1674 -486 -1172 1672 -460 -1218 1578 -265 -1287 1467 -78 -1390 1433 12 -1506 1326
4911A326j139j741K879r76k009K946r07k127K998p16k368K890m74k322K861l30
$$ 1326 187 -1554 1325 349 -1660 1286 379 -1748 1250 534 -1834 1056 582 -1740 1121 791
4927G91k561K658O1k710K540K60k829K508M42k953K417O69l154K347Q97l266K320
$$ 791 -1770 888 949 -1761 779 1039 -1790 718 1160 -1793 624 1293 -1861 486 1383 -1883 437
4944D37J068l334K235J209l440K023J401l396J810J726l491J599K020l586J480
$$ 437 1505 -1829 406 1615 -1825 198 1599 -1797 13 1739 -1752 -153 1867 -1719 -239
4959b39K185l655J429K316l734J302K412l639J137K521l558R34K587l331O39K748
$$ -239 1946 -1709 -280 2036 -1698 -396 2016 -1623 -486 2035 -1523 -589 1998 -1333 -694 2054
4975B054l350M64K945l301K76K991l192P1L168l144m8L127l001j65L142k893l21
$$ 2054 -1296 -832 2113 -1188 -912 2079 -1113 -1042 2126 -1018 -1066 2061 -940 -1105 2037 -856 -1177
4992a177L090k557o69L158k355r33L222k123j141L248j908j464L325j786j651
$$ -1177 1913 -644 -1313 1845 -510 -1443 1779 -344 -1485 1763 -145 -1609 1716 -70 -1721
5007a721L329j536j782L300j357j953L106r84k182L009o42k331K847l44k622K858
$$ -1721 1608 72 -1710 1590 233 -1720 1386 402 -1780 1229 587 -1744 1103 759 -1863 995
5023I95lk887K749K51l019K677N06l323K760O30l304K556Q23l407K363J207l535
$$ 995 992 -1895 854 1105 -1914 763 1269 -2054 706 1336 -1968 588 1411 -1996 367 1574 -1961
5040a961K171J531l692K052J741l850K034J953l963J859K158m055J884K256m061
$$ -1961 210 1741 -1951 101 1842 -2008 26 1979 -1984 -125 2033 -2022 -138 2118 -1943
5055a943J702K413l943J354K592l892J144K824l828Q67K918l673O44L137l723
$$ -1943 -241 2172 -1771 -417 2175 -1717 -573 2251 -1577 -710 2208 -1465 -821 2316 -1407
5070a407M27L284l650K65L353l404j2L392l315j48L416l121m01L456k831p83L608
$$ -1407 -980 2304 -1346 -1081 2272 -1132 -1144 2248 -1067 -1215 2201 -920 -1321 2135 -696 -1479 2129
5087B129k719r49L669k525j237L763k420j529L844k247j565L807k135j771L724
$$ 2129 -590 -1539 2130 -395 -1632 2131 -289 -1818 2026 -221 -1786 2021 -114 -1885 1839
5102A839j716k049L709j503k222L590j259k375L428q61k718L555p40k818L487
$$ 1839 123 -1926 1783 280 -1942 1648 389 -1986 1442 581 -2137 1418 678 -2140 1347
5117A347n34k987L399k74l053L154q6l038K976L04l199K678O51l293K493J003
$$ 1347 813 -2174 1225 951 -2102 1052 966 -2072 904 1208 -1991 687 1338 -1955 538 1541
5133A541l474K284J283l637K244J516l752K158J717l775J910J926l778J656K181
$$ 1541 -1933 351 1634 -2003 241 1757 -1995 163 1880 -1895 15 1941 -1837 -181 2000
5148B000l785J477K389l767J152K816l873Q46L094l971P81L232l963N72L480l982
$$ 2000 -1785 -308 2081 -1686 -534 2282 -1591 -745 2349 -1622 -841 2391 -1572 -1000 2480 -1502
5164a502M76L508l882K78L567l655q0L711l421m30L867l336o48L980l234q00M036
$$ -1502 -1026 2482 -1400 -1122 2445 -1210 -1290 2421 -1000 -1430 2437 -899 -1547 2433 -801 -1601 2435
5181B435l140j027M102l026j084M052k851j283M044k583j519L947k277j715L862
$$ 2435 -705 -1732 2370 -656 -1740 2312 -539 -1822 2222 -361 -1880 2067 -210 -1925 1937
5196A937j961j965L848j669k266L857j414k527L835j205k647L764r70k736L595
$$ 1937 -24 -1989 1859 190 -2076 1781 367 -2160 1675 470 -2177 1587 617 -2119 1476
5211A476p88k776L377l74k986L196m5l132K998K71l381K948O76l599K818P87l655
$$ 1476 688 -2088 1289 915 -2071 1125 1080 -2052 946 1217 -2164 784 1460 -2139 679 1466 -2189
5228b189K817R48l684K495J224l610K241J492l635J924J810l691J740K119l788
$$ -2189 628 1576 -2108 387 1611 -1999 242 1734 -1901 23 1833 -1858 -118 2001 -1787
5243a787J495K434l972J474K587m052J353K716l945J135K832l843Q92K927l735
$$ -1787 -292 2142 -1830 -356 2231 -1821 -468 2248 -1697 -562 2270 -1573 -681 2246 -1489
5258a489O36L134l614L16L371l545j8L596l531k09L737l381m55L857l344o00L934
$$ -1489 -853 2281 -1333 -1017 2354 -1191 -1209 2387 -1144 -1353 2384 -997 -1452 2405 -939 -1539 2395
5275B395l208q03L966l033r22L775k620j280L827k393j585L956k179j864M023
$$ 2395 -813 -1616 2350 -683 -1605 2170 -450 -1730 2097 -296 -1881 2075 -104 -1968 2055
5290B055k059k093M173k083k078M107j924k168L955j676k243L768j358k503L779
$$ 2055 -4 -2097 2076 -7 -2085 2022 98 -2070 1885 209 -2034 1734 376 -2127 1652
5305A652j117k690L675q25k988L703n83l095L583l97l156L500k73l247L380m1
$$ 1652 535 -2155 1520 695 -2293 1410 827 -2268 1315 918 -2238 1262 989 -2258 1122 1081
5321A081l227L037K97l201K708O42l257K392J001l358K230J286l452K024J524
$$ 1081 -2146 891 1188 -2013 695 1337 -1920 472 1473 -1885 345 1631 -1821 203 1727
5336A727l581J934J657l570J770J851l521J598J921l393J264K227l319Q71K571
$$ 1727 -1854 80 1737 -1833 -63 1788 -1733 -135 1786 -1607 -343 1884 -1435 -564 2007
5351B007l380N75K965l542M14L237l658L47L368l608J86L392l522J33L368l338
$$ 2007 -1373 -798 2167 -1375 -961 2276 -1382 -1035 2333 -1275 -1089 2303 -1219 -1086 2282 -1056
5367a056j83L510l203m55L667l037p77L811k939r96L941k864j108M004k853j220
$$ -1056 -1239 2271 -932 -1387 2280 -757 -1534 2277 -662 -1658 2283 -581 -1689 2315 -538 -1758
5383a758L948k617j381L931k443j488L763k096j707L710j845j895L638j597k120
$$ -1758 2190 -427 -1808 2123 -320 -1808 1955 -141 -1848 1862 17 -1878 1760 163 -1957
5398a957L594j286k391L684j252k419L666j195k535L567q91k579L367o97k625
$$ -1957 1637 351 -2040 1644 392 -2027 1639 444 -2091 1476 585 -1994 1373 676 -1949
5413a949L149l50k775K947l0k962K848L13l191K811M85l371K807O09l363K620
$$ -1949 1200 850 -1925 1022 992 -1970 878 1191 -2000 811 1296 -2075 732 1341 -2022 598
5429E98P06l168K333Q94l178K099J207l196J844J481l238J535J753l292J422K033
$$ 598 1304 -1864 469 1363 -1815 284 1491 -1705 139 1620 -1618 -83 1670 -1622 -200 1833
5445A833l440J369K102l426J282K111l290J070K268l222Q44K321l080N62K573
$$ 1833 -1607 -238 1864 -1562 -280 1831 -1459 -389 1879 -1343 -499 1822 -1258 -696 1877
5460A877k975K37K815k956n3L119k997k00L180k957l10L244k833m74L265k687
$$ 1877 -1098 -861 1954 -1002 -1055 2064 -933 -1133 2047 -910 -1220 2024 -809 -1283 1982 -705
5476g05o69L285k500q35L265k173j175L343j985j576L542j879j701L650j916j792
$$ -705 -1374 1911 -589 -1424 1841 -332 -1507 1836 -149 -1725 1817 -62 -1763 1887 -29 -1821
5492a821L676j848j849L612j692j803L409j544j895L266j198k103L257r99k329
$$ -1821 1855 7 -1842 1770 78 -1725 1684 140 -1755 1511 313 -1790 1467 468 -1861
5507a861L208q04k451L168o09k568L165n31k668L134m60k647L014l32k592K813
$$ -1861 1347 543 -1908 1260 651 -1917 1248 717 -1951 1183 723 -1924 1090 758 -1834 979
5523I79j11k619K517K91k765K312N43k841K155Q37k985K068R72l004J995J015
$$ 979 868 -1751 766 1057 -1708 604 1147 -1694 461 1298 -1687 381 1353 -1651 344 1359
5539A359k911J728J219k911J613J309k813J256J660k725Q97J910k743O63K216
$$ 1359 -1552 176 1395 -1516 97 1406 -1407 -151 1509 -1216 -319 1591 -1152 -489 1727
5554A727k860N20K380k969N31K520k990M73K493k901L16K539k742R2K680k612
$$ 1727 -1133 -613 1767 -1202 -671 1849 -1141 -668 1825 -1076 -760 1779 -963 -871 1809 -803
5570h03j67K752k437m77K925k367p10L131k409o88L151k542o53L128k288q63L020
$$ -803 -970 1782 -655 -1132 1793 -574 -1284 1847 -562 -1250 1901 -641 -1294 1834 -454 -1317 1703
5587A703k083r96K930j755j214K890j479j541L002j286j827L059j148j948L129
$$ 1703 -380 -1376 1554 -201 -1415 1475 -4 -1545 1457 171 -1656 1403 255 -1693 1436
5602A436j204j949L154j161j963L031j004j978K877p97k059K697m68k270K557
$$ 1436 232 -1717 1437 276 -1687 1344 340 -1638 1239 442 -1617 1080 612 -1658 899
5617H99r2k535K576O8k623K603L9k699K502K43k704K484J87k585K216M09k495
$$ 899 807 -1728 848 916 -1707 896 935 -1764 738 981 -1723 761 948 -1637 579 988 -1507
5634a507J946O42k571J768R08k572J476J241k770J511J302k756J385J397k747
$$ -1507 439 1081 -1490 278 1186 -1386 90 1331 -1439 72 1374 -1382 3 1400 -1347
5649a347J284J434k540R60J528k417Q49J634k356N44J820k297K67K145k299J3
$$ -1347 -63 1371 -1169 -209 1319 -1098 -249 1385 -971 -427 1393 -904 -637 1508 -791 -778
5665g78K326k379j1K502k447j19K501k344j54K437k196l24K442j936n36K493j807
$$ -778 1548 -831 -842 1660 -787 -906 1595 -749 -903 1534 -662 -986 1456 -480 -1016 1477 -330
5682c30q89K688j591j209K871j729j197K952j626j401L022j637j312K883j529
$$ -330 -1219 1469 -122 -1331 1540 -189 -1386 1566 -60 -1461 1561 -76 -1388 1495 -34
5697c4j311K704j285j498K684j022j681K543p16j914K629p15j986K705n76k136
$$ -34 -1345 1359 74 -1424 1260 238 -1443 1100 384 -1530 1099 384 -1602 1103 527 -1609
5713a609K729o05k104K600n46j999K474m04j995K232p2k071K007J51k184J946
$$ -1609 1120 515 -1589 1011 465 -1534 940 536 -1459 773 701 -1370 637 788 -1396 550
5729E50L58k394J963N99k559J901O68k574J824P55k509J706P22k243J395Q58k209
$$ 550 908 -1486 477 1076 -1483 418 1086 -1488 336 1091 -1418 288 1010 -1233 162 1020 -1189
5746a189J173J178k236Q37J524k303P78J561k391P48J722k422O72J754k395N66
$$ -1189 -16 1162 -1074 -237 1287 -1016 -238 1323 -1068 -320 1402 -1020 -348 1406 -989 -423
5762d23J793k279M16J857k126K26J849j958o9K101j949l38K394k099l27K386j971
$$ -423 1370 -909 -493 1364 -762 -536 1313 -645 -714 1387 -562 -900 1494 -605 -932 1454 -517
5779e17m84K469k000m36K391j884m79K234j615o83K212j387r45K230j084j290
$$ -517 -1001 1468 -532 -968 1423 -461 -940 1294 -321 -1004 1208 -179 -1124 1106 22 -1268
5795a268K399r58j554K556r92j555K555r96j603K624j000j548K433q42j589K343
$$ -1268 1131 173 -1381 1175 183 -1372 1183 187 -1416 1208 208 -1340 1093 251 -1338 1005
5811A005n81j706K069k41j920K174j09k145K231p2k168K205nk251K261k4k185
$$ 1005 424 -1282 787 546 -1374 800 691 -1454 777 705 -1463 742 737 -1514 747 723 -1462
5828a462K181Q3k247J963L28k164J722M41k099J533O76k186J446R02k391J405
$$ -1462 719 802 -1445 518 846 -1318 404 845 -1254 279 955 -1231 215 1117 -1274 131
5844A31J012k406J326J107k358J269J061k241J094J066k040Q25J264j930N43J393
$$ 131 1143 -1263 63 1170 -1188 81 1142 -1099 -5 1061 -979 -154 1110 -820 -277 1116
5860A116j835K89J644j972J89J880k064J34J904j990R4J895j929l0J895j744k10
$$ 1116 -719 -430 1214 -758 -569 1311 -753 -619 1285 -705 -611 1284 -645 -675 1220 -524 -734
5877g34J945j574m59J956j653m75K162j301r77K349j394j002K477j428j033K418
$$ -734 1211 -363 -822 1134 -519 -994 1168 -133 -1110 1239 -155 -1157 1320 -108 -1141 1277
5893A277j347j071K332j281j052K239j023j180K087p74j427K117n58j641K189
$$ 1277 -70 -1141 1191 -90 -1142 1097 74 -1106 981 207 -1220 897 339 -1302 887
5908H87m67j763K323n25j796K297n10j836K218l64j754K030k01j794J872J2j846
$$ 887 420 -1343 980 455 -1341 956 446 -1390 828 464 -1290 740 539 -1255 617 629 -1217
5925a217J745K68k015J689M02k148J669N46k246J726N05k183J618N71k125J453
$$ -1217 528 796 -1219 470 872 -1276 393 939 -1307 419 924 -1259 359 930 -1195 258
5941B58O52k033J260P88k006J051J066j998Q23J309k119P35J378k135P20J445
$$ 258 910 -1123 137 925 -1081 -30 1036 -962 -139 1170 -949 -214 1164 -971 -251 1194
5957A194k176P40J407k039N63J507j934L39J550j773J78J575j638m3J703j594
$$ 1194 -982 -242 1165 -874 -311 1196 -738 -399 1151 -622 -444 1131 -507 -550 1153 -441
5973d41k63J898j582m34K066j662m04K059j657l60J944j501n05J938j238p19J777
$$ -441 -704 1194 -388 -822 1244 -418 -822 1237 -420 -780 1164 -337 -842 1096 -142 -861 916
5990I16r33r50J870p88j193K018p17j372K094o96j426K145p77j381K063n60j462
$$ 916 -17 -967 903 115 -1078 940 223 -1149 945 249 -1177 968 191 -1190 873 313 -1149
6007a149J949m82j455J798j75j645J836n9j817J754J87k027J855J80k034J833
$$ -1149 800 318 -1137 661 486 -1159 677 618 -1199 555 742 -1285 570 750 -1284 549
6023E49J40k023J892J84j983J692L01j927J514M07j850J360R00k348J401N94j817
$$ 549 689 -1334 558 742 -1241 451 752 -1175 339 746 -1104 256 1156 -1192 209 803 -1014
6040a014J505N25k137J125J134k237J100J042k092J052J093k033Q64J058j810
$$ -1014 491 1016 -1121 4 1138 -1099 1 1043 -1049 3 1096 -937 -73 985 -825
6055h25O13J259j747L85J356j695J93J567j719J02J706j858R9J744j791R9J632
$$ -825 -212 1047 -700 -315 1041 -654 -461 1106 -613 -511 1195 -663 -564 1180 -611 -512 1120
6072A120j629r0J632j403k59J613j191n52J743j120o95J880j167q32K006j169
$$ 1120 -509 -599 1033 -370 -629 984 -207 -759 984 -136 -831 1049 -118 -950 1056 -113
6088a13q77K125j193r38K013j051r20J942q92j059J739n76j180J710m24j352J764
$$ -113 -990 1135 -58 -996 1017 -34 -954 988 96 -963 776 200 -980 730 306 -1046 718
6105G18k61j645J798j31j630J810j09j722J790j09j613J634J3j608J524J58j640
$$ 718 457 -1188 610 479 -1151 659 550 -1172 618 509 -1104 530 543 -1065 459 617 -1023
6122a023J334M01j692J197O36j944J308P34k029J252Q04k041J252P97j998J109
$$ -1023 311 712 -980 217 853 -1091 217 951 -1078 174 978 -1063 189 986 -1012 97
6138I7P91j828R20R45j776P36J031j703N50J243j733M01J401j873L81J601j969
$$ 97 888 -940 -20 925 -851 -115 916 -787 -237 1006 -727 -326 1075 -798 -417 1184 -785
6155g85M12J539j930L93J496j819L02J430j580P1J493j452j01J537j296l82J664
$$ -785 -373 1166 -764 -371 1125 -694 -392 1038 -542 -471 1022 -430 -531 1006 -290 -672 992
6172I92j250m58J725j281m86J741j263n01J764j206n36J665j032o35J569q38p93
$$ 992 -258 -716 1009 -272 -758 983 -280 -781 983 -223 -759 906 -126 -761 808 -30 -823
6189h23J628o59j080J658m75j221J711m50j240J638l74j248J669m09j267J588
$$ -823 805 146 -934 724 249 -972 739 289 -951 687 313 -935 734 325 -942 646
6205F46k90j230J419j26j259J250J14j428J242N38j999J560L08j712J218N10j819
$$ 646 356 -874 545 419 -840 410 524 -904 338 876 -1123 437 745 -967 251 761 -1058
6222a058J330M65j666J194M12j556J004N78j530Q87P41j550O62R28j540N77J013
$$ -1058 272 737 -929 265 677 -879 125 703 -827 60 801 -749 -87 841 -699 -122 891
6239H91j608N72J078j696O07J096j678N96J032j556M78J061j444K48J229j340
$$ 891 -717 -145 933 -763 -156 940 -738 -142 890 -666 -188 873 -571 -323 906 -434
6255d34M7J251j254r3J337j253j77J503j313k11J507j251j95J482j330j62J345
$$ -434 -387 864 -390 -483 854 -399 -576 927 -386 -597 910 -341 -536 946 -384 -546 799
6272G99r78l87J280q23o09J425p01p49J466o78q22J506o20r30J569o65r23J571
$$ 799 -179 -566 714 -109 -718 707 6 -743 723 45 -777 729 109 -821 748 83 -840 731
6290G31o71p90J458n78r05J375m19r68J260k15j082J173L4j207J214K1j283J271
$$ 731 60 -730 728 150 -755 620 201 -767 493 278 -804 369 403 -804 410 431 -852 419
6308D19N0j296J189J00j265J120J32j191R95J99j097P54M02j117O37N66j207O06
$$ 419 469 -827 362 462 -803 317 449 -742 253 452 -645 109 511 -606 31 597 -610 -4
6326dP46j421O69O90j263N98O39j189K89O45q43N43N66j089K16Q57j046J41R30
$$ -4 742 -679 -10 680 -583 15 654 -535 -246 399 -444 99 665 -424 -208 649 -397 -256 674
6345F74j063J11J066j209O4J185j226k5J240j218K6J165j092o4J121j087j8J005
$$ 674 -389 -278 788 -421 -357 828 -398 -423 817 -401 -375 790 -302 -366 755 -332 -350 655
6363F55q67k44J084p04m31J152p39m89J210p08n17J272p04n74J229o24o07J196
$$ 655 -212 -456 628 -76 -507 645 -94 -583 627 -81 -598 674 -30 -604 625 1 -606 590
6381E90n76n33J022m51n75R50k85o94R46j72q55J049j78q99J112j86r68J157k15
$$ 590 14 -519 503 52 -523 427 142 -552 394 222 -633 416 238 -661 451 265 -703 454 239
6400B39q65J032j80p92Q73k7p65P36N8q17O09K72r21O66L60j031O41M18j098O54
$$ 239 -626 406 226 -566 307 280 -485 251 309 -508 101 373 -548 118 478 -553 88 506 -592 62
6420F2M21j048O53L20r17N29L75q41L72M65p10J56O45q00J37P03q35J74O95q99
$$ 62 483 -565 88 408 -509 20 395 -446 -74 391 -319 -163 482 -318 -181 522 -313 -139 556 -343
6440c43J93O94q81J70P05q76J75O25o73MO56o22j07O93m91k66P71n04l67R02n44
$$ -343 -150 544 -337 -167 538 -338 -163 462 -211 -207 449 -173 -280 413 -78 -344 427 -77 -444 458 -86
6461h6l77R32n34l71R21n91k19P70n37k54P22l85l56O23j76n00P51k03o02Q54
$$ -86 -463 469 -65 -436 485 -106 -325 445 -92 -346 376 -9 -365 258 82 -418 333 130 -472 382
6481C82j82o24P79j95o46Q29k09n25P36k77m28O27j08n14N23L0n40M70J06n60
$$ 382 200 -424 355 160 -486 343 134 -391 345 68 -360 267 159 -355 168 198 -342 128 234 -326
6501c26M10J79o86N49J33o41N64O1o50N68Nn24M72P0m60L54J46m30J80L17m76
$$ -326 84 263 -423 126 259 -382 182 243 -407 161 166 -358 114 184 -276 78 224 -206 -26 291 -185
6522a85J07M11n54J26M16n69J92M18n82J88L03m94J52K98m25J28K73k46o7K28
$$ -185 -78 333 -221 -95 321 -248 -56 362 -220 -32 271 -223 -71 227 -198 -70 203 -43 -110 118
6542A18j49j75M14k24k11M87k96k23N03l04j18M30l69k1K83k08p5L18k09j04L05
$$ 118 -31 -206 208 -16 -227 260 -36 -259 244 -60 -178 252 -117 -138 145 -63 -138 180 -29 -133 172
6563A72p8l74M56r2l13M08k7m56M82r1l57N04k44k10L81j41k26L10lk79K47K8
$$ 172 94 -280 176 84 -229 179 152 -304 178 87 -270 234 -10 -220 161 20 -206 104 101 -178 69 97
6585I7k04J40J22k87J63J96m88L43R0m08L45j1l14L01j4k04K61r1j26J32np4K1
$$ 97 -107 33 155 -132 31 227 -261 82 172 -236 109 98 -216 85 71 -133 128 37 -89 43 38 -36 -15
6608a5J39j96L7K00k41O9J66k92J83O6k53J30J12j72R0Rp1N3J6p8L3N8k7q2J06
$$ -15 124 -72 -35 165 -76 -7 159 -133 50 116 -137 -7 105 -67 23 32 -39 14 30 -48 -15 43 16 -66 40
6633D0M6k11K23j12j00K23j22rJ21o9L1m0o1Oj8Q0o5l3K06k20P5J25k21J29R9
$$ 40 86 -125 98 -14 -114 109 -13 -22 99 30 61 21 -40 -34 -52 28 -37 -70 136 -84 -9 116 -105 24 123
6658A23k24J41J6j00R6k0o5O4m5k5JJ33n9j03J12l9j17K45j60r9K58k03jJ95j84
$$ 123 -101 40 56 -44 52 32 -33 31 -14 -39 -38 95 36 -67 45 6 -111 134 -26 -125 133 -70 -71 124 -60
6683f0O8P7o9j1K6m7j6J3Q0j55J18N0j76J42L9j98J40on4J02j38L1R6q4L1J9N
$$ -60 8 85 16 5 31 -16 -32 -19 61 -94 24 74 -102 40 79 -119 21 15 -39 63 -75 -44 52 -32 -1 18 23
6710B3m7p3K15j22j03K47j35j48K68k11MJ92j50L1J22j13n8J82j10n5J33l0j57
$$ 23 -24 -97 118 -4 -107 140 5 -143 125 -86 -82 110 -40 -9 113 0 -58 124 14 -41 92 62 -95
6733i5J89Lk48K87q4k70L77j44j81L64k41j49L21j31j20J68J2k05J74L5j88K39
$$ -95 94 97 -151 136 52 -218 159 15 -166 198 -43 -192 129 -2 -122 46 58 -147 27 62 -126 113
6755A13l1l03L10M9m07M03k5l74M21n8k82L19l3k41K26k5j68J96Jk18J28J19k67
$$ 113 82 -221 89 138 -269 134 109 -265 156 98 -184 135 102 -139 87 62 -106 90 91 -127 1 120 -147
6778a47Q9K30l79J67K17m09K81J43m47L10N7k61J84P6k58J46R8j72m6K98k26r0
$$ -147 -58 172 -207 -40 177 -232 49 192 -255 55 112 -149 35 111 -147 -1 97 -75 -121 177 -49 -139
6800a39L83l15p1L98l49JL50l82L9K75l00jK99k88k6L16k15j04K61j09k65M10
$$ -139 244 -71 -142 256 -93 -92 258 -124 -85 190 -110 -111 188 -100 -126 190 -25 -129 132 23 -242 168
6822A68j47l16N03j71k71M73k83j65M62k39k66M13j04k92L55Kl19L14ql17L11
$$ 168 21 -295 208 37 -234 239 -44 -209 253 14 -252 161 57 -235 120 122 -197 117 109 -208 103
6843A03M4l86L34R8n30N51p6m37M71m2m77O51j89m08M23K9l96L43P9m72L52J48
$$ 103 147 -239 95 193 -337 214 138 -299 172 130 -347 304 115 -293 130 159 -237 106 185 -287 65 213
6865B13n11L16K06n27L58J72n53L64J76m98L78J40n46L38J79l79K08J60l43J06
$$ 213 -298 18 224 -303 55 227 -326 38 214 -284 94 234 -312 26 205 -174 34 194 -149 -43
6885d3L11m78J68L01m14Q9L02m71J53M41n36Q6K95l95J69K57m17P9L35l36k6L23
$$ -43 268 -210 -42 259 -155 -66 236 -235 -82 359 -177 -91 204 -191 -22 235 -182 -103 232 -104 -130 193
6907A93k61q9L26k49j49M92l03j77N08l87j06N06l39k05M48j92k72M66k00k13
$$ 193 -68 -157 169 -80 -229 263 -40 -217 291 -96 -202 304 -35 -240 208 16 -256 210 10 -203
6927b03M15r7l95M79n4m51M72q1m07N75j41m54N56r3n08N92j29l58M77j73l22
$$ -203 212 115 -280 199 145 -306 166 85 -322 253 112 -342 214 121 -387 205 76 -282 195 22 -300
6948c00M33o4l14K69N6Rj25L86p22K31N50o55L19K60q35P61j1n21M16j17l98K85
$$ -300 133 69 -245 24 80 89 -36 350 -372 -141 409 -246 73 333 -502 259 248 -273 143 26 -372 -87
6970h7K58m61O4O52o51Q1M80m25j2M34o43L05K82n15K31L37n96J51K57l39K16
$$ -87 171 -290 -226 426 -225 -144 336 -89 -101 333 -310 -5 277 -238 -7 330 -266 -115 142 -197 19
6991A9pl22K79L79n54J84L84m24j07N62o28J94L67m88J23K53n25J00K45p0k15
$$ 19 12 -310 -31 348 -206 -22 362 -62 -169 393 -235 -41 326 -162 -39 214 -311 -211 34 -36 -251
7012b51M87k38k58N11k82r7L57k47k01M43k00k59N18l00k37N45l30n1K02j35k61
$$ -251 236 -2 -260 251 -31 -128 229 -18 -219 224 24 -235 283 -17 -254 291 -39 -90 112 -23 -284
7033b84N02R3m43L05J56o13P29n99j5L62M4n71O54j61m18L89J60o61N02j28k89
$$ -284 218 311 -132 173 329 -284 445 -154 -169 193 237 -334 320 159 -259 130 290 -371 131 3 -286
7054b86O44k50l95L68J07n36N34J66n71L32Q5p08O97K45r38Q97j02o65N45O1n77
$$ -286 358 108 -287 81 188 -348 186 352 -219 113 198 -510 187 432 -506 391 289 -376 169 230 -347
7075c47M14J28m62L22J63n07L35K30n44L01K00m58K53K63m93K10K80n21K45J86
$$ -347 67 195 -267 55 218 -289 46 276 -268 33 233 -225 28 291 -202 8 288 -233 12 198
7095A98m13J84K61m31J75K27m30J64K66l28RL63l73kL79l38n0L79l78K0L63l20
$$ 198 -215 -31 230 -201 -26 201 -229 -65 201 -127 -118 245 -128 -130 249 -89 -139 240 -138 -118 245 -75
7117g5p4M12l41n8L45k90m5K96k02j02L25j56k01M28k68k12L98k22j90M69k51
$$ -75 -149 263 -78 -136 209 -81 -126 170 -32 -134 191 35 -166 262 -6 -218 180 -42 -232 237 -14
7138a4k36M29j95k25M12j06l41M29p8k60L80j47l25M35m6l51L60l1l33M13q5l32
$$ -14 -250 179 -16 -241 171 65 -276 153 75 -185 195 48 -277 158 112 -239 121 90 -243 170 85 -247
7160b47M08k0m37M34l2l66M31jm08L42M4l90L31N0m44L97O5l84L18Q9m30K89J62
$$ -247 161 141 -296 138 106 -260 171 170 -238 104 148 -242 89 139 -305 92 157 -227 91 180 -250 39 201
7183B01m69L21J83n03L11J55m68K83K37n15L11J73m12J99K50m66K24K57m30J98
$$ 201 -268 53 236 -267 44 199 -269 14 251 -264 47 220 -192 7 257 -209 15 272 -158 40
7203D0K42m86K10K33m37K35J88l82R9K54l78J37K39l48Q6L21l81KK89l01O8K86
$$ 40 282 -204 6 239 -198 37 225 -157 -58 196 -182 -45 194 -154 -68 253 -128 -126 163 -138 -70 216
7225B16k90k2K63k12m0L00k82j03L42k64m0L36k25j21M02k66j32L10j72k10M13
$$ 216 -74 -96 167 -45 -85 215 -67 -170 172 -92 -132 204 -21 -142 260 -6 -138 172 0 -210 203
7246B03j53k27L52m6l80L63j71j90K83P8m07M36q0l64N84k64r1K40q2n11O31k0
$$ 203 50 -177 175 129 -251 112 -59 -249 34 112 -295 141 61 -303 281 17 -74 166 84 -427 204 184
7268A84k67P5K77p90N79O1l95L50R3n06M04J19m73M31j2l64L21O5m01L32N5m23
$$ 184 -83 -8 269 -521 58 119 -276 74 167 -339 65 184 -289 142 130 -234 87 152 -249 83 138 -285
7290b85L63R6m52L65O6l95K89J55m09K30J49m02K61K14m73K50K35m66J89K86m38
$$ -285 78 174 -278 87 153 -242 47 202 -207 23 172 -230 31 245 -228 22 257 -209 -20 266 -172
7311a72K03K11m06J45K63m53K06K68m31J68K40l88O5K82l74R1K84k98RL04l04
$$ -172 31 242 -164 -19 244 -209 -3 265 -166 2 242 -146 -81 201 -173 -82 202 -96 -87 217 -87
7332h7J2L31m00N8L39l41j07M12k55r6L24k20j45M01k48j57L95k04k18M07j98
$$ -87 -75 256 -144 -86 253 -88 -195 217 -38 -134 190 -30 -175 226 -22 -179 216 12 -206 201 3
7353Cj70M27k14k68L81j11k44M01j19l40M24p3l31M15o2l84M28r3l50M19o3l25
$$ 3 -167 260 46 -222 159 48 -196 205 86 -254 170 97 -234 181 119 -265 163 70 -280 139 76 -249
7375b49M09l5m00M23j1l97M00Km48M24O0n04M57O9n11M30J52n64L58J66n00L64
$$ -249 160 125 -275 148 137 -260 140 142 -306 118 178 -326 131 200 -311 119 271 -293 65 231 -269 95
7397I5J45n25L86J09n58L56K63n54K83L55o39L05K82n67K41L05n69J94L37n35
$$ 95 240 -285 101 210 -348 8 271 -283 0 355 -284 21 303 -264 -23 282 -287 -93 244 -291
7417b91K35L39n31K11L29n19J64L16l99J10K68m07L8M48m04m4M27m45qN05m34
$$ -291 -56 283 -248 -37 292 -227 -63 253 -146 -36 232 -175 -137 311 -93 -137 290 -155 -163 342 -92
7438i2q8N02m09o9M44m03j71N41l39j81N42l07j88M66k39k88N16j95l17M98j87
$$ -92 -180 322 -87 -156 288 -115 -286 255 -84 -265 277 -30 -218 248 9 -279 237 42 -275 223 36
7459C6l03N59k56l51O00k00m26N35j20l92N14n1n16N68j9m94M79l4m52N05j6n12
$$ 36 -267 292 36 -315 285 85 -341 194 74 -318 196 145 -371 197 178 -316 163 129 -323 182 166 -346
7481c46M72O7n30M70J00n69M93R2o19M28J94n49K79K95o15L69K27o09L80K74o37
$$ -346 126 193 -337 133 233 -336 157 249 -370 58 252 -297 -18 277 -338 31 258 -351 29 303 -334
7502c34L34K71n67L07L36o39K39L86n99J88M72o44J84M97o68L5N96o36R6N64o37
$$ -334 0 271 -296 11 347 -292 -53 333 -266 -78 394 -250 -66 431 -237 -202 394 -242 -146 418 -219
7523b19L5N62o10K9O06n98J7N78n60n2O05n55l6N22m53m3N52n30j69O53m27k32
$$ -219 -184 378 -232 -203 403 -195 -178 400 -160 -212 393 -162 -198 324 -129 -172 380 -150 -319 334 -93 -325
7545c25P01m43j89O67m74k38O48j98m49Q10n91l90Q08k93l26N46j44m12N94j39
$$ -325 376 -67 -256 411 -63 -301 347 149 -300 510 -81 -471 337 44 -282 264 120 -292 302 163
7565A63n03N46n8n46O21n2o09O18kn00N63m2n44N08J04o07M55J17o31M96K21o77
$$ 163 -340 206 148 -398 223 171 -438 180 178 -322 241 199 -345 163 267 -340 115 232 -399 97 318 -359
7587c59M54K03p14N31J96p05M21L13p25M11L54p24L70L54o83K50M81p13J91M97
$$ -359 95 298 -416 115 311 -394 27 340 -385 26 380 -344 26 380 -303 -53 428 -285 -94 403
7607D03o87J48O32p85J68N19p04M0P24o59j6O43o79OO44n89j7O14o11m9O71n49
$$ 403 -284 -136 496 -289 -121 398 -306 -266 458 -201 -217 426 -253 -247 397 -192 -209 405 -206 -255 416 -133
7629a33j57P76o38j65P31n44j55O88m78k28O73l92l33Q05m40l62P14l71l71P51
$$ -133 -290 486 -152 -317 414 -130 -285 403 -75 -303 370 -22 -355 450 10 -352 362 -9 -380 371
7649C71l47m11P29k56n11P33k20n77Q18j78n58O80j74n68O83j4o03O30l2n94N75
$$ 371 24 -387 342 86 -425 308 88 -489 329 151 -407 273 99 -469 214 200 -403 227 195 -399 176
7670A76P0o29N53Q7o89N74J56p68O88J17p25M53K41p72O29P1o99N54J29n71L47
$$ 176 246 -383 170 257 -432 142 298 -470 218 335 -390 63 304 -468 161 232 -467 87 216 -355 -8
7691hM14p22K59M07j000N65O63j119M47P11j002K84N81p75J05O19p47l5P85o61
$$ -8 406 -316 -57 350 -650 -85 578 -541 -94 617 -385 -101 480 -295 -190 429 -318 -353 432 -229
7711b29K9O78p06m4P37o79q1Q08o39k39R15p01j56Q28o64j34P20n38k48Q02m87
$$ -229 -200 478 -228 -272 465 -214 -295 513 -126 -365 550 -151 -307 521 -143 -277 443 -95 -343 459 -28
7732b8l26P55m78l17Q11m77l08P90m15m28Q12l43m75P98l43m67Q21k45n42P17
$$ -28 -354 401 -77 -394 417 -60 -368 422 7 -421 391 48 -427 371 28 -439 382 137 -405 312
7752C12j85n48P43j10o23O85j02o31P04J1o87O03Q8o98O36O9p72O75J15p42N48
$$ 312 127 -421 322 212 -411 274 172 -459 245 256 -431 172 260 -438 198 267 -505 170 285 -457 91
7773I1K43p61N23K39p49M85L33p76L73M19q03L99L81p73L56M68q21L34M50p60
$$ 91 334 -427 96 335 -414 71 404 -372 1 420 -383 16 397 -376 -20 448 -373 -39 411 -349
7793c49K16N86p19J33O11p43Q7O66p57P3O01o37jP14p35QP13o68n2P31o50j23
$$ -349 -133 453 -266 -133 478 -265 -178 488 -269 -196 405 -232 -233 481 -254 -246 467 -201 -253 478 -172 -295
7815b95P17n59j89P31m66l06Q13m93l49Q20m35l88Q65m11m83Q53l67m61P88l33
$$ -295 422 -137 -326 405 -61 -367 446 -47 -396 424 -11 -399 466 55 -428 425 58 -403 385 52
7835E2m68P49k38n77Q59k60o20P98j13o54P89r4p37Q15l1p79P72k6p48P20O0p37
$$ 52 -416 333 95 -482 377 117 -503 295 182 -472 317 223 -514 301 270 -509 263 237 -511 209 269 -468
7857d68O98O1p86O49J53p40M94L27q61N26L16p95M79L73q63M86L78p90L64M23
$$ -468 230 291 -495 154 307 -433 61 388 -473 53 369 -426 53 426 -437 49 427 -363 1 424
7877D24q38L53M51p11K61M51o76J82N00o38J02N32o32J3O90o84l1O95o60M3O70
$$ 424 -414 -61 390 -321 -60 391 -285 -103 397 -241 -139 393 -239 -226 464 -220 -251 444 -216 -173 497
7898D97o87n1P01n76j79P07m90k58P26l87l78P35l84l73Q08m29l58P91l62m46
$$ 497 -190 -241 460 -116 -295 412 -78 -336 390 3 -375 360 -24 -397 411 -18 -376 415 53 -393
7918c93P31l31m70Q58k83n65P67j80n96P62j23n95O86p4o79O96K9p19P22k3p39
$$ -393 338 7 -463 395 112 -453 314 134 -462 300 177 -418 268 194 -485 211 240 -479 243 220 -519
7939e19P45N8p65O83J25p56N67J70p30N43K12p30M60L17q07M92L60q44M65L55
$$ -519 226 284 -481 202 327 -429 138 308 -422 121 333 -397 63 380 -427 65 425 -419 46 401
7959D01p29L54L46p86M13M33p91K95M85p95K68N68p59J63N53p20J56N82p03J2
$$ 401 -328 26 372 -414 -1 432 -359 -64 421 -374 -106 462 -297 -134 419 -301 -145 437 -266 -254
7979b54P02o57KP50p12j00O93o11q5P38n52k23P75n28k43P30m50k76P27m20l74
$$ -254 448 -209 -207 543 -169 -269 424 -187 -272 466 -86 -309 466 -62 -305 425 -25 -301 426 6 -368
8000c68P40l49m38Q07l66m74P77k96m62P39k52m98P01j23n46O86j13o46O67J0
$$ -368 372 23 -415 392 26 -448 329 33 -429 310 58 -440 261 138 -408 278 165 -481 186 196
8020A96o56O63M8p01O99%p09O79L5p11O27J60p90N73K19p69N62L00q69N06L29
$$ 196 -460 203 251 -450 249 249 -460 219 254 -457 170 330 -460 113 332 -437 125 425 -444 62 391
8041C91p88M52L43p76L55M94r23L67N50q31K54N39p51K36N84q16K06N40p41J15
$$ 391 -397 55 398 -378 -23 471 -452 -85 465 -366 -112 427 -324 -88 496 -320 -114 426 -315 -200
8061b00O77p70L7P45p55RP82p62n3P72o57o1P00o26j17P19n33j71O85n15k06P55
$$ -200 477 -293 -256 489 -266 -257 525 -237 -290 482 -175 -236 464 -162 -279 440 -93 -264 421 -94 -300 455
8083D55n13k96P42m08l83Q39m02m05P03k35n89Q64k52n54P00j80n40P49p1o23
$$ 455 -58 -354 388 -20 -403 436 34 -371 332 97 -492 372 120 -434 266 86 -454 295 224 -399
8103c99P52j99n54O19L7p63P17R8p89O99J05p85N49K56p96O20J99q16N28K69p57
$$ -399 353 154 -400 219 256 -507 210 308 -481 218 323 -462 87 343 -453 167 366 -450 78 347 -410
8124d10M52L43q18M67L43p98M53M14q49M06M48q82L94M38p93L01N97q67K44O03
$$ -410 42 385 -433 34 377 -421 32 446 -403 3 451 -431 -37 401 -392 -91 506 -361 -117 486
8144D86p63J13O01p10N9O84p16L2O83p47L7P04p25J9P59p43n8P21o56n1P52n85
$$ 486 -277 -164 437 -273 -214 470 -246 -214 469 -278 -241 463 -262 -243 516 -227 -285 436 -220 -271 481 -104
8166a04k55Q29n50k23P23m69l33P87m34l94Q08m10l71Q02m04m14P42k24n13Q32
$$ -104 -359 470 -80 -303 420 -49 -382 405 -29 -423 385 -25 -396 406 2 -412 330 106 -407 425
8186D25l41n00P36k20n21
$$ 425 84 -416 320 100 -421
8191d21
$$ Imaginary data points
##PAGE= N=2
##DATA TABLE= (X++(I..I)), XYDATA
0@%%%%%%Qj6J6j6J6k4M0n6P0p8R4j18J44j77K14k53K96l50M15m86N62o44P39q50
$$ 0 0 0 0 0 0 0 8 -8 8 -8 8 -16 24 -32 38 -40 54 -64 80 -97 117 -136 160 -190 225 -261 301 -343 396 -454
30d54R73j108J257j419J598j798K021k262K523k809L121l467L846m258M703n187
$$ -454 519 -589 668 -751 847 -951 1070 -1192 1331 -1478 1643 -1824 2022 -2236 2467 -2720
46b720N720o306O949p655Q429r280J0228j1290J2483j3830J5361j7124J9182k1619
$$ -2720 3000 -3306 3643 -4012 4417 -4863 5365 -5925 6558 -7272 8089 -9035 10147 -11472
60a1472K4556k8169L2731l8702M6868n8699P7332j10770J87338o30049K3775J587338
$$ -11472 13084 -15085 17646 -21056 25812 -32887 44445 -66325 121013 -509036 -485261 1102077
72A102077j742465K43518J331566j470141J82297J234368j366300P1301J201618
$$ 1102077 -640388 -396870 934696 -535445 -353148 881220 -485080 -413779 787839
81G87839j088414j70514J224039j019726k69911J329004r82799m09878J372836
$$ 787839 -300575 -471089 752950 -266776 -536687 792317 -190482 -600360 772476
90G72476r77027l44512J332377j014136l31011J301947r05502l29822J123921
$$ 772476 -204551 -549063 783314 -230822 -561833 740114 -165388 -495210 628711
99F28711p70083l41521J061304o09884m86542R92971m14794n93143J005801l56589
$$ 628711 -141372 -482893 578411 -31473 -518015 474956 60162 -532981 472820 116231
109A16231p44793J090631k65338q26807J076241k85449p87225J094632k88350
$$ 116231 -628562 462069 196731 -630076 446165 160716 -626509 468123 179773
118A79773p78827R78095j99398o92829Q30985j01238p23445P11869J21649p93895
$$ 179773 -599054 379041 179643 -513186 317799 216561 -506884 204985 326634 -467261
128d67261N84073K56302q84903O19051L54169j021060O32819L97661j017918O53844
$$ -467261 116812 373114 -511789 107262 461431 -559629 73190 470851 -547067 106777
138A06777L42501r96428O26345L58851r02225M93995L71566q17711L94243M74091
$$ 106777 449278 -547150 79195 438046 -464179 29816 401382 -416329 -22086 452005
148D52005q27881K53673O08104q33036J92783O82503r09266J98977P50766r47050
$$ 452005 -375876 -122203 485901 -347135 -154352 528151 -381115 -182138 568628 -378422
158c78422K02353P23376r38886K35984O98071r05045J81507O80559p96550J05295
$$ -378422 -176069 547307 -391579 -155595 542476 -362569 -181062 499497 -297053 -191758
168a91758O71778p40139O288P50215o96533j09209Q13527o96001j45896Q86618
$$ -191758 480020 -260119 -253831 496384 -200149 -309358 504169 -191832 -337728 548890
178E48890p41166j70378R05914p36129j33491Q49939p29723j06839P99920o42750
$$ 548890 -192276 -362654 543260 -192869 -326360 523579 -206144 -312983 486937 -155813
188a55813j41473P15806n31335j90690O99357m46814k99977P20441l74154l65501
$$ -155813 -297286 418520 -112815 -303505 395852 -50962 -350939 369502 -4652 -370153
198c70153P54733l87016m00336Q02466l92264l96300P70528l95852l43555P22766
$$ -370153 384580 -2436 -402772 399694 7430 -388870 381658 -14194 -357749 365017
208C65017l66063l34508O38369k73574l35415N63359j88850l91012N40289q8467
$$ 365017 -1046 -335554 302815 29241 -306174 257185 68335 -322677 217612 129145
218A29145m62807N24533l7774n06839N49046k1582n39470N46178p510n14681N11124
$$ 129145 -333662 190871 153097 -353742 195304 173722 -365748 180430 172920 -341761 169363
229A69363k317m87485M52253N1881m66595L60045J23632m64662K98972K10045
$$ 169363 167046 -320439 131814 183695 -282900 77145 200777 -263885 35087 245132
239B45132n11359K58509K90775n53758K51734L21999n93668K70545L32741n98020
$$ 245132 -266227 -7718 283057 -270701 -18967 303032 -290636 -20091 312650 -285370
249b85370K63161L15500n59544K40860L09390n20011J75615L40546m74810R9102
$$ -285370 -22209 293291 -266253 -25393 283997 -236014 -60399 280147 -194663 -95561
259i5561L85999m68847M3031M58213m93428M704N08534n24579J4958N27855n54428
$$ -95561 290438 -178409 -135378 322835 -170593 -165889 342645 -181934 -166976 360879 -193549
270a93549K7632N17258n37585L5687M78311n00428J8065M62798m41836l7539M59120
$$ -193549 -165917 351341 -186244 -150557 327754 -172674 -154609 308189 -133647 -171186 287934
281B87934l90079r2307M87970l72454j46291N24270l67922j63688N38814l82021
$$ 287934 -102145 -194452 293518 -78936 -225227 299043 -68879 -232567 306247 -75774
291g5774j55127N32926l74644j41723M90454l41631j32363M44536k85814j57971
$$ -75774 -230901 302025 -72619 -214342 276112 -65519 -197882 246654 -39160 -197131
301a97131M08058k13647k01425L95453j61492k57433M13802j31350l00429M33125
$$ -197131 210927 -2720 -204145 191308 29816 -227617 186185 54835 -245594 187531
311A87531j27488l11859M44769j34831l04073M28666j26534k80653L83590r7731
$$ 187531 60043 -251816 192953 58122 -245951 182715 56181 -224472 159118 61387
321F1387k67322L33194m2642k80385K87366K0293l08973K66561P0963l50340K68134
$$ 61387 -205935 127259 84617 -195768 91598 111891 -197082 69479 140442 -209898 58236
332E8236J00615l74698K73668J01325l74622K72841R6954l54721K44698J00037
$$ 58236 158851 -215847 57821 159146 -215476 57365 154319 -200402 44296 144333
342A44333l19116J98110J23642k99957J43418J69655k96590R9366K16531l16544
$$ 144333 -174783 23327 146969 -152988 -9570 160085 -136505 -37139 179392 -137152
352a37152Q0820K57478l42408P6940K72712l54225Q4081K68616l48844P8477K58733
$$ -137152 -56332 201146 -141262 -64322 208390 -145835 -61754 206862 -141982 -63505 195228
363A95228l19860N5129K54575k88217J4504K72514k63712l3679L04352k58235
$$ 195228 -124632 -69503 185072 -103145 -88641 183873 -79839 -113518 190834 -67401
373f7401o8159L43082k73254q3962L68823k90247p7959L71082k98360o5821L55160
$$ -67401 -135560 207522 -65732 -149694 219129 -71118 -149077 222005 -76355 -142176 212984
384B12984k84807o0899L26167k50036p4669L05906k08662j07035L04610j75090
$$ 212984 -71823 -132722 193445 -56591 -131260 174646 -34016 -141051 163559 -11531
394a1531j44426L18640j61340j69810L35585j63878j76022L43371j71278j65193
$$ -11531 -155957 162683 1343 -168467 167118 3240 -172782 170589 -689 -165882
404a65882L31869j69463j49801L03149j47324j43047K67809j11554j50976K43047
$$ -165882 165987 -3476 -153277 149872 2548 -140499 127310 15756 -135220 107827
414A07827p2200j74585K32919m1321j99012K35916k6549k16530K41618k2518k16348
$$ 107827 35627 -138958 93961 52640 -146372 89544 62995 -153535 88083 65565 -150783
425a50783K36847k5101k02534K19672j8502j86521J87226K609j75304J50941L6787
$$ -150783 86064 60963 -141571 78101 59599 -126922 60304 62913 -112391 38550 75337
436G5337j79399J20190P5899j94595J04584J04725k15548J04862J20356k29635
$$ 75337 -104062 16128 92027 -102568 2016 106741 -108807 -3945 116411 -113224
446a13224J09028J20312k27043J06969J13550k09640R0018J12561j86948O1974
$$ -113224 -4196 116116 -110927 -3958 109592 -100048 -10030 102531 -84417 -22443
456b2443J25159j73605L0358J51633j73987N804J79112j84456l039J96254j96947
$$ -22443 102716 -70889 -40531 111102 -62885 -57081 122031 -62425 -65464 130790 -66157
467f6157J34J99565k02184M982J92856j93574J018J84888j74395j5179J82411
$$ -66157 -66023 133542 -68642 -63660 129196 -64378 -63360 121528 -52867 -68046 114365
478A14365j53325l7614J88558j40765n9290K04053j38217p5699K18584j40908
$$ 114365 -38960 -76574 111984 -28781 -88071 115982 -22235 -97934 120650 -20258
488b0258q1080K24118j44178p7608K18580j41812p0128K04036j30812o8739J88313
$$ -20258 -101338 122780 -21398 -99006 119574 -22238 -92366 111670 -19142 -87881 100432
499A00432j09141p8370J75227q3987r4607J71199o5172j13049J77166n8146j25345
$$ 100432 -8709 -87079 88148 4161 -90446 80753 15581 -97468 79698 21552 -103793
510a03793J86903o0978j28125J89859o3804j20203J79004o1447j07770J59543
$$ -103793 83110 22132 -105993 83866 20062 -100141 78863 17416 -90354 69189
520F9189m9376j02993J39893k8532j09351J26905o390j22948J22512Q837j34057
$$ 69189 19813 -83180 56713 28181 -81170 45735 39345 -83603 38909 47746 -86311
531h6311J23490J2100j36046J24517R353j30470J18428J0162j20098J01690J7517
$$ -86311 37179 49279 -86767 37750 47103 -83367 35061 45223 -74875 26815 44332
542D4332j08842Q0362L0822j03454O1860M6841j05254M9970O2133j12011M3833
$$ 44332 -64510 15852 46674 -56780 5080 51921 -53333 -3363 58770 -53241 -9408
553i408P3524j17105M0754P6892j16204L9415P4711j10871L4929P2442j01026
$$ -9408 64116 -52989 -12235 64657 -51547 -12132 62579 -48292 -13363 59079 -41947
564d1947K3759P5713r0746N709Q5716q2851j2165R8444q2823k3433J13406r0925
$$ -41947 -18188 57525 -33221 -27512 58204 -24647 -36812 61632 -21191 -44624 68782 -22143
576b2143k7027J22731r8060k4508J23087r8943k2537J16881r0838k4124J08773
$$ -22143 -49170 73561 -24499 -49007 74080 -24863 -47400 69481 -21357 -45481 63292
587F3292p9014l2188J08024o7935m6095J13523o1772n7215J20833o2192o0845
$$ 63292 -15722 -47910 60114 -7821 -53916 59607 -2165 -59380 61453 -739 -61584
598f1584J24779o5929n7172J22868o7864n1194J14867o2444m8371J03686n0961
$$ -61584 63195 -2734 -59906 62962 -4902 -56096 58771 -3673 -52044 51642 681
609F81m9972R3913l8533n5875R0125k8426o4473R0934k2143p1612R3666k0173
$$ 681 -49291 44622 6089 -49786 40339 11913 -52560 38374 16231 -55381 38285 18112
621A8112p4448R4214k0693p1282R1370k2273o5372Q4045j8090o1021P2465q890
$$ 18112 -56336 37878 17185 -54097 37273 15000 -50372 33673 15583 -45438 27027 18137
633A8137n9607O1133L503o3254N3686J4677o9005N1682K0832p4771N3458K2783
$$ 18137 -41470 19663 23166 -40088 13598 28275 -40730 10952 31784 -42987 10471 33254
645C3254p5644N2336K1364p0419M7607K0006o2167L7823K3091n5566K6954L0510
$$ 33254 -42390 9946 31310 -39109 8498 28504 -33663 4160 27251 -28315 -1361 29149
657B9149n3782J7119M0927n7442J2600M8520o2194J3083N0393o4852J4674M9036
$$ 29149 -24633 -7514 33413 -24029 -11429 37091 -25103 -12020 38373 -26479 -11805 37231
669C7231o2436J3956M5929n7076R576M5467m9796J108M7473m4515p512N3475m2969
$$ 37231 -25205 -11249 34680 -22396 -12820 32647 -17149 -16041 31432 -13083 -20595 32880 -10089
682a0089j5207O0571m4244j8835O5240m7573j8330O6832m8289j7434O3423m5493
$$ -10089 -25296 35275 -8969 -27804 37436 -10137 -28467 38365 -9924 -27358 36065 -9428
694i428j6285N9235m0451j9032N5859l2249k4161N3914k5989l1025N6613k2144
$$ -9428 -25713 33522 -6929 -25961 29898 -2351 -26512 27402 1413 -29612 27001 4857
706D857l7058O0419k3446l8071O2831k5951l6188O1411k6012l2455N6141k3921
$$ 4857 -32201 28218 4772 -33299 29532 3581 -32607 28804 2792 -29663 26478 2557
718B557k9873N0371j7809l1784M5859j1157l5356M4765o253m0383M6339m313m3232
$$ 2557 -27316 23055 5246 -26538 19321 8164 -27192 17573 11320 -29063 17276 12963 -30269
731c0269M8256n573m2758M8706p213l9331M5031p108l4514L8664l834l1723L1289
$$ -30269 17987 12414 -30344 18362 11149 -28182 16849 9741 -24773 13891 10057 -21666 9623
744I623K101l1218K4938Q900l3357K1737J4258l6436K0912J6212l7107K0857J5939
$$ 9623 11724 -19494 5444 14344 -19013 2724 16982 -19454 1458 17670 -19437 1420 17359
757A7359l6219K0100J4703l1965J6089J4301k7449J0401J7029k4326L755K1947
$$ 17359 -18860 1240 15943 -16022 67 14368 -13081 -2680 14349 -9977 -6222 15725
769A5725k4146o82K6968k6074l009L1157k8629k875L1962k9609j566L0968k8932
$$ 15725 -8421 -9103 17865 -8209 -11218 19939 -8690 -11565 20397 -9212 -10778 20190 -8742
782h742k294K9628k5381m798K9134k1771r549L1155j9033j4539L4303j8813j7476
$$ -8742 -11036 18592 -6789 -11587 17547 -4224 -13773 17382 -1651 -16190 18113 -700 -18176
795a8176L7768k0193j8604L9640k1857j6955L8547k2179j5346L5844j9563j4774
$$ -18176 19592 -601 -19205 20435 -1422 -18377 20170 -2009 -17355 18489 -1074 -15848
807a5848L2086j6479j5459K9469j0861j9449K9211q267k1977L0637p582k4214
$$ -15848 16238 -241 -15700 13769 2908 -16541 12670 4403 -17574 13063 5481 -18733
819a8733L2085q205k3757L2112r052k2135L0443q595k0364K7291o385j9300K3727
$$ -18733 13352 5147 -18610 13502 4450 -17685 12758 4163 -16201 11090 4705 -14595 9132
832I132l179k0650K1911N56k2621K1317K721k4700K1966L432k5780K2375K951
$$ 9132 5953 -14697 7214 7770 -14851 6466 9187 -15513 6453 9885 -15895 6480 9431
845I431k5136K2249J776k2525J9736K511j9921J4956N078j8310J1289P970j8225
$$ 9431 -15705 6544 8320 -14205 5531 8042 -11879 3077 8155 -10155 1134 9104 -9121
858i121Q212J1599j9748P427J2981k0756P124J3613k0105O914J2223j8094N866
$$ -9121 -909 10690 -9058 -1631 11350 -9406 -2282 11331 -8774 -1860 10363 -7731 -1865
871a865J0997j5399L178J1520j2326p10J2969j0659m182J5897j0949o521J8220
$$ -1865 9132 -6267 -3089 8431 -3895 -4605 8364 -2295 -6477 9420 -1529 -8050 10170
884A0170j1595p676J9818j2171p572J9528j2038p492J9059j0390q672J7823p821
$$ 10170 -1425 -9101 10717 -1454 -9026 10502 -1536 -9028 10031 -359 -9031 8792 971
897I71j0708J7354m895j3719J8311k946j6613J9782k565j8199K1472l457j8131
$$ 971 -9737 7617 2722 -10997 7314 4368 -12245 7537 4972 -13227 8245 4788 -13343
910a3343K2068m140j7286K0615l354j6211J8543j495j6704J6545J074j7576J5639
$$ -13343 8725 4585 -12701 7914 4560 -11651 6892 5397 -11307 5238 6312 -11264 4375
923D375L027j9109J5507M840k1107J6410M640k1040J6609L911j9915J5862L564
$$ 4375 7402 -11707 3800 8640 -12467 3943 8583 -12457 4152 8063 -11852 4010 7574
936G574j8202J4089M294j7543J1628O024j6497R278P686j6291P583R265j6593
$$ 7574 -10628 3461 7755 -9788 1840 7864 -8633 645 8331 -7960 -377 8888 -7705
949g705O658J0780j7591O296J0925j6959N787J0758j5398M288J0211j3082K070
$$ -7705 -1047 9733 -7858 -1562 9363 -7596 -1809 8949 -6449 -2161 8050 -5032 -2962
962b962J0306j0804q37J1438r041l847J3125q493n637J4396q430o835J5573q614
$$ -2962 7344 -3460 -4297 7141 -1900 -5747 7378 -1115 -6752 7644 -786 -7621 7952 -662
976f62o684J5100p820o926J3697o062p997J2835k996j0332J2540o76j3036J3338
$$ -662 -7346 7754 -66 -6992 6705 643 -7354 5481 2485 -7847 4693 4017 -9019 4319
990D319Q90j5238J4711J011j6530J5744J101j6817J5366J605j6383J3830K818
$$ 4319 5209 -10029 4682 5693 -10837 4907 6008 -10809 4557 6162 -10221 3609 6427
1003F427j5926J1828M987j6626J0507P298j7984R810R200j8786Q619J0952j9934
$$ 6427 -9499 2329 7316 -9310 1197 8495 -9489 321 9521 -9265 -646 10306 -9628
1016i628Q560J1916k0662Q680J1894k0295Q308J2099j9700O665J2793j8402M587
$$ -9628 -1068 10848 -9814 -1134 10760 -9535 -1227 10872 -8828 -2163 10630 -7772 -3185
1029c185J3908j7577K582J5706j7928R21J7897j8710J38J9109j9427L00J8983
$$ -3185 10723 -6854 -4272 11434 -6494 -5573 12324 -6386 -6248 12861 -6566 -6266 12717
1042A2717j9216N54J7977j8051N3J7184j5943j924J7115j3495m644J7706j1939
$$ 12717 -6499 -5945 12032 -6019 -5966 11218 -4725 -6649 10466 -3029 -7673 10033 -1906
1055a906o665J8740j1426q055J9584j1199q582J9442j0308q847J8116q532r194
$$ -1906 -8571 10169 -1257 -9312 10272 -927 -9509 9933 -375 -9222 8894 362 -8832
1068h832J6506o233j0125J5153l691j1678J4241j034j3692J3830J194j5417J3485
$$ -8832 7674 1441 -8684 6469 2778 -8900 5341 4307 -9385 4445 5639 -9778 3707
1081C707L105j7009J3750L437j7724J3374N180j8006J2269O567j8222J0268Q634
$$ 3707 6812 -10197 3553 6990 -10734 2640 7820 -10186 2083 8650 -9572 696 9330
1094I330j8678Q606J1167j9556O966J3507k0739O284J6006k2587N803J7272k3284
$$ 9330 -9348 -742 10425 -9131 -2165 11342 -9397 -3113 12893 -9694 -3891 13381 -9903
1107i903N849J7709k3581N543J8199k2543L347J9197k1758J385K0508k0565j636
$$ -9903 -4054 13655 -9926 -4383 13816 -8727 -5380 13817 -7941 -6556 13952 -6613 -8249
1120h249K3000k1039l062K4799k1608l796K5769k1538m199K5564k1074m629K5248
$$ -8249 14751 -6288 -9350 15449 -6159 -9955 15814 -5724 -9923 15641 -5433 -10062 15186
1133A5186j9685o082K4742j7832p390K5262j6997q934K5400j5270j0964K6079
$$ 15186 -4499 -10581 14161 -3671 -11061 14201 -2796 -11730 13670 -1600 -12564 13515
1145A3515j4205j2359K6354j3074j3804K6669j2507j4238K6495j1675j4722K5079
$$ 13515 -690 -13049 13305 231 -13573 13096 589 -13649 12846 1171 -13551 11528
1157A1528r238j5619K3797p311j6529K2557m368j8168K1410j789k0287K1019M64
$$ 11528 2290 -13329 10468 3157 -13372 9185 4817 -13351 8059 6270 -14017 7002 7466
1170G466k1615K0465K047k2348J9777K643k2142J8509M202k1761J6067O508k1681
$$ 7466 -14149 6316 8363 -13985 5792 8435 -13707 4802 9004 -12757 3310 9818 -11863
1183a1863J3512R084k2353J1684J1990k3419J0081J4346k4565R271J6049k5054
$$ -11863 1649 10733 -11620 64 12054 -11365 -1284 13062 -11503 -2232 13817 -11237
1195a1237Q296J7067k4901P020J8035k4195N000J9380k3248K412K1285k2656l16
$$ -11237 -2941 14126 -10775 -3755 14280 -9915 -4915 14465 -8783 -6371 14914 -7742 -8058
1208h058K3663k2437k792K5931k2550m662K7880k2714o136K9194k2436p328K9660
$$ -8058 15605 -6832 -9624 16307 -6243 -10905 16975 -5739 -11875 17319 -5117 -12445 17215
1221A7215k1380q941K9778j9768j0817L0329j8140j3359L1266j6622j5769L2500
$$ 17215 -4165 -13106 16672 -3096 -13913 16416 -1724 -15083 16183 -439 -16208 16292
1233A6292j5688j7880L3979j5661j8902L4723j5285j9655L4431j4508j9809L3638
$$ 16292 604 -17276 16703 1042 -17860 16863 1578 -18077 16354 1846 -17963 15675
1245A5675j3039k0266L2305j0901k1778L1691q840k2885L0959o799k4776L0821
$$ 15675 2636 -17630 14675 3774 -18004 13687 4847 -18038 12921 6122 -18654 12167
1257A2167n211k5807L0282m043k5928K9519l297k5525K7523j421k5208K4933Q06
$$ 12167 6956 -18851 11431 7388 -18540 10979 7682 -17843 9680 8259 -16949 7984 8790
1270H790k4767K2072L795k5201J9634O827k6018J7680R549k6910J6270J1455k7244
$$ 8790 -15977 6095 9890 -15311 4323 11150 -14868 2812 12361 -14549 1721 13176 -14068
1283a4068J4690J2391k6479J2924J4193k5989J0482J5679k4805P253J8189k4275
$$ -14068 622 13013 -13466 -542 13651 -12338 -1856 13823 -10982 -3729 14460 -9815
1295i815M319K0751k4118J496K3793k4766j96K5650k4984j786K7184k5014k904
$$ -9815 -5496 15255 -8863 -7367 16426 -8340 -8536 17114 -7870 -9656 17528 -7486 -10390
1308a0390K8248k4369m686K8388k2513p029K9293k0489j0071L0269j8600j3154
$$ -10390 17858 -6511 -11197 17191 -5322 -12351 16942 -3547 -13618 16651 -1949 -15103
1320a5103L2075j8038j5105L3390j7373j7132L4464j6864j7894L4466j5729j8894
$$ -15103 16972 -1066 -16171 17219 -154 -17286 17178 314 -17580 16886 1157 -17737
1332a7737L3826j3943k0057L2822j1504k1699L2334r132k3765L2183p058k5913
$$ -17737 16089 2146 -17911 14911 3407 -18292 14042 4910 -18855 13328 6270 -19643
1344a9643L2447n537k7617L2908m571k8544L2820l853k8712L1812k690k8651L0150
$$ -19643 12804 7267 -20350 12558 7987 -20557 12263 8410 -20302 11510 8820 -19831 10319
1357A0319p80k8926K8160J889k9674K6371M641l0960K5036P052l2237K4438Q545
$$ 10319 9539 -19387 8773 10662 -19012 7359 12000 -18960 6076 13128 -19109 5329 13874
1370A3874l2795K3652R367l2326K2022J0181l0978J9578J1393k9450J6414J3306
$$ 13874 -18921 4731 14098 -18228 3794 13975 -17003 2575 13968 -15482 932 14238
1382A4238k8423J3402J5758k8200J0724J8146k8101Q716J9887k7908P188K0801
$$ 14238 -14185 -783 14975 -13225 -2501 15645 -12456 -3740 16147 -11761 -4573 16228
1394A6228k7189N452K1688k6052L277K2542k4407N94K3680k2583k529K5098k1125
$$ 16228 -10961 -5509 16179 -9873 -6596 15946 -8461 -7867 15813 -6770 -9299 15799 -5326
1407e326n502K6749k0011q405K8835j9339j0805L0353j8541j2761L1277j7771
$$ -5326 -10828 15921 -4090 -12495 16340 -2999 -13804 16549 -1992 -14753 16524 -1247
1419a247j3979L1250j6195j5682L1122j3651j8188L0809j0771k1152L1330q592
$$ -1247 -15226 16024 -171 -15853 15269 1618 -16570 14239 3468 -17684 13646 5054
1431E054k4304L2584o691k6829L3687o736k7393L3718n937k7672L3337m732k8140
$$ 5054 -19250 13334 6643 -20186 13501 6765 -20628 13090 7153 -20519 12818 8086 -20054
1444b0054L1664k927k8634L0662p19l0367K9982J495l1891K9870K988l2889K9318
$$ -20054 11610 8683 -19951 10711 9992 -20375 9607 11102 -20789 9081 12069 -20820 8498
1457H498L886l3050K8784M417l2637K7485N472l2309K5508P133l1696K3098R062
$$ 8498 12384 -20666 8118 12535 -20102 7383 12855 -19454 6054 13187 -18509 4589 13651
1470A3651l0739K0292J1179l0808J7977J3512l0875J5811J5814l0806J3496J7815
$$ 13651 -17088 3204 14383 -16425 1552 15064 -15811 0 15814 -14992 -1496 16319
1482A6319l0399J1610J8706k9299R724J9279k7773P402K0057k5821M082K1804
$$ 16319 -14080 -2470 16236 -13063 -3339 15940 -11833 -4431 15626 -10195 -6113 15691
1494A5691k4096M76K3928k3160k230K5841k3117l633K7159k3078m773K7729k1978
$$ 15691 -8405 -7929 15999 -7161 -9391 16450 -6667 -10300 16859 -6219 -10992 16737 -5241
1507e241o217K7357j9648q342K7080j7142j1042K7861j5296j3913K9188j3818
$$ -5241 -11458 15899 -3749 -12091 14989 -2153 -13195 14666 -630 -14543 14645 827
1519H27j6724L0377j2453j8585L0607j1112j9868L0340r510k1167K9910p413k2962
$$ 827 -15897 14480 2027 -16558 14049 2937 -16931 13409 3899 -17268 12642 5229 -17733
1532a7733K9306m748k4890K8421k079k6532K7626Q8k8191K7463J995l0024K7330
$$ -17733 11573 6825 -18065 10356 8277 -18255 9371 9459 -18732 8731 10726 -19298 8032
1545H032L868l1625K7171N182l2290K6501N962l2030K5360P056l1923K3684R037
$$ 8032 11900 -19725 7446 12628 -19662 6839 12801 -19229 6131 13187 -18736 4948 13985
1558A3985l2223K1744J1564l3058K0167J3833l3972J9525J5034l4737J9413J5585
$$ 13985 -18238 3506 15070 -17988 2179 16012 -17960 1565 16599 -18138 1275 16860
1570A6860l4703J8646J5836l3432J6699J6309l1633J4188J7278l0102J1479J8902
$$ 16860 -17843 803 16639 -16793 -94 16215 -15418 -1230 16048 -14054 -2575 16327
1582A6327k9384R056K0770k8923P172K1784k8054N547K2153k6701M007K2139k5010
$$ 16327 -13057 -4001 16769 -12154 -4982 16802 -11252 -5705 16448 -10253 -6246 15893 -9117
1595i117K231K2140k2804k99K2479k0493l028K2923j8245n854K3810j6629q333
$$ -9117 -6886 15254 -7550 -7849 14630 -5863 -8891 14032 -4213 -10067 13743 -2886 -11219
1608a1219K4927j5379j0629K5965j4343j2365K6333j3095j3574K5982j1386j4881
$$ -11219 13708 -1671 -12300 13665 -678 -13043 13290 195 -13379 12603 1217 -13664
1620a3664K5398r112j6755K4908o479j9180K4743l635k1977K5015j932k4072K5875
$$ -13664 11734 2622 -14133 10775 4296 -14884 9859 6224 -15753 9262 7330 -16742 9133
1633I133j113k5237K6051j63k5884K5327J157k6155K3898L014k6640K2393N331
$$ 9133 8020 -17217 8834 8671 -17213 8114 9271 -16884 7014 10028 -16612 5781 11112
1646A1112k7628K1168P577k8983K0714R191l0146K0397J0323l0730J9996J0901
$$ 11112 -16516 4652 12229 -16754 3960 13151 -16995 3402 13725 -17005 2991 13892
1658A3892l0587J9183J1508l0103J7965J2153k9281J6005J3549k8695J3966J5137
$$ 13892 -16695 2488 13996 -16107 1858 14011 -15270 735 14284 -14411 -445 14692
1670A4692k8311J2027J6785k8297J0515J8270k8322R280J9224k7940Q207J9541
$$ 14692 -13619 -1592 15193 -13104 -2589 15681 -12641 -3361 15863 -12077 -3870 15671
1682A5671k6915O834J9597k5234M848J9900k3336K459K0567k1720J3K1699k0690
$$ 15671 -11244 -4410 15187 -10047 -5199 14701 -8635 -6176 14391 -7329 -7316 14383 -6307
1695f307k089K2785j9852l652K3456j9271m448K3348j8111n401K2781j6490o517
$$ -6307 -8396 14389 -5463 -9115 14341 -4930 -9378 13970 -4141 -9542 13239 -3251 -9768
1708i768K2083j4237q256K1667j2075j0320K1748j0154j2390K2190q782j3999
$$ -9768 12315 -1922 -10178 11489 -586 -10906 10842 688 -11702 10488 1706 -12293
1720a2293K2436p646j5042K2179o411j5771K1333m779j6450K0115k542j7479J8763
$$ -12293 10143 2497 -12545 9634 3223 -12548 8785 4006 -12444 7671 5129 -12350 6413
1733F413k8j8919J7765K499k0617J7311M491k2171J7062N963k3262J6830P004
$$ 6413 6385 -12534 5231 7730 -12887 4424 8915 -13256 3806 9769 -13493 3337 10341
1746A0341k3789J6216P971k3908J5174R100k3792J3806J0550k4052J2520J2303
$$ 10341 -13448 2768 10739 -13169 2005 11105 -12687 1119 11669 -12383 137 12440
1758A2440k4685J1575J3779k5435J1252J4677k6002J1048J5178k6106J0763J5248
$$ 12440 -12245 -670 13109 -12326 -1074 13603 -12399 -1351 13827 -12279 -1516 13732
1770A3732k5581R964J5338k4533Q597J5812k3558O854J6702k2770N210J7724k2228
$$ 13732 -11849 -1885 13453 -11080 -2483 13329 -10229 -3375 13327 -9443 -4233 13491 -8737
1783h737L758J8576k1879K790J8975k1230K046J8752k0096J208J8236j8473p5
$$ -8737 -4979 13597 -8282 -5492 13483 -7747 -5701 13051 -7045 -5837 12399 -6074 -6149
1796f149J7722j6439j796J7572j4576l722J7879j3131n430J8433j2199o789J8838
$$ -6149 11573 -4866 -6662 10910 -3666 -7388 10491 -2640 -8070 10363 -1836 -8625 10213
1809A0213j1521p638J8831j0690q150J8246r427q820J7506p689j0061J6860n640
$$ 10213 -1308 -8946 9885 -805 -8955 9291 -136 -8956 8550 861 -9200 7660 2020
1822B020j1641J6677l841j3504J6954k565j4981J7353j716j5891J7273j002j6178
$$ 2020 -9621 7056 3215 -10289 6665 4100 -10881 6472 4756 -11135 6138 5136 -11042
1835a1042J6630n5j6243J5383J421j6483J4022L397j7223J2778N398j8267J2116
$$ -11042 5588 5533 -10710 4673 6094 -10389 3633 7030 -10193 2585 7983 -10284 1832
1848A832O895j9132J1816P856j9831J1761Q233j9844J1283Q601j9449J0333R136
$$ 1832 8727 -10405 1411 9267 -10564 1197 9430 -10414 869 9470 -9979 354 9490
1861I490j8880R026J0100j8556P596J1308j8608O541J2623j8990N738J3674j9344
$$ 9490 -9390 -364 9736 -8820 -1224 10084 -8524 -1983 10640 -8350 -2612 11062 -8282
1874h282N273J4213j9374N068J4169j8932M619J4018j7951L436J4121j6568J839
$$ -8282 -3009 11204 -8170 -3102 11067 -7865 -3246 10772 -7179 -3743 10378 -6190 -4351
1887d351J4478j5385Q8J5351j4839j247J6353j4684k077J6832j4635k237J6618
$$ -4351 10127 -5258 -5170 10181 -4658 -5905 10448 -4236 -6313 10519 -4116 -6353 10265
1900A0265j4108k272J5678j2823k773J4785j1161l783J4298r469n343J4415q191
$$ 10265 -3843 -6115 9563 -3260 -6033 8752 -2409 -6192 8106 -1363 -6706 7709 -482
1913d82o649J4599p458p457J4873p114p897J4767o625q081J4095n471q414J3107
$$ -482 -7131 7468 10 -7447 7426 312 -7585 7182 557 -7524 6571 1100 -7314 5793
1927E793m155q710J2004k516r512J1271p79j0834J1019P88j2204J0900K030j3147
$$ 5793 1638 -7072 4932 2416 -7096 4175 3396 -7438 3581 4369 -7835 3065 5095 -8052
1941h052J0852K525j3485J0760L012j3693J0224L648j3421R007M833j3411P626
$$ -8052 2800 5325 -8160 2600 5612 -8081 2143 5791 -7630 1377 6210 -7201 425
1954D25O407j3838O777P796j4885O729Q850j5995P102R179j6458P324Q915j6005
$$ 425 6832 -7006 -229 7567 -7318 -589 8261 -7734 -632 8547 -7911 -587 8328 -7677
1968g677P130Q472j5071O333Q657j4433N078R501j4169L971J0533j4139L200J1213
$$ -7677 -547 7925 -7146 -813 7844 -6589 -1511 7990 -6179 -2208 8325 -5814 -2614 8599
1982H599j4502L173J1399j4529L064J1425j4152K494J1275j3214J892J0816j1893
$$ 8599 -5903 -2730 8669 -5860 -2796 8629 -5523 -3029 8246 -4968 -3076 7740 -4153
1995d153Q54J0434j0785j14J0727r770j562J1370r280k368J1537q917l026J1937
$$ -4153 -3299 7135 -3650 -3764 6963 -2807 -4369 7001 -2279 -4647 6890 -2027 -5053 6884
2009F884q654l325J1935q429l185J1051p397l736J0300o001m152R699m914n170
$$ 6884 -1770 -5095 6840 -1589 -4774 6277 -1120 -4856 5444 -557 -4709 4990 76 -5094
2023e094R685l721o663J0537l471p454J1028l434p558J0653l149p084R879k740
$$ -5094 4591 870 -5793 4744 1273 -6181 4847 1413 -6145 4508 1359 -5725 4154 1414
2037A414o867Q959j658p291Q170n4q090P779J203r185P588K038r734P466K389
$$ 1414 -5453 3506 1848 -5443 2727 2673 -5417 2362 3565 -5620 1968 4006 -5728 1738 4127
2052D127r939P542K427r826P100K794r542O259L369r204N235M186r239M543N362
$$ 4127 -5812 1730 4157 -5669 1431 4225 -5317 942 4311 -4893 342 4528 -4711 -168 5194
2067E194j0025M157O251j0531M179O628j0824M192O713j1052M493O408j0781M236
$$ 5194 -4831 -674 5577 -4954 -775 5853 -4971 -779 5934 -5118 -625 5783 -4998 -762
2081g62O348j0166L542O491r500K465P089r201J637P977r632J223Q725j0021J273
$$ -762 5586 -4580 -1038 5453 -4047 -1582 5507 -3694 -2057 5920 -3712 -2489 6236 -3785 -2512
2096b512Q759j0054J478Q323r681J496P739q753R60P400p817J26P464p063p86
$$ -2512 6247 -3807 -2329 5994 -3687 -2191 5548 -3205 -2245 5155 -2662 -2536 4928 -2135 -2921
2111b921P800o694j411Q207o673j638Q325o672j677Q207o544j337P576n983j419
$$ -2921 4879 -1815 -3226 4981 -1692 -3330 4995 -1677 -3354 4853 -1691 -3028 4548 -1435 -2854
2126b854O903n057j782O437m070k517O294l303l596O855k731m487P190k581m803
$$ -2854 4049 -1008 -2790 3647 -423 -2940 3354 51 -3545 3310 579 -3908 3282 701 -4102
2141d102P437k478m893P177k274m495O461j966m502N888q23n097N694K37o127
$$ -4102 3335 857 -4036 3141 867 -3628 2833 867 -3635 2253 1430 -3667 2027 2264 -3863
2156c863N395P51o471N544J459p468O369J098p227N980J082o938N907J049o750
$$ -3863 1532 2283 -4188 1356 2815 -4653 1716 2814 -4413 1567 2649 -4289 1618 2667 -4083
2171d083N429J378o598M766K188o954M442K847p473M548L258q074M875L283q295
$$ -4083 1346 2724 -3874 892 3080 -3874 568 3415 -4058 490 3748 -4326 549 3832 -4463
2186d463N084L070q067N125K721p537M560K795o932L766L285o725K947M059o831
$$ -4463 621 3691 -4376 749 3470 -4067 493 3288 -3644 122 3407 -3318 -371 3688 -3143
2201c143K353M821p268K216N310p632K378N273p684K564M955p374K496M566o617
$$ -3143 -790 4031 -3237 -1021 4289 -3343 -965 4308 -3376 -812 4143 -3231 -735 3831 -2786
2216b786J866M511n979J117M899n688L86N499n733q8O054o047j13O319o374J93
$$ -2786 -920 3591 -2388 -1271 3628 -2060 -1674 3825 -1908 -1996 4058 -1989 -2102 4217 -2157 -1964
2232a964O047o224L41N651n725N9N280m922n07N082m046j423N447l552k305N976
$$ -1964 4083 -2141 -1800 3851 -1874 -1815 3465 -1457 -1964 3118 -928 -2351 3096 -456 -2761 3215
2248C215l545k726O392l586k861O515l690k667O087l310k583N484k581k831M992
$$ 3215 -330 -3056 3336 -250 -3111 3404 -286 -2953 3134 -176 -2759 2725 144 -2687 2305
2263B305j656l522M841p79m419N123l72n102N632l83n541O099n81n442O082p38
$$ 2305 649 -2873 1968 1189 -3230 1893 1521 -3581 2051 1668 -3873 2226 1645 -3797 2285 1547
2279A547n249N798n65m976N170Q9n198M812O96n583M623J371o284M869J640o760
$$ 1547 -3702 2096 1531 -3445 1725 1814 -3384 1428 2124 -3459 1164 2535 -3749 1120 2760 -4000
2295d000N291J525o856N438J215o548N357J007n998M704J234n573L944J793n559
$$ -4000 1291 2816 -4040 1398 2613 -3935 1422 2429 -3569 1135 2369 -3204 740 2533 -3026
2310c026L376K435n818L149K946o212L164L120o422L462K889o267L524K491n827
$$ -3026 350 2785 -3033 116 3062 -3150 14 3134 -3288 174 3063 -3204 320 2811 -3016
2325c016L265K302n202K599K563m715J818K988m603J198L635m777Q63M174n161
$$ -3016 249 2551 -2651 -52 2511 -2204 -386 2602 -2001 -803 2832 -1945 -1082 3092 -2069
2340b069R59M307n284J055M088n088J014L891m599O17L738l946n8L929l469q69
$$ -2069 -1110 3197 -2087 -1032 3056 -2032 -1018 2873 -1726 -1109 2629 -1317 -1375 2554 -915 -1784
2356a784M432l290j455M951l529j631N363l812j463N223l830j262M926l478j359
$$ -1784 2648 -642 -2097 2854 -675 -2306 3057 -755 -2218 3005 -825 -2087 2839 -639 -1998
2371a998M533k900j641M294k307k279M515j845k948M896j837l357N341k072l332
$$ -1998 2535 -365 -2006 2288 -19 -2298 2217 372 -2576 2320 483 -2874 2467 395 -2937
2386b937N572k346l128N486k458k939N232k173k871M640j593l050M361r35l569
$$ -2937 2635 289 -2839 2647 189 -2750 2482 309 -2562 2078 485 -2565 1796 861 -2708
2401b708M429n50m223M825m62m499N097o62m457N179r21m050M805p12l904M412
$$ -2708 1721 1171 -3052 1773 1311 -3188 1909 1247 -3210 1969 1048 -3002 1803 1091 -2813 1599
2417A599l65l854L839K45m072L539Q24m576L780J011m948M000R97n131M260P16
$$ 1599 1234 -2620 1219 1464 -2608 931 1755 -2821 959 1970 -2978 1022 2019 -3112 1148 1864
2433A864m856M167N34m450L769O25m165L240J011l967K545J692m279K334K262
$$ 1864 -2992 1175 1709 -2741 1028 1653 -2512 728 1739 -2228 317 2009 -2270 64 2326
2448B326m623K228K547m874K383K563n074K511K445m816K189K687m629J582K813
$$ 2326 -2297 -69 2478 -2396 -13 2550 -2524 -13 2432 -2384 -195 2492 -2137 -555 2258
2463B258l979J313K729l790M03L525m314L75M622m519o6M437m709M71M359m992
$$ 2258 -1721 -408 2321 -1469 -1066 2459 -1855 -1480 3142 -1377 -1443 2994 -1715 -1244 3115 -1877
2479a877N85L977m298K70L789l761NM114l790o70M107l082j428N084l898j455
$$ -1877 -1292 2685 -1613 -1343 2446 -1315 -1310 2804 -986 -1656 2451 -631 -2059 3025 -873 -2328
2495b328N863m523j234N623m377r67N380m316j095M862l742j181M851l358j454
$$ -2328 3535 -988 -2222 3401 -976 -1943 3437 -879 -1974 2888 -854 -2035 2816 -542 -1996
2510a996M424k435k345M902k610k354N194k684k429M909k573k546N355k973k296
$$ -1996 2428 -7 -2352 2550 -60 -2414 2780 96 -2333 2576 3 -2543 2812 -161 -2457
2525b457N072k713k236M572k136k348M195j509k900M337j136l434M561r28l870
$$ -2457 2615 -98 -2334 2238 102 -2246 1949 440 -2460 1877 741 -2693 1868 940 -2930
2540b930M959j110l802M917j138l649M708j155l393M281q53l312L742j02l613
$$ -2930 2029 919 -2883 2034 896 -2753 1955 800 -2593 1688 835 -2477 1265 1163 -2450
2555b450L433N77m101L359J012m630L653J237m999L771J191n008L783J217m844
$$ -2450 983 1560 -2541 818 1830 -2800 853 2090 -2909 862 2053 -2955 828 2045 -2799
2570b799L598J169m536L072J570m394K466K213m684K111K873n089K014L382n617
$$ -2799 799 1968 -2568 504 2074 -2320 146 2359 -2325 -214 2659 -2430 -416 2966 -2651
2585b651K248L513n849K378L456n861K438L288n507K079L445n274J548L855n171
$$ -2651 -403 3110 -2739 -361 3095 -2766 -328 2960 -2547 -468 2977 -2297 -749 3106 -2065
2600b065Q87M496n373O15N106n814N88N360o088P65N375o160R37N052n930P82
$$ -2065 -1178 3318 -2055 -1440 3666 -2148 -1560 3800 -2288 -1523 3852 -2308 -1371 3681 -2249 -1467
2616a467N008n458L29N020n100j55N275m856o99N677m876j100O075n030j084O233
$$ -1467 3541 -1917 -1588 3432 -1668 -1823 3452 -1404 -2103 3574 -1302 -2402 3673 -1357 -2441 3792
2632C792n185r83O067n073q80N764m707j062N450m036j523N405l529k143N617
$$ 3792 -1393 -2376 3691 -1382 -2262 3502 -1205 -2267 3183 -853 -2376 3029 -500 -2643 2974
2647B974l137k645N743k917l031O023k899l219O026k725l290N851k394l317N327
$$ 2974 -163 -2808 2935 18 -3013 3010 111 -3108 2918 193 -3097 2754 360 -2957 2370
2662B370j630l687M931q18m338M939j39n019N011L19n571N259M99n894N313O77
$$ 2370 740 -2947 1984 1166 -3172 1767 1628 -3391 1620 1939 -3632 1627 2126 -3768 1545 2222
2678B222n939N167Q22n909M833J221n911M345J874o205M036K526o633L825L102
$$ 2222 -3717 1450 2272 -3637 1196 2417 -3494 851 2725 -3480 556 3082 -3551 274 3376
2693C376p037L852L466p489L901L710p646L923L731p552L633L912p359L193M255
$$ 3376 -3661 191 3657 -3832 69 3779 -3867 56 3787 -3765 -132 3780 -3579 -386 3869
2708C869p201K598M815p315K134N467p548J783N956p762J716O206p926J660O197
$$ 3869 -3332 -734 4081 -3234 -1100 4367 -3181 -1398 4558 -3204 -1488 4718 -3208 -1548 4649
2723D649p757J564O119p394J008O255o925M00O566o668k33O982o581p41P475o591
$$ 4649 -3108 -1544 4575 -2819 -1811 4444 -2481 -2081 4485 -2183 -2416 4566 -2015 -2756 4719 -1872
2739a872j056P767o719j081P698o515j169P554o193j357P266n566j768P162n016
$$ -1872 -2928 4839 -1880 -2961 4737 -1778 -2947 4607 -1586 -2943 4323 -1243 -3011 4151 -865
2754h65k444P287m508l014P525m202l547P724m021l800P746l714m096P487l157
$$ -865 -3309 3978 -530 -3544 3981 -221 -3768 3956 -65 -3865 3881 167 -3929 3558 401
2769D01m238P055k490m624O715j573n250O447o91n894O354j37o442O449L33o936
$$ 401 -3837 3218 728 -3896 2819 1246 -4004 2443 1752 -4142 2212 2075 -4367 2082 2415 -4521
2785d521O485P04p209O305J024p246N887J566p335N429K210p603N019L066q168
$$ -4521 1964 2668 -4541 1764 2788 -4458 1429 2995 -4340 1089 3299 -4304 715 3781 -4387
2800d387M756L756q703M848M286r247M835M501r424M851M653r417M577M890r277
$$ -4387 369 4125 -4578 270 4556 -4691 144 4645 -4779 72 4725 -4692 -115 4775 -4502
2815d502M102N354r269L544N936r339L059O488r550K777P034r776K578P280r806
$$ -4502 -400 4954 -4315 -771 5165 -4174 -1115 5373 -4177 -1400 5634 -4142 -1564 5716 -4090
2830d090K396P359r568K072P400r231J650P493q805J062P635q313L25Q000p984
$$ -4090 -1694 5665 -3903 -1831 5569 -3662 -2012 5481 -3324 -2262 5373 -2940 -2615 5385 -2599
2845b599l10Q378p868p28Q628p789r78Q730p552j203Q493p067j423Q196o344k066
$$ -2599 -2909 5469 -2399 -3127 5501 -2288 -3266 5464 -2088 -3291 5202 -1865 -3288 4908 -1436 -3502
2861c502Q121n461k971Q270m836l821Q629m453m414Q837m253m808Q958l902n137
$$ -3502 4619 -842 -3813 4457 -379 -4200 4429 -24 -4438 4399 146 -4662 4296 394 -4743
2876d743Q819l323n445Q340k455n941Q064j639o570P873q59p218P835k30p772
$$ -4743 4076 753 -4692 3648 1193 -4748 3316 1677 -4893 2980 2121 -5097 2738 2508 -5264
2891e264P847K58q190P731O23q318P460J040q471P125J629q584O470K353q733
$$ -5264 2583 2841 -5349 2382 3005 -5313 2147 3187 -5284 1841 3470 -5114 1356 3709 -5024
2906e024N982L191r133N549L959r601N405M621j0151N282N111j0384N108N299
$$ -5024 958 4149 -4984 565 4524 -5077 328 4949 -5202 80 5191 -5193 -85 5214
2920E214j0202M670N602j0044M073O071r813L213O929r981K560P705j0179K068
$$ 5214 -4988 -318 5284 -4760 -687 5384 -4429 -1216 5713 -4268 -1708 5997 -4182 -2114
2934b114Q385j0458J925Q686j0533J791Q632j0255J509Q641r755Q49Q718r136
$$ -2114 6271 -4187 -2262 6424 -4109 -2318 6314 -3941 -2432 6209 -3546 -2697 6021 -3115
2948c115R9R027q798n37R352q571j022R672q430j512R836q151j701R677p713j995
$$ -3115 -3016 6011 -2787 -3324 6028 -2543 -3565 6107 -2323 -3835 6001 -2150 -3851 5826 -1887 -3882
2964c882R470p173k312R138o363k921Q979n478l743Q885m601m602R024l976n370
$$ -3882 5588 -1585 -3897 5241 -1122 -4043 4936 -542 -4285 4600 -1 -4603 4421 445 -4925
2979d925R266l545n944R313l102o207R035k601o322Q435j718o602P872o77p306
$$ -4925 4341 796 -5148 4165 1063 -5144 3891 1290 -5032 3403 1685 -4917 2955 2278 -5028
2994e028P400M93q231P518J223q951P623J661r472P749J755r493P539K208r537
$$ -5028 2372 2865 -5366 2152 3375 -5576 2047 3708 -5764 1985 3740 -5753 1786 3994 -5543
3009e543O989K677r429O261L449r576N640M377j0085N426N077j0602N159N720
$$ -5543 1446 4123 -5306 955 4404 -5172 468 4845 -5240 186 5263 -5339 -180 5540
3023E540j0928N043O029j0849M403O379j0598M367O380j0293L446O798j0070K772
$$ 5540 -5388 -345 5684 -5165 -762 5617 -4981 -614 5766 -4527 -1081 5717 -4353 -1581
3037a581P468r854J901Q103r758J302Q668r913R42R151j0078Q43R186r910O83
$$ -1581 5887 -3967 -2066 6037 -3721 -2419 6249 -3664 -2722 6429 -3649 -2806 6380 -3530 -2847
3052b847Q956r185J32Q789q454n65Q826p719j578R188p490k323R935p060k946
$$ -2847 6109 -3076 -2944 5845 -2609 -3174 5652 -2067 -3645 5543 -1947 -4270 5665 -1395 -4341
3067d341J0227p242l097R965o541l331R780o112l492R057n184m170Q951m237m774
$$ -4341 5886 -1356 -4453 5512 -1029 -4360 5420 -692 -4184 4873 -311 -4481 4470 233 -4541
3082d541Q622l323n747Q848k746o286R415k961o819R248k025p016Q757j622o819
$$ -4541 4081 758 -4989 3859 1113 -5173 4242 1281 -5538 3710 1685 -5331 3426 1804 -5015
3097e015P950p61p045P295J53p369O608J296p970O315K165q633O206K756r129
$$ -5015 2935 2174 -4871 2424 2577 -4792 1816 3112 -4858 1457 3622 -5011 1195 3951 -5178
3112e178O247L065r309O137L223r135N591L643q892M767M468q971L887N330r016
$$ -5178 1069 4134 -5175 962 4185 -4950 641 4284 -4608 159 4627 -4344 -457 4873 -4143
3127d143L162O321r393K720P109j0086K759P463j0183K669P483r988K355P463
$$ -4143 -981 5340 -4053 -1333 5776 -4310 -1551 5912 -4271 -1602 5881 -4107 -1752 5711
3141E711r520J851P564q988J036P933q562J87Q513q459m10R043q535o80R263q588
$$ 5711 -3809 -1958 5606 -3382 -2346 5587 -2975 -2788 5725 -2734 -3144 5899 -2636 -3316 5947 -2641
3157b641o62R194q400p12Q806p870r02Q340o966j502Q154o040k383Q211n315l323
$$ -2641 -3303 5891 -2509 -3221 5585 -2285 -3187 5153 -1813 -3315 4839 -1201 -3584 4627 -688 -4011
3173d011Q570m885l994Q907m705m322Q925m505m404Q730m126m495Q241l373m758
$$ -4011 4559 -326 -4320 4587 -118 -4440 4485 -20 -4424 4306 180 -4315 3926 553 -4205
3188d205P531k212n364P064j066o233P007k76o995P155J47p505P370K56p670P231
$$ -4205 3326 1114 -4250 2814 1748 -4485 2522 2246 -4749 2406 2553 -4952 2418 2674 -4996 2235
3204B235M84p478O708Q33p291N976J583p293N146K528p650M693L403q136M462
$$ 2235 2719 -4759 1949 2782 -4509 1467 3050 -4243 903 3431 -4219 474 3877 -4259 203
3219B03M040q607M454M269q857M571M244q613M221M281q148L526M606p721K567
$$ 203 4243 -4364 90 4359 -4498 73 4317 -4296 -75 4206 -3942 -416 4190 -3531 -964
3234i64N314p541J653O200p576R38P040q056P95P502q309P00P353q023P22P385
$$ -964 4350 -3191 -1538 4662 -2914 -1976 5064 -2992 -2197 5305 -3004 -2304 5049 -2974 -2252 5133
3250E133p899M60P138p113k37P205o578j026P549o150j791Q116o127k277Q541
$$ 5133 -2766 -2306 4832 -2281 -2518 4687 -1891 -2917 4632 -1518 -3309 4807 -1320 -3597 4944
3265D944o223k369Q610o276k230Q346o093k127P856n404k393P419m597k947P247
$$ 4944 -1279 -3648 4962 -1314 -3544 4802 -1291 -3418 4438 -966 -3359 4060 -537 -3484 3763
3280C763l725l806P372l156m526P681k996m851P855k905m908P691k783m762P184
$$ 3763 38 -3768 3604 448 -4078 3603 607 -4244 3611 706 -4202 3489 706 -4056 3128
3295C128k328m587O410j507m730N733m18n377N368M53n908N187J133o597N400
$$ 3128 800 -3787 2623 1116 -3614 2119 1701 -3676 1692 2145 -3763 1424 2557 -4040 1360
3310A360J301o805N455J401o702N249J430o470M703J857o210L841K611o232L060
$$ 1360 2661 -4144 1311 2712 -3990 1259 2689 -3781 922 2779 -3431 410 3021 -3211 -151
3325a51L578o660K761M351p261K728M787p692K943M814p783K942M691p341K538
$$ -151 3427 -3233 -472 3879 -3382 -654 4133 -3559 -616 4198 -3585 -643 4048 -3293 -755
3340g55M738o941J814N141o616J047N731o566M38O341o727J65O868p064J30O934
$$ -755 3983 -2958 -1144 3997 -2619 -1572 4159 -2407 -1969 4372 -2355 -2190 4678 -2386 -2256 4678
3356D678p105K72O696o802J33O408o296j89O171n594o53O017m894j502O383m509
$$ 4678 -2427 -2155 4541 -2261 -2128 4280 -2016 -2205 3966 -1628 -2281 3736 -1158 -2660 3723 -786
3372g86k246O871m488k620P215m607k609P162m628k388O835m330k398O309l468
$$ -786 -3032 3839 -649 -3269 3946 -661 -3270 3892 -736 -3124 3711 -619 -3017 3292 -176
3387a76k830N901k618l509N831j866m233O123j558m835O497j550n032O531j541
$$ -176 -3006 2895 277 -3232 2599 733 -3500 2623 1065 -3770 2727 1177 -3855 2676 1135
3402A135m879O210j344m564N584q40m552M953l6m853M449Q32n349M223J454n806
$$ 1135 -3744 2466 1122 -3442 2142 1302 -3250 1703 1667 -3186 1263 2095 -3254 969 2423 -3383
3418c383M284J692o145M496J719o226M524J637n962M071J812n524L391K191n276
$$ -3383 901 2593 -3552 944 2663 -3563 961 2598 -3364 707 2519 -3005 386 2577 -2699
3433b699K628K908n395K022L756n808J697M499o298J696M798o649J876M737o558
$$ -2699 -71 2837 -2558 -536 3220 -2588 -891 3608 -2690 -994 3804 -2845 -969 3768 -2790
3448b790J881M517o120J354M674n627O15M994n295j40N670n385n86O242n765o22
$$ -2790 -909 3608 -2512 -1158 3516 -2111 -1496 3498 -1797 -1937 3733 -1652 -2238 4004 -1761 -2383
3464b383O510n968m82O433n999k14O008n681k50N592m982p00N520m470j281N672
$$ -2383 4127 -1841 -2323 4110 -1889 -2103 3905 -1776 -2026 3566 -1416 -2116 3404 -1066 -2347 3325
3480C325m083j893N988l855k312O274l931k418O402m037k311O243l899k194N787
$$ 3325 -758 -2651 3337 -518 -2830 3444 -487 -2905 3497 -540 -2851 3392 -507 -2701 3086
3495C086l342k340N241k644k599M908j820l320M944j193l980N126q74m491N336
$$ 3086 -256 -2596 2645 1 -2598 2310 490 -2830 2114 921 -3059 2067 1193 -3298 2038
3510B038q03m524N277p97m254M922o64m086M360p1l992L575P59m377L294J492
$$ 2038 1235 -3289 1988 1191 -3063 1859 1195 -2891 1469 1398 -2594 981 1740 -2637 657 2149
3526B149m967L251K040n508L561K079n776L727J973n565L522J942n258L081K204
$$ 2149 -2818 433 2473 -3035 526 2605 -3171 556 2529 -3036 486 2428 -2830 251 2455
3541B455n042K505K708m943J790L405n126J367M074n521J320M413n857J416M521
$$ 2455 -2587 -82 2626 -2317 -527 2878 -2248 -881 3193 -2328 -1008 3405 -2452 -1036 3485
3556C485n986J535M405n815J396M185n294Q97M305m868L00M552m486m25N056m518
$$ 3485 -2501 -966 3439 -2376 -980 3205 -2089 -1192 3113 -1755 -1455 3097 -1389 -1814 3242 -1276
3572a276p78N512m756q55N697m894p67N601m812o52N256m447q96N094l817j399
$$ -1276 -2054 3458 -1298 -2153 3544 -1350 -2117 3484 -1328 -1980 3276 -1171 -2067 3027 -790 -2189
3588b189N031l218k086N246k933k661N721k921k928O003l066k990N998l049k823
$$ -2189 2842 -376 -2462 2784 -149 -2810 2911 -10 -2938 3065 -1 -2991 3007 -42 -2865
3603b865N707k844k651N209k329k799M754j627l177M503j041l580M438n27m143
$$ -2865 2842 -2 -2653 2556 227 -2572 2182 555 -2622 1881 840 -2740 1698 1171 -2972
3618b972M709m51m381M803l82m264M562l40m047M169j06l839L587M79l919K988
$$ -2972 1737 1286 -3095 1708 1326 -2938 1624 1284 -2763 1406 1300 -2539 1048 1527 -2392 596
3634E96J235m218K734J832m689K673K300n105K758K438n167K735K379n042K525
$$ 596 1831 -2387 347 2179 -2510 163 2463 -2642 116 2554 -2613 122 2501 -2541 -16
3649a6K516m771J989K897m635J356L424m672Q43M062m853N44M583n233N62M834
$$ -16 2500 -2271 -282 2615 -2020 -664 2760 -1912 -1069 2993 -1860 -1316 3267 -1966 -1404 3430
3665C430n425N96M820n450O60M619n172N01M578m771N6M548m343m14M847m215
$$ 3430 -1995 -1399 3421 -2029 -1369 3250 -1922 -1421 3157 -1614 -1558 2990 -1353 -1767 3080 -1135
3681a135r02N287m493p02N069l991j318N447m352j094N391m180j148N075l711
$$ -1135 -2037 3250 -1243 -1945 3124 -867 -2185 3262 -1090 -2184 3207 -973 -2121 2954 -757
3696g57j367M795l110j853M869k673k440N057k336k933N278k263l115N437k259
$$ -757 -2124 2671 -439 -2292 2577 -96 -2536 2521 185 -2748 2530 267 -2848 2589 330
3711C30l150N283k117l053M925j730l057M496j184l277M128n16l727M074n9m193
$$ 330 -2820 2463 346 -2707 2218 488 -2569 1927 743 -2534 1594 1078 -2649 1425 1366 -2827
3727b827M203J55m413M205K84m514M193K98m392L970M46m239L459R04m134K970
$$ -2827 1376 1531 -2882 1323 1607 -2907 1286 1584 -2808 1162 1608 -2631 828 1732 -2402 568
3743E68J325m247K488K100m513K095K638m924K317K732n032K305K793n062K106
$$ 568 1893 -2354 134 2234 -2279 -184 2454 -2470 -153 2579 -2453 -148 2645 -2417 -311
3758c11K892m741J672L085m548J201L385m304N57L922m422K17M407m579m0M769
$$ -311 2581 -2160 -488 2597 -1951 -750 2635 -1669 -1112 2810 -1612 -1395 3012 -1567 -1607 3162
3774C162m702j29M883m740j48M826m582k50M641m170o34M716l739j169M880l489
$$ 3162 -1540 -1669 3214 -1526 -1674 3152 -1430 -1680 2961 -1209 -1843 2873 -866 -2035 2845 -644
3790f44j624N229l454k076N600l430k185N738l685k100N668l462k122N405l099
$$ -644 -2268 2961 -493 -2569 3031 -399 -2584 3154 -531 -2631 3037 -425 -2547 2858 -241
3805b41k321N197k598k657N002k113k933M958j729l436N102j469l701N134j362
$$ -241 -2562 2635 37 -2620 2382 269 -2664 2294 565 -2871 2231 762 -2939 2195 833
3820H33l784N022j305l577M692r93l502M150m73l569L694J46l775L326O73m043
$$ 833 -2951 2071 766 -2811 1881 888 -2614 1536 1063 -2506 1188 1334 -2441 885 1558 -2485
3836b485L259J027m416L297J268m580L263J362m496K977J474m270K577J789m190
$$ -2485 774 1801 -2615 682 1950 -2630 633 1995 -2501 476 1950 -2320 257 2046 -2144
3851b144K095K296m231J568K914m453J209L429m699J170L749m879J074L831m802
$$ -2144 -49 2247 -1984 -416 2498 -1955 -746 2683 -2016 -846 2903 -1976 -902 2929 -1873
3866a873Q93L811m517N34L960m314J85M066l978l45M348l789q10M716l859j043
$$ -1873 -980 2831 -1686 -1152 2808 -1506 -1321 2745 -1233 -1578 2770 -1019 -1829 2887 -972 -2015
3882b015M975l792j246N087l877j230M979l659j248M826l366j584M720k884j887
$$ -2015 2960 -832 -2078 3009 -868 -2098 2881 -778 -2026 2800 -566 -2150 2570 -314 -2201
3897b201M587k423k410M810k174k883N110k068l161N228k003l282N231j851l288
$$ -2201 2386 -37 -2447 2363 189 -2694 2416 348 -2813 2415 412 -2870 2361 510 -2778
3912b778N031j660l261M668j186l491M384o74l773M254j52m209M277M0m349M324
$$ -2778 2253 593 -2668 2000 814 -2677 1707 1033 -2740 1514 1362 -2847 1430 1470 -2879 1445
3928A445N4m416M249J84m290L982L57m163L539P35m113L123J080m099K750J541
$$ 1445 1499 -2917 1332 1516 -2774 1208 1565 -2598 941 1676 -2437 686 1766 -2333 417 1958
3944A958m236K511J885m359K263K226m463K137K339m404J959K451m234J572K687
$$ 1958 -2278 233 2118 -2241 22 2248 -2215 -78 2261 -2143 -184 2267 -1967 -395 2292
3959B292m060J135K940l818N71L322l674Q4L750l722k48M158l904m59M384l892
$$ 2292 -1768 -633 2307 -1511 -940 2382 -1292 -1208 2542 -1180 -1428 2730 -1174 -1633 2751 -1141
3975a141m72M328l711o51M250l418r63M269l089j423M502k818j847M649k660k195
$$ -1141 -1613 2715 -996 -1647 2603 -815 -1778 2491 -598 -2021 2481 -337 -2184 2465 -195 -2390
3991b390M983k681k420N094k680k415N069k626k434M931k337k541M697j907k834
$$ -2390 2593 -88 -2508 2586 -94 -2509 2560 -66 -2500 2431 94 -2447 2250 343 -2491
4006b491M533j481l182M556j158l472M660j038l804M753q47l884M617o94l804
$$ -2491 2042 561 -2621 1935 777 -2695 1965 927 -2877 1876 1029 -2855 1762 1068 -2736
4021b736M449n96l746M073k33l731L711J76l825L304P91m124L179J137m314L103
$$ -2736 1713 1117 -2629 1444 1211 -2520 1191 1367 -2458 846 1637 -2487 692 1829 -2485 618
4037F18J279m342K970J358m282K836J454m123K540J570l918K095J938l910J637
$$ 618 1897 -2445 525 1883 -2399 437 1891 -2232 308 1878 -2040 55 1993 -1917 -280
4052b80K447l936J255K812m067J166L081m286J102L164m182Q85L215l954O64L309
$$ -280 2167 -1769 -514 2298 -1769 -603 2478 -1808 -706 2458 -1724 -839 2376 -1578 -914 2395
4068B395l760K52L434l428k13L645l199o47L930l183r42M169l084j185M320l141
$$ 2395 -1365 -1113 2321 -1107 -1320 2325 -874 -1521 2409 -774 -1716 2453 -631 -1816 2504 -637
4084f37j228M268k934j296M134k692j504M024k300j805L980j889k267M102j638
$$ -637 -1865 2403 -531 -1827 2307 -385 -1889 2135 -165 -1970 2010 121 -2146 1956 318
$$ [...]
8191F2
##END NTUPLES=NMR FID
##END=
