##TITLE=1H_MTBPA2610-3
 D2O,8 sc, 
 27.10.2021
##JCAMPDX= 6.0         $$ Bruker NMR JCAMP-DX V2.0
##DATA TYPE= NMR FID
##DATA CLASS= NTUPLES
##ORIGIN= UXNMR, Bruker Analytische Messtechnik GmbH
##OWNER= root
$$ XWIN-NMR		Version 3.5
$$ Wed Oct 27 10:59:55 2021 Russian Standard Time (UT+4h)  she@DPX200
##.OBSERVE FREQUENCY= 200.1313468511
##.OBSERVE NUCLEUS= ^1H
##.DELAY= (6, 6)
##.ACQUISITION MODE= SIMULTANEOUS
##.ACQUISITION SCHEME= undefined
##.AVERAGES= 8
##.DIGITISER RES= 18
##SPECTROMETER/DATA SYSTEM= spect
##.PULSE SEQUENCE= zg30
##.SOLVENT NAME= D2O
##.SHIFT REFERENCE= (INTERNAL, D2O, 0, 15.7039)
##AUDIT TRAIL= $$ (NUMBER, WHEN, WHO, WHERE, WHAT)
$$ ##TITLE= Audit trail, XWIN-NMR		Version 3.5
$$ ##JCAMPDX= 5.01
$$ ##ORIGIN= Bruker BioSpin GmbH
$$ ##OWNER= she
$$ F:/spectra/data/she/nmr/H-F/1/audita.txt
$$ ##AUDIT TRAIL=  $$ (NUMBER, WHEN, WHO, WHERE, WHAT)
(   1,<2021-10-27 10:58:41.14 +0400>,<she>,<DPX200>,
      <created by zg, POWCHK disabled, PULCHK disabled
       configuration hash MD5:
       00 E9 B6 7A A2 85 ED C7 34 08 36 98 17 FE 4E 26
       data hash MD5: 16K
       2B 31 45 56 AC 75 9D 3A 07 98 DD 55 7F D5 6C EF>)
$$ ##END=
$$ 
$$ hash MD5
$$ C4 3A 0F 09 EE 34 77 C7 C7 7F A6 F9 DE 92 53 39
##$RELAX= 
##$RELAX= 
##$RELAX= 
##$RELAX= 
##$RELAX= 
##$RELAX= 
$$ Bruker specific parameters
$$ --------------------------
##$DU= <F:/spectra>
##$EXPNO= 1
##$NAME= <H-F>
##$PROCNO= 1
##$TYPE= <nmr>
##$USER= <she>
##$AMP= (0..31)
100 100 100 100 100 100 100 100 100 100 100 100 100 100 100 100 100 100 
100 100 100 100 100 100 100 100 100 100 100 100 100 100 
##$AQSEQ= 0
##$AQ_mod= 1
##$AUNM= <au_zg>
##$AUTOPOS= <>
##$BF1= 200.13
##$BF2= 200.13
##$BF3= 200.13
##$BF4= 200.13
##$BF5= 200.13
##$BF6= 200.13
##$BF7= 200.13
##$BF8= 200.13
##$BYTORDA= 1
##$CFDGTYP= 0
##$CFRGTYP= 5
##$CHEMSTR= <none>
##$CNST= (0..31)
1 1 145 1 1 1 1 1 1 1 1 1 1 1 1 1 1 1 1 1 1 1 1 1 1 1 1 1 1 1 1 1 
##$CPDPRG= <>
##$CPDPRG1= <>
##$CPDPRG2= <>
##$CPDPRG3= <>
##$CPDPRG4= <mlev>
##$CPDPRG5= <mlev>
##$CPDPRG6= <mlev>
##$CPDPRG7= <mlev>
##$CPDPRG8= <mlev>
##$CPDPRGB= <>
##$CPDPRGT= <>
##$D= (0..31)
0 1.2 0 0 0 0 0 0 0 0.06 0 0.03 0 0 0 0 0.0002 0 0 0 0 0 0 0 0 0 0 0 0 
0 0 0 
##$DATE= 1635317920
##$DBL= (0..7)
120 120 120 120 120 120 120 120 
##$DBP= (0..7)
150 150 150 150 150 150 150 150 
##$DBP07= 0
##$DBPNAM0= <>
##$DBPNAM1= <>
##$DBPNAM2= <>
##$DBPNAM3= <>
##$DBPNAM4= <>
##$DBPNAM5= <>
##$DBPNAM6= <>
##$DBPNAM7= <>
##$DBPOAL= (0..7)
0.5 0.5 0.5 0.5 0.5 0.5 0.5 0.5 
##$DBPOFFS= (0..7)
0 0 0 0 0 0 0 0 
##$DE= 6
##$DECBNUC= <off>
##$DECIM= 32
##$DECNUC= <off>
##$DECSTAT= 4
##$DIGMOD= 1
##$DIGTYP= 9
##$DL= (0..7)
0 120 120 120 120 120 120 120 
##$DP= (0..7)
150 150 150 150 150 150 150 150 
##$DP07= 0
##$DPNAME0= <>
##$DPNAME1= <>
##$DPNAME2= <>
##$DPNAME3= <>
##$DPNAME4= <>
##$DPNAME5= <>
##$DPNAME6= <>
##$DPNAME7= <>
##$DPOAL= (0..7)
0.5 0.5 0.5 0.5 0.5 0.5 0.5 0.5 
##$DPOFFS= (0..7)
0 0 0 0 0 0 0 0 
##$DQDMODE= 0
##$DR= 18
##$DS= 0
##$DSLIST= <SSSSSSSSSSSSSSS>
$$ [...]
##$SUBNAM2= <"">
##$SUBNAM3= <"">
##$SUBNAM4= <"">
##$SUBNAM5= <"">
##$SUBNAM6= <"">
##$SUBNAM7= <"">
##$SUBNAM8= <"">
##$SUBNAM9= <"">
##$SW= 18.0517286264689
##$SWIBOX= (0..15)
0 0 2 0 0 0 0 0 0 0 0 0 0 0 0 0 
##$SW_h= 3612.71676300578
##$TD= 16384
##$TD0= 1
##$TE= 0
##$TE2= 300
##$TE3= 300
##$TEG= 300
##$TL= (0..7)
0 120 120 120 120 120 120 120 
##$TP= (0..7)
150 150 150 150 150 150 150 150 
##$TP07= 0
##$TPNAME0= <>
##$TPNAME1= <>
##$TPNAME2= <>
##$TPNAME3= <>
##$TPNAME4= <>
##$TPNAME5= <>
##$TPNAME6= <>
##$TPNAME7= <>
##$TPOAL= (0..7)
0.5 0.5 0.5 0.5 0.5 0.5 0.5 0.5 
##$TPOFFS= (0..7)
0 0 0 0 0 0 0 0 
##$TUNHIN= 0
##$TUNHOUT= 0
##$TUNXOUT= 0
##$USERA1= <user>
##$USERA2= <user>
##$USERA3= <user>
##$USERA4= <user>
##$USERA5= <user>
##$V9= 5
##$VALIST= <valist>
##$VCLIST= <CCCCCCCCCCCCCCC>
##$VD= 0
##$VDLIST= <DDDDDDDDDDDDDDD>
##$VPLIST= <PPPPPPPPPPPPPPP>
##$VTLIST= <TTTTTTTTTTTTTTT>
##$WBST= 1024
##$WBSW= 4
##$XGAIN= (0..3)
0 0 0 0 
##$XL= 0
##$YL= 0
##$YMAX_a= 249258
##$YMIN_a= -237050
##$ZGOPTNS= <>
##$ZL1= 120
##$ZL2= 120
##$ZL3= 120
##$ZL4= 120
##$ABSF1= 10
##$ABSF2= 0
##$ABSG= 5
##$ABSL= 3
##$ALPHA= 0
##$AQORDER= 0
##$ASSFAC= 0
##$ASSFACI= 0
##$ASSFACX= 0
##$ASSWID= 0
##$AUNMP= <proc_1d>
##$AZFE= 0.1
##$AZFW= 0.1
##$BCFW= 1
##$BC_mod= 2
##$BYTORDP= 1
##$COROFFS= 0
##$CY= 11.3945322036743
##$DATMOD= 1
##$DC= 2
##$DFILT= <>
##$DTYPP= 0
##$F1P= 2.36226072786647
##$F2P= -0.459571619588291
##$FCOR= 0.5
##$FTSIZE= 0
##$FT_mod= 4
##$GAMMA= 1
##$GB= 0.15
##$INTBC= 1
##$INTSCL= 1
##$ISEN= 128
##$LB= 0.24
##$LEV0= 0
##$LPBIN= 0
##$MAXI= 10000
##$MC2= 0
##$MEAN= 0
##$ME_mod= 0
##$MI= 1.114404
##$NCOEF= 0
##$NC_proc= 0
##$NLEV= 6
##$NOISF1= 3.799351
##$NOISF2= 2.8
##$NSP= 1
##$NTH_PI= 0
##$NZP= 0
##$OFFSET= 15.70392
##$PC= 1
##$PHC0= -15307.52
##$PHC1= -0.9991798
##$PH_mod= 1
##$PKNL= yes
##$PPARMOD= 0
##$PSCAL= 0
##$PSIGN= 0
##$REVERSE= no
##$SF= 200.130013532006
##$SI= 16384
##$SIGF1= 3
##$SIGF2= 2
##$SINO= 400
##$SIOLD= 16384
##$SREGLST= <1H.CDCl3>
##$SSB= 0
##$STSI= 0
##$STSR= 0
##$SW_p= 3612.71676300578
##$SYMM= 0
##$S_DEV= 0
##$TDeff= 0
##$TDoff= 0
##$TI= <>
##$TILT= no
##$TM1= 0
##$TM2= 0
##$TOPLEV= 0
##$USERP1= <user>
##$USERP2= <user>
##$USERP3= <user>
##$USERP4= <user>
##$USERP5= <user>
##$WDW= 1
##$XDIM= 8192
##$YMAX_p= 0
##$YMIN_p= 0
$$ End of Bruker specific parameters
$$ ---------------------------------
##NTUPLES= NMR FID
##VAR_NAME=  TIME,          FID/REAL,        FID/IMAG
##SYMBOL=    X,             R,               I
##VAR_TYPE=  INDEPENDENT,   DEPENDENT,       DEPENDENT
##VAR_FORM=  AFFN,          ASDF,            ASDF
##VAR_DIM=   8192,          8192,            8192
##UNITS=     SECONDS,       ARBITRARY UNITS, ARBITRARY UNITS
##FACTOR=    0.0002768,     1,               1
##FIRST=     0,             0,               0
##LAST=      2.2672688,     0,               0
##MIN=       0,             -237050,         0
##MAX=       2.2672688,     249258,          0
$$ Real data points
##PAGE= N=1
##DATA TABLE= (X++(R..R)), XYDATA
0 0 0 0 0 0 0 0 0 0 0 0 0 -2 8 -8 8 -8 13 -16 16 -24 24 -32 40 -40 48 -56 71 -80 88 -104 120 -136 157 -176
34 -176 200 -224 250 -281 314 -352 392 -434 482 -533 589 -653 719 -796 877 -965 1062 -1170
52 -1170 1290 -1423 1572 -1741 1934 -2154 2412 -2715 3079 -3527 4092 -4835 5849 -7338 9739
67 9739 -14256 25817 -122923 -203048 19503 135873 232516 216242 107685 -79149 -200048
78 -200048 -237050 -160930 -15186 150790 231473 206755 80692 -77109 -200152 -220800 -145333
89 -145333 -486 144030 222724 188416 68263 -81926 -188203 -207314 -130569 4444 143482
100 143482 212661 173096 52162 -81037 -178173 -197482 -117975 21014 138717 189381 159755
111 159755 52819 -85960 -177299 -179205 -101490 21581 135982 182474 143008 40670 -83236
122 -83236 -170449 -169070 -85687 28058 126710 172616 134991 28910 -86278 -157519 -157097 -81481
134 -81481 33853 128883 161158 119473 21437 -85368 -148637 -144302 -74510 34686 127940 154077
146 154077 107056 14537 -84371 -144143 -134015 -62172 37353 121109 146357 98609 7171 -83463
158 -83463 -136581 -126164 -53795 42131 115561 136873 93426 1655 -88257 -130666 -112956 -45902
170 -45902 43453 112686 127617 83534 -340 -86058 -128362 -106451 -37176 46807 110276 121022
182 121022 72792 -7076 -82128 -120734 -101326 -31500 50453 106028 113507 67659 -11637 -83608
194 -83608 -114692 -93059 -26784 53105 104779 105300 59030 -14003 -81847 -110108 -85695 -22172
206 -22172 52469 103004 101845 51684 -19401 -80572 -105147 -79027 -15414 53268 97088 96334 48403
219 48403 -22777 -80569 -99869 -73538 -11963 55565 95001 89515 42873 -24806 -80288 -95643
231 -95643 -66381 -8012 54796 92172 84789 37827 -25977 -78796 -93825 -61783 -1716 56077
243 56077 87940 79605 32818 -29029 -76046 -88118 -58644 225 57931 86063 74391 28699
255 28699 -31360 -76179 -83752 -52430 3136 57778 83857 69320 23881 -32038 -74255 -80960
267 -80960 -48030 6539 57249 81719 66548 18832 -35717 -72025 -75702 -44025 9195 57244
279 57244 77864 62428 17059 -36980 -72256 -72380 -39309 11884 57690 75370 57315 13137
291 13137 -37373 -70354 -68939 -35159 13637 56463 73397 54557 9567 -38622 -68558 -66373
303 -66373 -31804 17339 56243 68992 50584 7631 -39392 -66702 -62418 -29486 17944 56941
315 56941 67695 46425 4201 -39975 -65114 -58770 -25253 19205 55205 65229 43441 1732
327 1732 -39809 -63236 -56937 -22739 21726 54825 62265 40377 -910 -40976 -60625 -52650 -20403
340 -20403 22098 54171 59849 37614 -2338 -41528 -60273 -49619 -16593 23575 53229 57345
352 57345 33776 -4739 -40580 -57955 -47510 -14194 24924 52095 55223 31714 -7308 -41827
364 -41827 -55742 -44027 -11722 26226 50992 51608 28807 -7763 -41322 -54629 -41645 -9510
376 -9510 27056 50896 49747 25160 -10175 -40789 -52566 -38854 -6836 27362 48781 47755 23605
389 23605 -11853 -40955 -50693 -36761 -4982 28990 48182 44551 20692 -12995 -40459 -48362 -33790
402 -33790 -3742 28637 47570 43083 18264 -14358 -40473 -47247 -31018 -765 28961 45487
414 45487 40742 16222 -15627 -39478 -45137 -29552 508 29904 44586 38569 14316 -17047 -39779
427 -39779 -42980 -26236 2178 29672 43047 36131 12564 -17239 -39351 -41947 -24253 4057 30180
440 30180 42365 33986 9536 -18519 -37697 -39696 -22735 5348 30303 40637 32290 8459 -19586
453 -19586 -37904 -37914 -20368 6839 30858 39469 29408 6219 -19647 -36647 -36223 -18623 7659
466 7659 30492 38888 28228 4122 -21229 -36159 -34051 -16009 9155 29766 36824 26509 3092
479 3092 -21605 -35479 -32593 -14599 10292 30287 35570 24222 1456 -22054 -34644 -30466 -12580
492 -12580 10832 29619 34471 22486 167 -21853 -33946 -29860 -10903 12751 29526 32473 20511
505 20511 -1195 -22114 -32468 -27760 -9982 12809 29416 31675 19036 -2454 -22751 -31979 -25877
518 -25877 -7959 13596 28716 30042 17180 -3383 -22338 -30922 -24703 -6758 14099 28548 29366
531 29366 15609 -5278 -22827 -29524 -22764 -5357 14660 27573 27558 14610 -5475 -23073 -29175
544 -29175 -21381 -3871 15359 27378 26125 12621 -6390 -22517 -28136 -20063 -2572 15574 26420
557 26420 25106 11729 -7309 -22690 -27297 -18825 -1289 16426 25909 23318 10081 -7901 -22111
570 -22111 -25961 -17730 -953 16541 25877 22454 8726 -8804 -22303 -24980 -15775 427 16212
583 16212 24776 21449 7699 -9395 -21781 -24143 -15114 1398 17007 24324 20121 6428 -10286
596 -10286 -21701 -22712 -13357 2115 16584 23419 19022 5810 -10539 -21829 -22319 -12130 3376
609 3376 17063 22745 17547 4251 -10755 -20889 -21301 -11309 3999 17046 22059 16873 3444 -11668
623 -11668 -20864 -20051 -9986 4785 17169 21189 15334 2554 -11539 -20350 -19298 -9141 5246
636 5246 17316 21026 14354 1011 -12200 -19746 -18047 -7876 5772 16780 20002 13692 697
649 697 -12494 -19583 -17292 -6972 6652 16969 19254 12338 -245 -12711 -18855 -16087 -6049 6754
663 6754 16695 18723 11529 -949 -12913 -18751 -15491 -4723 7648 16405 17601 10471 -1675 -12789
677 -12789 -17855 -14709 -4479 8072 16590 16963 9492 -2366 -13156 -17457 -13469 -3298 8221 16080
691 16080 16145 8556 -2771 -12865 -17095 -13098 -2571 8844 16009 15581 7602 -3806 -13077 -16142
705 -16142 -11858 -2035 8796 15530 14930 7163 -4181 -13364 -15861 -11045 -1144 9364 15430 13784
719 13784 5943 -4467 -12868 -15296 -10366 -607 9261 15018 13592 5418 -5301 -13056 -14698 -9538
733 -9538 291 9771 14372 12291 4878 -5142 -12851 -14308 -8869 646 9901 14361 11785 3799 -5798
748 -5798 -12703 -13527 -7884 1201 9746 13831 11339 3286 -6041 -12488 -13189 -7503 1948 10158 13400 10417
764 10417 2515 -6438 -12205 -12265 -6815 1887 10003 13223 9996 2066 -6716 -12346 -11988 -5829 2706 9901
780 9901 12615 9178 1507 -6715 -11847 -11422 -5506 3011 10024 12261 8702 943 -7364 -11858 -10615
795 -10615 -4613 3440 9856 11656 7987 711 -7090 -11711 -10387 -4208 3853 10100 11398 7206 -235
810 -235 -7274 -11093 -9777 -3706 4058 9799 10994 6969 -447 -7591 -11046 -9226 -3124 4539 9919
825 9919 10343 6089 -919 -7440 -10540 -8597 -2842 4457 9860 10371 5722 -1506 -7746 -10360 -8035 -1990
841 -1990 4842 9345 9649 5272 -1668 -7717 -10045 -7705 -1734 5154 9485 9295 4652 -2079 -7842 -9719
857 -9719 -6934 -1152 5170 9104 8775 4259 -2198 -7764 -9691 -6776 -512 5617 9037 8228 3555 -2750
873 -2750 -7567 -8854 -6304 -543 5630 8969 7998 3170 -3016 -7763 -8777 -5614 57 5745 8747
888 8747 7415 2684 -3138 -7485 -8431 -5326 262 5765 8691 7262 2255 -3647 -7590 -7974 -4666 788
904 788 5745 8062 6718 2141 -3635 -7626 -7798 -4399 1140 6114 8000 6114 1499 -3751 -7390 -7412
920 -7412 -3852 1362 5870 7754 5964 1266 -3984 -7280 -7228 -3559 1831 6205 7420 5249 817 -4045
936 -4045 -6955 -6752 -3330 1810 6187 7468 5077 402 -4386 -6948 -6288 -2748 2085 6020 7049 4641
952 4641 168 -4353 -6785 -6132 -2504 2352 5998 6865 4386 -245 -4686 -6687 -5536 -1978 2497 5831
968 5831 6422 4055 -213 -4581 -6768 -5493 -1642 2824 5960 6138 3526 -623 -4493 -6290 -5154 -1567
984 -1567 2927 5812 5984 3450 -890 -4738 -6215 -4868 -1101 3162 5837 5592 2846 -1096 -4551 -5942
1000 -5942 -4551 -1029 3193 5830 5644 2619 -1508 -4801 -5771 -4082 -503 3171 5537 5253 2546 -1627
1016 -1627 -4792 -5681 -3877 -311 3448 5508 4947 2119 -1776 -4747 -5421 -3545 -99 3396 5283 4778
1032 4778 1962 -1824 -4755 -5427 -3353 373 3625 5167 4314 1508 -2037 -4514 -5027 -3205 260 3708
1048 3708 5224 4199 1271 -2264 -4658 -4799 -2816 563 3662 5007 3914 1050 -2220 -4475 -4689
1063 -4689 -2641 704 3733 4976 3816 695 -2641 -4481 -4337 -2266 853 3672 4639 3560 760
1078 760 -2547 -4597 -4293 -1966 1159 3759 4530 3149 405 -2603 -4317 -4065 -1833 1272 3703 4388
1094 4388 3043 180 -2702 -4336 -3910 -1519 1617 3732 4107 2689 39 -2697 -4130 -3722 -1570 1557
1110 1557 3833 4199 2430 -350 -2846 -4017 -3367 -1115 1611 3643 3947 2434 -349 -2856 -4013 -3309
1126 -3309 -1020 1773 3681 3739 2158 -569 -3009 -3809 -2954 -774 1755 3500 3582 2002 -593 -3018
1142 -3018 -3879 -2843 -523 2013 3552 3333 1657 -763 -2834 -3716 -2774 -460 2115 3527 3330 1624
1158 1624 -942 -2986 -3529 -2475 -297 2147 3442 3097 1343 -996 -2843 -3500 -2393 -162 2234 3543
1174 3543 2996 1056 -1250 -2951 -3280 -2162 26 2089 3256 2891 1176 -1256 -2968 -3236 -2019 228
1190 228 2289 3228 2583 893 -1328 -2879 -3100 -1802 243 2246 3142 2623 739 -1438 -2943 -3058 -1577
1207 -1577 524 2303 2933 2283 557 -1426 -2716 -2835 -1601 562 2449 3008 2157 338 -1679 -2810
1223 -2810 -2630 -1274 685 2275 2843 2076 265 -1610 -2833 -2609 -1148 836 2447 2811 1884 27
1239 27 -1732 -2610 -2396 -1006 902 2300 2678 1800 31 -1781 -2733 -2290 -792 1079 2296 2547 1486
1256 1486 -134 -1715 -2618 -2180 -750 1038 2368 2589 1457 -303 -1830 -2522 -2004 -513 1180 2240
1272 2240 2307 1318 -307 -1782 -2459 -1973 -509 1259 2364 2297 1107 -562 -1813 -2356 -1707 -342 1270
1289 1270 2205 2156 1117 -533 -1921 -2325 -1694 -149 1404 2183 2005 895 -639 -1843 -2162 -1540 -139
1306 -139 1332 2218 1986 827 -723 -1967 -2223 -1362 55 1426 2107 1776 696 -756 -1776 -2128 -1358
1323 -1358 98 1461 2155 1791 552 -961 -1898 -1983 -1111 190 1447 1951 1631 559 -840 -1952 -1979
1340 -1979 -1094 287 1504 2057 1591 335 -999 -1753 -1776 -974 328 1456 1915 1484 349 -1073 -1943
1357 -1943 -1791 -866 553 1558 1817 1302 199 -994 -1734 -1706 -850 489 1553 1842 1306 45 -1108
1374 -1108 -1749 -1571 -622 584 1486 1731 1192 83 -1048 -1716 -1533 -587 644 1574 1738 1065 -102 -1167
1392 -1167 -1660 -1335 -491 618 1511 1667 961 -115 -1156 -1681 -1418 -374 821 1458 1573 844 -184 -1156
1410 -1156 -1581 -1262 -406 697 1496 1519 830 -247 -1233 -1668 -1168 -177 831 1455 1377 684 -305 -1177 -1515
1429 -1515 -1141 -191 833 1445 1425 633 -418 -1287 -1431 -1032 -62 867 1329 1280 598 -406 -1258 -1444 -962
1448 -962 -9 936 1470 1184 424 -535 -1234 -1395 -796 10 899 1367 1206 513 -568 -1286 -1393 -839 170
1467 170 995 1302 1091 298 -516 -1197 -1255 -751 137 1019 1428 1033 249 -631 -1282 -1213 -601 191 955 1237 944
1488 944 221 -641 -1189 -1169 -686 249 978 1256 904 129 -713 -1139 -1099 -538 284 931 1236 866 193 -683 -1214
1509 -1214 -1120 -479 356 998 1170 765 -15 -651 -1101 -1040 -531 385 978 1142 786 -13 -768 -1144 -940 -353
1529 -353 460 1017 1017 663 -1 -676 -1109 -935 -322 490 988 1124 571 -173 -782 -1092 -871 -176 456 919 1041
1550 1041 633 -156 -772 -1060 -851 -150 604 1013 913 489 -207 -810 -980 -677 -119 462 967 931 463 -179
1570 -179 -893 -1082 -735 -24 615 913 829 390 -237 -802 -916 -701 -48 637 927 861 347 -342 -864 -929 -589
1591 -589 58 614 945 734 351 -317 -750 -955 -629 72 676 923 706 161 -384 -793 -772 -474 79 573
1611 573 824 775 223 -382 -853 -841 -439 131 645 850 626 147 -390 -766 -771 -432 128 568 826 676 182
1632 182 -435 -798 -797 -349 218 707 764 496 61 -435 -756 -722 -409 142 665 813 490 9 -488 -734 -674 -268
1654 -268 230 606 750 520 52 -499 -750 -643 -179 302 693 774 400 -45 -515 -730 -537 -257 275 672
1674 672 706 422 -62 -542 -729 -632 -117 366 670 629 368 -79 -506 -694 -520 -102 369 707 639 372 -126
1695 -126 -619 -724 -504 -85 332 562 545 324 -70 -489 -671 -521 -73 427 668 557 251 -283 -561 -561 -467
1716 -467 -48 365 592 589 230 -201 -561 -655 -465 16 432 639 518 162 -238 -550 -605 -385 55 382 590
1737 590 557 211 -277 -590 -604 -328 111 432 535 449 160 -246 -513 -545 -349 7 425 570 450 95 -363
1758 -363 -534 -546 -250 126 392 558 391 99 -270 -502 -569 -249 193 446 542 441 -10 -322 -439 -462 -207
1779 -207 106 427 513 370 88 -374 -561 -456 -173 204 451 527 318 -71 -275 -488 -397 -211 151 392 538
1800 538 329 -34 -352 -521 -433 -146 207 383 416 276 41 -303 -478 -404 -121 241 514 424 205 -60 -308
1821 -308 -462 -344 -53 221 412 488 272 -60 -457 -484 -402 -65 331 457 392 195 -116 -367 -465 -334 -85 212
1843 212 469 356 224 -138 -368 -449 -262 25 247 436 326 159 -159 -276 -423 -346 -29 272 377 375 135
1864 135 -187 -376 -398 -191 -33 253 343 288 183 -171 -390 -393 -252 52 312 422 300 62 -153 -363 -351 -223
1886 -223 -11 285 361 306 119 -227 -402 -388 -212 61 269 367 280 40 -259 -365 -353 -187 80 294 411 322
1908 322 20 -240 -405 -288 -108 92 317 356 271 29 -234 -321 -326 -173 140 308 373 215 -9 -221 -312 -329 -90
1931 -90 109 264 329 257 29 -235 -348 -376 -65 132 262 284 189 -69 -190 -265 -283 -113 127 317 283 207 -18
1954 -18 -285 -338 -229 -71 135 303 286 165 -62 -211 -297 -253 -40 171 337 254 168 -117 -270 -279 -155 10 215
1977 215 261 296 150 -61 -235 -314 -231 -19 154 287 224 107 -63 -242 -270 -158 7 108 273 249 193 -92 -255
2000 -255 -292 -198 -1 254 307 245 81 -69 -223 -248 -185 -8 203 260 201 88 -146 -269 -262 -145 78 149 272 204
2024 204 39 -133 -220 -305 -147 28 214 308 210 68 -117 -217 -256 -163 42 198 227 198 104 -71 -252 -236 -106
2047 -106 77 211 227 133 49 -117 -222 -149 -79 44 183 202 173 18 -170 -269 -195 -76 94 260 147 175 6
2070 6 -95 -245 -206 -92 81 172 199 148 -17 -169 -256 -143 -30 83 189 190 84 30 -137 -262 -186 -48 119 201
2094 201 203 108 -92 -144 -214 -116 -53 32 191 203 148 -64 -166 -234 -170 2 156 241 151 59 -23 -119 -229 -200 -39 127
2120 127 245 156 52 -120 -209 -183 -81 16 78 225 166 83 -30 -170 -229 -168 -35 161 188 190 31 -34 -134 -124 -68
2145 -68 -39 68 154 148 60 -98 -248 -172 -98 63 112 147 118 15 -65 -164 -189 -69 -38 117 187 182 34 -98 -250 -180
2171 -180 -93 44 150 166 141 28 -88 -162 -134 -135 23 136 180 99 -51 -116 -206 -123 -63 24 135 183 91 6 -92 -145
2197 -145 -161 -34 71 118 137 93 -63 -136 -120 -143 -28 94 144 186 84 15 -116 -165 -113 -51 43 132 149 66 -46 -115
2223 -115 -119 -124 11 76 192 128 120 -17 -122 -72 -32 -28 73 86 87 69 -37 -87 -135 -88 -62 22 127 169 55 -12 -108 -65
2251 -65 -98 6 80 142 146 75 -54 -127 -160 -113 63 128 112 162 4 -37 -112 -75 -71 -34 97 118 146 42 -86 -113 -163 -78
2279 -78 48 97 102 93 91 -19 -70 -163 -106 5 69 143 79 78 -74 -110 -89 -49 30 100 107 71 26 -31 -108 -74 -59 22 76 145 67
2310 67 -14 -48 -68 -104 -31 30 89 148 110 -8 -95 -139 -110 -66 67 102 81 50 40 -9 -118 -113 -82 44 77 148 55 -17 -76
2339 -76 -108 -57 -48 35 52 115 65 -3 -62 -149 -81 -116 46 77 63 37 -59 -64 -72 -90 -55 68 80 99 78 -15 -86 -136 -82 -20 41
2370 41 91 148 38 26 -77 -72 -79 -57 65 102 71 47 -50 -58 -107 -37 -30 38 65 37 65 -36 -19 -80 -36 -45 56 124 72 77 -35
2401 -35 -114 -56 -29 -18 100 80 34 48 -67 -100 -118 -49 -37 78 131 91 -25 -6 22 -67 -63 -47 70 114 28 -7 -39 -89
2429 -89 -70 -35 -23 66 119 68 52 -88 -26 -32 -85 -44 77 98 98 58 -37 -74 -67 -28 39 36 22 48 5 -31 -57 -131 -104 6 81
2460 81 129 47 -13 -45 -54 -78 26 14 16 40 49 38 -48 -77 -82 -60 56 53 7 54 9 -51 -106 -127 -75 3 115 55 79 27 -63
2491 -63 -118 -9 4 46 80 74 1 -18 -41 -70 -91 9 66 47 75 29 -9 -61 -60 -8 46 -8 48 70 98 10 -38 -69 -93 73
2521 73 26 56 52 33 -43 -38 -77 -35 -26 26 54 86 71 3 -54 -109 -83 10 44 16 63 27 -12 -19 -101 -70 -43 32 85 71 31 -40
2553 -40 -76 -63 -34 -6 -3 47 11 40 -3 -44 -61 -45 -3 40 52 34 -4 -52 -42 -55 11 42 47 77 72 26 30 -88 -74 4 20 58
2585 58 38 -46 75 -48 -55 -66 -11 -50 5 66 91 -52 -66 -59 -36 -69 32 54 18 13 -12 -12 -26 -44 -24 -23 29 82 23 -16 -84
2616 -84 -31 -14 -24 -1 43 70 47 -9 -46 -38 -66 -38 64 87 47 -5 25 -36 -33 -44 -63 -5 23 57 0 49 -34 -48 -120 -20
2646 -20 11 25 43 8 0 -6 -26 -47 -63 51 18 19 -4 23 -71 -78 37 4 -64 51 30 -44 -28 -35 -45 0 -7 -9 39 27 16 -23
2678 -23 -27 15 -8 -13 -25 10 51 22 23 -77 -77 -69 -27 31 21 14 34 -18 10 18 -52 -40 24 33 31 6 -39 -33 -40 -34 -14 29 53 11 17 1
2714 1 -15 -43 -25 -27 2 7 26 14 -11 -7 -19 -30 -1 36 72 -16 14 29 -32 -56 -14 15 -26 32 20 -4 -31 -22 -45 -77 1 10 77
2747 77 43 0 -7 -89 -53 9 37 -23 5 24 -10 -35 -43 65 -1 -26 32 40 9 -27 -56 -41 -18 -40 -5 49 23 -6 15 -30 -43
2778 -43 9 -37 -2 15 80 -60 -16 -3 -28 1 24 13 -27 -6 3 30 -20 -57 1 -28 71 -1 31 3 -8 10 -39 -2 53 -23
2808 -23 18 5 28 16 -40 -6 4 49 34 11 14 13 -26 18 -20 -25 -12 3 19 54 3 15 -31 -31 -25 -16 -2 1 9 17 1 -44 -78 -18 77
2843 77 32 12 15 14 -38 11 -25 -27 4 -12 -12 -13 10 -11 -20 -3 43 -14 45 18 -6 -19 -28 -15 -23 51 -5 -22 54 3 -9 -14 -5 -47 -78
2878 -78 24 -13 -2 -84 0 -31 28 -28 -26 -16 8 52 -8 4 -13 -25 -42 -62 6 26 -15 31 4 64 -6 -63 -3 -21 32 -4
2908 -4 -41 -23 -30 -28 -18 -23 -69 42 21 40 -25 -40 -99 -32 3 11 89 59 49 6 -57 -24 16 -36 20 56 133 -37 -37 14 -30 15
2940 15 7 28 28 0 27 -10 11 -8 -49 30 -43 -16 66 13 31 -12 22 -44 3 -2 17 21 1 -39 -23 10 -15 -26 -33 -13 -3 18 -21
2973 -21 -6 29 -13 -26 27 69 36 -9 6 -54 -27 9 -28 -27 -4 18 -47 33 -14 -40 20 -68 33 -2 1 24 -18 -6 24 28 -3
3004 -3 10 45 18 13 -6 -10 -78 -2 0 32 2 -10 79 -53 14 -1 -20 -11 -24 9 -21 33 1 -1 13 -3 -19 31 67 -9 9 28 -37
3037 -37 -43 -44 -1 27 41 -11 1 0 -26 18 16 -11 -35 -37 36 52 13 16 -32 28 35 56 17 32 33 14 9 -14 18 23 69 -19 -24 42 3 -29
3073 -29 10 8 35 -16 -4 -53 4 -12 28 5 11 -29 -25 79 -19 3 4 17 -39 -15 27 -43 -36 -12 16 -20 14 10 75 90 -40 4
3105 4 -39 11 -3 -36 -13 -18 21 26 39 19 -17 -11 -20 -15 -97 12 27 -19 -47 -31 26 -8 -12 15 -29 22 -22 59 -13 -34 -15 -2 62
3138 62 24 25 8 -10 18 -22 -31 -15 11 57 -8 33 -21 -15 4 -14 -9 43 43 15 12 -4 -35 -29 -41 -15 -8 -34 -4 14 52 31 -24 38
3172 38 8 -23 5 10 14 17 56 -5 -7 -9 55 5 37 -13 33 -18 14 -5 10 13 -19 -37 29 -75 0 -17 19 27 11 -32 -4 -16 25
3205 25 46 -18 18 9 79 59 31 13 28 -13 -8 -11 -32 -3 0 -68 -42 30 4 -4 -36 45 7 -20 -4 9 19 -21 18 24 -23 0 12
3238 12 -51 14 -30 -21 -19 -25 -36 -30 -2 9 -17 6 -2 -40 -14 18 -13 41 18 26 -15 8 1 56 -8 46 1 -9 -13 3 -2 -5 -1 7 38 -6
3274 -6 12 -5 20 -34 3 -8 22 1 -28 20 37 47 -29 -6 30 6 -5 0 2 31 -10 -6 -10 30 -32 11 68 -27 -33 -29 38 -61 -7 50
3308 50 -3 18 -4 13 -4 24 -40 -20 -5 -18 -8 -13 -49 39 -1 -10 14 -32 12 -15 28 -30 46 15 -10 4 15 -29 -4 19 29
3339 29 -35 11 7 33 -72 13 -19 -7 -46 -29 -8 -58 12 -12 48 9 8 40 -20 -17 -25 20 47 7 -41 3 -22 -9 -48 -5 3 -5 26
3372 26 38 6 1 26 -29 -39 -4 35 60 -16 41 -46 -14 24 -25 -29 40 32 24 20 -33 -12 -6 -10 -11 -7 15 41 -46 -6 -11 20 -16 -21 7 14
3408 14 -10 15 12 48 -6 4 15 -16 14 -11 29 22 34 68 -33 0 -18 4 28 29 23 8 34 -11 -32 -49 33 -14 13 62 -5 26
3440 26 -21 17 29 -39 -1 48 7 -10 -22 3 6 -25 -43 8 59 29 4 32 -13 28 -18 23 -17 -3 28 -14 41 -30 11 22 61
3471 61 -7 -5 -39 5 18 13 92 31 20 -18 -40 2 -25 -12 -20 33 33 -64 10 -4 5 25 -30 -19 15 -12 -10 -27 -66 -4 22 9 -18
3504 -18 0 14 40 33 -6 41 29 49 -19 -11 13 -41 0 -2 8 2 -48 29 -21 23 -10 -26 25 38 80 -25 -2 43 10 -21 38 9
3536 9 -33 30 -9 38 -24 -29 3 20 28 26 -44 -17 -11 7 14 -15 -4 -6 -9 26 27 47 -11 -4 17 2 -43 -19 -8 73 -34 -6 -29 -47 19
3571 19 -7 -21 28 57 -22 -7 16 24 -13 -33 -32 32 -21 -3 -15 11 -32 32 -10 -26 -8 -24 -31 0 -86 -1 -18 13 47 31 33 27 -8
3604 -8 7 -3 5 17 -24 -34 -39 11 1 12 0 12 8 18 16 39 -18 19 -24 -49 -4 1 -6 6 -18 42 23 -23 42 1 -2 -23 -17 -12 17
3639 17 53 -24 -16 9 17 12 11 21 7 -25 13 5 17 33 -23 -5 -4 -38 32 49 -15 -10 -10 38 23 6 -28 10 38 -21 13 -5 -21 58
3673 58 -8 -24 46 18 20 26 -18 -33 39 -35 -6 -8 3 15 76 1 -25 7 29 9 47 26 -33 11 1 46 2 -14 3 -1 31 -18
3705 -18 -24 10 14 0 -23 7 34 -58 2 -35 37 42 -4 22 -20 22 -17 -14 -43 -7 -31 -6 -3 -8 12 -31 -18 -9 3 -4 24 -4 -7 -59 -14
3740 -14 -79 -58 1 9 13 -3 15 21 -6 -31 -8 -36 -8 -48 -38 -27 -19 10 53 25 18 -18 29 22 1 -18 -19 -38 11 32 48 -2 13 6
3774 6 79 -7 35 80 -4 -15 -54 -17 14 34 -15 50 -32 -17 -19 15 -8 -27 16 -18 11 0 -34 2 4 35 15 -56 15 22 7 -39
3806 -39 47 -3 74 6 -41 30 22 -74 -34 22 -74 12 -20 -7 -1 -21 -3 -10 7 15 -10 7 -16 -16 8 25 79 -6 -2 2 -13 -6 -11 46 -50
3841 -50 -26 -29 -11 -19 23 6 -23 0 -12 20 -8 15 3 -11 -18 9 -6 38 -73 20 7 -75 -44 -2 -39 23 -24 41 -19 -32 -14
3872 -14 14 -24 -5 59 27 28 3 7 -20 -45 -10 -34 -64 11 31 -51 -25 5 -13 -60 28 -53 -25 -8 -20 -6 -64 -13 -6 -21 12 -24
3904 -24 -17 44 13 5 -16 -42 30 -25 -19 9 -4 -39 -8 -18 -40 -42 -29 4 6 8 15 30 7 -1 17 0 -32 -10 -11 24 44 11 -8 -33 -21
3939 -21 -5 10 36 -14 11 0 -36 -39 -9 8 -30 -94 -6 18 -21 -10 -10 -26 52 -18 2 11 -23 -3 -39 27 -66 28 -16 -1 61 -19
3971 -19 -7 -8 -1 -30 17 -27 -54 -4 -22 -14 -23 13 12 -7 -1 5 14 -2 48 -24 1 31 -41 -8 12 -10 37 32 -12 8 1 34 -33 -37 39 13
4007 13 4 15 -77 -26 28 -9 -55 -1 -53 23 -3 6 11 3 12 -51 -25 9 14 -33 -32 -38 4 40 -11 -46 67 -18 8 -8 -6 33 38 10 0
4042 0 -5 6 -40 -1 22 -5 24 -25 36 -2 -9 -47 -18 -19 -13 30 81 21 -6 51 7 12 -1 -28 5 -28 -63 -65 -28 -4 12 25 -53 -34
4076 -34 -17 51 18 3 -13 -81 -29 21 -41 9 21 19 -36 -49 -37 30 -29 -15 9 10 -15 -2 -5 -41 -1 12 -17 -20 16 24 -45 15 19
4109 19 -10 32 -34 -11 -8 -2 -27 44 -28 -7 10 50 10 -11 1 14 -4 33 -7 -4 -67 9 -17 -37 7 9 -5 -14 12 32 -16 7 6
4142 6 7 10 -26 -12 44 -29 42 22 18 40 -22 -22 -21 6 -20 -43 8 13 -6 -23 -14 -21 -1 15 -6 44 11 13 -28 34 -10 -32 -37 -7 3 40
4178 40 27 -51 3 42 -22 0 -4 40 32 -21 -20 -63 22 15 12 3 3 -20 33 -17 21 -12 -40 13 4 -24 -9 -36 -42 21 20 -22 -3 36 10
4213 10 39 40 39 -23 8 38 9 37 31 35 -21 19 -12 1 -7 -64 0 -20 -17 -16 39 -46 62 -55 -2 4 -12 -28 0 16 -42 -12 -22
4246 -22 -2 32 41 -9 -21 -11 -13 31 -1 1 27 -2 -56 26 62 -8 -33 12 8 -15 2 -22 41 21 -36 -26 -35 -29 13 -15 -50 11 -19
4279 -19 54 -58 -10 -7 -18 28 -28 -24 17 30 33 -36 -34 -9 13 7 31 52 6 -28 -10 -22 41 -7 31 -3 52 -15 31 22 9 11 -8
4312 -8 32 -9 -30 -68 -71 32 10 -25 13 -8 0 45 24 -16 -39 18 24 21 31 -84 -19 55 -2 -3 -23 31 -22 40 28 -18 -10 -5 15
4345 15 -24 2 8 -9 14 -7 0 26 19 12 28 33 18 -24 -31 22 11 -1 12 11 20 -6 30 18 -28 30 -41 23 -58 -68 -10 -12 -29 51 0
4380 0 -54 62 -34 37 42 38 -9 16 32 -31 -27 35 -1 -39 13 10 -37 -44 -19 -21 -32 -15 -8 -44 29 -35 -7 10 -9 -4 17 -62 41 83
4414 83 -7 -33 -7 9 -62 -21 -20 15 38 -9 -2 10 -22 39 5 -34 15 22 3 41 12 5 -27 26 -5 57 26 -5 -39 47 35 -21
4446 -21 -19 -29 5 25 -17 -12 5 -2 30 0 4 -19 -8 -15 -11 44 -21 -8 -22 27 -39 -25 -45 19 41 21 -3 10 -46 -41 7 -50 -4 5
4480 5 24 15 -1 14 -32 9 -12 22 -31 -11 39 -61 23 -9 4 -4 -6 27 -25 -30 -33 1 -44 -4 20 -3 64 1 19 1 25 7 -29
4513 -29 31 -19 -8 -24 -25 14 -51 26 -18 -53 6 62 23 22 -42 16 -15 8 24 -23 0 -1 -36 16 -17 25 -12 -4 -12 29 46 23 33
4546 33 46 -1 15 -15 -23 8 -25 19 16 8 -38 15 0 76 -26 21 -5 -4 31 7 -3 -13 4 6 -5 10 7 12 7 -31 -18 4 15 -2
4580 -2 -27 -22 43 -54 30 -11 12 53 -43 -14 9 8 12 -14 -7 -7 -27 60 39 0 24 13 -4 -7 11 37 19 -23 16 28 -41 -11 37 -40
4614 -40 -3 -46 26 -2 -38 -4 -9 -13 -30 -20 -5 15 30 -16 13 -23 35 -16 18 9 -9 -50 10 -1 13 -9 34 29 -6 -44 -2 2 35
4647 35 -35 -16 -18 8 37 -24 -6 -21 2 -13 -4 -25 -13 -67 21 -24 58 29 -30 -50 34 9 1 27 -2 -2 -26 -8 -25 -30 -16 -36 -48
4680 -48 40 -35 -22 -49 -22 2 31 84 -56 -19 14 -20 -24 3 28 -5 -27 -14 -44 27 -1 -31 22 -7 -18 2 -3 15 0 -7 -37
4711 -37 -17 -10 -14 36 7 23 -32 3 -23 -17 9 -36 -33 12 -26 -72 21 28 4 -15 21 -12 35 -27 8 32 -37 -16 5 -47 52 -14 10
4744 10 -32 -9 26 -9 61 12 -18 -44 33 -24 -35 37 30 -10 16 10 29 9 7 20 20 -7 -47 29 13 -31 10 19 -8 -32 49 -8 30
4777 30 -10 5 36 -3 20 0 10 42 15 -26 23 -43 -14 -13 -41 3 17 -6 9 -20 -28 40 27 30 27 4 -28 -41 -9 -11 11 36 11
4810 11 4 2 35 -29 22 43 14 30 -38 26 6 55 4 -5 -16 -42 -31 -33 -22 17 -9 -28 35 -23 13 34 -20 -22 45 2 38 -11 6
4843 6 -8 101 -45 21 -8 61 9 -22 21 -37 26 6 -27 -35 44 -22 7 -32 -20 67 -19 2 -5 -18 -63 -26 -41 -5 63 -9 8
4874 8 -28 14 -66 38 30 -34 -1 -37 9 8 -10 -21 -55 -30 -33 45 13 -20 -27 17 13 -61 -7 -3 40 -2 6 0 -5 -37 23 -4 -45 -26 32
4909 32 61 -31 -14 0 27 -55 -31 -46 33 -45 -17 29 -7 -11 17 24 -9 9 -16 32 11 6 -43 -2 9 14 -31 24 -16 44 -12 -15 23
4942 23 -13 14 -9 -15 -44 -30 22 -7 2 -11 24 10 1 11 -37 -24 -33 52 21 15 38 -12 12 14 21 -28 -19 -31 24 -25 -12 -29 -50 20
4976 20 20 -7 -10 26 -27 -55 7 -38 34 12 -46 10 42 20 13 46 5 23 14 12 6 -9 10 10 28 0 26 41 -13 10 -37 -39 -25 44
5010 44 36 13 -35 -18 26 -10 22 -14 -7 7 -8 14 2 -47 -15 -24 -16 12 -14 -15 -34 -32 13 -4 0 -55 -41 -16 24 3 -23 -3 -25 -14
5044 -14 -49 10 2 61 -18 -23 -32 47 -12 -42 47 24 -43 -18 -35 -30 8 -30 -10 -26 -19 -9 23 13 -18 22 -27 -9 51 7 13 -45 -10
5077 -10 5 17 54 -27 1 -4 -50 2 -19 10 45 8 -50 -19 14 -16 -22 -40 0 36 -5 -28 53 -26 -3 5 0 -29 11 20 58 -73
5109 -73 22 -8 -1 -15 20 31 36 -27 -24 -24 16 -25 3 10 -9 38 -13 -11 12 46 -4 24 -23 81 -5 6 25 -1 48 7 7 -35 -5
5142 -5 15 -2 35 -3 -2 -65 30 -34 -25 -14 -7 -11 -6 0 -35 -20 -8 -40 67 -13 -41 19 -24 -2 3 -2 -31 12 -36 -3 6 23 -22 15 24
5177 24 -24 36 2 -12 4 -71 3 12 1 30 -10 10 3 -45 23 68 53 -43 11 -20 0 -8 18 3 18 33 -40 56 55 40 30 41
5209 41 8 -35 -30 -22 -4 18 -2 20 16 -19 -13 -46 35 11 -3 -15 37 73 20 -21 -2 -28 11 16 9 -11 14 -41 26 -88 -31 9 49
5242 49 -23 38 -21 -8 35 -54 14 29 -13 1 15 5 -29 21 -6 78 10 -7 9 -56 47 -52 40 -13 22 8 4 -28 37 -43
5272 -43 -8 -17 -13 -18 -26 -21 49 12 39 -26 11 -30 -42 21 45 0 -19 -2 -34 5 13 51 17 -29 -12 -9 0 14 -21 6 6 -62 -18 32 44
5307 44 23 -20 15 30 -3 21 14 14 32 56 -14 -25 15 -5 23 44 30 52 -10 18 22 13 16 -40 -4 -16 32 -10 7 14 -37 19 -45
5340 -45 5 -83 16 -15 -29 31 20 -13 -28 30 18 65 21 -14 22 -22 -13 28 -42 -9 24 16 4 27 2 23 -19 2 24 -67 -6
5371 -6 29 -41 31 31 -25 0 66 8 -21 41 -20 -45 -27 2 -13 0 12 -43 -7 71 52 26 52 32 12 30 37 75 -15 27 -12 -27
5403 -27 15 -12 6 -14 -13 50 -31 38 28 7 -7 15 -36 2 20 -56 -23 8 15 3 17 -57 -18 -11 33 -37 10 -5 -21 21 -23 -13
5435 -13 -33 17 27 1 13 6 7 30 65 56 -2 -11 7 74 19 17 -19 -4 -28 30 4 8 -16 -6 -4 -17 33 6 -9 22 -31 33 14 15
5469 15 31 -14 -48 -17 -18 -7 -15 -48 -21 -2 46 13 36 11 13 41 -53 -8 34 14 29 38 21 -34 26 13 41 5 35 43 -19 25 27
5502 27 3 12 18 -20 35 -71 -18 16 23 57 -10 -3 25 5 36 -15 -37 30 31 10 4 34 -14 8 -12 21 -26 -28 -10 28 20 59 9 -29
5536 -29 7 -7 -59 26 -8 28 -9 -10 -17 54 -37 -19 17 14 -34 -15 -4 48 -19 -69 41 23 -34 -19 -21 -24 29 -14 -74 -18 56 -13
5568 -13 -29 -11 3 -8 26 -8 26 8 -10 7 17 -19 0 32 38 4 47 18 16 29 36 56 12 16 -14 -64 -15 24 -47 12 -7 29
5600 29 -13 -77 2 -20 -3 -12 -23 -14 5 -52 30 -11 34 -12 -29 0 -63 -15 8 -9 -32 39 2 44 46 -13 43 20 -6 -44 -49 3
5632 3 -28 35 -6 -6 -16 21 11 33 -4 12 1 20 15 -14 -28 21 -3 -15 17 8 -5 -10 6 17 16 22 -8 20 -20 1 16 27 5 26
5666 26 4 30 63 10 65 29 0 37 -19 26 -4 27 -3 9 8 6 43 17 27 24 36 40 10 -7 -10 -10 -17 54 8 -24 16 -15 1 26
5700 26 35 -8 13 39 36 23 44 -14 21 35 12 9 44 -6 -6 10 -3 20 -15 -16 -28 6 33 -8 -15 15 5 10 37 38 -47 -21 -34 -15
5734 -15 33 -5 -1 -6 54 49 -35 -30 -2 -4 0 -18 -36 36 -18 -12 -18 -35 -6 24 2 -37 -30 -11 -1 26 -4 10 32 2 2 19 26 48 -20 -14
5770 -14 -23 39 35 -9 27 -10 0 20 23 10 19 -12 20 -79 38 -10 -8 -2 -14 8 12 4 -7 -46 -11 4 19 10 39 36 -47 -4 11 4 19
5805 19 46 8 39 4 -32 -6 -13 13 7 5 37 -15 30 29 -50 14 -20 21 -23 -12 8 14 11 -34 -102 5 6 -14 6 -24 0 -15 45
5838 45 24 -25 30 14 -1 -11 -24 12 -45 0 -23 -21 1 5 -14 43 -13 42 7 -7 24 1 42 10 12 0 -2 -6 -31 -54 -41 -2 -17
5871 -17 -2 -82 -24 3 -40 26 1 -42 -29 -31 18 -18 -22 -74 -22 34 -25 17 21 -22 -37 54 39 -9 -14 -21 -18 -2 -2 -55 7 -16 -16 -55
5905 -55 -19 24 -45 -2 -50 -7 -5 18 -16 -16 -5 14 -10 19 -24 -47 15 8 28 5 1 -32 -47 21 -21 -22 38 -31 -6 6 -4 -44 -5
5938 -5 20 25 69 3 12 7 5 -24 6 -6 -15 0 -22 39 -20 -9 -22 -49 43 50 41 -13 12 -35 -30 -56 -11 3 -48 -66 39 -16 -37 -16
5972 -16 40 5 -42 -47 -11 11 30 0 18 30 -11 21 3 8 35 -22 -9 -31 28 -40 4 13 27 1 -22 12 11 -18 -16 18 19 72 -6
6005 -6 -12 6 7 -17 -12 -39 7 -6 42 -30 -10 3 29 -34 47 -17 -3 1 3 6 14 27 -49 2 7 4 15 14 1 -26 -71 4 -3 -15 7 48
6041 48 6 -22 10 39 18 28 55 33 -41 19 -14 -28 23 -11 3 21 43 -7 -11 -6 17 27 -43 -8 47 -34 -48 8 25 19 -40 -21
6073 -21 12 -28 4 -3 31 -58 -9 -30 -34 -59 -34 53 9 6 25 8 -60 -33 46 50 -28 26 18 -38 -25 -1 2 78 -17 30 -4 -9 37 6
6107 6 -44 35 41 9 11 22 -5 39 29 -30 55 -58 29 -25 -60 -3 18 -79 -17 17 -31 54 -56 -25 -25 35 23 -24 15 -49 24
6138 24 20 -14 43 23 2 7 26 26 -45 -41 11 12 33 -23 -2 -30 25 20 -44 31 18 -12 14 29 25 -11 31 18 28 -5 20 10 55 4
6172 4 34 5 -4 -9 -29 -26 46 -31 16 6 37 86 39 89 -19 16 6 24 -13 -25 -3 -2 -24 30 6 18 -14 -27 8 10 -9 -28 -28
6205 -28 -4 -9 1 -6 -37 -25 30 35 -20 -25 3 34 7 -18 1 -24 -1 32 13 -8 -14 -25 17 9 37 -35 4 -12 -40 22 -46 -8 -36
6238 -36 -30 26 -32 -2 -32 3 7 -31 8 -56 -2 10 47 -7 2 -45 38 -10 -46 12 -45 24 9 7 9 -20 20 -3 27 7 57 7 12
6271 12 -61 70 -33 3 5 -36 11 -4 53 32 24 23 1 -7 1 13 39 -19 18 73 -36 25 -4 43 15 62 37 -40 -5 17 8 -5
6303 -5 65 15 -52 2 10 -9 22 27 36 12 46 12 -25 11 -23 -9 -10 -62 -19 6 13 25 5 -17 -5 55 27 -15 8 4 -15 -23 -1 32
6337 32 -2 -10 -40 -10 -54 11 35 -52 6 3 -46 61 -17 1 6 44 1 -1 6 -26 14 10 -42 9 2 -63 47 18 -28 5 -7 -24 -37
6370 -37 -19 -8 -96 -20 -4 -17 -40 5 28 21 -2 7 -8 11 3 1 -16 -15 -47 -7 -34 -50 35 -35 15 -20 -7 -1 29 15 4 35 37 -28
6404 -28 36 5 -51 -5 -39 26 -28 23 11 -36 -34 -36 -41 7 11 11 -32 -46 -50 -15 35 41 6 -19 10 11 18 13 -60 9 -16 -23 -1 -5 20 -45
6440 -45 -3 45 40 22 -4 -19 60 -8 -28 -4 34 29 -52 -29 -8 2 28 25 12 12 -13 6 -18 -47 3 32 -45 5 36 -54 12 32
6472 32 -52 7 -39 -7 10 13 8 -1 13 10 -16 -37 -46 -48 -1 43 51 20 -13 39 20 57 2 7 32 9 -5 32 6 7 7 15 -9 -18 16 15 18
6509 18 28 12 -13 -25 50 32 56 45 24 24 13 -11 34 11 2 33 -6 -1 -31 0 -30 11 0 -3 13 -22 3 75 19 -28 -22 2 3
6542 3 -8 -85 14 -6 9 9 -35 51 59 22 6 21 36 17 -56 6 42 30 22 -17 2 7 -4 20 -49 0 8 -17 12 17 -31 36 3 -7
6576 -7 18 5 26 39 16 18 -11 -9 11 -56 51 14 39 21 13 33 -3 -16 66 -21 11 12 43 24 41 50 17 59 -20 47 33 -17 15
6609 15 0 -4 -14 -5 0 51 7 1 38 -45 -15 1 76 22 9 -13 -30 -19 16 8 -5 4 -34 -10 -23 0 51 -29 -50 -23 15 35 -37
6642 -37 19 8 -44 20 48 11 -36 -55 47 -22 -18 6 0 -31 -16 12 30 56 32 1 34 -17 -14 -10 17 23 9 8 34 11 -20 -4 -32
6675 -32 -4 -1 -43 53 -14 9 -29 -51 22 17 -22 -4 15 -49 54 -11 50 61 -9 -16 22 41 45 -70 -14 -3 43 -9 40 23 -15
6706 -15 -34 4 -3 -46 -50 -3 -3 -9 -10 19 -6 9 19 -4 9 -19 61 4 8 18 75 29 -51 -14 -13 19 -10 -37 45 13 26 32 8 -44
6740 -44 -1 20 -18 37 -35 -16 51 -5 1 19 30 14 27 48 18 17 -1 -3 -36 21 17 -18 51 34 -16 34 30 -21 -14 20 31 6 -12
6773 -12 -26 -19 -16 -9 28 11 49 -47 13 18 -4 -10 8 -26 6 42 -15 -23 28 32 2 45 42 -15 3 -25 26 7 -35 11 21 26 -4 60 17
6808 17 9 0 2 39 -21 20 3 -16 -25 22 -48 -11 -21 -37 0 12 16 -3 -8 5 32 -36 39 -5 -14 -44 -3 58 -12 47 -25 27 -5 56
6842 56 -33 -51 3 -36 18 -22 8 18 25 65 -23 -23 12 -3 -13 -16 18 -6 3 25 1 9 19 -27 -54 2 26 -32 0 25 12 11 -47
6875 -47 -52 29 13 -31 -24 38 -10 -46 23 -17 9 -22 -13 -8 -47 4 -5 -52 14 5 -38 -10 -15 19 39 -30 -32 37 -52 23 42 39 11 0 -10
6910 -10 10 -12 24 -9 26 42 40 20 47 -24 25 19 -30 -12 -2 -22 -5 -44 -15 -67 -37 -10 5 -23 9 -9 24 49 10 29 -2
6941 -2 8 -1 15 -9 2 -47 10 -8 -15 32 9 -60 -1 -14 21 19 -9 41 -53 39 -30 -29 10 33 -24 4 -14 52 -8 4 -16 -52 -31
6974 -31 35 1 -16 45 19 3 -7 -21 28 -5 -39 36 59 1 31 5 44 12 32 39 13 59 -13 -9 45 -7 -10 -7 31 -27 -21 -21 26
7007 26 40 -26 42 -23 -3 -14 12 12 -29 21 -10 -8 7 15 -5 -26 57 24 -9 17 15 38 46 -19 20 6 59 -6 -92 -7 3 -12 3
7040 3 -15 3 1 34 33 -20 -18 18 0 -37 -34 -2 -52 9 3 -5 48 25 -13 24 5 53 14 -6 13 19 28 -23 44 -2 24 -14 -14 -9 -12 -38
7076 -38 -71 -1 -65 40 -18 -5 65 38 14 -29 42 14 12 -1 32 19 5 -43 -19 -39 24 -25 9 -9 -28 -8 3 17 6 50
7106 50 -30 54 8 5 34 44 -8 30 -13 6 15 6 46 24 -18 -38 12 17 37 -22 55 15 -10 -40 -14 -31 -16 48 59 55 8 15 -73
7139 -73 -22 27 -16 -47 -32 6 -33 -31 -7 -72 70 7 14 -66 28 -3 0 -16 -7 52 8 8 22 -22 46 -21 -17 91 -34 13 37 36
7171 36 -59 2 33 -12 10 28 -30 -9 18 -15 -20 2 36 20 4 27 -2 35 10 -29 47 29 46 -16 15 18 -32 -11 -24 27 -5
7202 -5 -31 30 33 39 29 -13 -30 18 30 -22 1 29 3 -13 -22 33 -31 46 -11 -10 -33 -1 2 -15 7 -30 53 -7 -36 72 -56 7
7234 7 53 23 -4 12 -63 -1 10 -6 -15 -1 -23 -31 0 -24 -19 48 -2 4 -16 -22 -4 20 0 -39 35 -19 -39 27 -55 7 53 28 1
7267 1 -11 31 -9 35 -13 33 13 18 -47 -10 29 51 3 35 -10 32 34 40 22 -9 -27 -24 -6 -51 -6 -14 21 12 15 1 12 27 21 5 37
7302 37 -16 1 23 -41 0 25 1 -29 -1 -21 4 52 -20 -40 -30 8 -7 6 -17 37 35 14 -2 35 26 45 23 9 -36 -11 35
7333 35 1 7 -18 -41 3 -10 30 2 46 1 4 -10 21 -27 -10 -25 -10 17 7 45 -53 -32 -17 -26 20 5 -9 -1 -4 1 -26 8 18
7366 18 30 1 19 3 -19 -4 45 -28 -17 39 -27 49 22 44 7 -29 10 -61 -20 -21 17 7 1 12 -10 23 -35 11 -49 -16 43
7397 43 30 -34 2 11 3 49 -10 11 -29 -14 -27 8 6 16 -28 -24 9 68 -47 -30 -12 8 -21 2 29 -14 3 31 -3 33 3 59
7429 59 17 -47 -42 33 -1 -60 -8 -14 -8 14 -24 12 -32 68 -22 5 35 -4 -3 3 20 28 -12 -20 -35 52 3 40 15 14 16 -35 -7 40
7463 40 -6 57 17 19 43 -6 16 41 -4 -22 36 27 65 -15 -9 -13 -4 14 -15 39 -40 31 28 -7 -36 20 -10 -24 -1 -46 26 -19 3
7496 3 -1 56 -17 9 -7 -26 3 26 14 -20 -16 -5 19 -25 -22 36 22 14 31 -50 -23 44 36 -46 -44 12 2 22 25 -28 0 27 -6 16
7530 16 14 25 8 66 34 3 41 -14 -3 27 -14 -10 -5 18 24 -42 20 33 -1 -7 -33 16 -26 -35 3 -27 4 0 1 40 73 9 14 -43 -3
7565 -3 22 4 3 5 31 16 19 22 13 -48 30 17 25 -28 -7 -16 -1 -52 0 -1 46 40 -50 -25 21 -54 -41 -21 14 69 29 26 -28 20 -7 14
7601 14 6 9 0 32 31 9 -12 28 -4 -25 16 19 8 -26 -18 36 -13 42 15 -1 -56 -14 -15 26 -6 -32 -13 15 3 -6 -30 22 -21 29
7635 29 27 -2 -16 -18 -15 -25 -10 -9 -64 -36 40 17 37 18 18 -6 -10 -20 -54 9 14 -31 -18 31 -7 42 -17 8 -7 -26 18 -13 26 7
7669 7 0 -9 62 -16 29 -1 12 38 -23 -63 -18 -59 4 2 -35 -4 -23 18 -16 35 -6 -10 2 -5 -1 -9 -12 -21 -5 9 -2 -6 7 46 -7 -14
7705 -14 8 -19 -26 25 -2 -7 56 -20 9 6 -84 60 17 15 62 -19 -19 20 30 -30 42 -3 20 10 -3 -16 25 -3 -34 -8 -19 -11 52
7738 52 10 -51 49 -34 53 -5 41 50 6 34 -21 38 -20 25 3 6 -23 -17 14 -51 5 -38 11 49 16 18 -2 -7 15 12 -56 8 -1
7771 -1 2 -4 7 12 -12 20 17 -5 23 23 -14 -2 75 23 11 56 -34 26 -8 12 -14 10 -9 13 -7 38 23 -16 -38 3 5 36 13 40
7805 40 94 -10 40 -3 -14 12 21 -7 -37 -31 -2 14 26 6 -5 9 -24 -4 -6 33 54 -15 48 23 18 -39 -10 -9 51 4 -8 32
7837 32 6 -34 11 37 -14 -5 -40 41 -4 41 67 -9 60 69 -14 20 0 -11 6 -14 24 79 11 2 11 -8 -48 -7 45 1 24 32 53
7870 53 -39 -33 9 -8 -11 14 6 -38 -1 20 21 22 48 5 25 69 -65 -5 -5 -4 52 29 22 8 -22 12 6 20 38 38 -20 -37 16 -18 17
7905 17 22 11 -22 99 2 1 19 30 26 8 51 14 -16 46 23 46 54 -9 -59 4 -12 0 18 31 -26 -13 53 14 -65 -28 20 -13
7937 -13 -26 15 30 -7 15 35 3 25 -42 43 -26 46 32 30 -13 12 13 -1 24 -37 9 43 30 20 25 4 20 29 -51 -39 -19 36
7969 36 -44 14 1 -24 10 23 -19 -26 -7 39 43 -7 -15 36 33 -27 32 36 5 -77 -39 24 11 13 21 -11 -22 20 0 -4 16 10 -13 -27 -45
8004 -45 36 14 19 -62 2 0 -4 21 37 18 64 56 19 -45 28 13 -26 14 12 28 3 25 -1 20 34 -4 19 52 26 -27 0 -31 43
8037 43 -36 9 18 -5 -3 27 -31 13 -29 33 0 34 18 35 20 20 54 -43 -28 11 -56 -13 21 -14 -5 -37 -3 71 -6 -8 -6 -8 -24 28
8071 28 11 23 11 16 5 37 1 0 76 -4 40 41 39 63 5 -24 -25 23 18 -32 15 12 -12 37 4 -23 5 -34 11 1 41 -64 -4
8104 -4 -3 -29 30 31 -7 13 -24 26 -7 -2 45 13 41 1 -58 27 4 30 -17 -12 -58 18 14 -27 -19 5 -13 31 44 -22 33 -6 9 -31
8138 -31 -2 29 -4 18 72 1 8 -10 -46 14 21 17 -2 -6 20 24 -9 -25 3 55 21 8 -13 -9 61 14 27 26 39 57 -15 39 -8 13
8172 13 -16 -26 -9 11 -17 43 -4 -13 5 6 -32 -25 23 31 28 33 2 -1 25
8191B5
$$ Imaginary data points
##PAGE= N=2
##DATA TABLE= (X++(I..I)), XYDATA
0 0 0 0 0 0 0 0 0 0 0 0 0 0 0 0 0 0 0 0 0 0 0 8 -6 8 -8 8 -8 8 -11 15 -16 16 -20 21 -25 28 -30 36 -36 44 -45 52 -58
43 -58 62 -70 76 -84 93 -103 113 -125 137 -152 167 -187 206 -230 259 -291 331 -379 441 -524 636
64 636 -800 1061 -1517 2502 -5523 34790 207094 249258 181799 59137 -99129 -228301 -235224
77 -235224 -126787 29951 172296 240745 189334 45774 -114724 -218262 -218377 -113567 40057
88 40057 171103 224281 172615 35569 -116395 -208252 -200088 -99976 43677 164773 211958
99 211958 159519 25096 -119709 -196597 -181683 -90546 46502 166141 198287 134095 17388
110 17388 -107091 -188825 -176596 -74584 55871 155151 184280 125627 7282 -109629 -175500
121 -175500 -162242 -67113 61693 151471 167353 113068 5579 -110047 -169923 -145384 -56171
132 -56171 58144 146585 162630 100304 -5590 -107338 -158575 -133036 -46939 57815 138478
143 138478 155108 92803 -13368 -106744 -148967 -123690 -39421 62683 132845 141847 84234 -15872
155 -15872 -105942 -141521 -112616 -33434 63451 129620 131735 73919 -17335 -103397 -138947 -103532
167 -103532 -21613 64969 121912 123298 65597 -22306 -99007 -130424 -98554 -17292 68838 118872
179 118872 114888 57848 -28020 -98503 -120566 -88333 -14751 68086 116573 107177 49754 -29514
191 -29514 -96437 -116838 -80366 -7845 67636 112370 101806 41802 -34326 -92667 -109439 -74442
203 -74442 -3418 67749 106823 96366 38519 -38112 -93154 -103137 -66878 767 68818 102510
215 102510 87748 33479 -37433 -91436 -99823 -60485 4926 67963 99705 82960 26973 -39933
227 -39933 -88246 -95075 -55416 9664 67661 94262 77698 23480 -41674 -85802 -90243 -52199
239 -52199 12314 69996 91442 70466 18587 -42593 -84020 -84579 -45948 13524 67876 89655
251 89655 66857 13568 -44133 -81862 -81143 -40910 17856 67117 85196 62543 9745 -45859
263 -45859 -78862 -76183 -37678 19934 67257 81585 58232 7302 -47799 -78683 -71038 -31638
275 -31638 21650 65613 78294 53366 4143 -46936 -76561 -68990 -27928 24845 65145 75160
287 75160 49347 173 -47988 -73383 -64627 -24712 26629 63958 71275 46234 -1402 -48918
299 -48918 -71955 -60683 -21601 28013 64236 68460 40744 -4258 -47649 -69495 -57524 -18140
311 -18140 28665 62206 66633 38591 -7555 -48812 -66991 -53897 -14934 30502 60514 62586
323 62586 35617 -8786 -48852 -64666 -50525 -13169 31106 60506 60203 31700 -10915 -48654
335 -48654 -62928 -46680 -9484 31224 58086 57626 29268 -12531 -47992 -61030 -44826 -6759
347 -6759 33285 56801 54225 26153 -14681 -47785 -57809 -41314 -5455 33559 55953 51490 23485
360 23485 -15654 -47998 -56791 -37922 -2232 33939 54382 48745 20051 -17064 -46192 -54270 -36176
373 -36176 -498 34650 53146 46740 17821 -19380 -46320 -51338 -32928 1379 35041 51348
385 51348 43417 15830 -19380 -45918 -49928 -30244 3125 35225 50703 41214 12554 -20989 -44669
398 -44669 -47452 -27565 4917 34525 48403 39591 11177 -22279 -44296 -45577 -25490 6903 35612
411 35612 46684 36110 9134 -22501 -43506 -43309 -23007 7685 35222 45855 34242 6864
423 6864 -23280 -42849 -41750 -20336 10062 34909 43525 31846 5157 -23621 -41479 -39942 -19070
436 -19070 11240 35354 42249 29787 3231 -25094 -40701 -36874 -16520 11569 34763 41023 27481
449 27481 1637 -24844 -40074 -35866 -14357 13337 34556 39468 25406 -701 -25555 -38229
461 -38229 -33395 -12851 13965 33945 37952 24023 -1643 -26445 -38080 -31302 -10228 15396 33471
474 33471 35723 21403 -2643 -25970 -37013 -29901 -8780 16007 33221 34733 19650 -4504 -26295
487 -26295 -35677 -28058 -6892 16901 32124 32801 18221 -5394 -26363 -34384 -26458 -6174 17587
500 17587 32681 31395 15537 -6837 -25975 -33044 -24384 -4419 17426 31407 30429 14629 -7821
513 -7821 -26244 -32314 -22793 -2628 18424 30601 28441 12880 -8768 -25869 -30712 -21315 -1811
526 -1811 18586 30031 27291 11706 -9776 -26508 -29765 -19053 -144 18719 29065 25561 10032
539 10032 -10014 -25517 -29053 -18349 1034 19379 28483 24267 8471 -11188 -25136 -27319 -16830
552 -16830 1811 19586 27655 22677 7426 -11331 -24975 -26638 -15498 2872 19908 27158 21279
565 21279 5575 -12144 -24242 -25074 -14080 3431 19407 26456 20634 4710 -13021 -24234 -24078
578 -24078 -12591 4846 19570 24943 18942 3980 -13111 -23715 -22883 -11487 5162 19728 24727
591 24727 17756 2588 -13679 -23422 -21827 -9806 6352 19256 23418 16466 1913 -13601 -22901
604 -22901 -21245 -9077 7251 19725 22672 15088 546 -14181 -21979 -19552 -8081 7451 19455
617 19455 21950 14129 -81 -14433 -21962 -18748 -6646 8249 19208 21050 12790 -1256 -14405
630 -14405 -20925 -17752 -5973 8573 18986 20478 12209 -2157 -15197 -20571 -16264 -4674 9076
643 9076 18644 19209 10943 -2402 -14832 -20239 -15703 -3759 9558 18460 18616 9767 -3487 -15037
657 -15037 -19389 -14486 -2785 9845 17804 17662 9106 -3945 -15059 -18902 -13755 -2034 10598 17879
671 17879 16529 7800 -4507 -14878 -18068 -12560 -1499 10389 17594 16266 6965 -5375 -14821 -17526
685 -17526 -11782 -358 10944 16883 15092 6207 -5689 -14664 -16691 -10996 -122 11105 16894 14411
699 14411 5281 -6363 -14896 -16085 -9671 844 10938 16064 13528 4668 -6431 -14725 -15781 -9116
713 -9116 1601 11283 15830 12834 3574 -7270 -14177 -14595 -8420 1934 11336 15204 12060 3355 -7363
728 -7363 -14460 -14321 -7384 2653 11496 14852 10985 2067 -7307 -13676 -13708 -7027 3030 11498 14527
743 14527 10531 1531 -8078 -13677 -12886 -5990 3670 11377 13659 9778 1229 -8069 -13379 -12248 -5513
758 -5513 3824 11596 13637 8962 267 -8304 -13010 -11509 -4592 4188 11096 12996 8619 -18 -8475
773 -8475 -12838 -11159 -4104 4896 11295 12273 7717 -565 -8511 -12388 -10401 -3665 4903 11180 12025 7149
789 7149 -930 -8718 -12372 -9884 -2704 5464 10871 11314 6429 -1375 -8499 -11733 -9545 -2508 5698
804 5698 11006 11088 5920 -2060 -8821 -11323 -8493 -1906 5689 10708 10470 5372 -2184 -8805 -11237 -8181
820 -8181 -1373 6083 10634 10071 4595 -2857 -8764 -10599 -7504 -926 5991 10191 9722 4538 -3035 -9065
836 -9065 -10480 -6883 -248 6490 9947 8825 3707 -3129 -8683 -10047 -6507 -71 6493 9961 8638
851 8638 3186 -3698 -8733 -9688 -5916 543 6595 9456 8028 2787 -3751 -8465 -9261 -5722 779 6919
867 6919 9536 7455 2095 -4188 -8533 -8661 -4822 1022 6558 9180 7308 1812 -4355 -8436 -8519 -4473
883 -4473 1548 6811 8815 6673 1305 -4563 -8146 -7825 -4094 1680 6739 8591 6422 1145 -4851
898 -4851 -8317 -7596 -3431 2249 6772 8177 5667 667 -4624 -7972 -7489 -3242 2422 6907 8047 5382
914 5382 102 -4996 -7717 -6902 -2823 2699 6739 7605 4956 15 -5013 -7632 -6633 -2469 2866 6915
930 6915 7495 4384 -571 -5126 -7239 -6040 -2129 2849 6613 7267 4346 -743 -5365 -7279 -5739 -1557
946 -1557 3257 6460 6746 3845 -978 -5315 -6935 -5478 -1452 3356 6551 6512 3450 -1192 -5384 -6991
962 -6991 -5074 -803 3579 6269 6131 3144 -1354 -5180 -6670 -5014 -694 3869 6422 5917 2678 -1812
978 -1812 -5255 -6233 -4430 -519 3757 6201 5713 2405 -1924 -5329 -6222 -4152 -115 3891 6151 5344
994 5344 1937 -2237 -5255 -5805 -3795 64 3867 5928 5257 1910 -2444 -5447 -5726 -3338 490 4038
1010 4038 5639 4675 1663 -2241 -5221 -5615 -3195 679 4168 5641 4559 1236 -2623 -5178 -5203 -2879
1026 -2879 942 4090 5332 4203 1067 -2691 -5156 -5158 -2775 1076 4380 5379 3719 637 -2839 -4938
1042 -4938 -4673 -2365 1070 4136 5242 3819 463 -3069 -4975 -4561 -2031 1447 4237 5001 3422 197
1058 197 -3050 -4734 -4334 -1857 1480 4235 4907 3320 80 -3263 -4903 -4030 -1421 1703 4053 4525
1074 4525 2956 -78 -3142 -4679 -4078 -1436 2003 4270 4439 2630 -406 -3197 -4399 -3647 -1196 1953
1090 1953 4098 4317 2491 -554 -3295 -4409 -3441 -985 2155 4189 4080 2089 -764 -3198 -4146 -3243
1106 -3243 -795 2078 3976 4086 2058 -1041 -3419 -4113 -2965 -434 2239 3849 3682 1815 -978 -3350
1122 -3350 -4038 -2851 -403 2383 3955 3540 1545 -1168 -3374 -3877 -2526 -80 2371 3727 3356 1443
1138 1443 -1200 -3251 -3871 -2490 87 2597 3766 3119 1153 -1384 -3221 -3508 -2207 72 2434 3645
1154 3645 3099 1008 -1536 -3302 -3517 -1987 394 2528 3531 2806 768 -1614 -3155 -3354 -1918 391
1170 391 2531 3514 2754 638 -1822 -3257 -3125 -1600 636 2563 3241 2513 619 -1664 -3179 -3126 -1542
1187 -1542 786 2651 3270 2394 267 -1824 -3015 -2858 -1352 825 2573 3131 2201 230 -1869 -3064
1203 -3064 -2880 -1208 1032 2721 2997 1952 22 -1900 -2966 -2568 -1083 947 2642 3029 1924 -115
1219 -115 -2069 -2915 -2481 -834 1198 2551 2761 1716 -212 -1969 -2766 -2393 -805 1244 2647 2747 1570
1236 1570 -366 -2151 -2774 -2084 -516 1290 2444 2543 1439 -408 -2039 -2796 -2143 -421 1507 2594
1252 2594 2454 1078 -648 -2073 -2509 -1879 -334 1478 2519 2421 1166 -636 -2192 -2572 -1742 -113 1547
1269 1547 2521 2178 917 -712 -2021 -2398 -1717 -135 1551 2456 2206 856 -972 -2190 -2355 -1374 85
1286 85 1548 2234 1989 721 -901 -2131 -2312 -1439 165 1675 2323 1927 534 -1015 -2030 -2089 -1206 263
1304 263 1559 2259 1816 539 -1043 -2152 -2132 -1178 443 1770 2173 1619 339 -1161 -1912 -1964 -1094 378
1322 378 1651 2181 1637 272 -1176 -2087 -1857 -857 513 1677 2041 1458 118 -1150 -1955 -1907 -881
1339 -881 553 1751 2023 1300 23 -1286 -1926 -1614 -611 661 1666 1894 1263 14 -1179 -1910 -1653
1356 -1653 -610 788 1733 1848 1099 -184 -1294 -1798 -1565 -571 725 1652 1826 1103 -242 -1397 -1894
1373 -1894 -1487 -354 985 1695 1654 891 -245 -1304 -1749 -1350 -324 887 1698 1694 830 -357 -1372 -1686
1391 -1686 -1262 -184 973 1586 1511 756 -300 -1326 -1625 -1254 -160 970 1655 1480 609 -513 -1374 -1570
1409 -1570 -1111 -50 918 1547 1409 586 -500 -1383 -1604 -1030 11 1068 1547 1294 427 -560 -1279 -1460
1427 -1460 -955 34 1029 1537 1279 436 -648 -1378 -1413 -817 198 1053 1476 1142 329 -622 -1330 -1452 -842
1446 -842 177 1092 1496 1157 213 -786 -1311 -1324 -686 228 1087 1322 1055 226 -706 -1361 -1325 -612 324 1185
1466 1185 1337 924 56 -755 -1231 -1173 -514 344 1087 1375 975 74 -797 -1300 -1127 -455 456 1123 1267 812
1486 812 10 -818 -1243 -1066 -448 416 1173 1220 743 -61 -829 -1256 -1059 -334 521 1108 1153 676 -57 -833 -1168
1507 -1168 -1037 -290 557 1105 1169 608 -185 -873 -1154 -898 -236 534 1095 1128 650 -137 -892 -1116 -906 -127
1527 -127 581 1109 1039 461 -222 -829 -1041 -735 -197 565 1056 997 492 -275 -898 -1098 -716 -52 626 1017 934
1548 934 386 -320 -867 -1047 -711 -29 686 1073 862 317 -374 -906 -1009 -596 58 740 955 851 353 -301
1568 -301 -862 -952 -633 77 773 986 695 191 -418 -845 -892 -536 53 661 998 732 209 -507 -908 -892 -451
1589 -451 188 680 878 696 99 -417 -848 -787 -415 184 773 969 715 100 -578 -854 -770 -362 206 670 850
1610 850 631 125 -522 -858 -739 -353 345 742 846 518 -14 -550 -798 -688 -262 253 717 876 556 31
1630 31 -580 -879 -696 -241 367 697 746 440 -66 -526 -774 -657 -150 333 753 833 447 -117 -593 -741 -632
1651 -632 -164 437 699 630 402 -126 -578 -721 -635 -120 352 769 713 311 -137 -609 -729 -503 -60 332 612
1672 612 665 378 -135 -615 -767 -530 -8 489 702 589 253 -176 -554 -666 -408 -28 460 706 593 278
1692 278 -235 -612 -697 -458 41 461 688 555 135 -237 -535 -616 -447 -5 489 732 560 167 -323 -602 -601
1713 -601 -325 53 442 624 511 198 -217 -531 -607 -381 115 487 670 539 28 -249 -584 -559 -257 130 495
1734 495 584 481 126 -316 -551 -575 -226 179 504 542 382 -35 -313 -585 -499 -274 151 513 581 375 -77 -361
1756 -361 -618 -524 -154 155 516 550 319 36 -308 -528 -482 -220 198 531 557 355 -33 -396 -532 -462 -100 208
1778 208 494 512 315 -14 -352 -597 -400 -76 272 451 441 278 -92 -392 -484 -434 -101 272 487 445 272 -37
1800 -37 -404 -551 -410 34 371 508 361 266 -100 -366 -511 -389 -79 295 497 485 215 -176 -397 -440 -262
1821 -262 2 283 394 348 155 -122 -394 -478 -303 17 332 493 366 79 -190 -416 -420 -255 -21 269 418
1842 418 393 139 -219 -396 -468 -289 108 316 463 304 112 -166 -410 -384 -278 55 374 403 341 96 -241 -402
1864 -402 -391 -206 170 351 401 275 78 -211 -356 -411 -206 96 354 433 272 50 -229 -321 -340 -150 90 303
1886 303 393 253 26 -231 -361 -377 -61 140 388 392 198 -5 -300 -323 -263 -82 144 331 419 232 -6 -286
1908 -286 -401 -262 -86 178 302 293 164 -9 -254 -285 -287 -153 169 389 364 234 -66 -295 -365 -304 -39 234 317
1931 317 285 195 -65 -179 -370 -267 -65 222 373 328 184 -99 -288 -257 -197 -9 174 316 310 168 -130 -297
1953 -297 -407 -179 -8 231 294 269 109 -153 -231 -324 -224 -24 200 349 274 95 -182 -349 -365 -163 31 223
1975 223 286 237 74 -76 -253 -332 -145 20 237 366 326 16 -137 -242 -285 -144 43 173 248 276 60 -192
1997 -192 -290 -288 -198 77 197 273 192 -39 -138 -242 -261 -150 66 245 272 216 4 -211 -263 -243 -119 95 237 264
2021 264 157 25 -167 -220 -280 -114 105 210 279 171 -4 -182 -288 -193 -80 38 235 203 179 -23 -149 -296
2043 -296 -265 -75 131 223 265 63 -51 -222 -279 -166 -82 75 203 237 152 -40 -197 -178 -131 -36 161 242 254 143
2067 143 -35 -126 -245 -186 -78 119 198 215 159 -64 -170 -259 -140 37 106 172 176 94 -44 -179 -260 -157 -16 147
2091 147 194 206 61 -96 -154 -173 -122 -6 151 200 182 99 -49 -171 -230 -91 1 161 214 157 83 -77 -174 -145 -160
2116 -160 2 110 221 184 62 -87 -196 -167 -90 73 174 175 181 34 -7 -120 -176 -139 -30 142 164 140 61 -87
2140 -87 -173 -144 -51 89 152 167 133 65 -88 -157 -173 -80 116 146 228 164 -26 -124 -146 -144 -64 60 166 214 162 68 -102
2167 -102 -205 -157 -45 70 113 182 127 -22 -50 -173 -132 -90 44 200 158 136 -4 -159 -157 -117 -3 80 187 122 51
2192 51 7 -72 -95 -147 -8 97 230 163 45 -1 -171 -127 -111 -14 72 106 152 99 10 -126 -194 -148 -39 65 107 93
2218 93 41 -100 -151 -180 -102 22 120 163 203 67 -15 -201 -211 -117 57 88 93 89 50 -40 -70 -93 -39 12 103 174 146 53 -32
2247 -32 -123 -104 -19 -6 67 69 145 66 -39 -165 -169 -96 -19 94 132 102 22 -38 -123 -133 -52 12 51 113 177 33 -66 -121 -134
2276 -134 -42 74 91 139 117 34 -51 -114 -59 -86 -7 51 109 131 7 -129 -153 -80 -7 24 84 79 106 -48 -67 -123 -115 -48 55
2305 55 117 144 97 -49 -118 -92 -76 -55 36 34 121 114 15 -63 -97 -84 -27 61 106 146 59 -25 -85 -102 -54 -43 -28 64 96 60 9
2336 9 -89 -145 -103 2 53 140 71 34 -21 -81 -153 -122 -31 67 63 114 12 -31 -113 -92 -34 50 41 113 119 50 5 -46 -47 -71 -11 78
2368 78 139 54 30 -54 -67 -57 -76 -10 -4 82 92 55 -40 -137 -85 -77 -24 63 149 102 29 -70 -74 -89 -10 13 55 80 68 43 -31 -92
2400 -92 -67 -36 29 85 82 86 24 -15 -89 -70 -88 -49 64 60 56 25 -43 -120 -88 -51 12 59 76 4 16 -14 -86 -61 -78 37 71
2431 71 135 32 17 -25 -61 -47 -42 -5 145 88 101 -21 -37 -59 -36 -3 37 83 92 74 -31 -75 -102 -111 -8 -11 64 29 70 -6
2461 -6 -103 -26 -91 -32 -17 62 78 57 6 -26 -86 -124 -40 111 80 68 14 -78 -50 -91 -43 -43 13 65 131 95 -5 -25 -42 -43 -9
2492 -9 107 22 79 99 -62 -43 -51 -65 -31 -12 -10 22 99 -28 -37 -99 -27 -48 -2 4 -20 14 -6 -35 -62 -25 -24 68 47 71 58 -40
2524 -40 -89 -6 -10 19 39 30 15 33 -33 -47 -66 -48 25 62 59 16 10 -47 -39 -43 -49 -61 5 48 68 20 -52 -60 -76 -85 -6 35 76 41 38
2559 38 0 -12 -43 -49 56 49 89 74 -22 17 -42 -19 -42 2 36 40 58 18 13 -53 -48 -112 14 61 86 57 39 -50 -78 -79 -56 34
2591 34 -10 60 2 -7 -41 -70 -21 -15 71 46 39 -5 -24 -55 -35 -71 6 54 51 147 86 -4 -76 -98 -25 -10 5 25 71 -15 -7 -76 -67
2624 -67 -34 -78 1 38 40 -4 -19 -60 -84 -41 -29 5 69 24 -34 4 -43 -73 -15 -37 44 47 56 -14 -69 -46 -26 2 15 23 12 85
2656 85 9 -32 -43 -24 -18 14 24 24 30 51 -22 -55 -95 -10 -46 40 54 36 17 -78 -23 -49 48 25 14 0 59 -20 -17 -25 -5 -34 21
2689 21 68 24 13 37 -31 -116 -52 -31 36 52 58 41 -20 -43 -43 14 -28 -7 62 -2 37 11 -18 -42 -22 -29 -90 23 29 2 -23 -28
2721 -28 -56 -69 13 -14 22 58 -11 24 -4 -26 -18 -32 26 50 83 -5 7 -40 -3 -51 -14 42 62 28 58 -8 -50 -42 -34 -11 2 50
2753 50 46 -14 -19 -15 -59 -21 21 -21 50 47 -20 -28 -43 -24 4 -14 13 -2 -22 3 10 -10 7 35 45 11 42 54 -21 10 -19 -17 -28 17
2787 17 45 8 13 17 -33 -23 -30 -26 -32 58 38 0 24 -3 -30 -5 -10 -3 34 20 -1 37 -19 -54 -62 -18 1 59 10 27 3 39 -11 -55
2821 -55 -58 23 -8 -5 50 2 -31 -64 11 -6 33 42 41 -35 -63 -8 -49 -45 -37 -1 15 7 72 -68 -82 -76 -76 -7 4 12 38 22 20 6 -73
2856 -73 -15 -35 -5 -48 10 50 11 -37 18 -6 71 53 -43 -9 3 16 -52 -45 -7 39 27 14 4 23 -81 -23 -65 -66 54 -43
2886 -43 -14 31 20 32 -13 -39 -15 -18 25 4 65 -17 39 25 -21 14 -15 17 26 51 17 18 -21 -25 -17 -61 51 33 46 -5 -38 -38 27
2919 27 -50 13 5 -5 -21 21 27 -16 -29 -2 -8 -4 -20 70 -41 -19 -43 -6 6 3 16 42 -17 53 -1 1 -33 -70 -14 27 76 12 -35
2952 -35 -30 11 37 91 0 22 -10 58 24 32 -13 -8 -73 5 -26 -22 16 -19 -51 -16 19 -84 -24 7 31 36 -62 0 -43 -10 -39 22
2984 22 42 32 5 -4 1 27 -9 1 0 -8 -18 31 70 3 -27 -17 11 8 30 -59 31 10 -8 -71 -36 -106 -34 32 -16 20 0 -24 -27
3017 -27 32 9 2 67 18 15 49 -68 -55 -33 -40 -13 24 1 63 16 -71 18 -9 -28 -26 22 22 40 -17 -20 17 27 10 -11 -8 -25 13
3050 13 -35 11 0 -13 -8 -6 -4 27 7 -34 -76 -11 -1 58 -7 -13 21 37 30 30 1 1 48 26 3 44 7 42 20 -16 -10 -20 -38 -50
3084 -50 -11 -8 -24 -44 4 -5 25 30 -3 12 45 36 -37 -12 -10 36 -33 -29 64 -38 -58 17 23 19 63 2 -26 9 9 10 20 -14 -42 43 -5
3119 -5 -44 3 8 15 -57 5 31 -31 -35 15 18 -8 -23 -13 -43 -9 -18 39 -9 3 35 -3 -48 -9 -23 -45 13 -7 16 -22 -14 -22 4 15
3153 15 40 31 55 30 -6 -22 -8 30 83 21 13 13 -28 14 -40 1 -27 -14 29 2 -13 -36 -1 -36 -55 -56 -31 40 8 4 -24 76
3185 76 -33 27 15 -25 15 29 42 27 16 17 -30 -22 -35 22 -4 30 -15 11 61 51 9 28 38 9 82 31 -4 -15 3 1 4 -5
3217 -5 -54 -10 -29 23 -32 -15 -15 -7 -2 -31 -2 -6 1 -24 26 26 26 11 29 -15 -4 58 -2 -52 5 32 -26 7 6 63 6 32 -64 -39 -36
3252 -36 16 -24 3 26 -56 -17 -20 19 -28 -43 -50 -5 -20 -6 -2 -7 -21 -49 -1 18 10 30 24 -30 28 39 -11 32 -28 37 6 23 21 8
3286 8 -6 -12 38 73 -35 -58 -23 -20 25 -40 15 -32 37 -13 8 29 4 -8 -57 -12 17 -17 29 -17 28 11 -23 20 5 22 -12
3317 -12 -17 10 6 -19 3 -9 24 33 16 -17 16 -25 -25 20 -55 57 26 19 -9 -23 -26 -23 -5 26 2 -23 -27 -7 9 -25 -17 3 -46 -72
3351 -72 -7 -4 63 -31 -29 -10 3 -28 29 9 -14 19 14 -32 29 15 -32 -5 32 2 14 -13 10 12 -8 25 26 -7 -33 43 -30 -56 -15
3384 -15 26 -32 -24 11 8 22 58 -3 -39 -5 -6 6 -42 12 -2 2 21 7 42 -16 -42 49 -1 -11 -6 58 58 -12 39 -40 24 -39 -31 2
3418 2 -27 41 -16 20 1 -32 -24 20 -42 40 6 -32 -29 22 3 -17 9 -1 8 -39 43 -31 21 -4 17 23 -53 34 -13 -7 -5 37 2 -16
3452 -16 19 -26 21 -53 -38 11 40 -67 -54 70 8 6 3 -37 7 28 15 16 46 -8 -14 9 35 24 20 -1 -28 54 8 -22 51 -11
3484 -11 -9 -22 -27 -18 7 -13 -9 -14 -2 3 44 17 11 29 44 0 24 -66 -3 30 -5 13 26 -38 -13 -30 -15 12 -27 -1 4 -56 9 6 1
3519 1 12 10 30 -54 6 -22 -9 16 -10 4 -24 17 49 -48 33 26 -21 5 -1 13 19 -29 42 -8 -12 -10 7 17 -30 -21 36 -33 18 34
3553 34 -32 -40 -2 2 -43 -38 15 -45 1 -54 -4 26 36 3 -67 65 41 13 27 23 30 -19 -21 -16 28 36 0 3 0 39 21 34 -22 -15 16
3588 16 21 6 32 -60 34 0 -26 15 -50 6 -50 -7 -31 24 25 13 19 -46 -21 22 9 18 29 -63 49 53 -1 41 -14 1 -22 34
3620 34 35 -24 22 34 24 -30 -17 -37 47 -49 -44 36 -29 -76 -17 -53 -7 5 -7 60 2 3 -15 45 -2 3 15 39 -24 -14 60 -3
3652 -3 -24 -38 11 7 -7 20 -12 33 13 29 -16 24 -8 56 -18 57 27 -19 -33 10 34 15 -15 -10 9 -13 40 -79 -15 -2 -29
3683 -29 22 -7 29 -48 -11 36 9 -23 -57 4 1 7 -29 45 12 39 27 15 5 22 5 12 9 -7 9 6 42 -1 15 5 -9 -10 42
3716 42 22 -43 16 3 49 -19 -20 -56 36 17 8 -47 6 26 22 -15 -28 47 -13 19 20 -36 62 29 52 13 -15 22 2 46 -12 -10 50
3749 50 44 36 -22 -31 33 -32 -13 11 40 9 -58 -40 9 58 2 24 -30 16 22 13 18 -12 -17 -51 -12 -17 -50 -18 46 -13 33 50 26 -6
3783 -6 -6 55 13 50 20 73 47 35 34 20 -14 0 39 2 -27 12 -13 5 -17 -9 6 -28 -7 -20 -31 -35 -9 11 3 -13 2 45 4
3816 4 -1 26 -30 -15 -29 51 5 -6 -5 -14 -14 -7 23 15 20 17 25 -7 -11 28 3 47 -15 -43 -16 35 -42 -16 22 35 -21 11 -42 -16 -22 -48
3852 -48 53 17 -33 24 22 2 -3 26 -47 56 28 -2 25 26 7 39 -3 -26 7 52 -11 -28 -3 40 -19 -12 -45 72 -5 13 5
3883 5 -65 -51 67 14 17 6 -20 18 -6 -23 19 -14 -68 20 -30 0 -4 -8 37 -17 -4 31 -8 12 26 53 24 -1 -4 47 10 -33
3915 -33 -26 -40 -41 -7 -34 -50 -63 -39 -18 -26 -19 46 -22 1 -7 -6 23 34 0 16 -22 -27 -69 -15 -39 -32 51 -36 -4 -18 -4 -8 0 -64 11
3950 11 -31 2 34 -2 38 37 15 60 -12 -2 16 52 43 49 -28 -35 -9 -4 -9 42 -37 -74 -7 -24 27 -12 44 -10 -40 -43 2 -8 42 -12
3984 -12 -4 16 17 5 11 43 58 -50 4 67 52 -8 -8 -44 49 24 -27 0 -20 14 23 29 -43 6 22 -38 0 -3 27 -47 -14 28 20 -55
4018 -55 -43 42 37 -18 16 -34 7 11 -32 -9 -18 -45 31 3 9 16 12 2 -19 25 50 13 11 14 -16 21 -52 -6 -10 -15 8 -16 -9 -26 -10 14
4054 14 -7 0 38 -33 29 -46 11 -9 13 38 -6 -24 -16 -7 6 -18 -8 10 -21 19 -33 35 -6 -8 -15 34 5 -6 -9 -18 -8 -96 13
4087 13 28 39 -12 21 -21 19 -47 -25 37 -5 17 -4 -14 -49 5 -30 44 15 5 -32 -16 -32 25 18 42 -17 -13 18 -15 49 39
4118 39 29 -28 1 48 -12 6 36 -2 0 -11 -12 17 -22 -51 -46 -11 54 -11 -31 -23 -57 -39 -30 -12 -37 -33 -19 -26 -4 32 -19 59 -14 15
4152 15 -45 11 -47 -58 35 39 32 -9 54 2 33 15 42 -1 -39 16 -27 42 25 -30 -19 50 -4 30 9 -43 -2 -37 0 -27 15
4183 15 -10 -17 -13 -12 32 28 33 -7 -22 -64 34 26 0 7 -36 29 -4 -9 -14 69 -11 35 -7 -18 13 26 8 1 -19 11 7 17 49 40 17 31
4219 31 -24 -35 -23 -22 -79 -39 10 -28 63 -32 -27 22 44 -63 5 -16 53 57 9 25 42 9 18 7 26 34 23 26 -7 33 -1 -6 41
4252 41 9 -9 7 -8 -22 -24 -38 -26 -6 27 -25 -39 15 6 -36 -45 -14 15 -48 -3 -2 -29 -39 -69 -41 38 44 27 -15 53 49 42 26 -7
4286 -7 39 29 3 7 46 3 -9 27 20 -26 62 -32 94 10 52 -20 47 24 -10 -8 1 28 -78 10 -52 -8 -57 -21 17 -7 -10 18
4318 18 -45 -13 11 19 9 18 -16 4 23 -8 -41 40 29 22 42 -9 -43 4 -1 24 29 15 40 47 -23 10 12 45 -31 -48 -9 -70 -40 -18
4352 -18 15 -48 0 20 23 17 -4 -30 8 -16 -19 40 1 83 37 -35 14 3 3 18 -13 20 49 42 -36 82 -45 9 26 -31 -23 18
4384 18 28 6 25 13 22 -22 -16 -12 -39 -2 9 29 2 7 10 -10 -27 -51 -30 33 51 16 12 -5 -5 31 39 -50 20 13 -8 47 26 66 -2
4419 -2 -61 -5 25 -29 54 -25 -19 -1 -3 16 13 -20 15 -31 34 -40 54 -43 -63 -19 13 -16 3 34 5 -15 3 31 -13 0 48 -17
4451 -17 1 -6 13 -40 -37 9 -12 7 26 -2 -22 27 39 27 -9 1 14 10 -51 -73 45 12 32 9 1 3 13 45 -4 -8 2 -55 -14
4484 -14 4 17 -9 36 23 3 -12 -1 38 -13 17 18 10 34 29 -10 23 -47 33 3 60 -6 -39 -18 27 1 39 -8 -38 -19 -32 -43
4516 -43 -6 -10 -41 11 -16 3 -1 -42 1 -36 -25 3 44 46 -10 27 58 67 -59 23 2 -16 65 16 10 32 24 -31 12 -27 6 16 39
4549 39 41 21 10 15 9 -29 48 -24 22 18 0 -21 -34 34 -8 -13 13 -5 -35 -56 23 -40 -2 7 10 8 19 31 -44 10 -33 -34 33 10 53
4584 53 16 8 60 26 16 6 -33 -24 17 -34 -7 -8 -28 -40 -70 -52 3 -18 15 -16 8 -40 28 5 -35 -14 20 -14 0 14 0 39
4616 39 -24 32 29 -27 10 21 4 -23 13 31 6 -8 22 6 -12 -6 54 21 -23 -8 -11 13 0 3 -13 -24 -87 22 26 49 -27 60
4648 60 38 25 -2 4 31 39 30 -18 -18 -25 -18 12 -7 -4 -3 38 -11 4 12 -50 4 14 -42 15 35 -11 -13 -8 22 35 7 30 -68 45 52 45
4684 45 -37 -22 -28 10 -18 27 52 -26 -20 -1 31 -19 11 -13 26 14 20 57 2 30 -44 52 12 2 16 32 10 -9 -44 -4 -1 -53
4716 -53 10 -21 3 -78 0 -17 -37 -6 -36 27 -2 11 6 -59 8 -49 -4 -7 -13 8 -8 -54 -6 16 33 -36 -55 36 -12 17 27 -10
4748 -10 37 49 16 36 -13 -26 39 -21 15 -8 46 -24 -27 -39 -31 17 -46 28 -45 7 -39 14 -22 -1 -19 35 -31 2 -63 -2 31
4779 31 17 41 -25 -7 -28 61 -10 20 14 23 44 13 -11 -5 29 -15 15 -22 -16 -2 0 22 19 12 -6 10 8 -10 -68 20 -4 28 -28 -22 -62
4814 -62 -59 -5 -38 -46 -3 -6 8 6 5 0 -49 3 -30 23 -32 9 -37 -6 21 9 -57 13 -15 5 27 38 25 61 -2 40 35 -12 35 12
4848 12 -43 -66 -4 14 -23 -13 23 -36 -23 -22 -43 -13 17 1 -32 -12 20 -20 -4 16 13 13 16 -44 -53 -16 26 43 -15 -19 28 -11 25
4881 25 -50 -8 -17 22 57 24 -41 -28 38 15 -52 -29 7 16 1 -14 -68 43 -29 2 -19 52 -39 -11 -18 2 43 5 -3 -35 37 26
4913 26 -16 19 20 8 13 71 18 -28 -8 5 57 28 1 4 6 -11 52 12 18 -12 -24 -9 -11 -20 -4 -3 1 14 -55 -82 10 -45 9 19 -3
4948 -3 16 3 56 3 -33 30 5 16 3 2 -63 72 23 27 5 30 5 -51 49 -17 -38 -54 -23 -27 -44 -59 -82 -11 6 29 -18
4979 -18 16 -57 29 -6 -1 -23 1 15 15 -30 -5 -37 8 19 6 25 24 8 -52 58 -17 8 -46 -25 4 -28 -30 36 20 7 8 -15
5011 -15 -1 -18 36 -17 10 -4 12 10 1 7 19 -44 -38 -57 -52 -41 5 48 -20 8 -79 -13 -22 17 8 -16 17 7 -24 19 2 18 59 23
5045 23 -36 -8 -7 22 -12 57 -12 -11 24 18 -16 -23 5 -27 -5 -19 11 -29 -29 19 -46 -74 -17 -55 10 -65 6 -4 23 21 27 0 45 4
5079 4 35 6 1 4 20 16 -23 47 27 23 -11 28 5 0 -1 -14 -28 -20 24 28 -25 2 -5 -3 19 15 -41 6 6 -13 8 -59 4 -8 3 -15 -8
5116 -8 23 -19 63 5 -16 -10 -5 -51 42 27 17 -34 -16 -23 53 21 -29 22 -20 7 -57 48 -26 -36 59 -45 1 -9 -10 26 -20 -40
5148 -40 -30 32 -26 11 10 35 34 -25 19 34 4 9 2 -2 44 61 32 -24 70 11 -20 -33 24 14 -34 15 34 69 9 57 -26 -16 11
5181 11 4 -33 -11 -2 -21 -3 -10 -21 -24 -11 9 -18 -65 35 10 5 -11 3 0 -3 -20 0 -18 -22 -7 20 -32 17 -11 44 37 10 28 -36
5215 -36 17 21 57 6 66 -26 7 -29 13 24 29 -8 -26 30 1 -3 -36 17 -11 -20 -20 -12 -56 45 -31 8 -29 -27 40 51 -1 -36 35
5248 35 22 -25 17 45 60 -23 17 -38 -32 19 4 -27 -20 -28 33 53 19 12 -43 -19 -1 -40 33 -20 -25 -15 3 19 5 -14 -25 15 34
5281 34 13 2 6 -6 -6 -40 -49 35 19 -3 -2 41 40 -12 18 6 33 45 59 29 -14 -36 18 -6 23 62 11 -8 -22 5 27 -14 -52
5314 -52 -13 2 4 36 -11 -3 12 40 2 -15 -14 10 32 -35 -31 -29 -31 41 -23 -3 -10 38 -33 28 1 14 21 67 -3 -15 -18 13 11 -27 18
5349 18 44 13 31 5 7 -12 -17 2 -3 29 -73 -29 -4 -19 17 4 -59 -27 -28 -34 -39 -32 -16 -9 37 17 -7 -9 10 -21 24 -9 34 42 -56
5384 -56 50 9 47 25 -3 16 30 36 -21 13 -21 -6 -23 3 -24 -27 -16 11 -46 2 9 -12 12 46 6 -49 -35 -24 27 -32 21
5415 21 25 -34 0 11 3 -12 62 -3 2 15 -4 -11 -42 17 26 -36 10 -22 64 32 -51 37 -15 -25 -24 -9 -5 -93 -58 -13 -20 -21 -5 -12 -19 26
5451 26 -7 53 -2 -22 26 36 -47 -23 -38 4 23 -22 -57 -33 25 26 25 31 -17 12 -12 -10 14 26 33 53 -10 -105 -59 -10 -18 18 5
5484 5 -21 -20 -2 -30 44 -21 36 28 -2 -25 54 -38 52 19 -54 29 16 34 38 1 8 21 -21 -17 -41 20 16 -52 -26 52 17 37 34 -12
5518 -12 21 4 -30 -18 5 -52 -19 -7 -8 -26 -29 -32 -59 -10 -22 -43 -36 35 -41 9 28 -7 -13 21 -44 -4 -9 -1 -12 30 4 -16 41 -28
5552 -28 0 -21 32 27 24 -37 71 16 8 -23 15 24 5 22 -23 -6 17 -27 -3 -7 -12 8 27 -3 31 4 -4 -9 -2 -10 31 -29 -28 33 -15
5587 -15 66 25 -16 14 35 28 -12 74 -49 -37 28 -18 -12 -34 -9 -15 -2 25 34 27 34 8 -5 -46 -22 13 34 0 -38 -34 -18 5 11 -51
5621 -51 -24 -20 -52 32 -15 8 -14 13 -7 -33 -14 -8 5 -44 -6 -21 44 4 -10 -45 19 18 -23 -32 -48 78 -11 0 9 -33 59 19
5653 19 25 -27 -2 -27 3 -3 17 62 17 35 31 32 -30 46 30 16 3 3 -38 -22 8 61 6 -10 -26 53 28 -6 30 -36 25 -35 16
5686 16 -2 16 0 -35 -7 -1 -6 -18 43 -18 5 -29 -22 11 54 8 29 -30 11 -5 -9 23 -36 -39 3 -5 40 -1 1 18 70 -17 19 47
5720 47 -9 -11 -28 -6 -6 18 1 14 -23 -12 4 5 -52 20 7 3 -29 15 43 19 -25 8 -12 -8 -22 -19 20 19 -25 -19 -13 7 -9 36 19
5755 19 29 18 -37 -9 7 21 19 44 6 49 15 4 49 -35 -23 9 29 -15 -76 -5 62 -30 5 -50 -65 12 -20 9 -2 -35 -24
5786 -24 -12 -19 -56 -24 28 -5 34 -9 -41 80 30 22 27 7 -20 11 72 24 21 -24 15 39 50 42 -18 2 11 9 -19 -18 25 -14 -41 -15
5820 -15 5 -8 3 -12 -2 -9 31 -77 -41 -21 34 22 25 -18 68 47 -24 47 -9 0 38 1 3 25 2 26 10 -19 34 -19 24 0
5852 0 25 55 43 67 14 -3 -21 -19 -2 -8 28 23 6 7 23 -40 1 -41 13 39 1 -2 -39 27 31 17 36 17 33 52 78 45 49 37
5886 37 -25 39 22 -14 -27 -15 7 18 10 24 -43 -47 -40 30 -51 12 -25 36 -3 -19 -16 -38 -9 -14 -36 -12 -12 -22 -18 -25 -11 -27 -5 30
5920 30 17 29 11 49 -20 -12 -33 -32 14 -8 -34 -12 24 15 16 -55 -12 -24 41 6 7 15 -42 16 -16 7 35 3 -18 12 -13 13 -18
5953 -18 44 -39 69 36 53 25 -5 -1 -22 5 -56 -32 23 -4 27 24 -7 33 14 38 -24 26 9 44 44 32 13 37 -5 -23 -9
5984 -9 -39 -55 -26 -8 -37 29 -56 9 3 21 -16 -55 -36 -1 -22 -52 -1 13 37 36 -3 14 -39 48 17 25 12 -18 66 6 -2 -68 -6
6017 -6 -13 6 -32 19 -65 9 59 -13 -17 -61 22 6 -22 -13 -7 3 -25 32 22 48 -59 -5 -39 -45 26 29 19 1 48 6 -9 21 14 8
6051 8 14 41 55 21 -10 19 -26 -21 -15 16 -9 -16 -12 -21 -36 7 6 37 8 -38 25 -48 -5 7 -2 23 -16 2 8 3 -1 14 31 28 -11 44 -7
6088 -7 -14 31 24 -78 -21 16 -20 -1 28 11 33 -31 10 27 3 30 16 22 22 11 -14 -5 35 18 -14 33 -6 -10 54 -11 6 -12 20
6121 20 35 36 -7 -21 -11 21 -11 16 16 42 44 9 4 48 22 -24 -9 59 3 43 7 -12 14 -17 -7 -19 33 -10 -12 -32 27 -20 28
6154 28 -3 -1 24 -24 6 29 37 -6 -2 -1 45 8 -28 3 -14 14 31 -53 -2 20 7 44 -9 -5 16 19 -6 15 -31 -35 -2 11 -1 4
6188 4 -12 -29 9 52 -11 -51 -18 31 -21 -64 -20 -26 38 -43 8 1 34 -9 -17 -37 -16 29 21 20 14 42 -4 21 -22 32 -35 42 39 35 17
6223 17 42 1 -28 28 32 16 -7 -6 27 18 -69 -55 -57 -31 -24 -56 -28 -7 44 -4 27 5 -16 22 -23 12 -3 -29 48 -4 10 6 0 24
6257 24 42 -2 -40 14 -21 -28 67 41 47 35 2 -56 21 -14 3 67 25 -5 6 -36 -27 -14 -40 -35 -30 -22 -33 -10 -7 35 -1 6 -12 68
6291 68 11 41 -27 25 -41 55 16 16 26 5 46 57 35 34 -38 47 34 50 -16 23 31 16 4 40 -11 3 -15 -25 23 4 22 3
6323 3 -9 -29 -3 23 -49 32 54 -16 15 -50 7 -13 34 -17 -17 -7 67 -30 56 -35 2 3 44 12 -32 24 -2 20 32 -19 -10 13
6355 13 17 -37 -41 -20 30 -25 -46 -1 5 8 -14 -20 -25 10 -13 -8 -19 5 22 -10 18 31 54 0 42 -2 38 -13 4 27 -4 12 66 0
6389 0 -24 63 -38 0 -34 -58 14 42 -42 -21 14 -11 10 21 -3 21 8 -52 52 -33 54 33 -9 -42 -4 -11 21 -6 43 -20
6419 -20 -36 -42 13 34 33 13 -72 -3 46 -41 -10 40 20 47 41 31 -31 -29 -24 21 16 36 5 -24 11 44 -39 6 0 16 -21 -29 -25 26 -32
6454 -32 -11 -42 -5 -27 7 -27 33 -4 -4 23 -44 -15 -24 -2 -1 23 16 84 22 -12 3 5 -43 29 -10 39 38 23 30 8 73 -3 -6 23
6488 23 -15 19 38 13 -25 2 10 31 1 -36 21 10 52 -13 35 0 4 36 36 3 32 50 -10 49 51 -14 8 17 -47 75 35 7
6520 7 49 -5 -32 34 56 28 -2 -35 2 7 -31 -15 -7 -35 -22 -40 -25 28 -31 14 -27 -13 -45 -21 -19 34 -4 -17 30 -28 0 29
6552 29 40 -24 -10 32 36 -24 16 77 -44 40 9 42 54 6 -19 -57 -53 -4 9 38 11 31 4 0 -36 -14 23 26 -6 -19 -9 -42
6584 -42 8 -35 -26 3 29 -36 -21 -6 -9 50 -10 2 -37 6 -10 -3 90 35 23 -16 20 -24 2 -22 -67 44 4 3 34 -32 20 24
6616 24 -33 4 -18 43 -49 38 -36 1 -29 15 26 32 -3 16 7 2 33 12 -45 13 5 -30 -30 41 13 37 -13 23 -1 -39 7 11 30
6649 30 -1 -31 6 20 -14 -22 6 9 -13 -58 -29 -20 -5 -28 -44 -20 -11 -4 -69 13 7 -48 -8 5 10 -26 40 -1 -8 2 4 6 -61 20 30
6684 30 -29 -23 -8 70 52 17 -14 -35 -15 13 25 -15 -43 -33 -40 -41 -9 -67 39 3 -19 -70 -5 -9 9 41 22 47 -41 -29 -18 4
6716 4 46 20 58 45 -22 -4 -24 24 39 18 -2 15 35 -13 -24 32 -22 40 7 10 4 2 -4 -21 -5 -17 -24 27 -29 -26 -42 15 87 -38
6750 -38 -75 20 5 37 -30 4 -20 -27 15 27 2 -35 19 -27 -18 -18 -36 39 53 16 -3 -3 -29 24 -23 25 35 -24 -16 -39 -36 19 33
6783 33 0 0 -49 -21 17 3 -13 -16 10 -6 -14 33 -13 -28 5 22 -27 20 -5 17 -3 -37 1 -3 52 7 -8 34 36 -40 -7 19 31
6816 31 37 -52 20 11 -11 -7 -35 -17 -19 -5 -75 23 -20 -37 -32 50 -24 -60 -47 21 -9 20 25 5 6 8 7 31 11 20 7 26 29 17 31 12
6852 12 -4 59 66 55 -13 13 -20 -23 -18 -23 -52 -8 24 75 16 18 42 19 -6 -15 2 -27 -20 -21 11 -17 0 -21 -9 -37 33 28 42 30 0
6887 0 49 16 40 -8 1 1 16 2 7 -19 46 69 -10 22 -13 5 22 32 -35 8 14 -29 31 -29 24 -27 -18 -54 6 -24 -30 0 -27 -12
6921 -12 29 -24 20 1 -31 22 16 40 -1 17 42 -24 28 17 10 33 1 -28 9 -27 30 10 -14 6 -4 6 -10 21 50 -6 -22
6952 -22 -69 72 -41 -48 -47 -27 -4 9 -27 -33 12 31 -3 7 -29 43 -43 18 53 10 27 12 9 70 -54 -7 38 -30 12 3 80
6983 80 -14 -16 -25 -34 23 -14 -11 -13 48 32 -35 39 -32 -39 -12 -18 -32 -34 12 -14 -15 -3 13 18 -19 -7 -1 -3 42 -17 26 0 -1 -36 -9 -17 5
7020 5 -25 -1 25 14 12 -2 24 28 -32 33 46 13 10 -9 49 -57 -32 26 5 -44 6 30 -10 -4 11 -29 -59 -41 -28 30 32 -27 41
7053 41 -38 54 8 3 27 24 4 8 40 11 16 -22 49 5 39 -1 29 -7 -25 33 1 -8 -10 49 56 -33 8 39 -14 10 -66 49 -42
7086 -42 12 -5 -16 -8 -8 -16 -14 -20 -5 11 -2 23 -50 -15 3 5 22 56 15 40 -34 54 32 25 -10 21 -33 -19 -63 -3 -10 28 5 -32
7120 -32 13 -25 -11 -36 -32 -19 2 21 7 -27 -77 -38 10 -19 31 -33 34 23 68 52 -16 24 28 20 6 21 18 44 39 -17 -34 39 -27
7153 -27 7 -48 -23 -14 -13 -9 -14 -35 -1 8 -67 -54 -17 19 1 -11 -8 16 -25 -17 42 25 -33 38 57 5 -6 -4 -16 6 7 -31 -57 -3 33
7188 33 55 -5 13 3 -5 57 29 -48 17 -41 58 -22 53 3 -35 22 -12 38 51 -5 9 25 46 5 31 25 2 -16 -38 -12 1
7219 1 -35 19 14 -10 -7 34 -5 47 4 -16 23 2 12 -9 12 39 12 42 -42 58 29 15 19 8 -8 -17 10 -94 -39 20 -25 1
7251 1 7 -37 29 -39 7 -21 8 0 10 10 9 -4 36 26 -11 40 -14 15 -11 18 9 5 36 -17 -38 -6 -8 5 27 -27 9 9 -2 -15 -39
7286 -39 31 -19 22 -6 8 -6 -36 -6 -9 -28 -17 33 20 22 -37 42 35 38 29 24 92 38 33 12 60 11 20 -18 3 -50 -20 4 -10 13
7320 13 12 25 9 -20 -12 -48 -15 -36 7 -10 -26 38 -56 12 12 -39 -2 -22 11 14 -12 21 -18 -32 -53 11 -21 17 -1 39 74 21
7352 21 -30 30 -1 -8 14 7 -65 23 48 50 29 -5 6 -18 7 69 48 18 32 -7 54 0 -24 35 3 14 -20 15 -24 13 -3 31
7384 31 0 -39 -20 19 2 32 -21 -5 -19 15 5 -4 17 -16 80 -20 24 9 -6 -33 4 11 -31 -18 27 -53 -17 30 -3 44 22
7415 22 -28 18 -9 -22 13 -58 -9 0 -27 22 36 23 -6 -31 26 16 14 -3 -8 36 63 26 33 10 33 -20 -31 31 -22 4 13 4 -15
7448 -15 1 18 -18 -51 -6 12 1 12 -12 -22 14 -8 -16 -33 49 15 25 -22 -9 1 -11 23 1 -19 41 75 30 -12 31 13 -42
7479 -42 -26 -25 10 -25 43 9 33 -43 9 -1 62 0 -39 39 -69 -22 -19 7 -49 10 -3 30 65 -38 12 10 52 -8 50 14 29
7510 29 -28 -20 8 13 27 -20 -26 18 6 18 21 17 -2 74 20 26 13 -29 34 91 -3 -12 26 20 76 47 -7 16 -32 3 38 -11 -12 39 24
7545 24 4 11 26 56 -17 62 -6 14 9 -25 -19 -26 6 -4 -28 17 58 36 6 24 44 12 38 -27 30 2 26 35 12 11 -8 4 8 8
7579 8 -45 11 -15 28 -36 -31 5 -67 -24 -12 13 -8 -15 13 -9 -13 28 14 -31 -40 9 -27 45 -30 -11 22 19 -21 -15 12 -35 14 12 22
7613 22 53 -32 31 16 35 17 -1 7 21 -31 -28 -40 39 -72 -9 -44 9 27 -47 -16 23 -3 33 -31 -6 37 29 -6 -17 59 2
7644 2 6 -78 40 3 66 5 10 4 55 20 47 -16 -16 13 -26 10 4 37 13 -32 27 -11 -1 -27 -4 -9 -21 -35 27 0 -40 34 41 -17
7678 -17 0 -5 30 61 38 -3 2 40 8 0 49 -42 2 -10 5 17 -7 -26 -13 64 18 -29 2 19 27 8 -7 -31 -24 43 -3 16 9
7711 9 -7 -32 -39 -26 44 15 24 -37 9 23 52 56 20 68 -15 -8 16 38 8 -26 6 51 18 6 -32 -14 -34 4 62 19 -6 8 -18
7744 -18 8 -28 -31 -16 -9 -23 1 -1 12 -40 -36 -31 -14 -6 38 -21 -7 4 15 6 -60 -1 1 -10 65 38 6 -39 34 42 25 -1 55 59 39
7779 39 55 29 15 35 22 -12 -2 14 20 -8 -13 -30 18 -5 -9 -16 22 31 18 -36 -25 -9 5 -35 11 44 20 -12 -32 23 -8 -8 -17 -21
7813 -21 30 -9 8 -7 38 -31 7 37 4 -17 21 -9 -30 10 38 71 3 -11 -7 -34 -7 32 -34 11 -15 1 6 -24 18 -2 -61
7844 -61 -28 -39 -44 -11 18 -19 39 47 11 -21 51 26 40 43 47 34 24 12 -50 50 -27 -39 48 -1 -36 50 -17 -21 -1 -13 -2 -43
7876 -43 -47 -32 -29 46 29 14 -6 21 -7 14 21 28 24 -42 -1 24 28 -16 -35 31 -2 14 7 56 -5 -5 86 12 1 3 31 -22 -3 20 -28
7911 -28 12 70 -32 27 -35 -6 -56 51 49 -16 -29 -8 16 0 31 3 -1 0 -7 -7 -14 47 18 -8 -19 -7 -15 17 -25 -7 17 2 40
7944 40 -20 31 -10 -14 35 -20 -31 -70 67 59 -58 -12 -56 4 22 9 -63 -14 5 -46 -25 -25 9 -5 4 13 5 67 33 16 13 -4 -9
7977 -9 21 62 33 66 46 12 31 -17 64 56 64 11 12 -26 32 -32 34 -9 -44 9 -39 -13 -43 -9 -5 -5 -3 10 -42 -8 -9 -53 -3 -24
8011 -24 -53 -26 -36 38 10 9 -23 0 47 70 -41 11 12 55 20 41 42 -11 -15 25 16 40 44 7 1 3 24 -12 -49 -30 12 17 47 -18
8045 -18 -7 32 18 19 32 4 -8 16 19 29 -36 20 22 0 -12 27 18 -35 -2 29 3 37 62 12 17 33 52 44 -4 58 33 13 27
8078 27 19 -7 27 17 -1 27 -60 -35 -15 -25 16 -20 20 30 -15 15 -38 -8 17 -5 21 -23 -9 -5 -32 -11 42 13 -4 31 34 24
8110 24 -54 24 22 38 28 31 16 10 6 -24 28 -11 -19 72 36 -16 0 -10 -55 14 25 35 -53 29 54 16 6 12 -3 12 -17 -3 26
8143 26 37 47 31 -20 -43 11 -16 49 -18 53 -8 50 9 -13 -14 20 39 10 36 40 14 -18 32 46 39 -12 -52 -6 37 -29 15 14
8175 14 35 -37 -13 22 9 -26 -20 66 -24 -52 4 18 -16 -41 4 -32
8191c2
##END NTUPLES=NMR FID
##END=
