##TITLE=1H_MTBPA2610-2
 D2O,8 sc, 
 26.10.2021
##JCAMPDX= 6.0         $$ Bruker NMR JCAMP-DX V2.0
##DATA TYPE= NMR FID
##DATA CLASS= NTUPLES
##ORIGIN= UXNMR, Bruker Analytische Messtechnik GmbH
##OWNER= root
$$ XWIN-NMR		Version 3.5
$$ Wed Oct 27 10:51:05 2021 Russian Standard Time (UT+4h)  she@DPX200
##.OBSERVE FREQUENCY= 200.1313468511
##.OBSERVE NUCLEUS= ^1H
##.DELAY= (6, 6)
##.ACQUISITION MODE= SIMULTANEOUS
##.ACQUISITION SCHEME= undefined
##.AVERAGES= 8
##.DIGITISER RES= 18
##SPECTROMETER/DATA SYSTEM= spect
##.PULSE SEQUENCE= zg30
##.SOLVENT NAME= D2O
##.SHIFT REFERENCE= (INTERNAL, D2O, 0, 15.7039)
##AUDIT TRAIL= $$ (NUMBER, WHEN, WHO, WHERE, WHAT)
$$ ##TITLE= Audit trail, XWIN-NMR		Version 3.5
$$ ##JCAMPDX= 5.01
$$ ##ORIGIN= Bruker BioSpin GmbH
$$ ##OWNER= she
$$ F:/spectra/data/she/nmr/H-F/1/audita.txt
$$ ##AUDIT TRAIL=  $$ (NUMBER, WHEN, WHO, WHERE, WHAT)
(   1,<2021-10-27 10:50:00.12 +0400>,<she>,<DPX200>,
      <created by zg, POWCHK disabled, PULCHK disabled
       configuration hash MD5:
       00 E9 B6 7A A2 85 ED C7 34 08 36 98 17 FE 4E 26
       data hash MD5: 16K
       F3 B5 6A 7F 76 B1 6B 34 89 18 6E 71 BC 1E 93 0A>)
$$ ##END=
$$ 
$$ hash MD5
$$ 72 65 B2 AA E4 5B FC F6 37 97 FD A1 B6 68 9A 2B
##$RELAX= 
##$RELAX= 
##$RELAX= 
##$RELAX= 
##$RELAX= 
##$RELAX= 
$$ Bruker specific parameters
$$ --------------------------
##$DU= <F:/spectra>
##$EXPNO= 1
##$NAME= <H-F>
##$PROCNO= 1
##$TYPE= <nmr>
##$USER= <she>
##$AMP= (0..31)
100 100 100 100 100 100 100 100 100 100 100 100 100 100 100 100 100 100 
100 100 100 100 100 100 100 100 100 100 100 100 100 100 
##$AQSEQ= 0
##$AQ_mod= 1
##$AUNM= <au_zg>
##$AUTOPOS= <>
##$BF1= 200.13
##$BF2= 200.13
##$BF3= 200.13
##$BF4= 200.13
##$BF5= 200.13
##$BF6= 200.13
##$BF7= 200.13
##$BF8= 200.13
##$BYTORDA= 1
##$CFDGTYP= 0
##$CFRGTYP= 5
##$CHEMSTR= <none>
##$CNST= (0..31)
1 1 145 1 1 1 1 1 1 1 1 1 1 1 1 1 1 1 1 1 1 1 1 1 1 1 1 1 1 1 1 1 
##$CPDPRG= <>
##$CPDPRG1= <>
##$CPDPRG2= <>
##$CPDPRG3= <>
##$CPDPRG4= <mlev>
##$CPDPRG5= <mlev>
##$CPDPRG6= <mlev>
##$CPDPRG7= <mlev>
##$CPDPRG8= <mlev>
##$CPDPRGB= <>
##$CPDPRGT= <>
##$D= (0..31)
0 1.2 0 0 0 0 0 0 0 0.06 0 0.03 0 0 0 0 0.0002 0 0 0 0 0 0 0 0 0 0 0 0 
0 0 0 
##$DATE= 1635317399
##$DBL= (0..7)
120 120 120 120 120 120 120 120 
##$DBP= (0..7)
150 150 150 150 150 150 150 150 
##$DBP07= 0
##$DBPNAM0= <>
##$DBPNAM1= <>
##$DBPNAM2= <>
##$DBPNAM3= <>
##$DBPNAM4= <>
##$DBPNAM5= <>
##$DBPNAM6= <>
##$DBPNAM7= <>
##$DBPOAL= (0..7)
0.5 0.5 0.5 0.5 0.5 0.5 0.5 0.5 
##$DBPOFFS= (0..7)
0 0 0 0 0 0 0 0 
##$DE= 6
##$DECBNUC= <off>
##$DECIM= 32
##$DECNUC= <off>
##$DECSTAT= 4
##$DIGMOD= 1
##$DIGTYP= 9
##$DL= (0..7)
0 120 120 120 120 120 120 120 
##$DP= (0..7)
150 150 150 150 150 150 150 150 
##$DP07= 0
##$DPNAME0= <>
##$DPNAME1= <>
##$DPNAME2= <>
##$DPNAME3= <>
##$DPNAME4= <>
##$DPNAME5= <>
##$DPNAME6= <>
##$DPNAME7= <>
##$DPOAL= (0..7)
0.5 0.5 0.5 0.5 0.5 0.5 0.5 0.5 
##$DPOFFS= (0..7)
0 0 0 0 0 0 0 0 
##$DQDMODE= 0
##$DR= 18
##$DS= 0
##$DSLIST= <SSSSSSSSSSSSSSS>
$$ [...]
##$SUBNAM2= <"">
##$SUBNAM3= <"">
##$SUBNAM4= <"">
##$SUBNAM5= <"">
##$SUBNAM6= <"">
##$SUBNAM7= <"">
##$SUBNAM8= <"">
##$SUBNAM9= <"">
##$SW= 18.0517286264689
##$SWIBOX= (0..15)
0 0 2 0 0 0 0 0 0 0 0 0 0 0 0 0 
##$SW_h= 3612.71676300578
##$TD= 16384
##$TD0= 1
##$TE= 0
##$TE2= 300
##$TE3= 300
##$TEG= 300
##$TL= (0..7)
0 120 120 120 120 120 120 120 
##$TP= (0..7)
150 150 150 150 150 150 150 150 
##$TP07= 0
##$TPNAME0= <>
##$TPNAME1= <>
##$TPNAME2= <>
##$TPNAME3= <>
##$TPNAME4= <>
##$TPNAME5= <>
##$TPNAME6= <>
##$TPNAME7= <>
##$TPOAL= (0..7)
0.5 0.5 0.5 0.5 0.5 0.5 0.5 0.5 
##$TPOFFS= (0..7)
0 0 0 0 0 0 0 0 
##$TUNHIN= 0
##$TUNHOUT= 0
##$TUNXOUT= 0
##$USERA1= <user>
##$USERA2= <user>
##$USERA3= <user>
##$USERA4= <user>
##$USERA5= <user>
##$V9= 5
##$VALIST= <valist>
##$VCLIST= <CCCCCCCCCCCCCCC>
##$VD= 0
##$VDLIST= <DDDDDDDDDDDDDDD>
##$VPLIST= <PPPPPPPPPPPPPPP>
##$VTLIST= <TTTTTTTTTTTTTTT>
##$WBST= 1024
##$WBSW= 4
##$XGAIN= (0..3)
0 0 0 0 
##$XL= 0
##$YL= 0
##$YMAX_a= 266265
##$YMIN_a= -252907
##$ZGOPTNS= <>
##$ZL1= 120
##$ZL2= 120
##$ZL3= 120
##$ZL4= 120
##$ABSF1= 10
##$ABSF2= 0
##$ABSG= 5
##$ABSL= 3
##$ALPHA= 0
##$AQORDER= 0
##$ASSFAC= 0
##$ASSFACI= 0
##$ASSFACX= 0
##$ASSWID= 0
##$AUNMP= <proc_1d>
##$AZFE= 0.1
##$AZFW= 0.1
##$BCFW= 1
##$BC_mod= 2
##$BYTORDP= 1
##$COROFFS= 0
##$CY= 11.3945322036743
##$DATMOD= 1
##$DC= 2
##$DFILT= <>
##$DTYPP= 0
##$F1P= 2.36226072786647
##$F2P= -0.459571619588291
##$FCOR= 0.5
##$FTSIZE= 0
##$FT_mod= 4
##$GAMMA= 1
##$GB= 0.15
##$INTBC= 1
##$INTSCL= 1
##$ISEN= 128
##$LB= 0.24
##$LEV0= 0
##$LPBIN= 0
##$MAXI= 10000
##$MC2= 0
##$MEAN= 0
##$ME_mod= 0
##$MI= 1.114404
##$NCOEF= 0
##$NC_proc= 0
##$NLEV= 6
##$NOISF1= 3.799351
##$NOISF2= 2.8
##$NSP= 1
##$NTH_PI= 0
##$NZP= 0
##$OFFSET= 15.70392
##$PC= 1
##$PHC0= -15313.23
##$PHC1= 9.200823
##$PH_mod= 1
##$PKNL= yes
##$PPARMOD= 0
##$PSCAL= 0
##$PSIGN= 0
##$REVERSE= no
##$SF= 200.130013532006
##$SI= 16384
##$SIGF1= 3
##$SIGF2= 2
##$SINO= 400
##$SIOLD= 16384
##$SREGLST= <1H.CDCl3>
##$SSB= 0
##$STSI= 0
##$STSR= 0
##$SW_p= 3612.71676300578
##$SYMM= 0
##$S_DEV= 0
##$TDeff= 0
##$TDoff= 0
##$TI= <>
##$TILT= no
##$TM1= 0
##$TM2= 0
##$TOPLEV= 0
##$USERP1= <user>
##$USERP2= <user>
##$USERP3= <user>
##$USERP4= <user>
##$USERP5= <user>
##$WDW= 1
##$XDIM= 8192
##$YMAX_p= 0
##$YMIN_p= 0
$$ End of Bruker specific parameters
$$ ---------------------------------
##NTUPLES= NMR FID
##VAR_NAME=  TIME,          FID/REAL,        FID/IMAG
##SYMBOL=    X,             R,               I
##VAR_TYPE=  INDEPENDENT,   DEPENDENT,       DEPENDENT
##VAR_FORM=  AFFN,          ASDF,            ASDF
##VAR_DIM=   8192,          8192,            8192
##UNITS=     SECONDS,       ARBITRARY UNITS, ARBITRARY UNITS
##FACTOR=    0.0002768,     1,               1
##FIRST=     0,             0,               0
##LAST=      2.2672688,     0,               0
##MIN=       0,             -252907,         0
##MAX=       2.2672688,     266265,          0
$$ Real data points
##PAGE= N=1
##DATA TABLE= (X++(R..R)), XYDATA
$$ [...]
1220E514M580j3m645p525o611k183K790O370P656M974r87n757o890n519k304K995
1236g555O688O504M135J99m923q050o086j471L366O703P082L417j252m802o637
1251b682n715j616K874O317P224M026j475n375o776n717j310M173O337N645L673
1266I603p79n608o703m657j771K901P191P056K714j840n299o774m617l60L238
1281e705N789O347L319j559n201o870n224l30M181O142N851K948k273n540n697
1296c822m200j108L589O631N600K616j446n672p042m008L99L917N921N415K069
1311H859j980m882o026m540l26M152O482N561J839k649n299n670l830J66M175
1326c968N757M764K199j794n743o137l378J63M000O497N144R17k824m770n409
$$ y = [5514, 10094, 10081, 5436, -2089, -8700, -10883, -8093, -1723, 5933, 10907, 9920, 4163, -2727, -8246, -10550, -7555, -867, 5637, 9772, 9971, 5048, -3002, -9088, -10559, -7193, -490, 6592, 10009, 8757, 3955, -2682, -8397, -10013, -7139, -822, 6402, 10428, 8953, 3578, -3198, -8915, -10225, -6052, 285, 5930, 9603, 8824, 3216, -3487, -8144, -9915, -7014, 177, 7233, 9947, 8107, 2808, -3966, -8583, -8943, -5705, 84, 6431, 9750, 8191, 2990, -3880, -9104, -9434, -5253, 889, 6740, 9688, 7415, 1875, -3822, -8022, -9130, -5541, 1090, 6690, 9306, 7860, 2188, -4854, -8862, -8463, -4546, 1375, 6790, 8859, 6879, 1997, -4029, -8569, -8895, -4743, 1739, 7300, 9139, 6490, 1191, -4479, -8309, -8143, -3968, 1789, 6553, 8752, 6958, 1215, -4922, -8300, -8137, -4137, 2360, 7504, 8421, 5597, 827, -4582]
1341d582l480L98L875N638N227J779k825n708n569l109J006M510N256M359J427
1356H202k591n429m959l108J29M504O342M170P09k603n437n638k169J475L772
1371b631N169M395R68k777m970n421l100J378M866N485L843K92l115m854m648
1386e120k550J010M466N328L720R14l020n639m936j854J531M324N415L473j93
1401F869k958m417m687k526J364M719N302L586J02l546n392m131j400J664M116
1416a335M756L331L14l135n190m453j722J697M663N356K770p60l043m606m342
1431e699j432K147L934M448L559L8l774n116l986j390K210M848M400K238l27l089
1447C009m613l898j549J859M755M845K326n72l401n150l603l68K000L886M600
$$ y = [-4582, -8062, -7664, -3789, 1849, 7076, 8855, 6030, 322, -5247, -8356, -7350, -2840, 2416, 6775, 8202, 5611, 182, -4777, -7885, -7756, -3252, 3090, 7260, 7969, 5366, -71, -5709, -7878, -6403, -2631, 2538, 6933, 7901, 5124, 154, -5267, -8367, -6989, -2123, 3362, 7205, 7497, 4382, -472, -5120, -7670, -6660, -2194, 3134, 6854, 7768, 4748, -891, -5827, -7681, -6150, -1826, 3589, 7062, 6869, 3911, -506, -5193, -7719, -6355, -1636, 3666, 7252, 7354, 3808, -1584, -5715, -7115, -5451, -1335, 3421, 6752, 7066, 3931, -1259, -5712, -7434, -5737, -1074, 4282, 7052, 6292, 3249, -1357, -5699, -7131, -4984, -1050, 3398, 6957, 6995, 3221, -1895, -5881, -7271, -5061, -213, 4187, 6425, 6098, 3009, -1604, -5502, -7051, -5192, -437, 4408, 6734, 6162, 2761, -2389, -5992, -6360, -4360, -474, 4126]
1462D126K533q73l269m255m107j261K675M721M266K025j000l600m439l120o65
1477f243K109M086M126K577p04l964m825l107k87K395M439M052J490j157l035
1492A952m259l523m75K649M169L935K139j142m036m557k557q4K500M045L643J561
1508E960j015l219m399l325k22K946M458L712J157j520l457m085k687J97K492
1523c007L706L799J815j629l818l929k705p9L122M408L009R21j307l398l978k376
1539e446P8K418M149L705J181j728m017l986j881O33K536L779L263P84j528l157
1555G83m028k725O96L199L814L007J025j956m009l339j687M45K539L830L047R35
1571E576j708l692l840k017P69L318L956K331K86j594l328l632j775P31K650L930
$$ y = [4126, 6659, 5786, 2517, -1738, -5845, -7106, -4431, 290, 4556, 6581, 5581, 1981, -2458, -5578, -6243, -4134, -48, 4078, 6655, 5951, 1987, -2838, -5945, -6232, -3837, 602, 4654, 6144, 4987, 1952, -2307, -5830, -6305, -3656, 513, 4448, 6587, 5445, 1409, -3148, -5705, -5789, -3289, 756, 4399, 5960, 4945, 1726, -2673, -5998, -6220, -3274, 1184, 4896, 6053, 4533, 1076, -3009, -5696, -5499, -3007, 699, 4498, 6313, 4684, 866, -3063, -5768, -5847, -2725, 1683, 4692, 5613, 4306, 908, -3070, -5446, -5368, -2950, 1199, 4904, 6085, 4357, 340, -3646, -5527, -4894, -2358, 1421, 4684, 5468, 3940, 783, -3245, -5970, -5274, -2075, 1739, 4746, 5771, 3815, -194, -3533, -5220, -4775, -2236, 1594, 4641, 5576, 3868, 176, -3664, -5681, -4912, -1594, 2362, 4693, 4979, 3385, 57, -3575, -5350, -4619, -1969, 1961]
1587A961L115M66k422l728l127j553R64L028L538K363L34j788l375l507j693J032
1603d392L077L686K609J29k521l498k847j091Q45K696L510K479L92k161l599l368
1619d054j326J509L325L105J980J82k139l538k859r05R23K669L691K368j78k448
1635B305l502k828r41J579K961L073J793j19j966l268l099j052J569K953L286
1650B744K140m71k776l145k162r42J206L045L201J689k63k171l488k749o36J625
1666c153L195L015J450n75k369l106k266m62J141K762L412J788p62k608l216k425
1682d179l09J909K910K466J427l68k313l240k336l57J525L039L062J459j022k702
1698I71k899j948k86J724K799K643J196n00k369l302k282o1K036K990K530J082
$$ y = [1961, 5076, 5542, 3120, -608, -3735, -5288, -4324, -1296, 2242, 4605, 4939, 3151, -224, -3731, -5424, -4392, -1315, 2371, 4980, 5109, 2588, -910, -3757, -4848, -4003, -1307, 2203, 4682, 5074, 2913, -686, -4054, -5380, -3871, -546, 2559, 4539, 4721, 2582, -956, -3815, -4720, -3797, -1128, 2563, 4931, 4753, 2305, -1197, -4025, -4966, -3387, -426, 2647, 4440, 4321, 2355, -913, -4012, -5064, -3495, -542, 2744, 4884, 4413, 1637, -1508, -3670, -4612, -3406, -361, 2840, 4529, 4266, 2095, -1393, -4142, -4778, -3153, 42, 3057, 4507, 3932, 1563, -1543, -3809, -4271, -3130, -368, 3044, 4832, 4070, 1462, -1754, -4179, -4488, -2579, 331, 2797, 4224, 3856, 1543, -1697, -4033, -4390, -2865, 174, 3236, 4695, 3673, 971, -1928, -3876, -4162, -2438, 361, 3004, 4200, 3700, 1331, -1971, -4253, -4314, -2278, 712, 3242, 4324]
1714D324j046k605k606j661m26J411L151K863R08j029k412l066j955K75J970K670
1730G66K362Q29p96k381k836j873J0J794K910K717Q81j495k711k392j522P7J939
1747a721K637K049J024p60k687k972j556L13J938K947K286L80j323k293k462j446
1763c646J38J783K703K361O62j260k583k700j497O99K154K492J854N42j146k490
1779F6k331j367L9J968L188K063Q0j426k398k384j224O97J936K268J989N68j252
1796B480k537k523j209N96K097K772J837Jj642k245j917j132K95K019K665J673
1812C230L45j252k738k568o92J070J856K336J681M5j546k072k106j249N93K253
1828h14K612J633Oj761k400j935p44Q48K100K080J339L54j377k542k097p77P01
$$ y = [4324, 3278, 673, -1933, -3594, -4020, -2609, 542, 3405, 4313, 3284, 872, -2194, -4149, -3874, -1904, 766, 3128, 3957, 3161, 780, -2056, -3929, -3919, -2125, 785, 3502, 4383, 2888, 177, -2215, -3737, -3660, -1721, 916, 2965, 3989, 3229, 542, -2430, -3986, -3673, -1735, 1212, 3498, 3878, 2555, 262, -2200, -3646, -3508, -1725, 978, 3339, 4001, 2741, 158, -2542, -4039, -3340, -1186, 1306, 3160, 3702, 2556, 66, -2265, -3632, -3593, -1625, 1563, 3626, 3706, 2280, -118, -2502, -3726, -3029, -1093, 1175, 3164, 3732, 2480, -57, -2580, -3789, -3193, -1096, 1676, 3513, 3514, 1872, -373, -2290, -3422, -3127, -1108, 1557, 3230, 3575, 2323, -415, -2983, -3675, -2605, -749, 1587, 3268, 3313, 1767, -305, -2411, -3660, -3067, -814, 1798, 3431, 3437, 1676, -724, -2659, -3403, -2555, -455, 1625, 2964, 3318, 1941, -601, -2698, -3475, -2774]
1845b774K240K738J134n14j426k025k032o80R07J974K169J487O7j749k448j953
1861b885n07J120K169K036J258l55j577j982j754q38P84K360K337J097k88j736
1877A239k394j718j36J081J779J899J312j17j761k148j727o38J110K385K131P98
1893C095n66j562k088j491l74J077J948J906J130l34j657k408j637QJ258J984
1909B89J946P05o74j417j766j753m98J356K172J804R99n47j986k147j160n2J175
1926a554J922J632Q58m05j712k036j428k58J246K371J861L47p59j523k061j239
1942b738K19J167J559J888J013p70j909j924j294K6J523K061J423M09o06j535
1958E12j824j298r6J391J952J599P02q27j945j961q89L63J259J706J535M89p45
$$ y = [-2774, -534, 2204, 3338, 2824, 1398, -627, -2659, -3339, -2432, -458, 1711, 3198, 3265, 1516, -932, -2885, -3392, -2272, -103, 1933, 3191, 2836, 1259, -723, -2477, -3315, -2531, -171, 2166, 3263, 2975, 1239, -1155, -2873, -3009, -1928, -149, 1750, 3062, 2945, 1184, -964, -2691, -3329, -2219, 166, 2297, 3095, 2529, 967, -1121, -2612, -2986, -1909, 39, 1945, 3075, 2741, 1084, -1324, -2961, -2953, -1695, 289, 2235, 2940, 2266, 849, -917, -2670, -3168, -1812, 360, 2164, 3163, 2616, 630, -1517, -2677, -2729, -1554, 368, 2000, 2858, 2453, 741, -1295, -2723, -2981, -1735, 636, 2497, 2844, 2085, 562, -1499, -2738, -2519, -1352, 207, 2095, 3108, 2338, 429, -1495, -2789, -2763, -1240, 821, 2244, 2653, 2047, 512, -1312, -2610, -2706, -1315, 637, 2236, 2938, 2111, 166, -1795, -2684, -2321, -1062, 644, 2179, 2668, 1923]
1975A923j522j825j367M7J684K081J280L61r21j755j671p90K31J128J797J581
1991B262M57q55j767j880r28M29J497J833J270J10q96j500j561j074L46J485J594
2008H22J427N36j071k109j464n09K46J437J794J019J47o01j632j849q85N37J542
2025f13J809J176Nr99j680j585m28N81J055J549J403K21j156j632j486r37O57
2042b060J786J601P56R6q56j664j390n36L95J309J678J256%j175j808j342l05
2059b259N86J403J441R31m4q86j506j505o34P41J504J508R92l3j344j671r50k98
2077b024M72J183J620R32q8r99j627j470l99R82J512J297P17k40j085j416j134
2094a767l97O09J388J442R79j43j400j614r71k77P36J620J171M74q9q45j626j245
$$ y = [1923, 401, -1424, -2791, -2744, -1060, 1021, 2301, 2662, 1741, -14, -1685, -2475, -2244, -1116, 681, 2262, 2719, 1864, 97, -1783, -2711, -2282, -785, 1048, 2318, 2428, 1532, 32, -1529, -2603, -2257, -772, 822, 2249, 2785, 1714, -395, -1859, -2368, -2122, -685, 1109, 2128, 2275, 1674, 42, -1807, -2692, -2155, -613, 1196, 2372, 2377, 1378, -302, -1887, -2315, -1734, -679, 870, 2273, 2494, 1338, -294, -1780, -2717, -2060, -274, 1327, 2083, 2179, 1323, -341, -1731, -2267, -1872, -563, 1115, 2371, 2371, 1196, -612, -1954, -2259, -1673, -270, 1171, 2102, 2058, 1172, -334, -1839, -2473, -1732, -228, 1280, 2272, 2239, 895, -776, -1726, -2024, -1552, -369, 1251, 2183, 2095, 1096, -531, -2001, -2400, -1418, 94, 1391, 2108, 1868, 783, -633, -1767, -2164, -1555, -167, 1275, 2254, 2111, 711, -903, -1874, -2151, -1415, 205, 1376, 1850, 1761, 916, -710, -1955]
2112a955j35P43J311J566P85n70j238j370q88j72P40J183J325P47k31j244j340
2129g43j211j96J096J398J077N58l45j276j269p61j11M80J334J492N60m31j241
2146D11j404r58Q9R43J281R74N08l68r97j388r32k7P82J411J315M43o39j213j285
2165a054p02P2P45J310J095L77l54j044j535q91K16J029J167J134L52p20j197
2182@r57o13j76P92J377J104L88n55j261j279n90J85R79J263P47K56m21j106j238
2201a105o07J44P38J391J223R8q14j136r71o31K48R20J103P93L76n18j175j227
2219a150o20K46J054J173R18M9p38j115r13m32N0Q15J305R25J00n40j273j172
2237a318m94N33R88J013P65Q8o88j004r03n34P8R94J344Q06j05p66j047r64l59
$$ y = [-1955, -2090, -1347, -36, 1530, 2315, 1745, 507, -863, -1751, -1923, -1183, 0, 1325, 2072, 1841, 597, -743, -1954, -2150, -1054, 344, 1421, 1979, 1634, 358, -911, -1672, -1783, -1303, 31, 1523, 2083, 1652, 411, -993, -1951, -1862, -919, 362, 1336, 1844, 1476, 479, -909, -1841, -1868, -1086, 325, 1640, 2083, 1444, 231, -1054, -1756, -1684, -939, 371, 1466, 1843, 1489, 445, -1090, -1981, -1765, -736, 431, 1565, 1917, 1197, 0, -957, -1570, -1746, -954, 423, 1527, 1915, 1360, 99, -1180, -1770, -1585, -606, 657, 1404, 1660, 1239, 133, -1105, -1712, -1568, -830, 561, 1784, 1882, 1068, -68, -1039, -1670, -1422, -502, 601, 1394, 1770, 1252, 77, -1150, -1770, -1524, -470, 703, 1621, 1670, 932, -183, -1096, -1528, -1478, -663, 642, 1567, 1667, 1127, -146, -1318, -1812, -1279, -291, 722, 1487, 1575, 887, -117, -1020, -1554, -1476, -482, 862, 1668, 1563, 797, -250, -1214, -1573]
2256a573L81R03R87O98J44o15j104j105l84M24R26J191P15j51r23q38p16m98K68
2275a270J013J003O53J72p32j269r52j72N11R17R82N43p3o10j068q58k69K76R29
2294b74J263O25k84q03r62q62j75O23P94Q12N87O3q32j033p57l90M54J177J081
2313A107L80l82p08q97o72k33M54Q97R30N18q2p47j116q27j6N92Q88Q83M29l41
2333A057o17q33p27l12N05J038R36L80k62p92j084o05J04N69P24P59M88j99p03
2352D26r86o85j75O25J008Q25L00m41o87p70n85j35O12Q48O72M59p7j008r72n86
2372a332J25O12R14P75J06l75n77p61p09k4N75R15Q63K33m15p88q85m86J90O00
2392d44P24O44K71k66p61p78n83m3O74J034O19P8l15q28p25m25J58N14O38P53
$$ y = [-1573, -1192, -289, 698, 1396, 1540, 925, -179, -1284, -1668, -1244, -318, 873, 1588, 1437, 514, -324, -1040, -1538, -1270, -257, 746, 1399, 1571, 839, -430, -1382, -1554, -1043, -126, 856, 1399, 1326, 716, -352, -1210, -1479, -1203, -274, 989, 1614, 1330, 527, -435, -1297, -1472, -849, -55, 757, 1344, 1407, 575, -458, -1215, -1605, -1151, 26, 1107, 1487, 1105, 397, -500, -1172, -1405, -951, -54, 876, 1394, 1312, 565, -551, -1378, -1394, -802, 86, 969, 1398, 1057, 440, -393, -1120, -1432, -927, 111, 1047, 1427, 1165, 373, -711, -1316, -1212, -643, 81, 840, 1328, 1129, 426, -560, -1245, -1420, -795, 213, 1038, 1338, 897, 210, -560, -1145, -1280, -668, 180, 852, 1311, 1234, 226, -746, -1332, -1207, -595, 319, 1094, 1200, 825, 248, -513, -1222, -1246, -671, 244, 1107, 1340, 925, 137, -748, -1234, -1044, -444, 280, 924, 1195, 929, 168, -610, -1193, -1236, -562, 472, 1091, 1169, 854, 26, -699, -1124, -966, -452, 186, 939]
2412I39K97l01r22q26m11K45O31Q47O31l5l78o18p05n87J36O66Q07O37J09l59
2432H03r26q01k22K80N28P38N87J24m61o56p00n64J84Q04Q97M48L2m42q17o65
2452h29k15K20N36P00N68J74m51q45p25k38K37P21Q30L80j97l11o13p26k98K75
2472h07N40P02N77Q7n48q65n87j50L35O16O08L86O4m36o68n88m13K71Q78O96K76
2493I74k0n00p83n84J9K19M38P83M73Kn36p05p13j42L56P42O74K19r8m72n72o14
2515h40m7K08N57O52N90j73o24p14n30j9L32O55N88K21n7m01p03n66j23L53O54
2536A3O73L16j55o35p20k56j2K52N84N47L63j70m71p34n39KM62O80M84K29k49
2557F64m84o04m00J8K78N37O76L04k31n94o38m29M6M91O00L97J11n6m81o16l89
$$ y = [939, 1236, 935, 13, -813, -1224, -979, -348, 499, 1130, 1095, 717, 99, -606, -1193, -1057, -391, 416, 1053, 1162, 803, -123, -924, -1146, -866, -338, 400, 987, 1111, 650, -6, -706, -1270, -1086, -282, 615, 1063, 1095, 653, -164, -829, -1044, -824, -288, 412, 980, 1154, 703, -142, -867, -1105, -868, -147, 683, 1063, 866, 555, -58, -784, -1082, -807, -267, 435, 1012, 1099, 551, -314, -901, -1051, -716, -100, 508, 894, 958, 522, -146, -734, -1147, -876, 2, 698, 974, 954, 454, -329, -913, -894, -675, -237, 546, 1019, 1021, 485, -220, -933, -1075, -719, 23, 697, 916, 818, 346, -226, -840, -887, -679, -122, 530, 1120, 947, 323, -391, -921, -940, -608, 47, 635, 856, 799, 398, -305, -871, -994, -641, 13, 686, 1002, 847, 212, -508, -764, -776, -524, 60, 607, 970, 800, 329, -405, -944, -942, -480, 200, 684, 913, 664, 180, -424, -824, -806, -528, 9, 685, 989, 758, 164, -474, -903, -857, -366, 234, 631, 742, 686, 205, -411, -800]
2578h00o3M17O52N23K01k71o63n83j30O9K51N19O03J04j39n02o49m88J31N15N60
2599B57M66P5k40n45n17k52K3L36O00N02K52m04o09n52k42J90M23N30L59N3j65
2620E40m69n85l01J30L35O35N12J41m95n60m56j25Q8L69N54L41J24k34n25n78
2640e59k98J64M70O02L77j7l63n05l73j55M3L14N74N43k0l64n10n37j86K24N30
2661d6M15K58N5k25n44m67k19J42M35O04L77m2l85n44m00r3K20L00N05K99j1k30
2683D04m75n91j74L26M60M35L38q5m16m33k45j60j2M76N30L78q2l63n12m79p5
2704g55L09M84L47K65p7l20m36l47j55J67M17O09K68j14m27n47k76m7K54M11L87
2725D17J59Rl25n47l25l7J95M92N25J35j84m03l75k39j08K57L24M75K38j14l45
$$ y = [-800, -863, -446, 206, 729, 930, 659, -4, -587, -717, -648, -397, 122, 725, 829, 690, 188, -461, -949, -818, -303, 257, 723, 798, 558, 13, -504, -756, -733, -397, 203, 705, 957, 553, -56, -608, -850, -660, -237, 293, 652, 705, 540, 71, -514, -815, -685, -350, 285, 797, 938, 443, -117, -573, -698, -610, -241, 313, 654, 778, 544, 19, -559, -857, -693, -223, 379, 756, 739, 376, -129, -502, -657, -614, -300, 274, 817, 797, 433, -77, -614, -800, -576, -46, 369, 627, 682, 457, -87, -554, -773, -631, -196, 408, 785, 743, 358, -186, -586, -679, -459, -159, 346, 645, 634, 404, -71, -662, -836, -510, -50, 385, 723, 638, 222, -211, -456, -616, -628, -152, 378, 756, 674, 311, -201, -680, -755, -446, 38, 385, 650, 573, 253, -183, -530, -685, -518, -101, 508, 776, 662, 235, -312, -588, -635, -381, 30, 417, 576, 585, 260, -287, -612, -649, -454, 38, 563, 698, 514, 111, -264, -503, -611, -354, -30, 445, 683, 569, 224]
2746B24n59l24rL93M74K30J96q6l93l82k64j12J68N08N22R5j90l73m59k31PK97
2768b68L90K78J65r5k91m45l73k0L09N06M29Q3l00l65k99k59j6K75M30L00J90
2789F24j34l44n77k29J27L87L58K72J11k05l37l40k51p2L26M56L68J18k17m72
2809c1m71j02J17L78L18K07J25j28l20n18j91M3L06N03L42l1k86l05k87k08Q3
2830d56L34L59J74J65j91l98m04j82J73L30L99J93j2j90l70k48j46r8L44N04K72
2851E52Nk37m63l72p0K28K64K94K46J9k40k32l43k49J01L36M86K30q7k33l72l02
2873d39j07K01K86K97K40N3k01m67l19j01J65L56M31J47j80j98k20k80j35M7M00
2894b4L00K51n3k98m23k82j0K27K96K78K14r3j95l14k88j27J38M08M32J10j39
$$ y = [224, -335, -659, -668, -275, 199, 429, 625, 539, 146, -236, -500, -612, -444, 64, 586, 681, 491, 118, -341, -572, -565, -268, 122, 400, 565, 470, 179, -266, -639, -659, -350, 156, 585, 668, 368, 3, -296, -555, -571, -296, 134, 434, 624, 490, 146, -431, -660, -533, -146, 212, 484, 595, 390, 53, -287, -538, -610, -284, 172, 540, 658, 441, -31, -502, -604, -487, -109, 209, 416, 541, 413, 93, -425, -616, -573, -267, 236, 578, 547, 261, -44, -331, -539, -456, -122, 237, 411, 576, 385, -13, -417, -599, -426, -96, 303, 496, 484, 294, -76, -324, -470, -568, -224, 280, 552, 557, 320, -143, -515, -585, -357, -93, 201, 447, 466, 226, -6, -349, -598, -497, -161, 325, 555, 468, 235, -137, -439, -546, -345, -59, 238, 478, 531, 330, -137, -456, -557, -392, -36, 395, 542, 362, 164, -56, -336, -471, -424, -24, 276, 527, 474, 176, -247, -529, -539, -312, -16, 262, 476, 383, 188, -126, -414, -541, -403, 5, 437, 547, 408]
2915D08k42l43k70M9J27K85J92K80%l50l22k76p7K16M16K09J30o8k69k49k38o3
2937d55J00M18K65J80p2l23m29k24J22J60K80L12J17j34k11j95m23L6K79L40K17
2958C60J29r3l81l10j26O1J89K43J56K72j15k51m28j47J1J86M40K40l8j80j45
2979G3k55k40K6J55L05K72J96j67l37l76n8L4J85L19J87O7q0k07l51j89pK96L68
3002B16K55Pj12l80k73r9P0K00J67J96K17j82k09l33j95L0K60M06J46k1q3l13
3024c0j98p9l7J43L06K84P1j86l55k62k7J10K01K72J68m2j64j39k52k37J07K26
3046a20K68K46L7k46l04k07j1K7K04K84J31Q7j40k74l05j45J32K35L80J12k9k20
3068A42j95k62p1J18J25K22L29O2k58m09j54o1J75K48K17J33p8p7k83j64j81J13
$$ y = [408, 166, -177, -447, -398, -271, 14, 206, 486, 486, 136, -186, -462, -539, -323, 93, 302, 432, 364, 95, -154, -392, -455, -355, 63, 328, 508, 436, 113, -316, -540, -418, -258, 22, 334, 451, 317, 106, -89, -512, -476, -197, 143, 360, 489, 396, 15, -295, -421, -360, -171, 72, 228, 500, 385, 134, -294, -441, -430, -244, 196, 436, 398, 218, 73, -182, -422, -396, -241, 64, 336, 532, 365, 28, -348, -406, -372, -187, 132, 319, 386, 306, 99, -252, -441, -448, -152, 216, 471, 478, 366, -14, -287, -386, -316, -116, 51, 247, 464, 282, 73, -260, -455, -425, -165, 241, 387, 366, 283, -30, -228, -307, -344, -201, 105, 389, 460, 274, -81, -343, -370, -260, -59, 213, 381, 339, 175, 36, -216, -453, -346, -120, 148, 394, 431, 185, -119, -326, -337, -310, -106, 178, 309, 396, 256, -18, -323, -468, -336, -101, 279, 391, 362, 142, -53, -315, -386, -268, -143, 79, 408, 470, 212, -197, -351, -412, -237, 11, 228, 361, 283, 206, -77, -241, -422, -309]
3090c09K22L32J62m7k80k54k00L9J02J93J97J83J5k14k25k34q6R1K87L23N2n5
3112B94k36k38r6K8m4K20K92J50m6j60l07k54j1K10K49J52J28p2j99j73j33q9
3134c35J05K13K23K48j28k94k37m6n8J00L12J12M6M3j86k02k49l7Q6L79K14M6
3156C55j83j62k12q9J1O4K04K97J05j36j66k84j88M0K46K03J93j9n1j97k07j24
3178c00pP4K60K95J03j84l27r6j34J0K28J90R6P3p5j77k31j40M7J42K39K03K5
3201C14j13k22j54m9p2Q0K67K34O4j41j48k47k40J33K38J66J75k3j22j41j44r0
3223b35m5J58J39L04L9j80k69j32o3k0K24K30R1Nn7j76k50r3L5J42L01J89m2k05
3247I0j89j28k5N5J44J79J56k7n6j85k88j04J56K26J89M7K3j12k15j09r2JJ92
$$ y = [-309, -87, 245, 407, 360, 80, -174, -374, -335, -233, -40, 157, 340, 355, 141, -84, -318, -404, -313, -26, 297, 349, 294, 58, -180, -276, -248, -292, -72, 220, 370, 324, 164, -143, -397, -408, -198, 51, 203, 331, 259, 60, -113, -246, -335, -230, -17, 206, 454, 326, 32, -205, -251, -309, -209, 103, 215, 261, 304, 118, -84, -333, -370, -284, 95, 309, 355, 172, 10, -202, -291, -280, -216, -12, 285, 390, 254, 88, -196, -384, -344, -98, 105, 298, 279, 228, 31, -176, -300, -307, -233, 27, 322, 425, 241, -86, -182, -316, -306, -78, 112, 208, 281, 206, 29, -202, -342, -295, -153, 86, 289, 314, 201, -21, -175, -224, -296, -216, 51, 285, 349, 208, 60, -187, -427, -294, -56, 110, 285, 262, 140, -1, -145, -235, -280, -122, 17, 321, 360, 180, -89, -221, -284, -304, -80, 150, 241, 246, 189, 13, -237, -330, -295, -153, 148, 337, 295, 90, -99, -227, -252, -197, -53, 126, 282, 255, 199, 14, -274, -378, -222, 4, 193, 240, 263, 151, -64, -173, -265, -264, -72]
3270g2J97J81m2j93j72j51q6J23K85N0P0Q9j47j81j57j71J51J51K10J90j17j77
3292C1j07j09j4Q2R6J69J01kn1k71j98q5K38J62J15J11n1k01j19n7j26J3K31K36
3316A94L2M1j64j83k19qJ94J06J60L9K1j30j66j01q4M7K00K45Q5j52j68r9j21
3339b31rJ72R8P8J47Nj46j41k87nJ96J61J41M2j37p7j09j05o6J37J47J25J00l8
3363A98j49j43k07N0J32J49P6R0l8j35j38o6j01L4K73K31m2m5j66j76l3L1J06
3386f9J09J39N2n2j19j51j61N2J00J44K33oj91j37l8j16l3J18J80R1J09n6k03
3409ej69m9P5N2J90P3K1j8j43r9j70M0J53J65J53j00n1q4j72n3P1J10J6J11Q6
3434B03n2j27j33j63N3J36K05R7o2o2j09r7p8K3N9J44J53O5j06k24j47L4Q6L1
$$ y = [-72, 125, 306, 264, 71, -101, -252, -338, -215, 70, 120, 190, 279, 132, -49, -206, -377, -226, -75, 135, 325, 208, 31, -76, -185, -199, -117, -21, 148, 249, 247, 196, -75, -273, -358, -120, 42, 157, 268, 217, 16, -103, -160, -286, -273, -42, 194, 226, 267, 103, -80, -299, -307, -113, -7, 153, 192, 213, 83, -83, -184, -268, -221, -21, 224, 309, 157, -11, -110, -231, -240, -68, 30, 108, 255, 260, 114, -27, -314, -319, -123, 38, 179, 221, 84, 7, -102, -207, -273, -136, 11, 136, 236, 198, 49, -94, -301, -251, -119, 30, 106, 196, 158, 23, -115, -181, -282, -248, 25, 256, 214, 169, 3, -173, -206, -175, -69, 40, 179, 231, 179, 60, -91, -252, -200, -100, 44, 277, 271, 80, -57, -95, -211, -244, -126, 54, 145, 254, 198, -5, -174, -223, -148, -96, 94, 167, 188, 170, 27, -72, -242, -202, -49, 116, 269, 169, 118, 34, -138, -191, -120, -10, 6, 117, 203, 151, 24, -109, -272, -219, -83, 122, 219, 157, 95, -14, -111, -189, -166, -107, 37, 190, 255, 149, -75, -222, -188, -102, -71]
3458g1J53Q5j9p2n8j31q7%J52J97Q8k1r0j58j25j9O3N9R6J73j4j27q0j65j02R5
3484a78J57J76N1o1r8q5j32l9L7P0J13J60P3j52j57r9PO5Q8Q6M5J4m4j46n3r9
3510b01M4J91J11N0K2j58j41j44Q1lJ40Q0R8J6j66q2q3o4N0J34J28M3%j04j10
3535f8r6JN7M7J47Q5K8j25j88k8k4Q3J02J15O2r3n4p7j30k9J30N4P0J49j4k37
3561c3r4q4Q7M3K0J55M0Lp3j21j28J0Q4J70K7N6k8j63r1j1n4Q7M7J29J73j58r0
3588Co7n6m9J16J24Q5k3m0o1j05j18L5J10M5J44N4p5r2j79j2M8K9L6J63M8l1o8
3615F4q6j79L0R8J26P2K0o4j21o5j7K7J5R9J01O8q6j21p8l5j7J25J10K0ql5m1
3642B2j03l0jJ9P5J78K5j34p8p0j15Q9J10P7LL9J1j05r1p2K7P0J35O9kj10j06
$$ y = [-71, 82, 167, 148, 76, 18, -113, -200, -200, -48, 149, 237, 216, 126, -32, -157, -176, -113, -54, 42, 215, 201, 74, -6, -171, -273, -178, -21, 155, 206, 145, 47, -38, -170, -209, -172, -102, 11, 171, 244, 92, -65, -164, -157, -92, -4, 82, 127, 141, 97, -49, -102, -201, -157, 34, 145, 195, 217, 59, -82, -226, -145, -148, -8, 72, 170, 186, 20, -62, -145, -209, -159, -25, 103, 146, 146, 42, -68, -164, -163, -106, -59, 88, 173, 201, 76, -112, -140, -164, -81, 21, 136, 198, 105, 51, -26, -156, -185, -55, -1, 69, 218, 204, -33, -127, -211, -124, -81, -61, 94, 134, 137, 64, -57, -185, -175, -91, 79, 106, 162, 134, -29, -120, -131, -185, -98, -51, 78, 251, 93, 3, -64, -120, -169, -53, 71, 156, 133, 93, 32, -73, -191, -156, -46, -1, 143, 197, 122, 30, -149, -161, -113, -84, -48, 115, 163, 132, 64, -22, -201, -171, -73, 53, 125, 145, 81, -40, -105, -122, -95, -80, 19, 120, 188, 102, -19, -97, -132, -149, -24, 86, 106, 98, 63, 22, -81, -111, -112, -93, -18, 160, 185, 51, -27, -97, -212, -123, -13, 64, 67, 106, 117, 12, -79, -151, -124, -54, 81, 150, 148, 38, -68]
3669f8n6j8Q0K2R2Q4Kl7j11q5n9K8J38J79k1j34M1j06o3k5j7P7J43J15l2k07m4
3696h2p1j9R5J05K2K1k1K7r1j00l0K3Q2J19Q6j8j14p4Op9m3J55R4K0J6j3j06j57
3724a47j2JJ95P3m2L4n8j7j11k6lR3J31N4q8o4r6k8n1P7R9PO6j0J8j47mj13M8
3753a21Q3J42L7p2o9n6l7p4O3J02J09MP4j03p6j83L3J06RQ2O4p8n2m5j2k3mR0
3781gJ22k6J3j12n3j19L6J28O1M7k9L8n8j00n8k1J8J26J26j8l4q5q8j1p5J23P9
3808B3K0K8N0r6j36p6J08O0M0N3O5j22k2Or3m3Q3Q9O0P9j16l4j45j1K5Q1N5P8
3836A09j8m7j3q0l6j7J0J78L3j5q0p4rn2N2L2N8P9n0Nn9j34L0K2JP2N3kM5j36
3866d3k8n1oJ00N0P0PK8j51o3l1Q8KQ6l2O0j4l0j00lo8Q6P0O6O1p7j00Nq3O7L9
$$ y = [-68, -124, -142, -62, -40, 52, 136, 138, 101, -10, -95, -154, -126, 12, 191, 170, 36, 77, -29, -92, -117, -134, -57, 86, 201, 169, -38, -82, -153, -172, -77, 28, 50, 71, 50, 77, -14, -114, -144, -121, -39, 80, 166, 148, 34, -40, -34, -113, -156, -1, 93, 113, 129, 116, 10, -147, -159, -158, 37, 110, 68, 102, 44, 27, -84, -110, -113, -20, 111, 165, 77, 13, -83, -111, -162, -85, 14, 21, 87, 77, 95, -52, -56, -169, -121, -38, 104, 141, 69, 0, -56, -93, -167, -104, -2, 107, 111, 185, 82, 6, -177, -144, -38, -29, 53, 117, 39, -13, -58, -70, -93, -97, -7, 115, 89, 102, -10, -63, -182, -146, -18, 43, 90, 61, 99, 41, -59, -117, -138, -120, 6, 132, 114, 80, -5, -93, -104, -179, -56, 23, 43, 71, 121, 25, -111, -187, -79, -19, 21, 74, 139, 17, -5, 1, -92, -135, -52, 37, 97, 176, 60, 26, -119, -130, -105, -24, 31, 109, 91, 44, 31, -49, -85, -102, -92, 86, 119, 104, 24, -50, -59, -111, -59, -27, 31, 110, 60, 65, 6, -128, -98, -76, -75, -3, 50, 48, 93, -43, -71, -122, -128, -28, 22, 92, 99, 127, -24, -87, -118, -30, -28, 58, 26, 86, 72, 42, -58, -61, -129, -43, 27, 93, 154, 77, -23, -18, -101, -34, 5]
3897EM4L6RJ4q9r9rOO5J4P5Rm0q7ol0NP6J2J16pn7o0q5rO2J9Q2O2q0k2jj01k0
3931i1LJ13M6N8l3o2o6p3K1J6M5M5O3j1m3r5j7j8J4J03J04o4Kl2q5l3J5j0P0K6
3961A1P0J7n5p6n9JN5J07k2K3Lm1l5Kp4O4L4N4N4j03Oj37KO6J4l5J11Ol7Km2r9
3993a13NL6R2O7K8j20j9Qm7K1L7kLJ69o2k8j08l9L9J9P9M5J8r4n0l0Jl3L7O7L7
4024F3K1l5m9k2q3N3M1O2k1L0jm4o3o3K3Q3N6J0K9m9k2j02L1nM7nJ16j9o0m5r
4055c2n4J9Q4M2Jo0P4p9o1Po7O5P5J09j6r3q5j6N0k7K5L3K5M2l8k3m9o4N3P7R
4086B6M2L0r5K1j08N9J7L1J1oQ2n4n6Nj01k1Q4R9m3m7j7L7n7RL0j2O3L0J4p4q8
4117h9M4j7M0N3K4j2k0l2n0k4j3J9M8O8M3n7j9m1K9p7P1L7J5L8l9ol1o6mJ2J14
$$ y = [5, 49, 85, 94, 108, 19, -80, -89, -83, -18, -4, 71, 80, 40, -47, -53, -83, -78, -2, 10, 126, 119, 62, 2, -83, -92, -30, -11, 71, 133, 53, 31, 30, -71, -91, -88, 25, 71, 129, 96, 34, -32, -105, -84, -68, -23, 22, 85, 74, 31, -64, -81, -99, -85, 18, 122, 58, 60, 28, -57, -90, -75, -85, -15, 11, 81, 98, 43, -33, -92, -91, -36, 71, 49, 72, 75, 34, -1, 1, -73, -9, 25, 79, 133, 30, 36, -101, -99, -33, -19, -54, 57, 63, 26, 28, -14, -113, -108, -72, 20, 87, 115, -5, -24, -16, -63, -42, -5, -7, -4, 165, 103, 75, -33, -72, -33, -14, 65, 110, 128, 34, -16, -46, -45, -78, -41, 26, 63, 84, 49, 0, -22, -105, -52, -11, 51, 30, 60, 59, 15, -48, -111, -88, -5, 51, 61, 90, 41, 19, -83, -52, -57, -10, -15, 101, 82, 22, -23, -32, -86, -67, 17, 59, 60, 0, 74, -5, -66, -59, -126, -61, 14, 123, 107, 14, -71, -87, -37, -64, -39, -6, 19, 61, 23, 0, -49, -113, -60, 17, 26, 68, 98, 3, 24, -84, -25, -8, 23, 34, 28, 110, 56, 0, 5, -96, -117, -33, 66, 23, -24, -41, -4, -61, -52, -22, -34, 29, 59, 73, -1, -89, -45, -62, -22, 31, 55, 43, 23, -9, -59, -83, -96, -77, -29, 39, 82, 25, 6, -35, -6, -83, -12, 25, 40, 78, 39, 33, 2, -64, -68, -56, 58]
4148E8m8O4l8m7m4K4k1k7M7L2N7l8l5r7R5q2O2K8R7p2L1k3l3p7j8J05J5M1J9k2
4178E3p6m6J5L4pO1J5k7M2j14M4k2j7lP1j3O0j4o8j1llj3K0O0J7o2j5K4n0m6O5
4210b9L5P3j00K8Lk9l5J8qJ7Q5J6j6n2j2k7JL8l9O4K3Lj3k8j13P5k5Q7Mm8M0q9
4242e3n0K6N3o3Q0J01l8o8knp4L1M3N9m1oK3Nq0k1Q2l9O3N0l6k8j1o6L5M4k6K8
4274A6J2j8N2p9q7lQ4L6J4OJ3m3j3nJo1O3M2j4pL4j2j29M7K1P8J5k2LJ2o5m1r
4307e9P3J2rM8J5j9j08L1l4kQ2j7K6mM5j13k2J0N6K9LJk7m0KK7n8K1J2K5N3k7
4339C2k7l5n6R9MMqPJ3k9j4k0jLRQ0kk9l2%j9PL4K0p4R7k4l2k6m1l2K3J25m2N2
4374F6j6r2N0l0k8O9K2l3K8lnj8q8N4J1K2N4Lp5oN4q5J5O9K0K8j6ol9o8j3K7J1
$$ y = [58, 10, 74, 36, -11, -55, -31, -52, -79, -32, 0, 57, 19, -16, -113, -18, -100, -38, -10, 87, 15, 46, 23, -10, -87, -105, 0, 15, 56, 75, 53, -23, -69, -54, -20, -27, 34, 49, 22, 64, -50, -6, -28, -45, -48, 23, 10, 70, 56, -12, -23, -26, -29, -42, -22, 38, 55, -7, -22, 2, -48, -94, -29, 6, 79, -21, 7, 10, -19, -54, -36, -44, -27, 58, 74, 58, 6, -6, -33, -32, 6, -33, 31, 54, 57, 44, 16, -97, -22, -47, 40, 44, -4, 36, -53, -103, -77, -24, -87, -7, 94, 56, -12, -14, -19, -93, -62, -19, 40, -1, -7, 16, 21, -59, -80, 2, -37, 26, 76, 40, 12, 1, -65, -30, 14, -12, 16, 28, 10, 62, -17, -104, -107, -23, 13, 27, 33, 46, 3, -10, -15, -14, -75, -12, 30, 16, 9, 43, 31, -98, -51, -30, 48, 63, 41, 44, 56, -9, -50, -59, 14, 26, 17, 65, 80, 61, -47, -16, -50, -52, 30, 13, 39, 35, 80, -33, -55, -45, 11, 40, 43, 44, 17, -23, -21, 6, -52, -31, -19, 6, 59, 32, 5, -30, -86, 13, 17, 21, 13, 20, 33, 4, -10, -30, -31, -28, -19, 61, 59, 30, -2, -2, -21, -14, 20, 40, -34, 63, 39, 7, -19, -60, -92, -69, 56, 14, 66, 50, -42, 8, -22, -50, 19, 41, 8, 36, 33, 28, 10, -78, -24, -13, 9, 63, 66, -9, -15, 39, -46, -31, 38, 58, 86, 70, 64, 25, -43, -56, -29, -18]
4407a8O7m8K1J1Ol0k4k3J1J9N1J4m4m2K6n3N7oj8M9j7M1m2p5L2K0J8L9Jpj0Rj1
4440B4m6n1N2Q9l5l2J0ql6J8K3M0m0Nkj9k5L7J6m1K1J0kmK5j8l5K4J6lM9o7K1
4473A6L6n4nk1K1L2RM4m6m4P0p4l5J0N4j2LN9p3q8K5M5L7k4k3L8N1p5L7J0n8R
4505b6J4N2k9%n5Nk2O3K2l8O8o0P6q4J0K4m3k4M9mJ2m1k4K3L0j3J2J2k9L8%j8
4537@k0lM1l9K9J0j3nm9M9Mo0J0M7N3p7O2K4q2J3pnlJ9K4J9n9l5J2K2J9OK1J2
4571C9m3J6l6L0p2J15o2P8l1J7q7j0Rj0K9J9K5l5L9kJ6n2n9P3M0JRj6o0J8k3l5
4603f0N1K6J5j5j9M2p0j1J2M0L7l6l4Qj5L7J3n6N2Kn5M7L2Lq4P7pm2N4j0l4J1
4635A1j9j9qjL4J13p4N8r9m5L4k4KMQ2n4R7j13M0Jo7J9N8m1K7kL2o2M1n7k4N9
$$ y = [-18, 49, 1, 22, 33, 39, 9, -15, -38, -27, -8, 43, 57, 13, -29, -3, -56, 1, -5, -23, 26, 9, 50, 8, -67, -35, -15, 3, 42, 43, 36, 26, 35, 24, -22, -73, -21, 68, 33, 1, 11, 3, -33, -15, 8, 48, 8, 13, 11, -8, -33, 4, 20, -21, 0, 10, 8, 4, 29, 11, -24, 0, 16, 13, 62, -5, 16, 52, -2, -7, -28, -7, 25, 34, 78, 32, -12, 58, -16, -51, -41, 13, 1, 4, 63, -10, -98, -73, -28, 9, -15, -38, 0, 51, -24, 13, 23, -35, -26, -12, 40, 11, 11, -44, -39, -61, 2, 24, -14, 54, -6, 70, -14, -4, 20, -23, -47, 2, -2, 10, -31, -55, -32, -2, -15, -3, 9, -20, 18, 18, 0, -20, -23, 18, -21, 8, 18, 5, 0, -49, 0, 4, -56, -46, 1, 54, -23, 39, 63, -19, -6, -13, -18, -21, -2, 22, 41, -18, -53, -41, -19, 0, 6, 27, 39, -4, 12, -24, 6, -66, 49, -13, 65, 34, 51, -36, -46, -37, -47, -18, 1, 26, -9, 30, 28, 44, -8, -67, 6, 46, 47, 56, 40, -20, -2, -25, -60, -9, 17, 32, 17, -2, 40, -30, -41, -29, 11, 48, 12, -22, -14, -29, 8, 21, -35, 17, 19, -36, 11, 43, 46, -38, 39, 32, -10, 44, 34, 0, 11, -8, -27, -35, -36, -2, 111, 37, 95, -4, -49, -15, -39, -37, -33, 49, -5, 92, -21, 19, 20, -47, -28, 30, -11, 16, 14, 46, -16, 25, -32, -56, 3]
4667CrLLj0n4nO7K3o4Q0n9J9M0n0k5K3JP7j0pl1J8o5K4K7J8L0j0m6N8m8RJ1o4
4701b3j1K9K6LLm2m7L0pnJ0L3K6kq4O7k6K0K4pL9k2K4l8pL8q7QJ6P2ml7l1m2J0
4736d4K9k2L4j9M6N6o7l8J3J2k0O6n1M4m8N0m7Nqj3L2K8l3J8o0L8o4K6N2J9k3
4767A1J2J4j2j8k4k6K7PK7j3%J3n8K4j0J6K9J3o1N3J2n8o2L4QL6K9k2QJ8j4k3
4799a0NL0j9J4L6l8Mj2o7M0M2q7R0j7l6N1j4m8k0L7N1J4j7J6r4mQ0ln3o2J45K
4831E6p2qJ3l6K4j9P9k4Jk6j2J4l8J5PN6L4n8j5roJ2O9q6N7k7O2o7l7K7k4k6R1
4864B7M3k8l1k9m2O1l8M4qPJN6j2m2l7l0N9k7j7O9j8pl1L9m0P1m2M0J3rK2j7m1
4897FJNj9M2j7Pl1mj8k4k6Q1N7k1k9k5mn2M1MNL9L3rm9k9J7k0K1L5nJ2Pkm2K6
$$ y = [3, -6, -3, 0, -10, -64, -69, -2, 21, -43, 37, -22, -3, 37, -13, -38, -15, -14, 63, 53, 46, 15, 33, -32, -8, 19, 37, 67, 57, 11, 69, 21, 30, 41, -23, -34, -5, 21, 24, 27, -15, -62, -32, -39, -44, -34, -1, 25, 23, -61, 6, -20, 0, 24, 17, 56, 34, 58, 20, 13, 51, -36, -28, -12, 60, 56, 19, -12, -54, -44, -15, -37, -3, -22, 24, 80, 13, -25, -12, 0, -20, 46, -5, 39, -9, 41, -6, -1, -9, -22, 10, 38, 5, 23, -37, 1, -63, -37, 15, 34, 11, 23, 37, 25, 7, -17, -43, -16, -9, 18, 5, 5, 18, -40, -16, -26, -10, 19, 32, -29, 24, 36, -22, -84, -50, -42, -6, 23, 1, 9, 27, 13, -10, -5, 25, 6, 20, 56, 18, 22, 10, -57, -17, 25, -62, 28, 11, -25, 26, 12, -36, -56, -19, 32, 46, 29, 45, -49, -53, 27, 24, -29, -91, 54, 56, -16, -24, -11, -47, -23, -42, 37, 13, 14, -12, -24, -10, -48, -33, -26, 30, 64, 6, -9, -18, -24, -12, 57, -29, 28, 1, 63, -4, -41, -14, -38, -64, 27, 70, 42, 11, -18, -60, 1, -37, 7, -1, 6, 7, 63, 51, 9, -28, -58, 1, -26, -43, 26, 8, 1, -30, 9, -31, 40, -2, 38, 51, 42, 64, 47, 6, 7, 12, -7, 35, 18, 25, -6, -10, -28, -52, -78, 3, 60, 39, 10, -15, -19, -71, -30, -26, -21, 18, 51, 42, -7, -36, -19, -39, -18, 17, 12, 24, 31, 29, -13, 13]
4933A3m5O5K3pk5L3o4j6l2O5n5P3J5n4J1j4j7L0l0P0K4p9N7m2oJ8n7J8L3l7O6
4964C4k6J7J5k2o2K0rN2jO5m0n4JK3l3M1l6P4k0L9o0m0N3j1l7R2p9Mk4K3k1qk4
4997e4L9k1O0J4Ln7o7M8N3m9K5J3m1M0L9m3j1nK4J7J8l8oM9p0l5R9m6L7L8k2n0
5029Ak7Pl2jK3R2j03O8m6N6mm7J4n1L7L8j0l7K9p9P8nM5k9Qm1M8k8qk6k5J04o8
5062a9R4q6ql8RR8j8%o6N9mPRr0J4L3nL5n8K2K2k8j3lN0K4ln0P5p5k6j0N1L1m3
5097a0ML0Mk2K9l4j6jK9n7O8JpjJ4j1n0P4n3L5M3n6j1n7M6k9P6k8nj7mNJ9pr4
5132i3J07j3L5K1m3m4j8k0M5M3J2j1k7PL6p8P0l2M9m9L5j6nk2j0J9l9N9J3k1k0
5163a0K0M2q9L7j8LN8k8pOl0rM3k9K4j1jL9m9L4n7m6R7oJ6m2J6L2j7K0q1M6M4
$$ y = [13, -32, 33, 56, 49, 24, 57, -7, -23, -55, 10, -45, 28, 43, -11, 0, -14, -31, -1, -31, 39, 63, -16, 41, -1, -7, 11, -46, -28, 5, -32, 34, 8, 25, 40, 18, -44, -24, -33, 19, 18, 83, 43, -11, -10, 13, -20, 21, -15, 59, 39, 78, 18, -22, 31, 20, -17, 75, -4, 0, -24, -1, -22, -30, -54, -15, -36, 24, 38, 41, -16, -83, -35, 18, -31, -6, 7, -34, 6, 45, 2, -9, -14, 10, 27, 45, 7, 1, 50, -20, -55, 44, -2, 35, 73, 51, 1, -26, -19, -51, -52, -29, 63, -40, 28, -18, 38, 34, -13, 1, -50, -13, 25, 15, -22, 7, -72, 6, 1, 46, 17, 25, -16, 32, 4, -4, -30, -55, 49, -19, 75, -11, -19, -57, -48, 50, 32, 32, -34, 25, 21, 28, 37, -53, -39, -6, -11, 24, -34, -12, 10, -18, -31, -34, 16, 40, 37, -13, 62, -13, -39, -49, 2, 33, -10, -6, 24, 28, 6, 35, 1, -15, -16, 13, -44, 24, 25, 18, 17, 31, 20, -30, 44, -9, 26, 69, 13, 2, -55, -9, -38, 38, 10, 5, -12, -16, -11, 8, 1, -93, 14, 1, 36, 57, 14, -30, -48, -68, -23, 20, 32, 21, -6, 1, 37, -41, 29, -3, 46, -3, 32, 16, 11, -11, -21, -2, -41, 18, 31, 10, -10, 10, 52, -37, 0, -18, -15, 43, 15, 8, 14, -16, -25, 18, -11, 13, 2, 1, 40, -9, 25, -32, -78, 19, 13, 29, -13, 3, 35, 18, 38, -43, 3, 47]
5196D7p7K8K2l9K4j9l5J5oM8%qmRm3J1J6lj6j4O0l6k1J7j5L9L9l8pK2nk2oM8p0
5231c9O2kJ2l1M3Nr6L8K5n3O9M8j07N6n8K7nOJ0k1J3k7K4mk4j4N8J4qMj4k2l6
5264d7J7L8Jok1L9j2j3Lm2J9O7k7l1P8l4k0j2nj2%jL1M1p9K2j6ommrMK4L0o6K6
5300b7j6L9PJ1L0m5J4rl6K8l8Q8n0JnM4j1l2k1K4M1j1j8Nj5Mj7j6ML4M5l0K1r7
5334e4M4K3j3j0NL7j4m8L7qm2L1L6k6j3J0J0k0N0o2P3o9J6JK1J6k0j5n2R5k4n3
5366c8L6Qj9M7q9K0k6J1O2kj9P7r3j6PK7QJ9m4K4j1P1j3l8l1J1L5M0m3k9L5o0
5398c3J9j0L3k1L4K4ll1o7N2J0qj1N7m2l3k9O9j7l9J0K9l7K5J2ORl8M3j4Jj2P6
5431F4j4m6j0j6l2J5K4M2rj5k9QrJ7omJ2J09r7j1P7n8j1K2j4k7j5oK0Qk0RJ6P5
$$ y = [47, -30, -2, 20, -19, 5, -14, -49, -34, -40, 8, 8, 0, -4, 5, -38, -27, -11, -14, -30, -44, 16, -20, -41, -24, -39, 0, 39, 1, -6, 16, 11, -11, -17, 31, -39, 23, 21, 33, 2, 45, 50, -46, -8, 17, -36, 33, 81, -26, 30, -28, -1, -6, 0, 10, -11, 2, -25, -1, -5, -29, -43, 15, 29, 21, 25, 11, -11, -47, -30, 8, 9, 3, -18, 21, 9, -4, -1, -43, -24, 43, 16, -15, 63, 29, 9, -3, -8, -20, -20, -21, 10, 51, -28, -6, -22, -28, -32, -36, -45, -41, -17, 13, -53, -27, -43, -4, 3, 14, 44, -1, 13, 4, -32, -4, -42, 46, -4, -3, -8, 36, 25, -7, -28, -4, 37, 26, 8, 13, -2, 2, -15, -31, -27, 7, 52, 22, 43, -54, -10, 13, 0, -10, -5, 32, 18, -30, 7, -1, -43, -12, 24, -2, -15, -5, 5, -15, 35, -27, 46, -23, -7, -6, 15, 31, 11, -4, -56, 39, 15, -38, -2, 6, -13, 34, -55, -35, -61, -50, 12, 10, -9, 68, -25, -41, -34, -7, 1, 20, -24, 0, -11, 60, 47, 9, -22, -11, 24, 64, 21, -8, 27, -33, -14, -24, 9, -12, 22, 46, 43, 12, -55, -3, 7, -1, -12, 45, 3, -30, -59, 10, -7, -46, -36, -7, -44, -19, -7, -1, 8, -30, 13, -1, 0, -12, 64, 50, 4, -6, -22, -54, -39, -15, 27, 18, 3, -26, -18, -27, -10, -16, -20, -8, 101, 4, -7, 70, 12, 1, 23, 9, -18, -33, -39, -19, -11, -31, -22, -6, 69]
5465F9m4nj2j8rL7L0l2o3R0j4m0m7M5J4j1kK1K8l9j0K7j7m7M1j0j2M8L5m8m9l6
5497h0R8j7L4j3p7O2k6j3J6K0l9Q6l6ooM1o6L5L4p0N9k1m9N2j9M5q2N8l1J2N4
5528E5l1l8LpJ6Nj0LpLk2L3Jlj9qK3M1o6RJ7K7n3k5K3J5k3O9o3O0m4k4M9jl5N8
5564C1j7qJ8Pj9k4K2Pl5M8Ql4j2QM1k7ml4j0J9Nk9RJ5m4O3N0j0l7l0L7Nk3l6J9
5599b1L1mJ7J0o2PL9k2nJ5prM8j5k2L0ml4K3Nk4j0j5qL6J2K3p3Q0l7Lpo5j7P8
5634dMqJ7J6qrk0J2qL2L9k8n3N7j8mK2k4L5m6%KL8q0Rj8J5N4l5Q3n8o3O8j3K7
5669C3j0qjPJ9o6J0K1m5L5pL9J7j0Kn8N3k3j2Jk6P6k6Qkj5m9P7j6K7m3n1N4pK4
5704B8p8Q9k7J7J4o8Nk4J7K3k7M9m6K3Oj0L4m7k4N1JK1K3n1M7l8Kl9O3k2M0m1
$$ y = [69, 25, 20, 8, -10, -19, 18, 48, 16, -47, 43, 29, -11, -58, -13, 1, -10, -12, 9, 37, -2, -12, 15, -2, -49, -8, -18, -30, 18, 53, 5, -44, -80, 18, 1, 35, 22, -55, 7, -19, -32, -16, 4, -35, 51, 15, 9, 3, 44, -22, 13, 47, -23, 36, 15, -34, 18, -1, 44, -38, 20, -11, 1, 55, 24, -14, -11, -18, -2, 3, -7, -4, -11, -8, -30, 3, 4, 1, -18, -26, -3, 38, -28, -19, -2, 25, -28, -53, -30, -15, -38, 31, -32, 28, -16, -40, 9, 8, -27, 31, 14, 6, 24, 31, 12, -12, 10, 17, -18, 30, 38, 4, -8, 0, 41, 14, 10, -24, -34, -15, -10, -39, -30, -15, -59, 4, 54, 44, 7, -23, 14, 19, -4, -40, -21, 10, 6, 23, 33, -29, -22, 17, -5, -10, 5, -2, -11, 37, 22, 0, 30, 26, -8, 15, 20, -4, -14, -29, -37, -1, 11, 34, -39, 41, 4, 7, 0, -65, -82, -4, 0, -8, 9, 25, 17, 8, -12, 0, -8, 24, 63, 35, -18, 39, 21, 17, 39, 15, 50, 4, 4, 6, 44, -36, -27, -45, -30, 24, -11, 72, 14, -49, 19, 6, 33, 23, 15, 14, 21, 40, -26, -16, 5, -40, -5, -12, 27, 44, 34, 36, -22, 31, 8, -4, -3, -29, 47, 21, 29, 27, 12, -37, 40, 24, 51, 8, -43, 11, 4, 28, -50, 39, 12, 29, 43, -25, -20, -44, -27, -4, -31, 18, -28, -5, 1, -9, 25, -22, -46, 5, 6, 27, 50, -1, 46, 8, 10, -29, 34, 12, 52, 11]
5736A1m4k5N1K3PKL5o2nk5K5oj5J9L9m4LK1n6PJK0L6o3k6P8K3k1k5k5J3K6QP1
5770G7n6Pl3k4P1l7kk7J%J3L9l7kN3n9K9JK5k0j2Mo4J0J2K9k1k3P0j8k3pJ9k0
5804b5nN2kq4P5j3j7M6k5j0%J01o0m9L7j2l8Km2R2m0MPJ6np8R2j1k2MJ8o5L8M1
5838B2q6L2l1K2J04r1kL1j5oO4l4j6K9k0RK4k2mk3L4j6L2n9M4j4l5P2o3O2j17
5869g3M5K6l4kM6n8j9N6M6q4M2j0J7k0L4l2K1J1Rk7j1J5ll1N3o5L6L8l1Rm1L9
5901BM4q4O3N1n7j5K0nOj2rO4o9pJ3J7om4lPJ0L4j1j1K1k3j6N4n3K7j3L7k3J4
5935B3n8N4J3o9N2j5J6k5M2l3kl3N6l6M6j9ql8j1L9RJ0J2j6%Mk5J6l3K7RrL9J3
5969E0n7J4J1l4L9k7K0L0o7N9o2O7r9O3j3PL3l3J3J8l5j4L1Om3P3j6n9J9l4N9
$$ y = [11, -33, -58, -7, 16, 23, 25, 60, -2, -7, -32, -7, -13, -28, -9, 30, -14, -11, 10, -46, -39, -38, -18, 18, -45, -71, 7, 30, 9, -16, -41, -28, -2, 6, 77, 21, 28, -5, -29, 42, 5, 3, -24, -23, -23, -10, 29, -8, -10, 43, -16, 13, 14, 39, 19, 7, 11, -53, -43, -31, -2, -23, -46, 24, 6, -17, -24, -5, -25, -30, 22, 20, -64, 11, -2, -19, 27, 2, -8, -8, 93, 33, -16, 21, 9, -29, -27, -69, 23, -17, -13, -6, 10, 5, -73, 19, 8, -14, -10, 8, -57, -19, 22, -64, -32, -63, -41, 63, -28, -30, 1, -14, -20, 44, 10, -6, 23, 3, 12, 36, 14, 10, -13, 21, 5, 37, -22, 22, 8, -27, 45, -18, 44, -73, -28, -2, -36, -38, 8, -50, -69, -13, 33, -51, -9, -19, -2, -22, 12, -20, 1, 12, 21, -6, -17, -2, -5, -36, 17, -48, -12, 26, -5, 4, -37, 2, 46, -38, 25, 76, 19, 4, 24, 19, 25, 13, 4, 68, -1, -8, 5, 22, 16, -28, -31, -24, -14, 20, 9, -2, 19, -4, -20, 34, -19, 8, -5, 32, 9, 23, -35, 19, 32, -37, 15, 0, 16, -9, 33, 0, -2, -35, 21, -15, 31, 12, 4, -34, -45, -6, 3, 13, 25, 9, 9, 13, -12, 4, -29, -2, 7, -2, 37, 50, -7, 7, 18, -16, 23, -4, 16, 46, -21, 38, -24, 43, -56, 7, -6, 1, 34, 1, 14, 32, -3, -17, 14, 20, -23, 50, 34, -25, -6, -40, 19]
6000A9Qo6L9l0P8o9J3nk6K3K8J8mo6K7lj8jqK1M6J7K6q9pj1N6k6M4l4lnJ5J1l9
6035b1Lj7QL7l6O3n8L5p9L5m4Q2j9l7J9jM3njo6R3l4JK1k1Oj8N6J9l5l4N6k6k5
6069@L1%oqk4l6M8L2n1J8J1p6M1k9QL2J0l5J6L4j7n6O8ol7K1l1K5l0O3J4mj0Q
6103B4l4l4N6mn7Q5j13Q8Jk7K2k3Kj8O2J1J8o6J2nqQ%nmj9pL2RM7j4p1J2K1K6
6138B7L2k4mko9M4RM4n6L6Lj06J07j9lJ4l2QN8q2k7K3L0j1l7K6J2J8l9RK6l1j6
6171c2K2l1RJ0QM3n7K3j0K1K0j6Nk0J0PK3m4L9Kj2lk2M9o5NK4m6M5k2K4J9n3O
6205a9Q3o8J4k5M6n8O2J5p9L8k1qj3j3M7N9l6m6L7J3m7Q1o5J5mK6J1n2J8M4l1
6236B4J1lK7p1K2K6q2j9J8R9m7qPl0K1Lj9L7o5M8k2k9pM1l1L7M8k9OL1n7J1l2
$$ y = [19, 27, -39, 0, -30, 48, -21, -8, -13, -39, -16, 12, 30, 26, -40, -13, -16, -34, -35, -43, -22, 24, 41, 67, -22, -29, -40, 16, -10, 34, 0, -3, -8, 7, 18, -21, -18, -35, -27, 10, -26, 37, -21, 14, -65, -30, -74, 8, -11, -48, -29, -30, 13, 8, 7, -59, 34, 0, 1, 22, 1, 7, -11, 45, 64, 29, -5, 51, 25, 0, 31, 31, 25, 17, -7, -43, 5, 37, -14, 4, 15, -61, -20, -49, -41, -9, 1, -34, -18, 16, -1, -57, 11, 5, -32, -11, -42, -17, -47, 16, 30, 26, 16, 24, -10, -44, 12, 8, -49, 36, -77, 11, 12, -15, 7, -16, -14, -32, 30, 41, 59, -7, 5, 0, -8, 0, 0, -5, -9, -28, -35, -3, 6, 53, 39, -32, -20, 1, 27, 59, 35, 31, 29, -40, 4, 13, 57, 1, 37, 40, -66, 41, 22, 19, 33, 1, 9, 67, -15, -42, -19, 11, 0, -37, -11, 1, 19, -20, -11, 15, -16, -32, -10, -41, -32, -22, -14, 29, -28, -5, -15, 6, 26, 10, 15, -5, 5, 12, 35, -9, 30, 32, 20, 17, -5, 44, -21, -16, 8, -38, 7, -15, 9, 28, -25, -19, 64, -4, 10, -15, 31, -27, 35, 50, -29, 9, -12, -20, -33, -46, 1, 60, 24, -22, 15, 28, -19, 62, -3, 12, 8, 34, 45, -7, 11, 55, 24, 35, 32, 59, -12, 10, 36, -46, -65, -47, 52, 5, -3, 4, -26, -5, -2, -21, 16, -49, -1, -23, -52, -59, -18, -49, -12, 36, 7, 13, 44, -13, -2, -34]
6269c4L9OK5k9OMj2JJ5l3L3%KL0k0Pj05O0RPJ2l6K7k2O4n3l5N6l1j7j5K6J1Mq
6304fJ6mmK0n0N0k9KrM5ln3L5kl3M3n6L4j9M2l7J2J4j2N9k7q1N9nk1J3Ml4K7l0
6339d0L9Pk8J1K7m3J7l5oM0pJ2NM7k4r3R2J4m1l3O0L9p0K2j9j8L6k5k3P3Rl0m1
6372b6M5j4qqK9jp8P9n3P7m0j3j5L1om9O4n5P2k1K3K8j39Q6m6L6L7j7k1KJ6L3
6404D8n1L7j4k2j8O8k2k3j1L4j2j1j5J3pj9k1M7k7Lj8M5j7jj4k0P5j2K1K8p7M1
6436B8np5N3jK7k4J2K0j9m4J9K4J0j0Nm6K6j0M6l2j8j7RL1j5q4J00J1o1J2K9R
6468A0j7l0j1O5Ro6O8k0k5l9L7j9J9N4k9p9N8O4k0n6K2L7Nj8m4P7p1QJ8J0Rm3
6500a7K1j2L1o2L8k6L5J0j4k9M8n6j5j4J3O8n1K0K8j7k3M1L0j4Jl7M4r2P4k3k2
$$ y = [-34, 5, 11, 36, 7, 13, 17, 5, 6, 21, -12, 21, 21, 23, 53, 33, 40, -65, -5, 4, 11, 23, -13, 14, -8, 56, 3, -32, 24, -7, -24, -39, -13, -2, 2, -6, 10, 6, 2, 22, -28, 22, -7, -5, -14, 31, 28, -25, 10, 8, -25, 18, -38, -4, -23, 19, -18, -6, 8, -4, 55, 28, -53, 6, 1, -20, -7, -3, -37, -10, -40, -1, 6, -22, -11, 16, -27, -10, -45, -51, -11, -18, -6, -1, 46, 22, -71, 21, 35, -6, -39, 21, 60, -10, 12, -7, -25, 11, -14, -37, 36, 45, 15, -26, 19, 5, -3, -11, 18, 17, -61, 18, -35, 42, 2, -11, -26, 5, -1, -50, 14, -41, 31, 10, 33, 61, -78, 8, -38, -2, 35, 18, -3, -1, 15, 48, -3, 34, 20, -2, -20, 48, 26, 3, -8, 26, 14, 3, -12, 1, -6, -25, -46, 1, -26, -23, -41, 4, -13, -14, -28, -48, 27, 15, 36, 64, -13, 28, 23, -52, 1, 0, 27, 3, 15, 35, 16, -28, -9, 15, 25, 15, 20, -26, 0, -10, 36, 4, -14, -31, -22, 9, -6, -90, 10, 21, -40, -28, 1, 10, -7, -37, -48, 17, 26, -40, 28, 8, -17, -56, -19, -38, -19, 35, 6, -73, -15, 49, 29, -27, -5, 32, 37, 19, -25, 52, -19, -11, 7, 17, 26, -17, 4, -8, 23, -39, -1, -27, 8, 18, 4, -25, 23, -33, -48, -62, -49, 19, -32, -12, 16, -1, -24, 17, 47, 33, 34, -3, 41, -51, 23, 0, -22]
6531b2M2JJ6n5k4L5N5o8qnN4j4j8j9J3j5M0j1lM2n6L3k7J9n7QN3m6R2p5L2Rl4
6564a3j9M2N6k4l3j9n3P7L7k9%k4L6o4lJ8k2K7L0kk2l6M5m5L5l7O6J1k8ol8J2
6596b5OmQ1m6nJ4J7m2j8%J3j6M3J0l8J0OKJ5J3j06M4J7J3j8oL7k3K0j4o0P3j8
6629ek9K1L3n2L0l5L0JLoj5j6L7O5n8l8K8N5l5J9k7PP%MmJ4m7L6l7J9m6P4m2m2
6664e1J41p8m6PL1oj3M3RK1p5pQJ5j8oOL2jnm7L9K9m2J1L3m2P9r3%O8ol4pJ3r
6700aQj8j0K0m2JL4QmJ9Nk2%n0J3L6J5m4N3nk2M0o4k4L3L9m9L0l6J5oj5Q5j5k6
6735Ak9m6M5JM1l7J2K0k5M3l6J8l3j7L5n5Q0J1m1j1K6j2l0jP8q1L0M5o8nJ1k2
6767e2L2JL5j9L3m4K6k3kMKJ6RJ5N3r7N1m4lK6l4M5j3J1l0l0L6l2nkM0l9K0N1
$$ y = [-22, 20, 21, 37, -18, -42, -7, 48, -20, -28, -33, 21, 7, -11, -30, -17, -32, 8, -3, -6, 36, -20, 13, -14, 5, -52, -44, 9, -37, 55, -20, 12, 21, -13, -32, 10, 66, 42, 9, -10, -63, 14, 51, 22, 22, -2, 34, -30, -33, -15, -37, -10, 20, 18, -4, -40, 5, -40, -5, -42, 24, 35, 7, 1, -37, -25, -19, -23, 58, 12, 7, 21, 38, -4, -22, -22, -9, -25, 18, 28, -10, 0, 6, 8, 23, 36, -70, -26, -9, 4, -14, -20, 17, -6, 14, 0, -60, 13, -5, -34, -13, 20, -32, -2, -37, -7, -6, -3, -9, -24, -40, -3, 62, 4, -34, -6, 49, 14, 33, 6, 13, 20, 20, 24, 20, 34, -13, 23, -14, 5, -41, 33, -9, -51, 90, 12, -34, -27, 4, -2, -15, 28, 37, 58, -17, -24, -16, -1, -19, -25, -19, 13, 12, 7, -40, -1, 28, -14, -3, 30, -12, 67, -26, -26, 42, 36, 2, -5, 8, -1, 7, -11, -21, -1, -43, -42, -8, 0, -4, 15, 20, -2, -2, -52, -39, -3, 12, -32, 21, 16, -6, 34, -30, -54, -21, 18, -31, -1, -37, -22, -28, -43, 42, 27, 1, -28, -74, -29, -28, 13, -24, -12, 8, -17, 26, -10, 8, -25, -42, -7, -62, 18, 29, -12, -23, 3, -9, -39, -40, 38, -43, -13, 32, -36, -41, -30, -52, -20, -19, 16, -3, 30, -14, 12, -11, -13, -9, -7, 9, 18, 33, 86, -11, 40, -4, -7, 19, -15, 30, 17, 28, -2, -32, 4, -28, -33, -35, 5, -34, -14, 37]
6801C7lk6m1l6N0M4l9nJj3L1j1qj1K1j6L9n1R3n8J1PJ1K4l6Ork4j5O6n2%l0P7
6835C4n7J0j9J1k7K6qO0o3J2kM5K0j18K1P0l9m2N8m3J2N0k8J8K3Ok8k4M2K1p1
6866c0pM3K5Pl7J6K8p0j0J9K4Lk7rN2n5M2k5Km7JK9j3RPJ4N1m1K0rlkm1R1o3o
6902a2M4m6K7j6L1LNk9o0L9Kl1O7m4mM0j0j0lK8p8M8qJ6J9j6J7l0n2N3M0j7o3
6935e0J5j5J18q3rk7N6K9m2K1J8k9L4m6%M0k1m2L9J2j1mj1pJ9K5k6l3%Q5m8k9
6967b2K8J6n5k3L1K6qk1K1O2p6M2J6n9k9J8L2J4Rk2OkK4Kk9J5J1l6k2m2RQ2n8
7000d0N3k6N2l6j0pK8j7k3P9l5l7L6p3K5N8L0n8p2M4N0k0j3J7j4m8M4J1J7l1k6
7031d2M4LLM8p8J3L9m7K8k5p9R2L3pk3nm9P7l5J7rN7p3K6k1KM3l9Jl2K3J4j1J1
$$ y = [37, 34, 8, -33, -69, -19, 25, -14, -19, -18, -31, 0, -11, -19, -30, -9, -25, 14, -37, 56, -2, 9, 16, 27, 51, 15, 21, 12, -12, -27, 39, -13, -13, -43, 34, -23, -13, -32, -21, -48, -22, -30, 30, -33, -21, -23, 22, 42, -76, -55, 15, -24, -66, -8, -51, -39, 11, -17, 1, 24, 30, 2, -22, 20, 41, -30, -37, 6, 31, 38, 1, 17, 45, -25, -35, -16, 8, 11, -16, -25, 27, -28, 14, -11, -9, -56, -55, -26, -39, -30, -23, -9, 42, 1, 21, 12, 9, 7, -34, 57, -6, -12, 32, -14, 13, -3, 28, 31, 36, 7, -53, -14, -12, -43, 24, -20, -24, 16, 6, -4, -7, 21, -57, -9, -17, -1, 18, 2, 19, -11, -63, -10, 30, 13, -50, -35, -50, 68, -15, -24, -51, 5, 34, -8, 13, 31, 2, 36, -10, -10, 30, 9, -33, 6, 18, 7, 3, -8, -15, 4, 29, 3, -30, -30, 55, 7, -22, 6, 22, -33, -56, -25, 1, -7, -28, -7, 55, -21, 21, 37, -22, -51, -33, -1, 13, 22, 0, 6, 4, 28, 30, 1, 16, 27, -9, -31, -73, -64, 18, -40, 13, -13, 39, 3, -7, -14, 14, -3, -26, 53, 18, -19, 17, -56, -31, 27, 57, -1, -73, -29, 21, 1, -12, 5, -9, -57, -13, -2, 15, -16, -42, 2, 5, 8, 56, -22, -9, 30, -17, 11, -14, -93, -1, 32, 25, 2, -3, -52, 25, -10, 7, -2, 55, -18, 8, -13, -11, 32, -7, -6, -38, -15, -1, -12, -1]
7065aj3mK7J4pk0rL6K2m3l9J27n3j1j9J7Np1M8pK5o3K1m6M7LJN6k1l1j2j8J0J9
7099a0l5N4j9K1k3MK4K4m1K4mn7j7J6M1ML8m2j6l9Q0m1K6M8l8M4j26N0K2pK6q
7131B3n7J02k0n6J7Jj0n9O3J0l1K4m4P6p1M4Mnl4M0M8o8L4n2N3n4j1R7o3Ql1J2
7163a0j5J6Mj6j0Mj2M6N4n1krmMK6o4M8o0N8J8k0j0M8M7p4nj9l6M1j0Mnk6Q4m9
7198eM1n7J5%RKrl3N1k0m0J1qRN3j3L0q0N8k6LM3l1LJ5j9L0q7j7J00kl7k1K2J3
7233Cj1M6k7lNk8o0N7K0k0K4%QNR%l8Pj3jj8N4j5K8m3l4M2K8k2L3k9k3M1k0jl0
7269b6J5%rL1Qk7k7J3k3K3k1M1j5n7N9j3N3k6J6J2m8K9J1J1k4L0k9J1r6N7l1M3
7301iJ3Qm9P6j5pol9l0M5k2L9Mk7L6n7N1KKn3j7K1K5j6L6K8m0%ML2rj03N4J5J6
$$ y = [-1, -14, -18, 9, 23, 16, -4, -13, 23, 45, 2, -37, 90, 37, 26, 7, 24, 29, -42, 6, -1, 24, -39, -18, -64, -17, -14, -13, 43, 22, -9, -21, -39, -29, -10, -45, 9, -10, 11, -12, -8, 16, 40, -1, 23, 19, -38, -55, -39, 2, 6, 44, 2, -14, -53, 27, -14, 12, 60, 22, 66, -60, -10, 12, 5, 31, 23, -34, 68, 48, -8, 9, 10, 0, -59, 4, 14, -17, 7, -37, 39, -32, 12, 16, 11, -23, 17, 65, -3, 31, -21, 32, -22, -33, 64, 1, 9, -22, -10, -25, -9, -5, -21, -31, -27, -39, 7, 61, 10, 8, -1, -5, -1, 25, -39, 9, -51, 7, 25, 5, -5, 43, 90, 16, 11, -8, -44, -3, -13, -9, -14, -40, 44, -5, 36, -21, -6, -6, 3, 5, -4, -37, 14, -6, -46, -35, -43, -34, 19, 6, 36, -44, 14, -12, -9, 34, 3, 6, 21, 2, 32, -55, -72, 28, 26, -11, -32, -10, 3, -8, 38, 11, 8, 13, -15, -75, -18, 2, -18, 6, 6, 14, 19, 28, 28, -10, -3, -16, -17, -35, 19, 4, 32, -11, -45, -3, 25, 3, 36, 7, -16, 25, 5, 4, -26, -11, -11, -20, 11, 19, -8, -35, -22, -45, -22, -43, -2, -17, -74, -15, -28, 25, -1, 15, 27, -21, 8, 19, 30, 6, 36, 7, 18, -78, -21, -52, -9, 4, 12, -37, 39, 24, 17, 11, -28, -58, -13, -35, 4, 8, -19, 17, -40, 11, 13, 15, -38, -55, -34, -9, -25, 11, 39, -1, -1, 3, 35, 26, -77, -23, -8, 8]
7336Hk6mM5M1m7l9L4l2N3nj7rK7m1K0k9Nm6M7O4q5J38j09K0rL7j0l9N3o4j3j3
7368d5L1MML0Oj9N2m3k9K1qL0l0j9j7K4ql4J16k7j13O8J5Ok0l2J7mL2j9L9k4P0
7401G4j22P4Lk7m2L9J9mK5o4N1m7k2P1k2mJ7K0n0K4l1L3l7j9N3qk0m3Q4m9N6m1
7433ik7L3J0P1q7k7K6K0n8J12j20Q2J0n6K0k7M1Pk0JJ6l2l1oP0M4o9j6M0nK8k2
7465A9%l0l7O7k4L8K6j15N7l2M6mNnJ8mo3N1j7PN3m6j1j9N4o2O8l7jOJ4j6rM0
7499C7K1o4J6l3JJ6k5j4R3n2K1j3j3j9nj7L1M1l2j0J6jl7J5M9m9N6o5J2J5j4K2
7531aj0pk6N6nj7KL1l4k5Q1o1L2J5l8plL1l5k3L1M2j9l7j3K8Jj4L1m8O3r2M4J7
7565a0K8q8O5l2kK8j2O0m7L9o3N7o7L8k5P2q6J00j7m1m5O4n2N6Qj5m8l8j5Q1j0
$$ y = [8, -18, -22, 23, 64, 17, -22, 12, -20, 33, 28, 11, 2, 29, -12, 8, -21, -16, -62, -15, 49, -36, 102, -7, 13, 4, 41, 31, -8, 45, -19, -32, -45, -14, -10, -6, 24, 30, 11, 63, 20, -9, 12, 4, 34, 4, -15, -32, -8, -16, -50, 66, 39, -74, -6, 9, 15, -5, -37, -20, -24, 8, -11, 28, 4, 74, -48, 26, 29, 2, -40, -1, 18, 14, 39, -25, 26, -21, -43, 28, 6, 2, 19, 39, -11, 13, -18, 15, -22, -41, 12, 4, -16, -59, 25, -24, 32, -9, -36, -3, 7, 78, -9, -36, -10, 10, -48, 64, -56, 26, 36, -20, 0, -27, 14, 21, 1, 2, 18, -14, -45, -51, 19, 63, -6, -22, 18, 13, 41, 19, 19, -11, -48, 19, -5, 33, 59, -56, 1, -31, 15, 11, 16, 11, 29, 25, -38, 13, -4, 3, 56, 10, -1, -20, 34, -28, 40, 3, 2, 8, 22, 6, -3, 37, 58, -6, 10, -23, -22, -6, -31, -45, 48, -4, 17, 4, -9, -28, -33, -50, -19, 22, -10, -20, -4, -5, -42, -27, 22, -27, 29, -36, -24, -9, -23, -1, -11, -18, -44, 12, 7, -10, -8, 23, -11, -36, 45, -16, 16, 31, -7, -14, -17, 14, -21, -44, -13, 29, 10, -27, -40, -12, -11, -25, 6, -42, 21, -71, -27, -10, 18, -70, -5, -37, -39, -11, -23, 37, -10, 29, -34, 23, -44, -6, -31, 41, -45, 55, 38, -3, -48, 16, -36, 20, 28, 13, -35, -73, -88, -7, -17]
7596a7J6l0Q9r2rO6k2M2pn0k3N6j8OK3m3Mj3KO4q7L1L4q4R9J0k4mj2m5O8m6J3
7629cJJ0Nm8J8L3pj1l6L7m6N4l5L9J1Km9K2rK9k3K1o0N8M0o7L5rl1K4Rm4K3O6
7663E9j4K6j19J00q7L7Ql0K7l2j6L4J2LM5n8K0n7kJL8oK1m6J7K1Ll4J2K6k6lK6
7696FMl0L6Pn1O1l4%L8k7J6k4L0k9mJ4m4PLL0l1M8j8oK3l0kM2m0l7P5j08P9Lj
7731Fj7mj8k8L3jP3m4K8J2r2O9j7Ql7M2l9L6J4Ko3K3O8k5J8n0k0K9j3L3Jl6Ln
7765a1k9K2L6Qk4K0j3n9K2K8J0Jl1N0rk1J8j8K0L2m3qM0n7j6P3l4o0N9lj5J5J
7798Dl6K6L3j3Opl8PpM1L2o3Ml8N2l3K8nk6QL5l3j1L6M3n9J7M5n0m9M3N3k7k2
7832dk5L7Ql4k0L5j0P7m9p4Q6p2M0l1L7k1J4k4L8J0k6J1k1K6l4kJ3L9pk9k2J5
$$ y = [-17, -1, -31, 58, -34, -43, 23, 1, 43, 36, -14, -37, 19, 1, 7, 30, -13, -9, -22, -20, 44, -43, -12, 22, -62, 37, 47, 23, 19, 7, -38, 30, -16, -3, -2, 8, 13, -35, -17, 16, 9, -2, -38, -1, -47, 7, -28, 11, 22, 24, -25, -3, -12, 17, -6, 15, -45, 13, 53, -14, 21, 12, -19, 5, 14, -30, -7, 59, 45, 71, -48, 52, -35, 2, 10, -20, 7, -25, -41, -7, 5, 8, 53, -5, 15, -42, -44, -43, -5, -11, 10, -36, -19, 2, 5, -29, -17, 9, -17, -20, 6, 10, -20, 16, 23, -28, 33, -1, -1, 37, 10, 26, 2, 32, 3, -1, 13, -31, -24, -21, 9, -22, 26, 8, 2, 25, -5, -7, 35, -5, -42, 33, -75, 4, 7, 6, -11, -15, -33, -61, -28, -29, 44, 0, 28, 40, -52, 17, 0, 8, -29, 13, -26, 10, 24, 26, -37, -14, 54, 29, 47, -3, -23, 6, -7, 26, 27, -9, -6, -11, -40, -18, 18, 26, 2, 22, 9, -50, -28, 0, 10, 11, -20, 30, 21, 0, 18, 0, 20, 52, 9, 1, 41, -16, -32, 41, 7, -53, 6, 3, -12, 3, 4, -32, -6, 27, 14, 20, 13, -25, -18, -25, 16, 48, -15, -11, -49, 3, -30, -2, -7, -33, -25, 10, -23, -34, 2, 45, -14, 3, 48, -2, -51, -8, 45, 18, -4, -29, 8, 16, -18, -38, -3, -13, 64, 15, -59, 27, -45, -5, -36, 1, -20, -6, -30, 8, 18, -8, 3, -18, 8, -26, -28, -15, 24, 17, -12, -34, -19]
7864a9j8j6P2k8k6J4K7k0N6l1j0PJ1j1k0%j0J7qM2j7qk6L0o9K9L5k1kj5J7rO6
7897C9n3M4j6m7O1m0RKk8P4k6L2m3J8J1m7L3m5L1l2L9k6N7o2J5N7p8M9l1J1j5
7928gO6p2J8ml6j4K3M8n6J6L4o7K0O5m4ml3O4k1j7O3l0k0L6Qlm2j7L3L2m9j8L2
7961DL5k6k3K2m1N6m1m1J7K7K9m3L7qm8J7M4J0J0m9J4j5l0M6j7J%l0K2J5m3O8
7993A9J8n3L0l8K1p4P6j4J10r7L4pj7J6k7K6l4%K2n2mQ9q2J4L4m0J3M3j6m4K1
8024a3nK5n6oL4m9K6qN9k1RO2m7qj7j4J2nJ6Rl8JL6n8M7Q9r9P2k5k0PJ6n7K5K3
8059B2j1o0nN8mL7n7J1K0M3p5j4L8l3N1j0k1K5oK3j5j7k7J03q9N4k6jp9M2P4m1
8091A0K2l3n2LL0j0P2k9J8k1p5J9M4K1k8Ol7K2N1m9K0Jm0OK5L2m8%Jj2O0Rr2Q1
$$ y = [-19, -37, -53, 19, -9, -35, -21, 6, -14, 42, 11, 1, 8, 19, 8, -12, -12, -22, -5, -13, 29, 12, 4, -22, 8, -61, -32, 3, -18, -20, -35, -18, -27, 39, -14, 30, 14, -33, 28, -12, -3, -1, -29, 45, 19, 51, 8, 26, 37, -10, 23, -22, 9, -23, 16, -10, 47, -15, 0, 57, -21, 28, -3, 8, -7, 59, -13, 5, 1, -35, -49, -26, 22, -34, -18, 16, -51, -31, 34, -10, -14, -47, 17, -4, -21, 42, 12, -8, 28, 36, 33, -9, -26, 7, 39, -10, -28, 4, 39, 13, -10, 12, -29, 27, -14, -55, -38, -11, 18, -25, 12, 4, -44, -27, 17, 27, 37, -12, 2, -13, -43, 3, -14, -13, -13, -43, -21, -6, -49, 19, 37, -16, 14, -24, -3, -77, -1, -15, 95, -2, 32, 25, 8, 24, -3, 23, -11, -11, 11, -41, -45, 44, -38, -24, 10, -30, -17, 26, 10, -34, -13, -18, 7, -49, -55, -21, -70, -44, -52, 7, -14, -5, 57, 10, 2, -15, -29, -17, -22, -6, 3, -35, -34, 2, -56, -9, 80, -19, 53, 28, 8, 15, 31, -26, -1, 22, 11, -49, -54, 4, 0, 37, -20, -9, 11, 54, -21, -35, 3, -30, 21, 11, -10, 15, 9, 32, 17, 0, -27, 76, -13, 41, 15, 14, -65, -23, 51, 10, 32, -1, -53, -50, -20, -30, 42, 13, 31, 10, -65, -46, -2, 19, -9, -3, -40, -18, 33, -16, 4, 5, -35, -29, -4, 28, -20, -20, -19, -31, 29, 38, -54, 27]
8125B7JJ5k6Jm5LO2n2L7o2K5qK7j2o3L2O0j7k3K6n5O9k1k2LL3l3J1L3qnM5o1P
8159Dk9k1R0m4Kk1J4M1k9qMo6Q8l0Qk3j1M0L0m7J7J1l8Q0m2l0j2N1j0J2l9K8
$$ y = [27, 28, 43, 17, 18, -27, -24, 38, -14, 23, -39, -14, -22, 5, -7, -70, -38, 22, 5, -18, 8, -47, 22, 1, -21, -18, 15, -18, -7, 26, 18, 13, 58, -3, 4, -25, -46, 44, 0, 2, -19, -5, 36, 7, -1, 3, -63, 25, -5, 3, -20, -31, 9, 39, -8, 9, 20, -18, 62, 20, -10, -22, 29, 19, 31, -8, 20]
8191B0
$$ Imaginary data points
##PAGE= N=2
##DATA TABLE= (X++(I..I)), XYDATA
0@%%%%%%%%%%%%%%%%%%%%%Qj6J6j6J6j6J6k0K8l2L4l8M3n0N5n9O7p4Q2r3J01j11
43e9J25j40J54j68J85k04K25k48K73l02L33l69M12m59N13n77O56p57Q81j042J264
64F96j585K087k951M722r709M9322K06973n55q2436q4137j78035j57299J8664
77b34243J09105J32290J67072R2041p1120j46404j51660j28239j3633J25587J60161
88D0957J29458P0870n0211j54424j49805r6611j9279J09283J76603J10692L9152
99B06685j4261j34256j98487q5598M2350Q1727J30337J49167M2852p3759j10994
110C5763j35686j14947J1804J21512J27599J06678O1508n5569j46543j28439o8791
121a85111k28R5619J44228J01129L4530m1121j30331j40004n7727J1601P2502
$$ y = [0, 0, 0, 0, 0, 0, 0, 0, 0, 0, 0, 0, 0, 0, 0, 0, 0, 0, 0, 0, 0, 0, 8, -8, 8, -8, 8, -8, 8, -12, 16, -16, 18, -20, 23, -27, 28, -31, 36, -38, 44, -49, 52, -59, 66, -74, 80, -88, 97, -107, 118, -130, 143, -159, 174, -195, 217, -242, 271, -306, 350, -407, 474, -568, 696, -889, 1198, -1753, 2969, -6740, 42582, 249555, 249000, 166564, 82427, -95608, -252907, -234243, -125138, 7152, 174224, 266265, 195145, 48741, -102919, -231158, -244791, -119204, 40957, 170415, 241285, 191074, 36650, -113155, -209766, -229045, -119762, 56841, 167533, 206685, 192424, 58168, -140319, -225917, -183567, -101840, 28497, 177664, 220516, 146757, 35763, -99923, -214870, -203066, -81554, 46045, 152723, 214231, 158662, 12119, -116320, -185111, -185339, -89720, 54508, 155637, 190167, 149046, 18715, -121289, -179016, -167415, -94913]
132i4913J47796J24455J282o9355q7234j20652q8584K4628R3933J09762J12992
143A54110L9740q1644j18689r0891o9045N12J03555J24545P6745K9100m6452j23903
155b317j10410m2434R699P6567J29795Q7637M469m5423r8318j25411n1700M5037
167a22809P5408R1117R4894K2006o7220r4524r5555o7546K6432J03974R5796O2777
179A24750K4414n3623j08955q7170m0794J1501Q4519J12343O2882N348m3083r9863
191g731j02316l2034L1020O8667J01849P7348o631o0419p4895q7536n3781L3033
203a13426Q5140Q4789O8790J3491o9008r6288o6734l3977J6162Q1358R4801N3242
215A18340N614m9140r6015q1049k2536K5449O8674R5959N9639r995n2616p8924
$$ y = [-94913, 52883, 177338, 178620, 109265, 22031, -98621, -187205, -162577, -68644, 41118, 154110, 193850, 112206, -6483, -97374, -166419, -165907, -62352, 62193, 138938, 168038, 121586, -2317, -112727, -155161, -145462, -68895, 60900, 148537, 153006, 107583, 9265, -116146, -167846, -122809, -47401, 43716, 138610, 160616, 93396, -1128, -96683, -164229, -137797, -33823, 61973, 124750, 149164, 95541, -13414, -100584, -141378, -129877, -45358, 66985, 129867, 135215, 92132, -7731, -110047, -142081, -111061, -42394, 59455, 136803, 130172, 69753, -5142, -92678, -146459, -113426, -28286, 56503, 125293, 138784, 69776, -26512, -93246, -127223, -111061, -29703, 65098, 118340, 123954, 74814, -21201, -102250, -124786, -99337, -30663, 65296, 124935, 114940, 62324, -16600]
227a6600q3684k8255M2175O6286P2250O6442N740o7898q3759o4873l3277L1765
239i3688Q5510P4221L8408N903m8485q9884o8194j8776K5697P3018Q7099M1727
251A12556j1899m7155p8808p3671j5474L8268O2996P6383N1051j4695n7439o5206
263b3093o5833l1075M0756P8321O5296M1112l129o2233p7794m7913j6929K2949
275g9565P1755P7141L5132j0091n1162p9187n8515o054L3228O1166P3109L8598
287A05555j8264n1576o6060o0618j3071M2434O1249O0221M4146j0105o5010o9305
299d0404m4296j3511L4332P0572N8806K5755n581m8214p6269n2359l255L5229
311e9195O3273O5066K6508j9279m7328o4184n2915m692L9724N7357N9208L3679
$$ y = [-16600, -100284, -128539, -86364, -20078, 52172, 118614, 124354, 56456, -27303, -92176, -125453, -93688, -8178, 66043, 104451, 110354, 61869, -28015, -96209, -114985, -89288, -16270, 70829, 112556, 100657, 53502, -25306, -98977, -114451, -76183, -13187, 63196, 114247, 99552, 42113, -23093, -88926, -120001, -79245, -924, 64372, 105484, 102355, 40122, -37672, -85585, -102514, -79565, -7810, 69331, 104463, 94372, 43210, -35977, -94492, -100546, -67318, -6152, 66957, 105555, 87291, 35715, -30345, -90963, -104034, -61600, -351, 59870, 104016, 93911, 28901, -40404, -84700, -98211, -63879, 6693, 65499, 91254, 85673, 37459, -38810, -91169, -94424, -59195, 4078, 69144, 95652, 76373, 29045, -35139, -88054, -92746, -53022, 4335, 63543, 97222]
323I7222j9819n5555n7830m6914j2693M2644O7936M9894K2641j1706n3671o4200
335d2051l7010n532K8609O4240O2366K0077k1305m9303o2607m0871L362L4789
347d5236N3121N6953K5118k3159m9563n5836m3834j489M2908N4954M7486K6789
359H8212j9488n8643n4720k9808l387L4009O0055M7409J6391j4178m8750o3591
371d6489l5299P837L7018N3339M8281J4941k1976m4618n3943l7828M238L9651
383c4848N1480M6231J9052k4886n1027m8129l1921j84M0920N6525L8245J2015
395G3473j7053m8016n3690k7579M393L3356N5714M7162P639k7633m3808m6922
407d2964k8860O793L5483M8433M3797J3415k7217m7635m5526k7734P180M0807
$$ y = [97222, 77403, 21848, -35982, -82896, -95589, -52945, 14991, 64885, 87526, 75820, 22149, -42051, -79061, -84593, -55984, 8256, 70622, 90699, 69394, 20091, -42516, -83387, -80025, -45236, 7885, 64838, 89956, 66797, 17234, -38602, -82436, -83925, -41017, 13937, 61423, 88212, 68724, 10081, -44639, -74447, -77834, -43825, 16230, 63639, 80030, 65852, 17102, -46489, -81788, -73951, -36933, 16406, 64687, 79628, 57652, 13034, -40909, -78737, -74499, -34848, 16632, 62863, 81915, 57029, 6002, -42127, -74048, -74232, -33312, 23213, 61458, 73473, 56420, 8404, -45286, -72865, -68472, -35116, 20598, 67760, 75399, 47766, 3958, -42964, -71824, -65031, -29548, 18885, 62682, 76097, 48880, 1245, -44281, -72015, -64835, -24028]
419b4028M7513L5299J3346k3096n1098m4375j9561M427L3820N2900L7483N001
431F7631k1968m4828m9973k1669J5456L5445M3246L6253O956k4915m1927m4479
443d4772k5622J2475M0451M3971L3126O870k8313m4826l7230k0369P275L9492
455a7472M6842K7765M422k1108m5385m3737j5789J2734L4735M6539L1805k371
467E8980k7243l7584l7820j9412J2277L5583M2976L2418J602l0912m1967l4125
479d5227j5801J2987L7355L9852K6027L216k6149m4040l4889j1598J1764L4379
491a2124M3623K6381l065k6302m0153l6383j0571J7943L2558L6267K6885J2k7898
504B7173l9239l4447j3691J8307L8719L5615K0117j262k6589l8989k9967j0916
$$ y = [-24028, 23485, 58784, 72130, 49034, -2064, -46439, -66000, -61573, -27753, 25147, 62630, 67631, 45663, 835, -49138, -70807, -55351, -19906, 23340, 59593, 66549, 41634, -293, -44772, -70394, -57919, -17468, 26503, 59629, 66499, 38186, -6640, -43870, -64239, -56964, -17472, 29370, 57135, 61557, 40449, -4936, -48673, -64462, -51728, -16993, 29546, 61351, 58980, 31737, -5847, -43667, -63079, -50802, -15219, 27757, 60175, 61777, 30865, -11102, -45227, -61028, -48041, -10686, 29166, 55193, 58409, 32260, -11780, -46669, -58267, -46503, -12124, 31499, 57880, 54815, 28513, -11640, -48023, -58594, -40651, -8093, 28174, 55059, 55071, 27173, -12066, -46513, -60204, -41897, -3178, 32437, 52554, 51292, 24703, -14286, -44253, -55169]
516e5169J2893L6771M0073J9079n161k4420l8667l3053o598J8034L2127L6547
528C2456K1578p492k6951l2888l0667j1357J8398L5369L4382K0802o001l1082
540A6547l4828k4163q448J5395L5264L2986J6665k962k6743l9392k6173k715J5735
553c2832L2006L5945J5959r887k5259l3125k7728l971J9775K9598L0666J9454
565E0601o923k9356l4225k4968l748K1437L2297K6696J4318n116k6911l3865k2938
578d2701m538J7606L5048L1004R817r582k3989l2767k4035n0J9410K8699K9425
591C3347J4218j1068k6949k9009k2464m061K1141L2966K6446J0458j0162k7399
603G464k9079j7943k221J6906L1436K7952J0109r670k6897l2424j7945L622J7916
$$ y = [-55169, -42276, -5505, 34568, 53647, 48486, 24066, -14601, -47654, -54252, -36218, -4091, 32456, 54034, 46542, 19591, -13297, -43964, -55321, -36923, -1554, 32828, 53630, 47629, 16547, -18281, -42444, -50892, -35497, -233, 32753, 49418, 46456, 19713, -19679, -45852, -48567, -32832, -826, 35119, 51078, 41191, 15932, -17193, -44921, -48892, -29117, 481, 31147, 50601, 43678, 14322, -19903, -44871, -48619, -27182, 5115, 31811, 46129, 41013, 14102, -19763, -42701, -47239, -29633, 5415, 36419, 46236, 36654, 12665, -20102, -44137, -44187, -24777, 3922, 33347, 47565, 36497, 9548, -19461, -41925, -45986, -24845, 8121, 34567, 45025, 34863, 7464, -21615, -39558, -41779, -24873, 6563, 34515, 44624, 34954, 8057, -24367, -42312, -38690, -20774]
616b0774K7508K7600R500j3148k3990k7136k1264M44K2485K8098K3130J1042j1280
629C2215k8717k7568j5235J266K0074K8624K1235Q086q396k6375l0079j5365L135
642c7100J9325L0156K2994K773j2149k1442k7420j7573N065K0500K5148K3040
654C3317P611j4759k5783k3745j5059K602K2329K7586J8471M410j1783k4657k4360
667b3820j2910K654J9386K8412K0692K805j3560k4747k4914j0645P086J7736K3357
680A1532K1195M660j5101k3740k2590j3496N769K2656K4330J5872M115j2954k5789
693c541k2217q465N485J8421K4766J7467K296j2883k4284k3915q828Q625J9367
706g706K3196J6395j93j3809k0108k1764j1946Q229K1431K1768J5828K255j6355
$$ y = [-20774, 6734, 34334, 43834, 30686, 6696, -20440, -41704, -41260, -18775, 9323, 32453, 43495, 32215, 3498, -24070, -39305, -38039, -17965, 10659, 31894, 39980, 31584, 5209, -24870, -40235, -37100, -17775, 12381, 35375, 38148, 25999, 4557, -22863, -40436, -35371, -14871, 10277, 33317, 40928, 26169, 386, -23359, -38418, -35816, -13487, 14099, 32570, 36980, 25197, 540, -23820, -36730, -34076, -14690, 13722, 34414, 37219, 23659, -1088, -26002, -36647, -29561, -11825, 11532, 32727, 37387, 22286, -1454, -24044, -37540, -31771, -9115, 15215, 31087, 35202, 22248, -3541, -25758, -34223, -28738, -10317, 14449, 31916, 34212, 21329, -2955, -26870, -35698, -27073, -7706, 15490, 31885, 31692, 17883, -2225, -23989, -35935, -27706, -6275, 15493, 31321, 33576, 17221]
719A7221k4045j7808p592N581K0223K3613J3128r9j2774k2500k0549p260P558
732b5303J9428K3718J4043k870j4696k0360j8976o647Q925J7523K0539J5906m15
745C0815j7074k1681j6941p065R169K1058J9298J0468J17j3632k2844j7316m075
758b9703P980J8220K1458J2332k873j5036k1205j7343l399J0531J7467J8536J1733
771B8698k350j4633j9481j7399n875J1332K0532J7480R637k069j5815k0570j3480
784b3993l170P653J8454K0221R318m231j4280j9828j5826k267J0865J7866J8150
797A8932R059n402j4643j7333j4522l660J0635J7886J7295J0367m579j7889j8472
810a2326j1023k234R408J8730J6248O639l188j3926k0153j3353RJ0425J7095J7332
$$ y = [17221, -6824, -24632, -32224, -26643, -6420, 17193, 30321, 30222, 17448, -5052, -25601, -32861, -25303, -5875, 17843, 31886, 29016, 14320, -6040, -25016, -31663, -22738, -5215, 15324, 31230, 30815, 13741, -7940, -24881, -31946, -22777, -1719, 17579, 28047, 28164, 14532, -8312, -25628, -29703, -21723, -3503, 17955, 30287, 27414, 12378, -8827, -26170, -29569, -19038, -1571, 16965, 28698, 26348, 11715, -7766, -25165, -31040, -19708, 824, 18304, 27941, 25872, 10057, -10513, -23993, -27163, -19510, -1056, 19165, 28483, 24252, 9972, -9856, -25682, -27949, -17084, 782, 18932, 27991, 22589, 7946, -9387, -23909, -27569, -16934, 952, 18247, 28614, 24035, 6146, -12326, -23349, -25583, -16175, 2555, 18803, 25442, 22254, 8328, -11825, -25178, -25169, -14744, 2351, 19683]
824A9683P138o429j4912j7295j2300j12J1044J5874J5498Q089n468j5712j7264
837a2166j2193o77J2813J7919J3059N083m468j4708j7449j0157oR769J7474J6125
851B0418M709p463j4430j6178j0563J192J1813J5842J3493N090o616j4408j5468
864a2569j0417L87J2051J6829J3284M420p322j6096j4604p032Q31R572J6572J3755
878A9661L146o719j4023j6467r036L722J1851J4486J2456L382q034j3925j3738
891a3238q618K092J1890J4737J1921L880p915j5597j3904o631K558J2158J5080
904H413R655K099n802j3983j5164o753L439J1117J5381J1646M50r040j2729j2497
918a3768p065L467J1747J3789J0348J884q305j3861j2872o280L954J2411J3955
$$ y = [19683, 26821, 20392, 5480, -11815, -24115, -24227, -13183, 2691, 18189, 26278, 20810, 5098, -12166, -24359, -25036, -12223, 5696, 18755, 23838, 19370, 4662, -12787, -22944, -22950, -13181, 4293, 20418, 25127, 17664, 3234, -12944, -23507, -22315, -10502, 5340, 18833, 23923, 17307, 2899, -12569, -22986, -22599, -10548, 6281, 19565, 23985, 16663, 567, -14037, -21069, -20238, -10666, 5906, 19661, 22807, 16088, 2065, -14402, -23438, -19716, -7865, 6621, 19077, 22459, 14425, 500, -13238, -21856, -19764, -7874, 6863, 18784, 22664, 14749, -848, -14752, -21383, -18825, -6667, 8413, 18068, 20167, 14365, 382, -14782, -21535, -18096, -6979, 8402, 20048, 20498, 11458, -1271, -13768, -20833, -17366, -5619, 8170, 18518, 20402, 12097, -1764, -14636, -20916, -16962, -4551, 9404]
931I404R208Q00q648j3793j1202m672K562J0710J4985J0106k70q952j3373j2312
945a5447m473N496J1316J2050Q840P72q711j3286j1231m810M323J2125J3435Q025
959A8424o11r150j3125j0423l581M603J1419J2668P220m96p700j3127j2109l223
973a9211O444J1257J2179P528k094r359j0956r806m610N289J2395J1706O661p55
987A6668r518j2999r353k269N464J1554J1647N684j788q298j2259r413k212N080
1001a2012J1162J2749O250l659r434j1055q992j713O743J0106J0029O788j487
1014A5475j0163j2200q161j624O434J1614J0449M517k726r149j1238p690j248
1027a5710N692J1184J0641M438k844q785j1765q633K24P498J0100R338M494l508
$$ y = [9404, 18612, 19412, 10764, -3029, -14231, -18903, -16341, -5631, 9354, 19460, 19190, 10238, -3135, -15447, -19920, -14424, -3108, 8942, 17782, 18554, 9843, -3443, -14674, -19484, -15161, -3036, 10399, 18424, 17813, 8663, -4462, -14885, -18466, -13863, -2444, 10224, 17444, 16948, 9248, -3879, -15988, -19211, -12767, -1510, 10669, 18197, 16103, 6744, -4212, -14018, -18628, -13339, -944, 10762, 17423, 16668, 7150, -5849, -15202, -17471, -12007, -453, 11194, 16878, 15090, 6792, -5467, -14880, -17092, -12012, -850, 11899, 18149, 14490, 5056, -5999, -14991, -16704, -9961, 145, 10174, 16962, 15475, 5312, -6888, -15049, -16673, -10239, 1375, 11824, 16341, 13615, 4466, -6772, -14462, -15710, -10018, 1166, 11807, 16245, 13401, 4616, -7149, -15782, -15558, -8060, 2040, 11378, 15872, 12364]
1041A2364q933r919p794j745O995J1931R474L258l548r292j0655o510J04O400
1055g870J0312R309L472l399q880j0822o951M93O969J0378R484K892n086q803
1069A498q754o573k83P364J0071P941L837l263j0527j0621m852J357O558J0147
1083C900Q005J967l802q317r919n942J063O978J0013Q492J831m880q557r538n596
1098a4302K214P671Q380P116K918m376r272q799n291Q35Q096J0436O456P73m465
1113H390q440q675m276J486O726R490P383J233m966q911q937m002K680P256Q715
1128E152O739P51n405q058p563m619J672P802R213O142R86n366r359p877k486
1143a2276K613O605Q421O101N85m916q330q350l645L212P753Q356N617j26n612
$$ y = [12364, 3431, -6488, -14282, -16027, -9032, 2899, 12373, 15631, 12083, 2791, -7864, -14374, -14270, -7870, 2442, 11751, 15223, 11824, 2944, -7878, -14829, -14336, -7367, 3011, 12495, 15387, 10301, 1498, -7256, -13829, -14112, -6748, 3323, 11264, 15101, 11838, 1311, -9310, -14162, -12805, -6247, 3900, 11905, 13872, 10070, 1753, -8166, -14108, -13045, -6067, 3946, 12438, 14269, 9389, 832, -8706, -14302, -12088, -4417, 3963, 11079, 13997, 9621, 349, -8450, -13741, -12906, -4810, 5626, 12082, 12855, 8390, -50, -8725, -13001, -11515, -4789, 4701, 12084, 13317, 8351, -560, -9497, -13499, -10819, -3563, 5152, 11891, 12642, 7237, -821, -8384, -13003, -11331, -3529, 5684, 11826, 12812, 7446, -1913, -9790, -12276, -9663, -3058, 5363, 11464, 12049, 7133, -1197, -9547, -13192, -9980, -2227, 6129, 11746, 11620, 6008]
1158F008p966p167l243L024P350P677N437R01n573r166p049k309K848P649Q573
1173F994M193r44m614p459p571k689L261P135Q288N346r50o180p916o455j993
1188a1554L650O943P192M784l02n957p831o205k550L331Q177P728L500r41n549
1203D416q270n829q04L230O251P666M727j255o074p870o278j113M552P163O580
1218G092L449j283n722p241n728j455M084P264O747L612j287o408q024m831j66
1233i897L793O729O829K872j919n178p117o083p30M813P166O396K961k455o298
1248A882o534m399n91L954O716O317L118j929o488p171m324k15M324P408N954
1263H022J494k203n200o972m632M72M061O146O598K861l217o459o355l932M44
$$ y = [6008, -1958, -9125, -12368, -9344, -1994, 5683, 11120, 12021, 6448, -2718, -9767, -12076, -9228, -1579, 6994, 11187, 10243, 5629, -1830, -9401, -12090, -8829, -1694, 6594, 11940, 10990, 4810, -3106, -9561, -11554, -7904, -961, 6231, 11015, 10713, 4756, -3075, -9280, -11830, -8499, -322, 7406, 10906, 9965, 4416, -3854, -9683, -10487, -7257, -1006, 6660, 11387, 10132, 4058, -3812, -10090, -11203, -6651, 512, 7092, 10541, 9258, 3536, -3705, -9433, -10888, -6804, 460, 7207, 10819, 9532, 3124, -4900, -9731, -9897, -6104, 625, 7454, 10326, 8407, 3229, -3888, -9971, -10701, -5888, 1278, 7674, 10635, 8180, 1882, -4652, -9051, -9642, -5688, 1028, 7345, 10463, 8534, 2046, -5125, -9449, -9664, -5340, 2068, 8022, 9516, 7313, 2113, -4859, -9491, -9019, -4958, 1188, 7786, 10647, 7430, 971, -5384, -9316, -8872]
1278h872M823O152N080K303k169n965o513m172J11M956P019N108J527k606o118
1293F64o461l065Q77L953O173N716J576l027n574o382m066J194N434O176M433
1308G621J303l089n728n524l148M45M515O573N107J168l499o172n722k541J264
1323g427M592O132M480M59k883n225n960l272J707M873N802M734Q61m059o056
1338a242m649k189J117M588N832M037Q22l118o029n631k234J928N037N869L540
1353G678n5l146n369n295j956J811M296N677M503mm215n370m815k175K291N286
1369h58M953L060L00l398n535m631j953J648N117N970L207n93l977n408m119j227
1385g444J832M448N483L172m16l567n284m869j481K845M951M914K928o55m169
$$ y = [-8872, -4049, 2103, 7183, 9486, 7317, 1352, -5161, -9333, -9222, -4266, 2753, 7861, 9388, 6782, 664, -5797, -8862, -7985, -4032, 2141, 7857, 9433, 6406, 832, -5550, -9616, -8422, -2988, 3188, 7621, 8924, 5835, 107, -5417, -8565, -8120, -3605, 2968, 8075, 9243, 5744, -428, -6150, -8691, -7427, -2835, 3297, 7777, 8236, 5353, 128, -5832, -9104, -7397, -2524, 3278, 8012, 8873, 4814, -1242, -5891, -8080, -6963, -2375, 3457, 7494, 8316, 5198, -831, -6462, -8696, -6768, -1731, 4138, 7678, 7623, 4477, -892, -6187, -8143, -6332, -2036, 3641, 8144, 8140, 3925, -1445, -6260, -8435, -6144, -858, 4095, 7155, 7455, 4057, -1478, -6109, -8062, -6414, -1297, 4673, 7880, 7287, 3310, -2098, -6217, -7444, -5612, -1164, 4319, 7491, 7075, 3508, -1776, -6645, -8126, -5281, -330, 4584, 7512, 6857, 2688]
1400B688n015l619j258J692M814N376K955q14l954n423m178o88K943M589M370
1415D478K526o23l642n075m082r89K649M827M843K708j307m461m699l245q66K470
1431d488M959M302J890n12l505n536l862k40K833M835M617J712j656l756m367
1446b774l314n33K465M546M725K186j762m117m532l417j81L392M488L606J838
1461F616j174m165m511k705n16K485N061M459J310j894l976m501k739L08K863
1476c079M232L716J519j258l866m779l123N09L358M326L740J189k026m014l806
1491c362k415j78K940M680L611R72j564m065m569k547Q89L388M095L292Q77j856
1507D188l793l820k533J14L231M668L539O25k339m032l681k095O80L170M174K918
$$ y = [2688, -2327, -5946, -7204, -5512, -698, 4678, 7633, 6819, 2865, -2558, -6736, -7424, -4481, 108, 4478, 7004, 6381, 2739, -2336, -6418, -7407, -4758, 69, 4912, 7620, 6313, 1852, -2847, -6092, -6958, -4488, 471, 4773, 6663, 6151, 2646, -2890, -6752, -6992, -4159, 676, 5293, 7005, 5349, 1593, -2774, -6088, -6621, -4156, 390, 5115, 7301, 5539, 1422, -3110, -6527, -6708, -3316, 1172, 4778, 6616, 5442, 1277, -3234, -5939, -6455, -3970, 1091, 5550, 6860, 4966, 990, -3511, -6250, -5942, -3079, 1153, 4869, 6388, 5130, 1264, -3515, -6638, -6129, -2771, 1555, 5295, 6484, 4458, 444, -3362, -5777, -5955, -3015, 1665, 5276, 6248, 4684, 619, -3950, -6497, -5608, -2220, 1875, 5167, 6044, 4188, 395, -3425, -5958, -5844, -2613, 2055, 5594, 6219, 3880, -152, -3833, -5928, -5248, -2078, 2096, 5014]
1523E014Q47j672m094m256j874Q44L085M423L304Q4k452l484l552j978Q30L152
1539a779L817L161P12k204m164l900j716J430L525L582K524M96k256l798l275
1554c845j765N84L519M406K468k1k153l932l767j120J551L025L485K611K12k229
1570C029l702l581j465J267L504M038K376n38k650l293k932j445J196L358L594
1585B756K324K05k519m103l236q30J632L269L543K034m76k440l352k864j244J307
1601c994L479L690K085m05k727l926k781l95J694L083L093J949k01k445l673k981
1617d455q22J621L741L518J382r15k397l260k785n32J878K970L050J956l57k899
1633A694l702k563m00J965L460L046J204q01k522l129k352p44J720L556L120J298
$$ y = [5014, 5861, 4189, 95, -4161, -6035, -5191, -2106, 2317, 5621, 5705, 3253, -231, -3783, -5761, -4931, -1779, 2038, 5199, 5911, 3707, -457, -4357, -6073, -4643, -1118, 2464, 4988, 5484, 3228, -570, -3845, -5610, -5026, -1507, 2899, 5367, 5346, 3193, -739, -4506, -5626, -4075, -1050, 2435, 5046, 5258, 3029, -673, -4254, -5719, -4452, -948, 3090, 5466, 4928, 2278, -1015, -3947, -5392, -4196, -838, 2756, 5080, 5285, 2766, -1337, -4573, -5403, -3771, -502, 3041, 5075, 4599, 2159, -1193, -4057, -5301, -3994, -515, 3175, 5260, 4855, 2128, -1798, -4579, -4974, -3280, -197, 2896, 4845, 4644, 2199, -1474, -4455, -5277, -3656, 85, 3603, 4985, 4070, 1673, -1587, -4372, -4904, -3026, -56, 2994, 4950, 4593, 1694, -2008, -4571, -4971, -3006, 454, 3500, 4704, 3903, 1381, -1748, -4100, -4844, -3124, 432, 3552, 4850]
1649D850p25k812l766k087K95J798K758L033J428j008k603l152k431k99K146L349
1665G74K927J049j228k719l073k005N5J974K863K581J501q24l026l423j869J43
1681d300K095L351K535N70j101k346l010k016l3K095L117K643R77j159l051l198
1697b831j438M55K037K918K400O96j164k598k850j962J10K353L355K331M33j381
1713B864k721k895j349O71J830K529K640Q78j495k920k721j541M21K471L079J882
1729C623K93j373k559k551j445L95K152K901K193O21j472l187k716q38Q17J996
1745a150K721K010J33j316k352k803j560Q50K444K743J986K70j843k726k254q97
1761c744O45K051K603J945L46j535k772k506j083Q27K501K841J473j62j456k446
$$ y = [4850, 4125, 1313, -2453, -4540, -4245, -2447, 311, 3344, 4772, 3764, 1161, -1991, -4422, -4721, -2575, 774, 3701, 4750, 3522, 803, -2270, -4275, -4220, -2246, 617, 3198, 4699, 3875, 849, -2574, -4443, -4300, -2205, 1146, 3681, 4251, 3150, 804, -2206, -4222, -4255, -2160, 957, 3600, 4577, 3418, 367, -2831, -4269, -3814, -1777, 1141, 3541, 4237, 3073, 475, -2375, -4337, -4227, -1874, 1481, 3812, 4245, 2864, 143, -2752, -4101, -3430, -1600, 929, 3569, 4447, 2952, 32, -2689, -4230, -3809, -1338, 1741, 3623, 3916, 2543, -16, -2567, -4012, -3617, -1465, 1436, 3629, 4250, 2778, -409, -3125, -3963, -3146, -1150, 1571, 3581, 3714, 2398, 46, -2757, -4317, -3467, -1023, 1720, 3706, 3976, 2133, -593, -2847, -3744, -3099, -1048, 1555, 3500, 3846, 2311, -461, -2967, -4050, -3223, -722, 2119, 3592, 3430, 1974, -472]
1777d72k419q56Q59J929K650K160j7k047k762j999p70Q87K389K452J402o9j433
1794A884k501k324r08J012K305K638J606j84k017k687j803l74R01J903K428J722
1810C601k43j750k455k296p53J404K584K122J086j70j740k558j655n15P75K165
1826c98K570J471m03j934k574j890k98J252K283K237R36m77j476k279k074n10
1842c564J375K158K353J358o82k342k114j325m14J136K219K007J086l46j756k502
1858a353j791k42J433K402K033P75o79j835k215j358j54R98K028K352J056p40
1874B710j991k308j570lJ609K158J682O47m51j685k277j520n4J282K208K158Q24
1891C419j053k082j923j240JJ384K072J765O98o59j803k179j563P9J730K194J686
$$ y = [-472, -2891, -3747, -2888, -959, 1691, 3851, 3834, 1787, -975, -2974, -3744, -2857, -468, 1984, 3386, 3317, 1884, -617, -2941, -3849, -2837, -532, 2106, 3712, 3528, 1511, -1176, -2979, -3353, -2452, -549, 1879, 3601, 3358, 1608, -847, -3143, -3896, -2492, 92, 2214, 3300, 3130, 1390, -1168, -2823, -3338, -2563, -398, 2172, 3643, 3240, 1306, -1268, -3158, -3456, -2204, 79, 2316, 3252, 2775, 1299, -980, -3054, -3564, -2189, -31, 2322, 3680, 2998, 656, -1458, -2783, -3197, -2061, 158, 2165, 3251, 2905, 1149, -1353, -3144, -3386, -1953, 449, 2482, 3257, 2578, 743, -1472, -2830, -2984, -1986, 42, 2394, 3450, 2710, 719, -1589, -3159, -3162, -1553, 605, 2287, 2934, 2483, 798, -1479, -2999, -3053, -1771, 437, 2595, 3419, 2366, 284, -1639, -2879, -2878, -1494, 578, 2343, 3041, 2382, 579, -1600, -3163, -3084, -1354, 840, 2526]
1908B526M99q92j985j796r62j23J071K361J927M25r01j887k189j175M44J609J932
1925H84J563M02r03j701j907j201J42J461K093J844M51j321k032j569r60K09J621
1942i24J982J165N03n92j953k193r70M48J570K130J469J13j203j690j638q54K25
1959b412J422J968J565K72j057j870j932r36P05J738J785J088K25j030j786j568
1975a823p75J65J526K195J478j26j314j704j622p08P04J578J560J156K96j061
1991A525j850j743o88N77J771J858J116j28j302j758j214n82L84J512J819J131
2007B428K1r56j999j872k83J004J425J628J095l04j188j475j350p76N35J806J723
2024A462J092k28j363j755j288l04P35J633J365Q17P3j132j836j365l90O85J661
$$ y = [2526, 3025, 2133, 148, -1648, -2610, -2733, -1662, 699, 2626, 3051, 2150, 263, -1926, -3101, -2657, -1048, 884, 2447, 2849, 1946, 245, -1662, -2863, -2721, -1260, 833, 2677, 3128, 1807, -225, -1794, -2754, -2545, -924, 1058, 2223, 2726, 2134, 181, -2012, -2982, -2534, -964, 1166, 2635, 2748, 1545, -145, -1783, -2637, -2412, -990, 978, 2543, 2815, 1758, -112, -2044, -2980, -2275, -537, 1248, 2336, 2561, 1531, -255, -1823, -2598, -2433, -907, 1288, 2766, 2640, 1326, -378, -2000, -2708, -2004, -426, 1134, 2290, 2586, 1525, -325, -2068, -2756, -2179, -408, 1450, 2566, 2438, 1136, -622, -1836, -2418, -2034, -522, 1297, 2428, 2449, 1493, -506, -2378, -2661, -1657, -232, 1396, 2491, 2187, 999, -476, -1826, -2602, -2067, -261, 1462, 2554, 2326, 963, -792, -2080, -2384, -1649, -16, 1349, 2166, 2239, 1107, -729, -2094, -2484, -1799, -138]
2041a38J916P88p35j095j440j339k82Q49J386J437R70r8j283j855j287k16J065
2058a357J539J403O51l58j230j375j164m17P34J647J595O83l82j257j724j200
2074b212O0J059J246J149Q71k12j322j569j122k94R23J834J373L80n31j210j434
2091a011r75j2P97J400J395N65l12j292j703j080K04J040J360J349L88p22j092
2108B99j117j127j95J060J500J177O49n23j539j530n89J54R38J320J087L77l62
2125A579j216j506q35J3R50J587J290J21o88j135j381p87L30R18J142J106O09
2142B097o20j343j427q09K84J151J473R24J16o07j140j176q16J36R47J357J186
2159A733L23p52j448j334l95M06R23J159R65K49o93j131j145q13J62J214J454
$$ y = [-138, 1778, 2566, 1831, 736, -704, -2043, -2325, -1476, -90, 1347, 2317, 2219, 936, -919, -2206, -2422, -1357, 182, 1585, 2236, 1878, 648, -727, -1891, -2308, -1574, 73, 1668, 2351, 1969, 712, -1012, -2212, -2152, -1093, 153, 1302, 2173, 1961, 639, -930, -2052, -2346, -1423, 411, 1784, 2164, 1633, 423, -1011, -1986, -1998, -1201, 199, 1594, 2159, 1847, 555, -1148, -2228, -2024, -984, 376, 1725, 2113, 1391, 299, -818, -1945, -2140, -1080, 420, 1597, 2246, 1723, 184, -1346, -1935, -1781, -843, 477, 1564, 1941, 1579, 363, -1143, -1978, -1965, -1015, 572, 1862, 1983, 1295, 160, -1221, -2008, -1678, -760, 382, 1488, 2097, 1477, 134, -1293, -2102, -1818, -667, 806, 1730, 1846, 1239, 99, -1077, -1893, -1757, -810, 547, 1733, 2056, 1304, -144, -1478, -1873, -1467, -544, 615, 1580, 1829, 1136, 5, -1140, -1953, -1791, -577, 877]
2176H77Q80N4o70j399j190k47L30P53J189J151J13p48j196j288n77N01J147J269
2194I49P30k7p49j030j087n99L73J072J094R23K19q39j530r48k23M05R45J293
2212I71N67p0n07j156j175n20M62J136J287O84r8q52j233r35j79N44P77J058Q70
2231A631M5q61j198j009l82N07J207J183M97k39p60j095q22k76M26Q64J186Q11
2249A715o1j044j298p31j59N21J058J037M03j33p06r90r38l57N55J152J090M53
2267A567j20r63j210o51K0M07Q46J112N49k73o95j102r77k01Q09J103Q56L97l15
2286A159q19r36o48j66N08R55R18O12k25j070j106n43o4O01J044Q97K20k13o63
2305D61j097p49m3N87R21J127M19m90j007r55m29K8N05R13Q43L98l07q26j013
$$ y = [877, 1757, 1811, 1141, -258, -1448, -1695, -1365, -612, 577, 1728, 1841, 1093, -103, -1391, -1968, -1467, -320, 949, 1679, 1652, 903, -127, -1214, -1813, -1440, -368, 726, 1649, 1868, 1029, -501, -1449, -1672, -1267, -322, 971, 1538, 1468, 961, -195, -1370, -1890, -1428, -292, 995, 1679, 1581, 729, -504, -1439, -1618, -1074, -297, 761, 1631, 1676, 815, -383, -1392, -1774, -1267, -60, 1123, 1620, 1381, 621, -474, -1296, -1572, -1146, -282, 904, 1715, 1654, 610, -688, -1419, -1578, -1057, 1, 1038, 1441, 1308, 602, -388, -1326, -1683, -1128, 24, 1114, 1567, 1447, 484, -726, -1377, -1357, -950, -104, 1008, 1557, 1284, 589, -513, -1490, -1691, -882, 221, 1077, 1474, 1159, 340, -596, -1244, -1410, -902, 53, 971, 1583, 1358, 288, -818, -1361, -1425, -824, 220, 1117, 1337, 1124, 461, -636, -1385, -1428, -841, 80, 1207, 1626, 1136, 129, -826, -1255, -1227, -722, 191, 1034, 1432, 1125, 299, -714]
2324g14p74O1Q06J019P28K74l93r06q37m77KM63Q73J015L83n11r04r18o15J37
2344a288Q19R54N65J83k95p25r75n05mO31J103P88J88n75r77p49l34J00N82Q87
2364C73P61R1k86p73j023n74K19Q24R23N91J38n52q97n25m21K4O40Q85P34J72
2384A324m42j019q28l95L34P82Q38M68J1l32p97p73l60J30O07J003P61l3o75p92
2404a88o54l47K25P24P46M55J73l90q04q37m12K91Q33Q40N14j01n90p54n08k72
2424a056Q5P11Q51N24Nn65p34q19k53M15Q04O74L58k9l92q16n82k55K09N86J007
2445G28M78j65o13p99o28r7L91O92O19L53L3m56p59p84j72M24P24P28M51j73p30
2466B45o02m72k10K97P09O51L64P8n64q85o34o8M16P78O55K21j40n15o84n40j03
$$ y = [-714, -1488, -1427, -621, 398, 1126, 1400, 1007, 101, -736, -1213, -1211, -748, 125, 1140, 1523, 1012, 108, -810, -1425, -1288, -469, 485, 1050, 1233, 938, 213, -762, -1267, -1271, -640, 463, 1251, 1439, 864, -113, -862, -1196, -1096, -514, 373, 1134, 1225, 939, 166, -857, -1431, -1212, -388, 535, 1126, 1264, 712, -185, -710, -1131, -1107, -467, 418, 1152, 1324, 882, -137, -965, -1360, -1026, -244, 594, 1062, 1073, 741, -56, -829, -1189, -1059, -452, 551, 1312, 1279, 604, -188, -842, -1189, -964, -240, 506, 961, 1134, 744, -60, -897, -1309, -1018, -185, 655, 1169, 1068, 478, -276, -784, -1056, -971, -260, 591, 1115, 1120, 555, -179, -998, -1251, -836, -32, 642, 1000, 971, 579, -237, -819, -1074, -865, -279, 728, 1206, 1041, 428, -371, -999, -1096, -705, -13, 606, 959, 992, 536, -223, -1007, -1179, -755, -31, 697, 1148, 975, 245, -357, -829, -1039, -742, -33, 618, 982, 1060, 496, -389, -1023, -1091, -675, 103, 758, 979, 839, 324, -360, -900, -1003]
2487a003K62P16Q61K88k79o06o74n62pN54O25L76L50l8n88p62m66j12M37P31O42
2508G45L39l93o42n37l28o3L19P06N53K38o0o25q08m89J08N04O47N40K17l25n36
2529A10n88l04j64L81P79O33K16l14o00p41l71J59N23M69M80K36k10n28o49m04
2549h87o4N28P53N29Q9l97n73m98l33J04M23N78L97L00k07o47p64k72J77M88O36
2570C60M72l9l34m81m66l31K4M25O69N22J05l19o77o78j18K38N02M16M08J78l42
2591E34o05n05k88O0N69P12L64q8l35n98m91j36J87M79M63L97Q6k71o33n84k26
2612i09K76N53N88L03j59k98m36m36k99K00M32N64M44k4l70o82m79k6K20N05M10
2633C77L29J5l14n53m39k89K41N83N63K88o3m00n86l83n8K26L98M07L50Q2l76
$$ y = [-1003, -741, -25, 836, 1124, 845, 239, -435, -997, -1004, -450, 175, 551, 901, 863, 275, -487, -953, -1065, -628, 103, 745, 1084, 691, 49, -488, -816, -879, -560, 146, 699, 937, 877, 252, -556, -1045, -937, -433, 214, 754, 971, 646, 110, -478, -782, -946, -565, 214, 847, 1063, 749, 149, -592, -963, -804, -281, 188, 668, 904, 694, 166, -483, -887, -951, -423, 330, 859, 948, 551, -22, -520, -853, -749, -326, 252, 649, 949, 742, 95, -669, -941, -764, -276, 360, 832, 793, 459, -22, -488, -819, -795, -370, 299, 821, 926, 607, -70, -748, -866, -628, -126, 290, 698, 876, 534, -71, -576, -864, -804, -235, 477, 841, 753, 418, -180, -671, -807, -620, -141, 322, 719, 805, 534, -99, -683, -909, -633, -80, 508, 811, 652, 354, -82, -518, -817, -617, -185, 379, 823, 799, 429, -253, -732, -758, -538, -33, 377, 706, 721, 407, -146, -585, -874, -633, -50, 513, 801, 738, 338, -248, -631, -689, -463, -65, 342, 692, 774, 398]
2654C98o55m28j10K56N61N46J79j57l75l80m33j73K62M88M44L74p1m42o32l67
2674g15oL40L95M20K91j32l87m26l67j90K20O22N39J54j62m18n18l05J11J39L85
2695a0M32L14n8m28o15l92N3K90N94M19J07k10l81m03l39LK04M10M80K68j80m27
2717A31n89k18Q5K53M62L76J49k10k87m11m06k9L54M85M09J68j61n64l93j73R3
2738d76K00M26L14J51q0l96n02k96M3K75N71M03l2k02l30m54k03O4K21L88M73
2759E58J98k91m89m30j87R1L54M34K68K6j12l58m35k67J7M16M40L47O7k62m32
2780d7m94j7P5K53L86L96L3k12l30m74l37J90M57M31K88k1k65m42l09j03N1K96
2802a95L71L99Q2l31l94m09j36K12L17M00J72pk04k75l76k66J61L25L96L58J3
$$ y = [398, -257, -685, -795, -539, 22, 568, 747, 590, 215, -165, -598, -771, -509, -21, 423, 797, 726, 284, -348, -715, -721, -381, 14, 434, 725, 593, 206, -220, -587, -777, -557, 65, 604, 758, 596, 178, -340, -645, -534, -395, -10, 422, 736, 678, 250, -365, -757, -704, -414, 180, 599, 706, 496, 115, -288, -627, -624, -420, -10, 470, 738, 558, 131, -458, -676, -591, -338, 124, 500, 649, 439, 152, -259, -665, -694, -340, 145, 554, 722, 561, -3, -396, -569, -476, -276, 150, 464, 615, 535, 139, -363, -659, -616, -341, 230, 633, 601, 399, 69, -385, -588, -524, -303, 85, 558, 756, 465, -24, -454, -641, -550, -196, 238, 506, 532, 420, 62, -373, -640, -623, -207, 233, 580, 647, 385, -47, -541, -558, -483, -230, 156, 552, 585, 373, 43, -431, -768, -578, -121, 310, 598, 577, 312, -130, -439, -542, -491, -195, 176, 575, 657, 326, -68, -477, -613, -401, -84, 316, 488, 481, 277, 2, -374, -640, -479, -154, 242, 600, 613]
2823F13l56n04k24l3J16L04M41J73j5k18l77m20j22K07L32M67J99j23k63l96k23
2844d22j04J70J99L71M07j06k52m34k99j32K28M77K48R9j8k04l65k68j13J56K84
2865g8M46K58j26l69m16j79LJ92L00L12J33p7j82l89k87j45K67M25K97J55j38
2886D02l43l02k00kJ56K75M18J52j16l04k97l93K8K76M28K46O6j08k61l50j92
2907d21n3J21L58L89K20j99l73l57j52mK37M29K01M7o2k09m28k57oK31L86L32
2929D30O5k21k77k39j78M7K02K52L02R8j56k54l68k75J05L53L83R1R3j75k56k81
2951b59j10o8J81M40K86M5k01l03l84p6M9K98K76J93O4j07k83l16j89R0K16K95
2973A37K90L4k45l18k04q1j7K82L25J60L7m4l34l75j38J65K73K85J77jj44l22
$$ y = [613, 257, -247, -471, -504, -388, -84, 357, 530, 515, 297, -80, -500, -622, -415, -83, 384, 583, 460, 197, -199, -422, -526, -356, -157, 214, 621, 515, 263, -171, -470, -602, -374, 103, 351, 450, 432, 228, -137, -405, -518, -362, -78, 368, 626, 500, 131, -285, -464, -461, -269, 31, 343, 476, 399, 217, -172, -459, -604, -337, 88, 385, 540, 402, 59, -243, -443, -445, -289, -14, 404, 556, 440, 136, -161, -554, -526, -250, 178, 424, 490, 382, 121, -229, -421, -474, -353, 5, 394, 614, 415, 42, -315, -467, -471, -234, 195, 396, 443, 381, 172, -256, -513, -519, -288, 98, 430, 495, 274, -3, -242, -420, -373, -171, 81, 383, 481, 325, 71, -297, -572, -467, -114, 269, 360, 453, 278, 22, -259, -369, -437, -256, 184, 470, 515, 314, 11, -373, -449, -400, -102, 174, 367, 431, 324, 41, -275, -464, -374, -158, 137, 427, 461, 216, -102, -306, -387, -404, -122, 203, 363, 400, 356, 22, -353, -491, -326, -53, 232, 409, 408, 264, -58]
2995e8j86j90O9K32L47K54J2k49k93k59j51J89K56J89J63P3j55k36l08j38O6K31
3017a42L39K95j55k13k79j75p5J63K12K19K49k5j49l64k86q3J44L28K35J87q3
3038C42k12k67j56m2rK21L85J13K7j95k90l11m2K71K04K24J02k9j80k27k93r0
3060d54J57L28K59J30j59k04k35p3j43K00K52J70J06R6k53l66j97l4J97K63K63
3081C03J05j16k17j82j40j19J32K70J98J55l7k76l23j26L7K76J62J61Q4q4j44
3102A19k73j79k3J37K77K53O9j18k50k06j74R1J89J00J93J52o9k02k64j70M9J43
3124a56K82J56N6j21k48j46j47L9Q6K36K34J31j21k39l43n6R0J83J73J95M8j54
3146A78j04k64j32n1K39K54J53R1r4k91j65j31J18J31J68J17P1o2j80k75j32M0
$$ y = [-58, -244, -434, -365, -133, 214, 468, 480, 231, -62, -321, -472, -283, -27, 162, 325, 398, 243, 7, -301, -439, -373, -142, 197, 492, 337, 124, -155, -330, -405, -242, -30, 189, 438, 413, 264, -100, -386, -469, -325, 3, 238, 425, 342, 130, -137, -293, -335, -344, -123, 262, 375, 402, 207, -83, -394, -436, -165, 39, 263, 365, 336, 156, -71, -364, -454, -297, 31, 290, 420, 261, 57, -178, -251, -394, -194, 58, 228, 334, 430, 177, -189, -386, -420, -223, 40, 303, 408, 292, 75, -107, -247, -366, -234, 36, 234, 389, 352, 76, -247, -373, -336, -60, 102, 263, 347, 263, 119, -154, -333, -356, -219, 58, 311, 380, 262, 12, -194, -368, -277, -88, 12, 205, 357, 288, 86, -178, -348, -299, -156, 126, 282, 338, 217, -31, -177, -324, -285, -199, 37, 271, 402, 281, 42, -301, -357, -267, -84, 89, 284, 332, 178, 74, -190, -322, -373, -134, 120, 273, 364, 270, -21, -186, -317, -199, -68, 100, 217, 288, 226, 46, -229, -361, -321]
3168c21K28J83K93j05j06j53j79j43LJ62J96K24O2p6l27k35oO6K03J81J35K0j29
3191A76j39k61n1l6K22K22J62Q0k16j87k27p4J51R8J95J50J08j44k85j68j41O7
3213b98K11L14O0l2j32k00j36m0M1J22K24J37N0j76k10j62p3J46Q8K84L4k9j15
3236A08j41j95j21R2J95K42J34jk06k46j03%R3J21J70J17mj00k07k34l5O6K71
3259A6J86N5j8j77j61j61L7J8J85J77J62M3k30k61j00r7J71J92J96l1m2q0j31
3282e1j38j33J79J24K28J47j44j20k75j36L2J09J93J60Q1j5j23j64j91j22K19
3303a40J92K00L2q3j32j90j00J4N8J37K32P0j8j88k23j29P8Q4K02J07k0k0j04
3326E9j57j06j11J65J64J85J27r7k48j71m0j4J47J77J96p6k9j09j79j69LJ49K43
$$ y = [-321, -93, 90, 383, 278, 172, 19, -160, -303, -300, -138, 58, 282, 344, 268, -59, -294, -300, -234, -31, 150, 285, 305, 176, 37, -224, -275, -311, -89, 133, 295, 375, 159, -28, -255, -329, -178, -80, 115, 265, 373, 229, -56, -224, -365, -298, -87, 227, 287, 255, 123, -77, -213, -253, -212, -90, 134, 271, 321, 145, -65, -227, -300, -154, -66, 218, 252, 223, 108, -33, -228, -349, -257, -62, 180, 314, 313, 107, -139, -242, -242, -149, -28, 142, 259, 255, 155, -52, -286, -321, -255, 16, 202, 257, 239, 62, -99, -260, -223, -205, -20, 157, 319, 362, 132, -129, -229, -326, -155, 37, 233, 202, 160, 80, -51, -189, -322, -143, -19, 209, 356, 212, 92, -183, -319, -287, -178, 15, 175, 256, 241, 118, -46, -237, -359, -140, 52, 252, 284, 201, 69, -121, -221, -207, -149, -12, 220, 290, 272, 84, -139, -268, -190, -106, 96, 203, 183, 163, 59, -98, -204, -315, -150, 14, 199, 326, 229, -19, -190, -230, -244, -97, 80, 276, 200, 171, 62, -117, -286, -283, -134, 109]
3349A09R2R4j79j55j49k4M6N2J35J46R0r4j24j71q6lJ91J67P1l8j1j17j43j40
3373b41K4J80Q3J96M4j62j78j27j6L9J39Q9J31J3q0q4k52q5N3J69J64R8Lr8j54
3398e2j40O4p0J11J17K36m8p0j05j46j08L8J78Q9J10j6p8j23q2p9JJ04J50J81
3422B62nj67j50j04j00P7K13J23k2N4r7q0j83k5K0J60J37J40r7p1j48n9r1L1J31
3447e1J19Q0pK3j53k09r3J65J11J68O4m4q5j39j02m5M1J21J34J20pj08j49j61
3471b07l6J35J55Q1M3K9j29j12j87ON1J64J72N3n6j09j64k6m1P4Q6R4J07L2r9
3496A16j03k41K1R7J15J58O9j52j03n5p2n9N3J29J27J08Jj66j62j08K1J67J19
3519H0rO0K2q2j29j09K8n1J98J98m4m4q1j49rnJ01P6Q5LJ3n4k13j02L8J10J44
$$ y = [109, 201, 295, 116, -39, -188, -212, -166, -114, 21, 167, 257, 163, 39, -132, -218, -221, -30, 137, 208, 170, 159, 42, -101, -241, -217, -37, 46, 242, 286, 124, -54, -181, -197, -158, -19, 70, 201, 214, 134, 50, -202, -287, -234, -65, 99, 197, 200, 102, -52, -192, -128, -198, -87, 30, 266, 218, 148, 43, -103, -211, -173, 5, 94, 204, 188, 110, -13, -95, -174, -173, -69, 81, 262, 257, 90, -60, -164, -264, -187, 26, 149, 127, 181, 84, 4, -179, -204, -184, -24, 113, 253, 156, 85, -63, -122, -213, -182, -51, 68, 148, 141, 164, 11, -198, -291, -126, -15, 153, 217, 173, 88, -51, -153, -198, -157, -36, 98, 218, 211, 103, -46, -207, -243, -108, 47, 128, 171, 200, 71, -41, -228, -222, -171, -7, 165, 218, 162, 53, -111, -137, -178, -104, -18, 76, 183, 215, 116, 13, -228, -207, -110, 5, 163, 232, 80, -23, -78, -150, -209, -156, -27, 100, 208, 209, 43, -119, -227, -206, -39, 80, 71, 131, 153, 71, -58, -167, -139, -190, 8, 206, 162, 118, 37, -112, -121, -126, -25, 51, 136, 139, 152, 98, -115, -217, -179, -69, 75]
3546G5J09L7j40j31lj23k7J00J39J22L2j1j21k26m3O3R3R8R2K7k5j26k2j64J5
3571a60M5J85J07po8j26j31j5O4J0J04P5R4J5j80j32r7J06O4J22R2qq9q8j6j45
3597a79J9J06Q6J17nnj97j15NQ8K5J62K2K7j4j56Kj08j0O1J70P8l1o6j06j32N
3624a51N8M0R5K2J24r0j37o8o0P0O1J14J25p5j20Nj71j6O0R6P6R5j9rj32j98N1
3651a54L9J06J42l8J7o1n6r2j02P0J27P9R6l3j27p0j00M7PJ27L4N5M1r0j06r8
3677a40n8mJ90J28K2k7j03k4p6q9N1J13P2J10pp3k27M0J9k1J17Q9O2n1q4l2q0
3704h3q4N8J47M8Q7l2p0j45p0K1P4J9J34Rl2m5m8j28k9J05J54K7K1k2j61J8q2
3731a09k6Q3R1O0M5K7j44q3j26O3P3Q8N9kLr0l2j03n2J09Q7R5J0o4q0j41R3m4
$$ y = [75, 184, 221, 81, -50, -53, -176, -203, -103, 36, 158, 190, 179, 58, -168, -211, -148, -55, 43, 135, 162, 137, 11, -11, -175, -160, -115, 70, 177, 170, 102, -24, -155, -170, -106, -96, 8, 83, 177, 192, 12, -120, -217, -111, -47, 75, 167, 159, 70, -18, -34, -179, -160, -54, 32, 149, 144, 139, -58, -173, -168, -80, -55, 107, 129, 156, 142, -14, -12, -120, -130, -69, 101, 179, 148, 82, -24, -156, -151, -93, -53, 42, 64, 188, 98, -39, -107, -167, -97, -36, 78, 203, 128, 8, 13, -158, -174, -114, -18, 58, 153, 134, 125, -7, -205, -154, -115, -9, 133, 95, 112, 51, -5, -97, -199, -129, -2, 77, 173, 140, 13, -57, -157, -110, -103, 24, 58, 113, 154, 64, -42, -140, -198, -202, -12, 116, 138, 111, 8, -16, -92, -181, -130, -17, 55, 165, 158, 85, -142, -102, -83, -104, 13, 102, 164, 113, 29, -3, -83, -167, -109, 38, 86, 173, 141, 71, -74, -144, -123, -49, -30, 104, 113, 81, 36, -12, -140, -169, -64, 90, 117, 138, 116, -45, -27, -109, -135, -52, 39, 99, 144, 171, 27, -56, -182, -119, -46, 42, 101, 99, 102, 12, -20, -123, -175, -66, 21, 116, 126, 62, -18, -159, -66, -110]
3759a10Q7M6O9N4j11l2k1j17k4Q9R9P3M8n8q0j29K0J9J1L7J41O5p9q1p4m1o5J03
3787f1J16N6K0j05Mj09jj0M9Q7M1M4r0p7j14L1K8O5L7N8L1l5q2Lj38NQ9R9N6J2
3817A09q2j16j5NN8l1J08L9O1o9k5j21q8N9J23O7K9l4p5K1r4l8L7J9P2J03N8q7
3845I3j35m4m3O3O2KN1l3J7j2j60L1O4L9J7J35rj16m8k1j7L4J8M9P3j9o2p0m0
3874h1p0J03P3Q1K8p0m1Jo0k4l3L8R5J01n4m2r5j0m2N9L7J00rK6k5o5j30J6N3
3903d0K0O1O5j1j55K1l4k3M0N4M6K9K8n1r0k6m1P8P9QkK3p0q5j9RK2J05N4K2p4
3934D3Lj01o0M4O9N1oJ5l4L8j18J8o2Q4N5R5ro8o2j09P6n2O8P6nM3L4j14n0p8
3964a16L8Q4L3j1J05k5j07j2m5j5l3Q9J22k3o4l5k7j01M0J34Mm4L3mom2qo3M5
$$ y = [-110, -23, 23, 92, 146, 35, 3, -18, -135, -159, -70, 29, 102, 150, 92, 12, -117, -97, -78, -67, -30, 111, 176, 97, 16, -58, -99, -164, -61, 55, 111, 131, 26, 30, -79, -80, -90, -41, 46, 87, 131, 41, -36, -150, -119, -91, -26, 11, 69, 100, 65, -17, -14, -152, -147, -58, 41, 97, 109, 27, -89, -104, -99, -41, -72, 36, 75, 136, 67, 42, -79, -167, -108, 15, 82, 111, 77, 2, 23, -71, -109, -72, -53, 19, 122, 180, 93, -42, -86, -129, -66, -4, -2, 49, 16, 33, 21, -139, -108, -44, -5, 12, 147, 138, 22, -26, -47, -64, -30, -12, 37, 110, 91, 29, -41, -81, -151, -48, 25, 106, 134, 64, 23, 24, -36, -60, -93, -55, 40, 141, 87, 45, -50, -60, -102, -43, -6, 94, 85, 111, 86, 21, -109, -93, -40, -20, 41, 106, 95, -60, -39, -73, -96, -56, -2, 44, 73, 101, 50, -40, -66, -107, -29, 50, 58, 56, 79, 9, -76, -95, -86, -64, 41, 95, 117, 43, 46, -55, -115, -71, -2, 49, 43, 58, 24, 62, -56, -38, -100, -16, 39, 134, 125, 57, -5, -114, -38, -90, -22, 54, 49, 92, 126, 12, -38, -116, -78, 6, 39, 28, 133, 108, 1, -11, -56, -71, -104, -15, 107, 84, 20, -15, -42, -143, -103, 31, 35, -9, 24, 20, 14, -28, -36, -99, -54]
3993e4J03L5J3q1k6l5J6k4k8Q6QL2O5q4j24NN4K5Q6L3m1j4l2k5k7n2Q8M6O5k7
4023H6k6n2j01k1L6O1L0O8q8K0J7r3J5k8O2N8N4jl5j12j4J3M5L1J0K4Rpl7r3O
4054f3J1K4J03jJ6r5j0o0K8m1P9L7L1J0m5l3l4k9M5L9J2J7N9p5Op5pkM5O9M7q6
4086B2oj7o5L5j3M6%Q8J4p0q1j6M1MJ1Q4L2j26On2M2r7M9P5K5k9K5O0j68%K8L2
4118b1M8J7Mj3K4n9p1L1k0M2M8PJ5q7k5o5R6PlO4K9k0Oj12J4rQJ05nol3j1mn4
4152e3L0MK0K4K8L3o2m4l6NN5K6M0j6rj6k1o2j5M5K4M3K6j1rj38J2P7m8R2L9J0
4184I3m3pp4ol0J6O1OM0lo0n0j8K3M6qJ0R3m6k3p5jJ2P8L4q1R3o9j0j8K5l0M6
4217B4m0P7N7l5j25jm2N6j3O0M1k8J6q5N2o8rL4J08j6K9p4ql1l6N3K2QN7ppj13
$$ y = [-54, 49, 84, 97, 16, -10, -45, -29, -53, -81, 5, 13, 45, 110, 26, -98, -93, -39, -14, 72, 105, 64, 50, 18, -7, -34, -86, 2, 48, 113, 86, 60, 8, -93, -114, -78, -17, 13, 81, -7, 13, 30, -63, -48, -76, -14, 44, 98, 97, 62, -50, -64, -51, -6, 25, 35, 59, 68, 61, 24, -69, -63, -52, -28, 75, 74, 90, -5, -15, -75, -47, -88, -9, 28, 59, 69, 24, -9, -43, -72, -27, 12, 24, 41, 100, 25, 31, -44, -51, -53, -8, 61, 108, 22, 16, -1, -66, -31, -44, 2, 2, 90, 104, 34, -47, -63, -22, -18, -7, 77, 109, -17, -11, -63, -21, -118, -69, 6, 31, 2, 27, 87, -81, -81, -53, -21, 27, 44, 48, 35, 59, 0, -71, -40, -60, -18, 30, 37, 52, -35, -60, -125, -29, -22, -25, 39, 68, 48, 54, -58, -44, -53, -45, 60, 55, 49, 16, 5, 1, -53, -23, -19, 1, 25, 53, 86, 24, -20, -56, -51, 4, 30, 70, 54, 45, 29, 8, -54, -69, -24, 0, 43, 69, 58, 49, -89, -77, 0, -48, 44, 83, 93, 50, 43, -31, -37, -67, -51, 10, 16, 56, 53, -7, -57, -75, -52, -6, -14, -4, 89, 43, 20, -55, -56, -44, 34, 68, -13, 80, 11, 1, -17, 8, -22, 24, -16, 61, 118, 83, -42, -43, -85, -29, -42, 18, 59, 31, 47, -38, 14, -54, -63, -29, 79, 63, 92, 18, 10, -21, -57, -4, 18, 26, 83, 76, 69, -44]
4249d4j5Q3p3N9R8r6M0p0J7m4PK5O0Rl8L8l6o1lJ8m8N7L3KK0%l5l2m9J9N1MQ0
4282G6K2p8l5j08P3O8Jl1O8K3k0q4j2m3N4L7M1jl5nj0j7Rj9nJ7Q2j9m4j3o2mM4
4315c0N7K2k6%k0l9l2K8J5lK3P2J3p2o8N7rPK9k4L3l0K9n0l2m6P2N0J6Kl5k0Q0
4348F9j14kN1j9L6L8K5q1n9L6n5M9J7Q5n1L2o0j8n5L8L9J3M8Oj5q2K1l9J9M6r
4379IJ1N2o3Pj5l6k6P6P0j8o1Ol2K2n2K2O5j4K0j3m2J7q3O4j0L9J5J9J8m1l2R
4411CJl6J6K6N1kl0m3op0N4nP2N2J5j08L1j30P8J0K3M6k4J5k5p3J5M1o3N0N1L4
4443F9m4N2j04kl4jQ1RJn7Q7q6l4%M1j3O9L5k3ok7lq4P3L8n4M2j6N3l4o8l4P7
4476CN8r1P2m8k0K9rlrM7j9O7o7kpq6P2M4MJ0l6Nn4jL9l2oK1PP7m0rkp4L4JP5
$$ y = [-44, -59, 24, -49, 10, 108, 12, 52, -18, -1, -45, -38, -13, 47, 56, 18, 56, 20, -41, -44, -26, -74, -17, 16, 18, 38, 38, 3, -29, -78, -59, -8, -4, 76, 98, 20, -15, -123, -50, 18, 19, -12, 56, 79, 59, -25, -37, -80, -26, 11, 52, 51, 16, 11, 1, -16, -7, -26, -31, -14, 68, 49, 5, -8, -70, -74, -30, 27, 49, 23, 23, 3, -36, -68, -40, -25, -28, -5, 67, 80, 8, -60, -3, -12, -5, 24, 0, 33, 3, 32, -18, -50, -96, -24, 26, 42, 44, 9, -11, 69, -45, -47, 4, -15, 21, 59, 84, 3, -56, -20, -75, -26, -9, 76, 25, 57, -3, -21, -76, -38, 1, 14, 62, 68, 53, -29, -8, -47, -28, 18, 9, 20, 72, 9, 16, 1, -35, -61, 15, 85, 67, 6, 12, -20, 2, -50, -28, 37, 23, 43, 30, -12, 5, -78, -14, -24, 15, 30, 49, 67, 26, -6, 3, 4, -32, -16, 10, 61, 59, 29, -14, -20, -90, -36, -41, 31, 83, 98, -10, 21, -109, -31, -21, 2, 48, 24, 39, 14, -59, -44, -3, -66, -16, 35, 69, 25, 77, -27, -29, -63, -64, 17, 26, 27, -30, 57, -29, -63, -63, -22, -35, 34, 69, 46, 40, 13, 10, -74, -1, 37, -17, 25, 9, 62, 28, -40, -74, 3, 61, -30, 42, -6, -26, 3, -6, -9, -18, 29, 10, 77, 10, 8, 1, -85, -13, 31, 35, 45, 9, 14, -40, -41, -2, -34, -40, -19, -12, 65, 25, 16, 14, -60, -26, -25, 50]
4513E0o0L5j8J1m1k9OlN8O7Nn2l9Ok7m9P6N0m0K9m3L3l1m0jO5K0m0K0MkL1oq4
4547c9nK4O1m0qn3RL0j5Q5j6MJ1o1O5p7j4k0Q4jM6p4oJ6j4K6q5P1L7k7Lnl0l0
4581d8M3K0l6J1N9k2j5l6J4m2M9m9N2M0l4M1n5k7m6L6M9P1p8LL6l7J2p6M6k5M7
4612CO1J7o6p6K0N8J6p4J7qN2j0J5l8l9N3j1L1j6J6n2l2J3k2J08n2K7PL5m8J8
4643B3l5m3M6JK3Kj2oo0O7o1QNP0M1k8m7l3PM2j4j7M1K3mo7j7mkL2L2N1n4lL2
4678C9q1Q9n2K0l9P2rM8o1n5KRj2O4m3j6j0P4o1qrRO4k6Q5o2pj10Q7L%l8M4J4
4712B4J4l1k7k1M6mJ6NK6q6k1R8o2k3l0J19n0N8j0l2km0L2oj3J9O0o7m6M7O1p5
4744b1MM0Rj2jKk9m8L9QRKj3K5%L7j16NM4L7l1K9J6J0l1n5j0lN7J8J9m9m0rJ7
$$ y = [50, -10, 25, 7, 18, -23, -52, -46, -49, 9, 76, 81, 29, -10, -4, -31, -80, -4, 46, 6, 35, -8, 25, -6, -46, -47, 18, 38, -2, 18, 22, 20, 51, 45, -39, -44, -20, 41, 1, -7, -60, -51, -21, -36, 49, 33, 37, 48, -13, 52, -25, -39, -59, 25, 24, 70, -4, -10, 6, -8, 18, -67, 4, 41, 14, 17, 12, -18, -48, -5, 15, -21, -10, 49, 27, 12, -24, -10, -52, -3, -52, 0, 40, 6, 47, -8, -35, -81, -45, 4, 75, -3, 0, 36, -1, 11, -65, -19, -44, 3, 64, 81, 15, -61, -41, 17, 33, -41, -24, -32, 20, 10, 25, -13, -52, 1, -10, 21, 5, 21, -31, -63, -50, -72, 36, -16, 11, 18, 53, 5, 23, -12, -55, -9, -8, 15, 17, 5, -1, -61, 6, -55, -47, -42, 28, 69, 41, -6, -39, -32, 10, -4, -21, 20, 43, 39, -28, -45, -49, -51, -19, 13, 64, 10, 7, 39, -42, 47, -5, 15, -24, 48, 39, 87, 26, -29, -27, -18, -30, 34, -9, -25, -35, 39, -22, -30, -39, -30, 34, 8, 93, 31, 24, -86, 1, 4, 4, -34, 10, 24, 38, 7, -20, -41, 5, 1, 17, 22, 48, -38, -59, 39, -23, -46, -76, 43, -7, 51, 41, 9, 7, -33, -1, -7, -20, -1, 59, -8, -54, -7, 54, -21, -17, 23, 32, 20, 19, 21, -8, -56, -17, -9, 0, 2, -11, 14, 14, 51, -65, -60, -16, 21, -10, 19, 35, 45, 14, -41, -51, -54, 3, 21, 40, -9, -49, -58, -41]
4779d1L5KmrL2k3K9J1o0L9l0JP5l2jn9J5Jl0J9M0L6l1l3Qno6N0O6K6n0L0k7m4
4813c0l3K4k4M2P0J9Kq0o7M3k0M1M3M6m4k4j7L9k6j2k3j9J12j7J0l6Rm3qj2K5
4844a0k9N7J0m3K9n4M3k1K3k0O0o2j6K3k9k8L5J8J4JQ7m9r4j1M6K0L7L4l0m9K1
4875A3l1Nl7P9k6M9K0p9K5n1N7o0oL9M0l7J2lp2J2N1rN0j8qqq1L5nRL1l7Q9n1
4909cJ1j5M6l6o3O2J3Mlk1M3l0j4L9qj3lO6m4j0p0L0o2J08j2L0J1m4k2Ro3L5N3
4942B4j9J8J3k0n3N0j6M1p6PQ2o0lJ8O1j12K5L9Jj0J3Kol8N1l6l6PM8RMl8m0%
4976e0L2J9K0K6N1j00Ro8QjN4M4Km4J5p4O6oL4n4MP0k9L2j03j1K0L6K1j4k9L3
5008A3rl7J5lQJj8R1l9l6m9L1K9l6O6m3K8J5l4j1j6L7q6Q9l3N0Rj9j6Lm7j2N9
$$ y = [-41, -6, -4, -8, -17, 15, -8, 21, 32, -28, 11, -19, -18, 57, 25, 24, -35, -20, -19, -49, -30, 10, 46, 15, -18, -10, -15, -81, -31, 35, 61, 11, 41, 14, -30, -63, -39, -63, -21, 49, 68, 70, -10, -77, -34, -54, -13, 30, 76, 32, 8, -9, 30, 4, -8, -31, -50, 62, 45, 55, 19, 28, -15, -23, -35, -10, -39, 18, 28, -15, 14, -40, 3, -18, 5, -15, 45, -17, -33, -10, -39, -67, -32, -14, 0, 1, 88, 39, -55, -66, -20, 0, 37, 71, 41, -8, 13, -18, -13, -50, 29, 3, 52, 72, -7, 18, -33, 24, -36, -42, -3, 37, 0, 12, 9, -63, -51, 0, -9, 41, 23, 15, 7, -74, -39, -44, -35, -4, -41, 48, -3, 8, -7, 39, 3, -60, 2, 15, 19, 16, -5, 38, 8, -6, 33, 25, 12, 9, 75, 31, 21, -49, -19, -81, 27, 15, 45, 56, 12, -10, -1, -64, -29, 24, 5, 23, 36, 16, -37, 13, -3, 38, -38, -31, 51, -9, -12, 6, 67, -45, -20, 19, 20, 10, 23, 25, 19, -19, 32, -4, -40, -33, 15, 24, 28, -10, -50, -50, -18, 1, 21, 47, 98, -2, 7, -61, -53, -54, 0, 44, 46, 2, 17, -57, 9, 3, 37, -17, -13, 57, 28, 60, -43, -54, -34, 2, 23, 9, -20, 13, 4, -33, -18, -21, -13, -12, -30, 61, 22, -14, -63, -32, -3, -39, 27, -16, 12, 27, -7, -18, -34, 3, -83, 6, -27, 23, 32, 13, -3, 0, -47, -59, 0]
5041@J6M0rl7j7m9P8k9OM3n6N4j4mk7k4o0M9kN2p2Q3j2M3j01M3J5j8j3M9K1o4
5073a6J2K3k0L2qJ4p3L3k4j4LP0PL1m6PJ8o6Kj4N5l9K7j3j5L7M4p4Pk0M6K9j7
5106C8m1J7o3RO5l0O2m7K2mk3k9M9m8L1L4Lj7nl9lJ6ok8O9k7K3K6j2n2lJ3k1N8
5140C7k4mN9m9j2J6m2k6J02l6k4N7k8m7K0Jk0L5%L5q8N1k0l7L4J9M5oJ2l7n7J4
5172b0k1J0K9K7M6n2J1o3J3L0J7K1J9r6M2K6nok6j2K0l8K5R3l7o6l8K5J6O2l6
5203A6j8N0N3q6nkJ2j1jM8n3oJ4o4N3%k3j2J5O0l6l0NL0m6P4Pj08O5K0m1M7m6
5236a9jJ3L0l8K6Jk7j0O5o0j8K7K7k2nK8m5N3j6l2J10r9O8l6l0J1m2K3M2k5J9
5267A8M6o0Ll7oqP5M0n9n3M9j9j0K2K7l5K4Q2j05J5j5nM4j2OpM0r6M2rK6l1NL6
$$ y = [0, 16, 56, 47, 10, -7, -56, 22, -7, -1, 42, -14, 40, 26, 22, -5, -29, -89, -40, -42, 10, -62, 21, 9, 52, -49, -6, 9, -9, -22, 27, 48, -16, -4, 19, -1, 31, 23, 37, -36, -3, -27, -41, -38, 32, 39, 70, 24, 31, 49, -17, -15, -29, 26, -13, 14, 1, -14, 23, 67, -7, 0, -20, 26, 55, 38, -3, 14, -49, -40, 25, -5, 57, 10, 32, 28, 5, -24, 25, -23, 8, 42, 45, 28, 23, -16, -19, -3, -9, -37, 32, 5, 28, 54, 42, -10, -13, 0, -21, 37, 13, 9, 68, 19, 7, 23, -19, -45, 57, 21, -3, 54, 26, -21, -1, 0, -20, 15, 15, 50, -38, 13, -7, -44, -10, 9, 54, 48, 60, 23, -34, -20, -41, -31, -2, 25, 71, 19, 30, -33, -20, 10, 27, 48, 67, -29, 13, 39, 34, 28, 2, -10, 10, -28, -3, 90, 53, -13, -51, -26, -10, 52, 16, -2, 48, 101, 15, 10, 8, 20, 9, 8, 56, 3, -3, 11, -53, 0, 0, -23, -35, -20, 40, 4, -26, -21, 9, -37, 37, 44, -64, 1, 21, -20, 27, -19, -20, -7, 23, -15, 11, 12, -15, -25, 40, -20, -38, -11, 16, -6, -11, 17, -28, 25, 9, -23, 87, -12, 56, 20, -10, 1, -41, -18, 24, -1, 18, 64, 4, 7, -30, -36, -44, 31, 71, 12, -41, 8, -11, -21, 1, 28, -7, 17, 99, -6, 9, -6, -11, 33, 21, 27, 20, 60, -36, 6, -3, 23, -8, -3, 33]
5301C3j2P1p4Ln0QM7o8P1l4M7l7lm8J03o0K2j6l0P2m5K4J4n6l5N5j7LL3L6p3J5
5333am1P8j1j7l1N4n9L5k4mM7J6p3QQ0p0L1l2Rqk1K2nJ2N4j9o5M6j7LK0J0l6j3
5367b2N8n7QL4n6J0J3L2J3k6m3Rk5J16l2k1m1%K4Mk7K8lj3P7n7QkJM0n1J6rkK7
5402C1jj9k6j6L8L2K9k4ok6l7J4J5K1j9L0mK2o8M3l2p6Q4OjM5K1n7k3Lk1J5o0
5435f7O1QM8p9L8l3L9l0M0m2K3N2m9l2L2j2n6M4QL3k9J0n0j9N1L6m6QJlL2k5l3
$$ y = [33, 21, 92, 18, 21, -29, -21, 26, -42, 29, -5, 42, 5, 2, -46, 57, -3, 19, 3, -27, 45, 0, 24, 38, -18, -53, 2, -15, -12, 21, 57, -16, -1, -42, 36, 25, 8, -23, 31, -28, 7, -17, -21, 26, 42, -31, -23, 57, -13, 18, -14, -5, -13, -34, -12, -17, -5, 49, 30, -35, 11, -6, -3, 17, 27, -9, -22, 36, -21, -13, 21, -35, -25, -12, 20, 33, 7, -36, -27, -52, 64, 32, 11, -30, -30, -6, -2, -29, -1, -4, -17, 60, 3, 11, 9, 10, 50, -1, 15, 6, 4, 31, 30, 11, -15, -31, 7, 39, 68, 44, 38, 12, -25, -11, 4, 25, 6, 36, 32, 54, -14, 29, -3, -79, 5, 11, 10, 55, 76, 19, -4, -1, -22, -7, -67, -6, 2, 50, -29, 9, -24, 15, -15, 25, -17, 6, 58, 9, -23, 9, -3, -59, -15, -7, 26, -3, 7, -43, -62, -11, 25, -21, -13, -12, -15, 17, -8, -41]
$$ [...]
8191c
##END NTUPLES=NMR FID
##END=
