##TITLE=1H_MTBPA2510
 D2O,8 sc, 
 25.10.2021
##JCAMPDX= 6.0         $$ Bruker NMR JCAMP-DX V2.0
##DATA TYPE= NMR FID
##DATA CLASS= NTUPLES
##ORIGIN= UXNMR, Bruker Analytische Messtechnik GmbH
##OWNER= root
$$ XWIN-NMR		Version 3.5
$$ Mon Oct 25 10:53:13 2021 Russian Standard Time (UT+4h)  she@DPX200
##.OBSERVE FREQUENCY= 200.1313468511
##.OBSERVE NUCLEUS= ^1H
##.DELAY= (6, 6)
##.ACQUISITION MODE= SIMULTANEOUS
##.ACQUISITION SCHEME= undefined
##.AVERAGES= 8
##.DIGITISER RES= 18
##SPECTROMETER/DATA SYSTEM= spect
##.PULSE SEQUENCE= zg30
##.SOLVENT NAME= Acetone
##.SHIFT REFERENCE= (INTERNAL, Acetone, 0, 15.7039)
##AUDIT TRAIL= $$ (NUMBER, WHEN, WHO, WHERE, WHAT)
$$ ##TITLE= Audit trail, XWIN-NMR		Version 3.5
$$ ##JCAMPDX= 5.01
$$ ##ORIGIN= Bruker BioSpin GmbH
$$ ##OWNER= she
$$ F:/spectra/data/she/nmr/H-F/1/audita.txt
$$ ##AUDIT TRAIL=  $$ (NUMBER, WHEN, WHO, WHERE, WHAT)
(   1,<2021-10-25 10:51:48.42 +0400>,<she>,<DPX200>,
      <created by zg, POWCHK disabled, PULCHK disabled
       configuration hash MD5:
       00 E9 B6 7A A2 85 ED C7 34 08 36 98 17 FE 4E 26
       data hash MD5: 16K
       B4 94 DC 49 0A 62 40 CC E0 81 7F 4E 6D 9C 2F D5>)
$$ ##END=
$$ 
$$ hash MD5
$$ 18 A3 52 CB E5 50 54 DD 70 1B C6 D6 04 7B AF 83
##$RELAX= 
##$RELAX= 
##$RELAX= 
##$RELAX= 
##$RELAX= 
##$RELAX= 
$$ Bruker specific parameters
$$ --------------------------
##$DU= <F:/spectra>
##$EXPNO= 1
##$NAME= <H-F>
##$PROCNO= 1
##$TYPE= <nmr>
##$USER= <she>
##$AMP= (0..31)
100 100 100 100 100 100 100 100 100 100 100 100 100 100 100 100 100 100 
100 100 100 100 100 100 100 100 100 100 100 100 100 100 
##$AQSEQ= 0
##$AQ_mod= 1
##$AUNM= <au_zg>
##$AUTOPOS= <>
##$BF1= 200.13
##$BF2= 200.13
##$BF3= 200.13
##$BF4= 200.13
##$BF5= 200.13
##$BF6= 200.13
##$BF7= 200.13
##$BF8= 200.13
##$BYTORDA= 1
##$CFDGTYP= 0
##$CFRGTYP= 5
##$CHEMSTR= <none>
##$CNST= (0..31)
1 1 145 1 1 1 1 1 1 1 1 1 1 1 1 1 1 1 1 1 1 1 1 1 1 1 1 1 1 1 1 1 
##$CPDPRG= <>
##$CPDPRG1= <>
##$CPDPRG2= <>
##$CPDPRG3= <>
##$CPDPRG4= <mlev>
##$CPDPRG5= <mlev>
##$CPDPRG6= <mlev>
##$CPDPRG7= <mlev>
##$CPDPRG8= <mlev>
##$CPDPRGB= <>
##$CPDPRGT= <>
##$D= (0..31)
0 1.2 0 0 0 0 0 0 0 0.06 0 0.03 0 0 0 0 0.0002 0 0 0 0 0 0 0 0 0 0 0 0 
0 0 0 
##$DATE= 1635144707
##$DBL= (0..7)
120 120 120 120 120 120 120 120 
##$DBP= (0..7)
150 150 150 150 150 150 150 150 
##$DBP07= 0
##$DBPNAM0= <>
##$DBPNAM1= <>
##$DBPNAM2= <>
##$DBPNAM3= <>
##$DBPNAM4= <>
##$DBPNAM5= <>
##$DBPNAM6= <>
##$DBPNAM7= <>
##$DBPOAL= (0..7)
0.5 0.5 0.5 0.5 0.5 0.5 0.5 0.5 
##$DBPOFFS= (0..7)
0 0 0 0 0 0 0 0 
##$DE= 6
##$DECBNUC= <off>
##$DECIM= 32
##$DECNUC= <off>
##$DECSTAT= 4
##$DIGMOD= 1
##$DIGTYP= 9
##$DL= (0..7)
0 120 120 120 120 120 120 120 
##$DP= (0..7)
150 150 150 150 150 150 150 150 
##$DP07= 0
##$DPNAME0= <>
##$DPNAME1= <>
##$DPNAME2= <>
##$DPNAME3= <>
##$DPNAME4= <>
##$DPNAME5= <>
##$DPNAME6= <>
##$DPNAME7= <>
##$DPOAL= (0..7)
0.5 0.5 0.5 0.5 0.5 0.5 0.5 0.5 
##$DPOFFS= (0..7)
0 0 0 0 0 0 0 0 
##$DQDMODE= 0
##$DR= 18
##$DS= 0
##$DSLIST= <SSSSSSSSSSSSSSS>
$$ [...]
##$SUBNAM2= <"">
##$SUBNAM3= <"">
##$SUBNAM4= <"">
##$SUBNAM5= <"">
##$SUBNAM6= <"">
##$SUBNAM7= <"">
##$SUBNAM8= <"">
##$SUBNAM9= <"">
##$SW= 18.0517286264689
##$SWIBOX= (0..15)
0 0 2 0 0 0 0 0 0 0 0 0 0 0 0 0 
##$SW_h= 3612.71676300578
##$TD= 16384
##$TD0= 1
##$TE= 0
##$TE2= 300
##$TE3= 300
##$TEG= 300
##$TL= (0..7)
0 120 120 120 120 120 120 120 
##$TP= (0..7)
150 150 150 150 150 150 150 150 
##$TP07= 0
##$TPNAME0= <>
##$TPNAME1= <>
##$TPNAME2= <>
##$TPNAME3= <>
##$TPNAME4= <>
##$TPNAME5= <>
##$TPNAME6= <>
##$TPNAME7= <>
##$TPOAL= (0..7)
0.5 0.5 0.5 0.5 0.5 0.5 0.5 0.5 
##$TPOFFS= (0..7)
0 0 0 0 0 0 0 0 
##$TUNHIN= 0
##$TUNHOUT= 0
##$TUNXOUT= 0
##$USERA1= <user>
##$USERA2= <user>
##$USERA3= <user>
##$USERA4= <user>
##$USERA5= <user>
##$V9= 5
##$VALIST= <valist>
##$VCLIST= <CCCCCCCCCCCCCCC>
##$VD= 0
##$VDLIST= <DDDDDDDDDDDDDDD>
##$VPLIST= <PPPPPPPPPPPPPPP>
##$VTLIST= <TTTTTTTTTTTTTTT>
##$WBST= 1024
##$WBSW= 4
##$XGAIN= (0..3)
0 0 0 0 
##$XL= 0
##$YL= 0
##$YMAX_a= 805225
##$YMIN_a= -886832
##$ZGOPTNS= <>
##$ZL1= 120
##$ZL2= 120
##$ZL3= 120
##$ZL4= 120
##$ABSF1= 10
##$ABSF2= 0
##$ABSG= 5
##$ABSL= 3
##$ALPHA= 0
##$AQORDER= 0
##$ASSFAC= 0
##$ASSFACI= 0
##$ASSFACX= 0
##$ASSWID= 0
##$AUNMP= <proc_1d>
##$AZFE= 0.1
##$AZFW= 0.1
##$BCFW= 1
##$BC_mod= 2
##$BYTORDP= 1
##$COROFFS= 0
##$CY= 11.3945322036743
##$DATMOD= 1
##$DC= 2
##$DFILT= <>
##$DTYPP= 0
##$F1P= 2.36226072786647
##$F2P= -0.459571619588291
##$FCOR= 0.5
##$FTSIZE= 0
##$FT_mod= 4
##$GAMMA= 1
##$GB= 0.15
##$INTBC= 1
##$INTSCL= 1
##$ISEN= 128
##$LB= 0.24
##$LEV0= 0
##$LPBIN= 0
##$MAXI= 10000
##$MC2= 0
##$MEAN= 0
##$ME_mod= 0
##$MI= 1.114404
##$NCOEF= 0
##$NC_proc= 0
##$NLEV= 6
##$NOISF1= 3.799351
##$NOISF2= 2.8
##$NSP= 1
##$NTH_PI= 0
##$NZP= 0
##$OFFSET= 15.70392
##$PC= 1
##$PHC0= -15158.9
##$PHC1= 14.40083
##$PH_mod= 1
##$PKNL= yes
##$PPARMOD= 0
##$PSCAL= 0
##$PSIGN= 0
##$REVERSE= no
##$SF= 200.130013532006
##$SI= 16384
##$SIGF1= 3
##$SIGF2= 2
##$SINO= 400
##$SIOLD= 16384
##$SREGLST= <1H.CDCl3>
##$SSB= 0
##$STSI= 0
##$STSR= 0
##$SW_p= 3612.71676300578
##$SYMM= 0
##$S_DEV= 0
##$TDeff= 0
##$TDoff= 0
##$TI= <>
##$TILT= no
##$TM1= 0
##$TM2= 0
##$TOPLEV= 0
##$USERP1= <user>
##$USERP2= <user>
##$USERP3= <user>
##$USERP4= <user>
##$USERP5= <user>
##$WDW= 1
##$XDIM= 8192
##$YMAX_p= 0
##$YMIN_p= 0
$$ End of Bruker specific parameters
$$ ---------------------------------
##NTUPLES= NMR FID
##VAR_NAME=  TIME,          FID/REAL,        FID/IMAG
##SYMBOL=    X,             R,               I
##VAR_TYPE=  INDEPENDENT,   DEPENDENT,       DEPENDENT
##VAR_FORM=  AFFN,          ASDF,            ASDF
##VAR_DIM=   8192,          8192,            8192
##UNITS=     SECONDS,       ARBITRARY UNITS, ARBITRARY UNITS
##FACTOR=    0.0002768,     1,               1
##FIRST=     0,             0,               0
##LAST=      2.2672688,     0,               0
##MIN=       0,             -886832,         0
##MAX=       2.2672688,     805225,          0
$$ Real data points
##PAGE= N=1
##DATA TABLE= (X++(R..R)), XYDATA
$$ [...]
1804E6M525J932j594k831l920l872o77K921L938L316K297l03m008m611k456o16
1820e903K009M342M175J380j591k823l676l344p15K736M415L436J190o90l384
1835A557m628k615K00K560L556L737J692j467l601l615k525o40K388M876L227
1850D702O27j078k883m418k701Q52K486L319L344J707j685l629l697k182L6K629
1866b571L779L570P59k022l157l147k361j44L065L868K609J162j219m022l899
1881c730j369P19K183L639L273M96j940l240l019j997K23K849L922K538N85j822
1897C310l306l625j569J234K344L203K905O59j992l724l013j241M56K379M288
1912B308K610n33k008k581l084j893J180K850K954K588P98k261l776k598j144
$$ y = [56, 4581, 6513, 4919, 2088, -1832, -5704, -6381, -3460, 478, 3794, 6091, 5788, 1780, -2831, -5287, -5903, -3894, 448, 4623, 6003, 4412, 1589, -2087, -5431, -6146, -3410, 1005, 4441, 5631, 4941, 1557, -3071, -5686, -5486, -2926, 630, 4367, 6059, 4592, 991, -2624, -5149, -5789, -3401, 1475, 4702, 5329, 4251, 1368, -3050, -5751, -4899, -2413, 906, 4250, 5957, 4272, 643, -3054, -5236, -5200, -2571, 1208, 4778, 5537, 3515, 358, -2789, -5150, -5294, -2229, 1639, 4248, 5410, 4191, 169, -3730, -5099, -4380, -2197, 1442, 4715, 5211, 3271, 31, -2988, -4985, -4762, -1913, 2009, 4547, 5132, 3310, 4, -3621, -5190, -3956, -1612, 1591, 4496, 5155, 3163, -561, -3574, -4815, -4359, -1980, 2308, 4918, 4385, 2377, -204, -3288, -5181, -4001, -1151, 1803, 4391, 5189, 2928, -848, -3446, -4590]
1927d590N85K881L427K490l43k256k928k360j632O66L238L345J737p5j639l259
1943g13l260p29J586K169L049K399j72k360l057k035j313M51L323L786J371o84
1959C811k025k549l171q15J697K816K658J813j25k168l394k246n02J123K815L076
1975B814J820j075k335k072k448j416J670L451K277J236j08k165l342k002l40
1990d035J168K890K843J368o28k419k532k068p31J345L014K972O39n55j887k696
2006a312k590j57J958K695J858J615l65k647k872j549m07J253K911K837Q42j176
2022B894j861k509k256k30J966K470K307R95m89k384k916j726R3J642K754K146
2038B896J195j329k414k084j497m68J528L247J919M27l52k270l104j490N94J673
$$ y = [-4590, -4005, -1124, 2303, 4793, 4450, 2194, -734, -3094, -4726, -4060, -822, 2523, 4260, 4185, 2546, -713, -3973, -4702, -3116, -947, 2102, 4501, 4329, 1969, -1088, -3123, -4436, -3985, -662, 3124, 4495, 3811, 1786, -763, -3934, -4749, -3052, -236, 2422, 4235, 4110, 1942, -1452, -3698, -4200, -3077, -262, 2814, 4634, 3559, 1224, -848, -3296, -4712, -3042, 409, 2686, 3922, 3814, 1649, -1693, -3695, -4035, -2867, 23, 2866, 4234, 3606, 1187, -1345, -3413, -4144, -2799, 215, 3187, 3826, 3271, 1384, -1312, -3902, -4059, -2101, 594, 2452, 4067, 3702, 1055, -1817, -3366, -3773, -2520, 391, 3228, 4070, 2894, 1033, -1476, -3732, -3962, -1996, 474, 2781, 3776, 3287, 903, -2013, -3739, -3646, -2004, 750, 2896, 4091, 2762, 348, -1736, -3233, -3701, -2173, 1074, 2993, 3420, 3068, 798, -2306, -3796, -3202, -1529]
2054a529K127K249J061j214k558k223j359Q2J677K703K311J97j054k247k350j468
2070c595K01K473K198J330R31q42k666k690o67N35J286K605K424J9j681j855j929
2087a923j592M24J983K542J615J55r50k344k446q95O96J891K164J562O38j386
2103B134k535j952p24N8J657L217J450k89j278j764k406j200J079J918K013J480
2119B858M32j441k378j853o23M23J672K546J689m64j585j726j785r77Q53J841
2135e18K408R80n3r20k388k379l33J002J616K188J567m45j867j363j709j070Q96
2152b388K300K131R02k02j543j853j866o91J310J794J627J203L0j554k269j324
2168b393n14O19K082K362Q16o18j535j656j638p46J544J954J466P74K38j479k362
$$ y = [-1529, 598, 2847, 3908, 2694, 136, -2087, -3446, -3364, -1687, 1016, 3327, 3524, 2470, 223, -2127, -3595, -3394, -921, 1277, 2607, 3538, 2696, 30, -2660, -3327, -2792, -1506, 1099, 3523, 3542, 1861, 6, -1923, -3515, -3091, -1108, 1434, 3049, 3204, 2254, -90, -2536, -3431, -2735, -844, 1320, 2882, 3520, 2134, -401, -2353, -3077, -3019, -1362, 1855, 3305, 3016, 1738, -26, -2432, -3632, -2553, -635, 1378, 2858, 3290, 1849, -529, -2382, -3005, -2582, -910, 1636, 3325, 2861, 1276, -450, -2235, -3212, -2359, -518, 1890, 2870, 2817, 1897, -491, -2870, -3203, -2201, -585, 1603, 3170, 2725, 858, -505, -2214, -3284, -2388, -88, 2043, 2945, 2743, 1200, -653, -2519, -3210, -1900, -106, 1521, 2724, 2754, 1200, -1069, -2393, -2907, -2288, -206, 2156, 2972, 2354, 819, -837, -2475, -3221, -1677, 277, 1743, 2517, 2755, 1276, -1086]
2185a086j557O9Q31J772J917R97p91j226j960j301l53P88K026J851P34n91j176
2202I44j926j953K49J494J596J348R33l87j884j604j038k89P80K152J789M04n94
2219B014j684j569j333lJ299J890J167N93j19j562k426q16J32J184J490J635Q25
2236B717r12j695j348j072k46J164K138J182L74k23j443k277q82M63J151J277
2252C68J641O45q42j806j359j025J36J309J525J691P7o76j628j459j079L44J517
2269f21J636O04P06m88j991j553m00J68Q40K034J487j26j066j203j427q59K20
2286b039J429J551R46K99o84j527j632o13M81J131J341J511O2j139j543r11q47
2303b184J28J333J736J194j08r39j066j818q01J079J237J076J025M89j102j706
$$ y = [-1086, -2643, -2574, -1743, 29, 1946, 2943, 2152, 926, -1034, -2335, -2688, -1900, 126, 1977, 2711, 2120, 944, -982, -2935, -2686, -1192, 404, 1752, 2685, 2298, 414, -1190, -2228, -2517, -1737, 415, 2204, 2608, 2014, 330, -1239, -2572, -2575, -1276, 614, 1781, 2374, 2255, 693, -1733, -2549, -2417, -1233, 257, 1892, 2717, 1805, 110, -1238, -2310, -2556, -1392, 746, 1928, 2302, 2079, 636, -1641, -2523, -2060, -909, 368, 2009, 2654, 1812, 6, -1353, -2378, -2242, -933, 592, 2283, 2360, 1684, 56, -1403, -2482, -2138, -621, 1015, 1619, 2325, 1837, -154, -1707, -2107, -1939, -1099, 935, 2422, 2296, 1230, 27, -1400, -2259, -2039, -610, 941, 1887, 2186, 1502, -25, -1657, -2270, -1789, -658, 683, 2194, 2256, 1117, -426, -1337, -2184, -2056, -723, 1013, 2207, 2099, 1160, 94, -1724, -2525, -1446, -209, 867, 1892, 2381, 1279, -427]
2319d27j073o47L67J345J652Q28k62p44j310j265q16M39J869J270N33R8m72j815
2337d30j434j34O88Q48J637R41m06r64j207r94o87N10J461J406O66j63r17j156
2355c35j676j46J260P58J261P49N4j060j640q62p0K26J351J500O31m56q47j209
2373e11j215m91J181J319P53O43J35j111j528j014P9L22J487J352M28l24r86j268
2391g49q69k40O74J125J375M87l61q30j346j187J37J135N87J270N85n27r31j143
2409h08q01j03O27J308J176M27n12q22j280j000l5J239J004N53N71m6j271j355
2427a128m17J56L83J261J312L96p40j113p90r51r1Q61J458P41J32j83q59j578
2445a150o37K98Q10R74J074L74p09r08j165o02L70M60J194J146J58n77r96j100
$$ y = [-427, -1500, -2147, -1780, -435, 1217, 2045, 1783, 1039, -271, -1536, -2352, -1913, -44, 1226, 1759, 1857, 1385, -430, -1864, -1998, -1310, -462, 1175, 2116, 1710, 746, -461, -1455, -2142, -1632, -171, 1235, 1901, 1738, 821, -335, -2011, -2157, -897, -139, 1122, 1871, 1925, 865, -775, -1637, -1707, -1481, -130, 1370, 2001, 1545, 698, -511, -1726, -2217, -1036, 283, 1036, 1679, 1814, 703, -825, -1839, -1760, -1438, 49, 1401, 1829, 1505, 519, -749, -1618, -1858, -1184, -59, 1316, 1803, 1442, 612, -734, -1921, -1784, -649, -62, 1208, 1793, 1266, 335, -808, -1609, -1712, -1085, 223, 1399, 1826, 1314, 492, -788, -1788, -1823, -584, 420, 973, 1544, 1498, 227, -1128, -1545, -1389, -1006, 255, 1567, 1963, 1223, 110, -680, -1631, -1722, -861, 597, 1338, 1470, 1287, 428, -1150, -1787, -1489, -679, 295, 1369, 1743, 1034, 126, -1039, -1641, -1271, -811, 383, 1529, 1687, 1110, 114, -986]
2463i86q44M38J105P99N93O60o04j262j121l19p0R18J419P69K48q10r04r78o67
2482a616J44J051J216M47J03k84j031j190n18N02R75Q65P04L16p38j134r23n32
2500a643K00J002J274M48k5k88r76j275m19O88Q68P86P84J81r20q60p78n32M90
2519i95N65J231N71J67q63j050p22m36M47J024Q05L46L67m97j407o35j10J61P01
2538c30J125P00j95q27p79p57n51P29O98J050K23K21n26j215r30j98P33Q75O67
2557G13N83pp41j051o94PL66N34J247M91m75n75p77r84k02R30P45P14L32k9p87
2578C40j104n32n2N35O06J150M42l52j009o92m36m8L86Q02R37R6k51j68j270p48
2598a368K71N91N89P55N86k01j165o25m73o8L81R09Q90K82m87n13q84o56k3N86
$$ y = [-986, -1830, -1392, -287, 512, 1105, 1765, 1161, -101, -1222, -1541, -1611, -693, 726, 1495, 1743, 933, 29, -949, -1616, -1472, -421, 795, 1242, 1345, 1061, 30, -1160, -1678, -1176, -201, 664, 1368, 1684, 946, -188, -1111, -1643, -1443, -441, 833, 1281, 1256, 968, -8, -1283, -1702, -1014, -146, 640, 1424, 1605, 685, -175, -953, -1485, -995, -430, 801, 1372, 1539, 676, -374, -1096, -1532, -1085, -61, 744, 1090, 1457, 960, -447, -1082, -1192, -1031, -330, 795, 1495, 1300, 473, -306, -1063, -1614, -885, -187, 863, 1086, 1307, 781, -434, -1364, -1562, -829, 46, 713, 1296, 1289, 548, -503, -1197, -1190, -824, -290, 957, 1448, 973, 398, -379, -1363, -1565, -635, 110, 824, 1156, 1127, 340, -764, -1296, -1348, -813, -207, 943, 1385, 1033, 24, -668, -1104, -1152, -766, 36, 973, 1069, 818, 650, -620, -1368, -1097, -506, 83, 838, 1424, 1223, 58, -567, -1040, -1108, -727, 182, 1072, 1354, 867, 354, -530, -1186, -1209, -623]
2618f23Q88N10L51j62p31r71n24L98K53O37Q42M61m71p99o10n69p7P94O71N85
2638H53R5M2q40q80m90L07K91Q34R36Q7m81q33m95n05R8O17O23O61K6k88l64r82
2660f88n45K11O62O32N63L80m61r13m32k20j85M21Q77P40K9l66q05o69m70oR42
2681c03O74L73J43o8p63q90k60L39L91O43Q24N9n66p38m65l89o6Q31R10K47q3
2702H43j79p68p99m05P08M27O56L75K98n43r63m29k17K97N32Q64J70J6m60n28
2722a05n04n98L49Q56N29K06J94m57p22n99N7J20M81P37O11k30n32n20p73n5L18
2743f37N69O97L87l61l27n82n46l44N05N49N61M99Q3o38r37l29m3K12N22Q12K40
2764H92j25m48n23o21r7N17M75L75L66J43p13p13k69j51K51N90N65N51k91o14
$$ y = [-623, 265, 775, 1126, 964, 233, -738, -1262, -864, -611, 26, 868, 1329, 858, 59, -551, -1120, -1197, -403, 268, 853, 948, 990, 150, -730, -1220, -913, -622, 212, 1148, 1235, 754, -79, -574, -1079, -981, -364, 259, 920, 946, 658, 294, -688, -1233, -1022, -360, 272, 835, 1215, 754, -159, -591, -811, -996, -575, 302, 1042, 1071, 705, -100, -769, -1239, -1245, -303, 371, 744, 887, 819, 56, -834, -1094, -755, -364, 279, 1103, 1162, 596, -142, -607, -996, -1062, -231, 679, 926, 843, 664, -104, -903, -1308, -600, -173, 483, 858, 1156, 613, -350, -779, -996, -699, -167, 697, 867, 883, 423, -105, -609, -1207, -858, -2, 527, 733, 927, 470, -252, -851, -794, -674, -193, 544, 1155, 925, 393, -127, -900, -955, -637, -68, 629, 1016, 655, 328, -254, -800, -1144, -639, -90, 471, 970, 1053, 415, -522, -851, -894, -682, -160, 652, 892, 767, 319, -204, -825, -922, -405, 70, 445, 811, 954, 241, -472, -741, -892, -641, -51, 514, 1065, 774, 160]
2784A60m96l72k01L20P66M52oJ51m73n62p86L12M71J31M81N82j79q48k77m19K2
2805g71L19O83L78L60l44n70m08m62M1M75M06M14L84l2p59p53q1JJ70N84Q23J32
2827I90n80l80n14l78JN10N74L31K06r8o59o66j10J61L84K63P62J14k19q20n57
2848f85m3J74K14M88Q50l43j52m64m26m17K32K27N38M31J44k30p27k55k69o6N39
2869b40N42K61L59m94l74o57l31NP72N14K33Qj23n23o13k41M11K16N16L18K71
2890H30m19o41l36k15J81L65O79L45J6k39o38n59j13K30L43N08M10kl93n35l29
2911e12j69K02K61O23M34j42m54l09o24N0J03N74L50L32J59n04p30j42j25M0L46
2932b37P77L50j93o38j89k59l95J79N60M52K93j69k86m24m06o5N9N07L87M20O0
$$ y = [160, -336, -708, -909, -589, 177, 629, 623, 774, 301, -261, -1047, -735, -264, -133, 348, 930, 751, -97, -374, -793, -771, -452, 231, 609, 969, 625, 55, -353, -815, -774, -299, 107, 521, 905, 873, 114, -639, -720, -719, -549, 35, 858, 990, 410, 30, -484, -862, -861, -351, 223, 554, 760, 662, 3, -663, -773, -612, -228, 35, 797, 911, 692, -128, -685, -728, -554, -340, 148, 998, 655, 503, 39, -387, -804, -572, -345, 193, 624, 768, 538, -189, -444, -713, -779, -240, 302, 563, 922, 428, 54, -603, -934, -929, -157, 357, 590, 598, 475, -48, -661, -902, -491, -275, 241, 559, 830, 411, -230, -566, -781, -600, -235, 444, 789, 805, 566, -72, -631, -744, -514, -171, 337, 747, 745, 352, -183, -512, -681, -479, -218, 405, 839, 697, 243, -66, -690, -640, -537, 37, 387, 719, 878, 374, -356, -498, -623, -583, -237, 540, 890, 697, 59, -130, -389, -784, -605, -45, 407, 700, 531, 245, -179, -585, -650, -591, -84, 303, 723, 783]
2953G83o56l58k06k08j5O51L86K37k0n04l41l97O8J91L93K01M15J38o54n51l10
2974g57J73J51L58N08M90k94o71j84k31k68K16O94L32N3R8m02o78k70K06J68L24
2995A6L72L35r7n30m53j23K0q0O97K50J49p0l38k79m34J9J54M52M24K95l19m58
3017Bm36j30k2L39L12L85K79l88k00k56o03L0N09L76K18L16k02m13l73k98J29
3038d26K6M88N17J46j18n47m21j72j70K03P81K87k93O4l03m89j89K38R7K35N71
3059E25J50l57m85j40j40p8L79L39M03j0k14k28k89m18O3K46M05L04K67l18l22
3080H2m36j53K49oL73L39K26k68l73l70k52m7N33N35j29J97m7m11l91k03M1L90
3102a21L11M72ol34n37k34j19N4J77N91L75k25j17k71l51k66J60N36K69J24J77
$$ y = [783, 127, -231, -437, -645, -660, -9, 377, 614, 594, 90, -251, -648, -580, -389, 4, 205, 620, 758, 104, -447, -757, -584, -433, -75, 433, 923, 629, -42, -226, -457, -725, -509, 185, 517, 570, 668, 266, -412, -682, -476, -308, 16, 388, 723, 626, 96, -357, -480, -460, -540, 157, 407, 556, 486, 148, -131, -565, -546, -392, 60, 484, 779, 460, 2, -434, -564, -586, -247, 65, 450, 729, 341, 141, -115, -718, -688, -179, 197, 415, 731, 529, 116, -257, -555, -426, -400, 88, 605, 751, 633, 86, -335, -507, -677, -474, 307, 594, 301, 365, 62, -427, -616, -378, -281, -46, 525, 675, 318, -167, -307, -447, -525, -146, 193, 596, 586, 372, 144, -145, -563, -500, -254, 151, 455, 722, 404, 82, -354, -507, -258, -264, 109, 448, 674, 406, 33, -337, -589, -636, -103, 432, 303, 500, 453, 42, -349, -552, -511, -121, 190, 662, 656, 322, -215, -449, -568, -514, -337, 254, 629, 404, 287, 16, -335, -601, -441, 95, 364, 488, 665]
3123F65m69l40k42Q6j58K93M21L62k9k92l40l51j79J14L89L36K06o9n1n19k22
3144c89j48J18L36J46N79m4l66o35L8p6J10L30L58L6j27rj39o32J02J47L09K24
3166B68L46J0m21m61q7m6jK73L92K25j05l64j9m04j76O8N75L05Q7R3k71m53l35
3189e01K31N2J18M34K91q3n03j49k48p5P9K69N24K5k1m00k36k63k24M27L71J54
3211B72J55K00m51n42m8lK2M02O20k38j95j30l2m11j29J85M84K86Q3j62l72j81
3233a85j91M3O7L42K85J41k57j35k05l37k8J53M81L66j50q7m3n74j56J07P8N27
3255B42j12L33j58m38q1q8j74J47N76J14R5k71j06k17l52nL07N42J5O7j36k55
3277D5l88n2L8K99o5N62l1j42k68q2l65q4L63L91J47P6K3m55l52k06K56P4K87
$$ y = [665, 196, -144, -386, -300, -458, -165, 256, 618, 589, 297, -43, -394, -573, -459, -70, 266, 472, 403, 352, -167, -389, -537, -419, -83, 63, 642, 598, 232, -403, -365, -441, -331, -1, 357, 393, 266, 257, 118, -514, -412, -265, 44, 268, 614, 624, 203, -258, -345, -391, -392, -119, 273, 498, 393, 29, 10, -394, -570, -502, 73, 378, 465, 558, 287, -166, -501, -270, -218, -100, 334, 625, 542, 39, -110, -358, -433, -354, -85, 439, 464, 443, 43, -193, -456, -680, -253, 118, 272, 427, 627, 176, -366, -414, -417, -395, 7, 627, 389, 194, 64, 32, -379, -508, -323, 161, 447, 530, 368, -4, -185, -376, -333, -266, 76, 361, 502, 245, 110, -95, -432, -460, -307, 174, 540, 390, 303, 260, -314, -470, -363, -285, 242, 130, 463, 305, -133, -214, -302, -476, -329, 247, 361, 456, 185, 79, -138, -490, -495, -188, 354, 369, 436, 300, 45, -343, -395, -357, -58, -123, 439, 408, 266, -2, -84, -449, -533, -170, 221, 368, 444, 467, 12, -340, -546, -290, -216, 71]
3300G1L72n4k16k24l93oL9K27L76K18Kk63o2l86j30J22L22J61M5K11K5o83K8k51
3324d49K43J23L21J03K3p9l96j73k65K04L52K60l2Q8k07k18j64j25MK68L01K29
3346D11r7n8l07j62j99j17L56N32l7L5k40k04l25J4J62K39L8L34Q4l64l16M2k69
3369d48J37L09L26Q9j57j19m3j88k25o8L92K43J01L6j62n07q2O4L2R3N44m8j54
3392A65j97j31j52k21K20L13L93j78q5J3k82j61o6K64J62J51J32P1k93k82l2j50
3414c46OL53K60J37k05n7j63k66k40L49K58J55N4n1j81l38o7R6R4L00J46n6J5
3437B53k77j09r6k52K16M15J52m8J5k24k77r9K46R6JK32O8J18l29k48l06J83N3
3460b17M13J04J1j32o4r2j98k66L62J63J52L26k62l96k17M1j40M66J39J75%j88
$$ y = [71, 443, 389, 173, -51, -444, -450, -411, -184, 192, 410, 412, 149, 87, -299, -429, -307, 15, 176, 221, 432, 457, -226, -198, -449, -206, -83, 238, 341, 364, 285, -111, -284, -549, -345, 7, 267, 235, 323, 116, -102, -266, -391, -387, -119, 182, 411, 314, 256, -51, -213, -412, -529, -173, 359, 322, 357, 117, -87, -412, -398, -236, 3, 41, 375, 459, 95, -221, -179, -448, -311, -2, 324, 413, 256, 137, 94, -94, -319, -387, 5, 248, 349, 385, 223, -284, -366, -302, -270, -177, 367, 319, 165, -32, -163, -315, -536, -316, -3, 390, 212, 127, 140, -142, -303, -369, -105, 57, 208, 340, 411, 118, -164, -196, -346, -340, 13, 273, 410, 205, 148, -15, -281, -521, -172, 86, 241, 295, 244, 63, -275, -342, -246, -152, 148, 294, 238, 253, -24, -133, -229, -481, -265, 150, 302, 254, 269, 45, -232, -331, -85, 11, 12, 244, 312, 430, 101, -147, -453, -270, -217, 196, 300, 311, 179, 115, 23, -175, -441, -79, 84, 236, 562, 300, -96, -313, -272, -412, 54, 193, 368, 368, 180]
3482A80l04P0l73j8M05M42j21j52M7j76l34J7R7J39M7M11nl19ll82M0j22K34O17
3506D37r9k28J9Rl23j20J18K40M2K67O4k23l80j2j71J30K33L4K93J3k62j43k96
3529c58O8J9J59L27M6qj28j49k65K2m4J12L75J19j5k12j48p7j85J25K51K70j19
3552A85k6J18l17j01j17J49J09o2K62J47k37j06k58n2j8K31M54Po0k65J14l77
3574b20j04O1L02J92p0P0N9l34r8n6J03J68J50J66j28n9m03k7o3K08j8M42k42
3597I9J13L6l84k81j45N16O0R3lN9O0m62l7J2oR7M07J92l21j46N8j99l11M75J13
3622I5q2L20L1j04l69k00M0J5K07L37J82k90l16J53l6k51J45J83j8K47j0j97l02
3645b20j62K63k7K24K32J3j50l16R9k64n9K28J78J03P1j13j56j76k3N7K74j16
$$ y = [180, -124, -54, -427, -445, -40, 402, 281, 129, 176, 0, -334, -317, -220, -81, -34, 377, 372, 53, 50, -332, -292, -414, -180, 437, 338, 110, 129, 138, -185, -305, -187, 53, 95, 362, 426, 203, -177, -189, -360, -230, 3, 37, 330, 343, 81, -62, -358, -290, -271, -112, 215, 261, 253, 125, -24, -289, -267, -311, -199, 176, 295, 280, 68, -80, -157, -342, -217, 34, 304, 185, 159, 277, -40, -141, -258, -109, 0, -62, 200, 347, 110, 4, -254, -306, -324, -93, 361, 368, 308, 43, 157, -220, -324, -263, 39, 231, 161, 231, 290, -44, -142, -198, -95, 73, 223, 389, 261, 202, -201, -228, -291, -83, -101, 341, 99, 212, 248, -136, -417, -562, -46, 14, 107, 104, 163, 223, -239, -276, -264, -270, -173, 234, 426, 105, -41, 17, -182, -493, -18, 95, 13, 333, 364, 260, -109, -309, -269, -254, -47, 290, 472, 182, -134, 19, -17, -268, -123, 60, 42, 289, 279, 82, -220, -382, -119, -146, 78, 310, 323, 173, -143, -44, -308, -367, -139, 39, 142, 213, 100, -56, -232, -255, -198, 76, -40]
3667d0L30j26k3l7k31j93J26O9L40J83k57m8j56O5k82j40L92J53%L0J13k40j83
3690a55k12J88O7J37N7J19K8k14j91P8k28J38M52j19j07R9Ol23l14K33K94P0L2
3713A35J51j79j16j06j48K00j04L58J10j25n5k21j57o1J78Q9K36l7p3O4k74j85
3735c20NK49K0Q2K44j9k59j92J29j51j24K50L11q2P0J3l59l0l7J30L6M6J88o1
3759A39n6j55p8Q3j86L27J08M4K4l25M0j57RK9K57J74p3Ok73j27n4R7L0n5K15
3784D3K78j5l10j9k18n1J25K25J89k17M9l9q3j49o3J81P0K5J27J2j61p6j7r8M2
3809a50J94J37ok8J0j79k43J23lK50p8O3J23j29j76N2j63J25J19J03Qr6l7j60
3833a41k08L1K69J78O5j78J00m0k38j77J32J67J02J3J51j00k50P6j28pJ17J80
$$ y = [-40, 290, 164, 141, 104, -127, -320, -194, -125, 215, 398, 141, 93, -63, 2, -280, -420, -28, 125, 125, 155, 268, 28, -155, -367, -179, -112, 25, 82, 201, 229, 15, -176, -98, -326, -188, 264, 145, 38, 137, 143, -180, -494, -261, 33, 103, 135, 286, 107, -9, -115, -263, -63, -167, 191, 301, 176, 121, -100, -257, -318, -140, -51, 185, 148, 75, 139, -135, -320, -315, -66, -46, 36, 280, 261, 2, -190, -61, -212, -336, -86, 225, 143, 213, 226, -133, -163, -200, -70, -34, 12, 200, 139, 83, -72, -150, -67, -253, 74, 182, 226, 250, -75, -35, -192, -183, -154, 103, 277, 204, 210, -63, -190, -244, -147, -117, -172, 43, 321, 306, -4, -23, -241, -292, -167, 58, 247, 30, 79, 40, -43, -192, -255, -74, -4, 21, 148, 160, -1, -77, -94, -192, -150, 44, 181, 175, 147, 157, -22, -265, -142, -145, 105, 27, 90, 213, 84, -92, -40, -203, -78, 41, 144, 152, 56, 19, -141, -349, -318, -49, 129, 194, 16, 116, 76, -162, -339, -207, -40, 62, 75, 226, 126, -124, -48, -176, -183, -66, 114]
3855A14J63j66R4k67j38j3J26J76o0K27j27j5p9l21K6J80L7P6K03r6j7q3j86j41
3879b87J27P3K70J2L6M8k29r3r2M5N3K5J36J9Mj42j58L7o7K25LJ05P0k4k23q9
3905a16oM7J45j32K06n6L5j76p4K7p1N5K82o6J17q0j98j60O0N3R5P6j21K69j93
3930A8j36K8m2k9J62J61j13R6j59o7K1O4j01j62N19k07n8O0j34k78K67J86j86
3953i0K0K30q1kj93O3J46j49J62J19o8j20R2j22j20j49L14J4n4J68Rj65j06r3
3977a75m4K0O2L39O6n8k05j93M6k20K85J12J40o1q4Q5k97M5O2rm0J2K39q7j58
4002a18L7M7l20K79R2J37Kj6k27M0k00K8R3J76M3K0R2r6j19L3k92K86Q9j2J7p9
4028C2j81J52j88J53J15M6q8N7j2j15o5j34J93J33P9j2O9k32O8k03Q5j33J02q4
$$ y = [114, 277, 111, 205, -62, -200, -213, -87, 89, 29, 256, 129, 114, 35, -286, -260, -80, -43, 33, 236, 140, 123, 40, -146, -287, -160, -87, 183, 195, 231, 279, 50, -43, -135, -90, -37, -12, 124, 143, 147, 5, -153, -116, -183, 42, 45, 150, 220, 196, -27, -116, -122, -75, 70, -62, 144, 88, 123, -53, -127, -100, -171, -116, 166, 100, 217, 137, -61, -221, -161, -108, -13, 63, -58, 211, 18, -118, -90, -132, -161, 1, 162, 49, 145, -14, -81, -60, 4, -97, -259, 260, 53, -5, 55, -79, -357, -90, 96, -90, -70, 160, 79, 77, -116, -53, 93, -56, 106, 225, 157, 37, 129, 7, -113, -262, 52, 66, 12, 180, 189, 24, -82, -175, -219, -199, -137, 202, 268, 210, 5, -188, -142, -362, -77, 35, 175, 114, 30, 115, -182, -137, -75, -84, -124, -112, 127, 40, -118, -81, -34, -354, -75, 17, 154, 156, 140, -87, -47, -247, -219, -126, 50, 93, 113, 205, 109, -10, 23, -269, 17, 106, 94, 111, 32, -149, 3, -185, -32, 83, 129, 41, 98, 86, -29, -94, -228, -35, 98, 177, 165, 234, 2, 70, -133, -48, -181, -79, -163]
4052a63K14J92j0k71po0P2L9qJ92r5N8p4j38J39m6j67O4K34j5r8m1j41l8lJ58
4078a3J00q5K03j15Qk73M5J2J15OJ78J9p0l28J80n6j00Q6J17N4P2N2j87j14r9
4103a93P6K87k07K67q2J19l56j07%j7J44J99K3l0m0K5j90k19K31Q5J83j44J47
4126B01j96n5J1m6m9M7Q0L48j26k33K2mj32J91k0L4J19k0k0k17j47J05J08j5M1
4151B7J78p4o7j63J6pj02L3K97Nr2r5j71J84j70K97N4o9o0L06m95R2nL6K3j07
4177a29L59n7Ml82J14o9J28P1q9N9j3J55j95K5j04Q4O0K9J43L1j82j90M0J51j05
4202f2k27L94j1L6j20M4r9r8k2J32Q8O1J06j4l78Q7mK4m8J77N3Pj94O1j29ON8
4229g2r5L44j28J67j07Mj58j45J34Q3q4L29j71j04Nk3m0k02L03m8O5O6lj31L2
$$ y = [-163, 51, 243, 233, -38, -45, -105, -33, 6, -2, 190, 95, 153, 79, -59, 80, 34, -133, -69, 165, 150, 52, 11, -130, -168, -171, -13, 87, 2, 205, 90, 98, -175, -130, -118, -3, 3, 181, 200, 130, -198, -18, -74, -174, -88, 29, 83, 155, 207, 20, -94, -193, -117, 170, -37, 230, 148, 267, -89, -196, -196, -213, -69, 130, 153, 123, 83, 108, -82, -301, -70, 15, 198, 54, 201, 5, -50, -39, -85, -134, -87, -7, 341, 215, -18, 4, 0, -132, 59, 39, 73, 192, 172, 152, -65, -212, -107, 1, -14, 27, 205, 131, 64, -99, -83, -90, -192, -159, 138, 143, 51, -44, -215, -31, -201, 96, 150, 81, 21, 327, -168, -76, -81, -45, -22, -129, 230, 173, 177, -205, -91, -160, -32, 39, -50, 9, -4, 151, -44, -19, -123, -39, 21, 50, 193, 224, 42, -148, -108, 43, -62, -289, 105, 94, 130, 10, 54, -45, -143, -165, -33, 55, 116, 222, 208, -170, -83, -87, -63, -111, 66, 119, 126, -68, -7, -136, -130, -72, -167, 177, 49, 216, 109, 113, -45, -190, -56, 27, -57, 272, 101, -3, 2, -21, -61, -263, 40, -8, 57, 123, 120, -11, 21]
4254B1j28Q9k0J34j44R5K6K8l91K07K4J07L1kq3O7K32k59k70J65K46m3q1KP7r3
4280C7l9j13R1l6rJ96O5k35Q1m9j62n1K08M0l8r2K20k4j75j46K08J1k8M1J50o2
4306H9j83J24j61J52o8J53k3J6l3N1k12p3Q7K56j23oQ2ml03Q9N6Q3j03J72J12
4331B30k44l9q3Q3j4j0L6R0K8j57p4J30Nj0r2J08j3J25Oj54j2j16L18k12M8j5
4357c8K69j58oJ6k56R9n3J88K9J10j63J08j76n3Q5j8j44L31o3o7o1r2nJ8o3J35
4383b8K21n8l6p1J01k33p5J07qL02M0Ll78O1j28J72j0Q7M8m3p1L3K3j05j25J89
4409A8o3P2K11k50j05LR1o5P1J47o3j38L4O2j95K4O9K29j3r6k4PM1j19p4J77r8
4436d7j19M20m1k76K8Jj18J51m5J52m1k1Qq0j7L6n9rJ42P0q7n1n6K35j81j00P1
$$ y = [21, -107, -18, -38, 96, -48, 47, 73, 101, -290, -83, -59, 48, 79, 77, -6, 61, 293, 34, -236, -71, 175, 132, 51, 53, 130, 37, -2, -115, -24, -60, -69, 127, 192, -43, 38, -11, -173, -224, -16, 24, -14, -106, 114, 90, -85, -231, -23, -12, -40, 1, 151, 89, -94, 30, -131, 21, -47, 106, 83, 99, 66, 117, -95, -168, -81, 175, 52, 46, 128, 124, -179, -90, -34, 49, -54, 118, 230, -14, -53, -136, -53, -67, -77, -41, 49, 77, -80, -154, -24, -19, -29, -121, -13, -26, 99, 105, -49, -61, -177, 141, -71, -23, -38, 231, 73, 67, 83, -173, -74, -127, 61, 90, 200, 37, 145, -31, -84, 1, -17, -161, 170, 107, 40, -21, -113, -118, -100, -163, -28, 193, 135, 99, 28, 129, -104, -179, -72, -80, 222, 262, 265, -113, -52, -180, -8, -18, 69, 117, 74, 3, 36, 59, -46, -171, 18, -45, 27, 238, -12, -117, -114, -23, -88, -17, 130, 67, -71, -37, 25, -170, -146, -77, 152, 139, 43, 19, 26, 67, -52, -126, 51, -47, -166, 254, 213, -63, -35, -34, -152, -1, -46, 106, 65, 44, 52, -28, -45, -9, -68, -77, 65, 135, 48, -3, -59, 176, -5, -105, -34]
4463c4K70k39j05J1o7R1j27J28J03N8k5mljj02J37j30N6N4O0j86J22n5n2o1Q2
4489a9N2L4J28j58m4L1j52K58k08KQ4K17l14j29J52N1j98P1J33m0O3Q4j16l3p9
4514a30pmJ32N5kR8o1k53M5K93j73n9n0J26n3M7K5Qm3kJ01M7m1p1N2j95O4j51
4542b02P7J39o3K43k32r8L9l5J46k4M9k6R7K7k23K53k41PL5J4J35m8M0j12p0R7
4568B4r2R4J95o0p1p3L2j05P5n3k2J30J3N4J03k44l7k7J72q6J11j55J07N1j23
4593A3j45M3O3N7L6J58k9o6j29q5o3MR7N5N5K05j71j06r6K06p2QnJ75j42p5J1
4620Bq3J8p0J91K5JO8p9j28J0K0j23L8J14J90o5r9j61K26j52j34K42kK2Q0q7J00
4647A64n1l11O2MM3K29l5J6j37j6O4r5j0O3K6Jo9Nmj15J99L3p4L8Mn5K30l04K07
$$ y = [-34, 236, -3, -108, -97, -164, -73, -200, -72, 31, 89, 64, 60, 57, 56, -46, 91, -39, 17, 71, 131, -55, 67, 12, -40, -101, -19, 33, 67, 195, 37, -7, 24, -128, 130, -78, -76, 8, 225, -89, -218, -66, -15, -213, -142, -9, -49, 14, 98, -18, -51, -130, -137, -141, -9, 46, 44, 142, 81, -172, -127, 166, -7, -66, -116, 10, -43, 4, 29, 37, -6, -8, 93, 140, 99, 28, 80, -115, -51, -202, -125, 14, -49, 194, -38, -136, -97, -132, 14, -10, 39, 13, 110, 137, -86, 167, -74, -67, -32, -18, 117, 69, 109, -3, -73, 24, -68, 26, 221, 161, 90, 17, 49, -56, 19, -34, -56, 74, 87, 141, 244, 0, -37, -64, 108, 22, 133, -22, 85, 136, 13, -132, -89, -26, 31, 67, 225, 196, 130, 1, -84, -147, -143, -46, 9, 64, 269, 98, -8, -104, 102, 30, 38, 33, 208, 66, -9, 2, -81, -63, -133, 58, 83, 84, 152, 73, -55, -45, -25, -148, -110, 4, 194, 129, 30, -131, 95, -57, -191, 51, 49, 71, 151, 64, 164, 113, -198, -136, -132, -89, 140, 105, 121, -16, -32, 32, -63, -73, -10, 16, 17, -52, -47, -51, -166, 33, 66, -8, 30, 34, -21, 209, -95, 112]
4676A12o2j33J19M1ll6P1l3k31K31pP5P9k77l1J5J04p0L2K1q8J59m7j46k4J80
4702E1j22MJ02J1N0l0j18J4n4j61K35J16L3J09j51Rj80L0K4o9Q7k8L11j71j7j85
4728a00J01q7K1J14r0J23j17J50r8j19K7q0L65p3L4K2j27n5N1K8j85R0r8K5L8
4753d0K0j27j3m5J36J08J3J34j72J30p8j13K20j76Q4j2r2J55k01N3J27j10J3j35
4777a21J08PrR7n0k99L42j23N1j2R6n9rj3l7O0j26M6J03j27N3J87j69j71J97j30
4803a08j16L12J33j46pj14P1L5j14J93J40k38n1P8j10m8n9Q0J52j38J63m2r8J0
4827b2p0Q5N6MO8j16j7K5o7j99J21N2K72q7L0j01q8q9K3M3N5rj06J10%RM2o5q3
4856a24J31N6l0j8K01k07l0J3q3P5P2l4m2R8Pj56N4o6nJ10k9r0M2N8L5K4O3o1
$$ y = [112, 50, -83, 36, 77, 74, 38, 109, 76, -155, 76, 69, 144, 223, -54, -85, -70, 34, -36, -4, 17, -71, 88, 41, -105, -129, 51, -71, -67, 35, 46, 96, 66, -52, -38, -92, -253, -18, 98, 131, 240, 89, 98, -82, -52, -28, -97, -10, -38, 273, 102, 85, -100, 1, -86, -65, 49, -41, 82, -35, 115, 17, -102, -75, -155, 210, 137, 171, 193, 66, 11, 62, 90, -95, -5, -103, -78, -40, -20, -147, -160, -205, -69, 39, 52, 186, 14, 144, 66, -47, 173, -3, 81, 69, -23, 132, -69, -16, 111, 1, 14, -121, -13, -6, -15, 82, 32, -267, 75, -48, 3, -9, 87, 28, 19, 6, -31, 29, -97, -51, 52, -75, -22, 165, -4, -175, 22, -108, -224, 88, 221, 75, 68, -46, 25, 60, -54, 139, 279, 41, -10, 68, -42, -90, -149, -69, 83, -55, 108, 66, -32, -22, -92, -7, 49, 53, 121, 5, -12, 13, -54, -253, -132, -80, 192, 105, 135, 34, -54, -143, -120, -77, -22, -31, -137, -27, -27, -18, 24, -41, -124, 7, 63, 33, 15, 216, 9, -21, -8, -91, -16, 56, 22, -20, 78, 85, -71, -17, -83, -88, 22, -7, -97, -55, 3, 38, 62, 125, 64]
4884F4J8r5J73k00J22n2n1J06j23R1J7L7n5j46J50nr3J7n2K59j01k06K49p4j01
4909e1J5R9Q5NK8l29K54k6m6m7J29j22J7j6j3L3j46P3M5l8j11K30Lo9R5k37P5
4936f5J8k5Q1j08J52j34k13J92N4l9l8K69Kj10j72K20j71J23J03j48O0L0j11l3
4960f3R1l8J22k05Q6O0J3m4N3q9J6n2P4m1n6K26j12j33L9j98J23K31j0M9k89K49
4986A02j55LN9j70R6PJ72r7L6k3j98K2J11K4o2J78q0l1l7K27j50p7j9l1J31J5
5012E3p4J17j36r9J46l8J2O1r8K4J12j16O5k5L6N2k13K28l3o9J11j2j6lj13RN4
5039C5o2p8N2J18n8o9J04j39J53o3l5l1J46q8Km5N5m1L5OJ8k0n9J21j55J63j22
5066e7J68j47q7Q1l5o2J01J82j37k9k8Q4r0J46J1j01kn6lL8P7j77L19j52J7o1
$$ y = [64, 82, -13, 160, -40, 82, 30, -21, 85, -38, 53, 70, 107, 52, -94, 56, 51, -42, -25, -77, 182, 81, -125, 124, 50, -51, -36, 63, 148, 153, 181, -148, 106, 80, 34, -13, 116, -6, 11, -5, -18, 15, -131, -58, -13, -51, -162, 68, 71, 2, 97, -140, -65, -47, -72, 9, -99, 53, -81, -294, -102, -48, -87, -125, 144, 146, 36, -136, 84, -87, 36, 139, -9, 51, 81, -30, -63, 28, -10, 112, -93, -7, 53, 66, 22, 75, -14, 2, -50, 24, -17, -73, 153, 41, -92, -53, -251, -128, 103, 93, 142, -147, 102, -53, -50, 9, -161, -65, -58, 114, 17, 53, 30, -168, -146, -35, -11, -73, 105, 25, -6, -43, 184, 34, -43, -62, -93, 38, 53, -21, 96, -40, -139, 7, -31, -19, 42, -56, -32, 80, -36, 29, 4, 40, 92, -121, 107, 74, 5, 116, 104, 88, 85, -28, -19, 35, -27, -105, -53, 65, 7, -62, 42, -97, 56, -7, -42, -73, 73, -15, -13, -58, -3, -44, -9, -3, 15, -5, -64, 57, -98, 65, -57, 111, -36, -123, -42, -77, -139, -38, 144, 7, -22, -50, 34, -56, 90, 101, 0, -2, -58, -61, -23, 54, -123, 196, 44, 61, 0]
5092@O3Q0j35j99K46k2p4J16j23J13k2q0m6O3L8np5j2K73j45j29j12O2J25K6J1
5118C7R0j61J10m2j16L8Q3nR1j01J4k6j06M5R7m3O8j92J58qp1M1j19L6R9J3n9
5145b9P1J3o3O3j04JP8j1P7q8P2j20M2j26Q9j69K58q6k2J7J13L1k55N1K34r9q4
5172d6J10n7N7k45J68k3qj4O2j36J58n6n8R0k13J46J14r7K2o0K05j61M7k8N9q9
5198e3J33m2r2j57J93j04J71j88M3J88qq4l9k16K73M4j34j3J41L6r3l6j14J2K39
5223A00m6n6J9k2p1O1M0q3J38n4j05J38J8k07K2J22J34j73L7n9q1Q0j20J05m0
5248a03J44Q1k59K71L9j75L2r1N4n2P0j2o9O5Q7K4j11j50J77j10L4J98p4j41J00
5273B9J5k8m4K7L2j36J14K26k39q2J30L2r2k3k4J71k60J29o6R7k3M8R5j71K31
$$ y = [0, 63, 143, 8, -191, 55, 33, -41, 75, -48, 65, 43, -37, -83, -20, 18, 13, -62, -74, 199, 54, -75, -187, -125, 0, 26, 37, 127, -34, 76, 34, -82, -44, 39, 34, 125, 24, 38, 12, -94, -49, 48, 5, 73, -119, 39, 31, -40, 1, -118, -82, 17, 30, -29, 42, 55, -8, 55, -49, -48, 30, 19, 96, 8, 80, -40, 2, -124, -35, -204, 54, -32, -54, -37, 76, 107, -148, -97, 137, 38, -46, 64, 7, 64, -181, -13, -36, -44, -58, 4, -132, 26, -30, -88, 2, -211, -65, 49, -48, -26, -86, 119, -42, 5, -23, 36, -53, 80, 38, -54, -211, -18, -122, 49, -139, -96, 92, 84, 0, -39, -255, 18, 62, -72, -85, 56, 92, -1, -37, -151, -139, 100, 54, -2, 17, -5, -76, -15, 25, -58, 80, 26, -79, 59, 77, -130, -108, 14, 148, -25, 12, -47, -128, -48, -168, -63, -103, 41, 122, -137, 134, 173, -2, 30, -61, -7, -59, 11, -1, -70, -5, 82, 106, -5, -155, 22, -88, -54, 144, 70, -71, 29, 44, 16, -28, -1, 31, -105, 9, 235, -4, -86, 44, 76, -16, -39, -63, 108, -152, -23, -89, 8, -15, 33, 128, -43, 188]
5298A88k55j0p8J08R4no0O7J05j26r3o8n0K72m3r3K29j56n5j6N3p8j59J61m4P9
5324c3J45jl43J71Q2jJ42k47J59Q2j20k6l9O0n1j79K71M5n4j45k1Q6J89j19l4
5349A9o8K8K9m6J2M2l7m4Q1k0mL6k3Q6q2n0M6l3n2K6J77j58q6K01j00K6J1m0n2
5378g5O6k7k5J66j06r8N7J49l13L32j49N8l5o2P0p9N0J48m2l7k25J73j01o4J71
5403BL7m2n7J54j87K0qK2K83k6j10q3K24l93J87n0p3J53j1P7r9p1q4K78j05j6
5429B2j15J57N5k57K06j35R5j07J07r5n0M1J62n5R4j33M9q1K3J46k28J40rJ3l7
5454Hk22J48J92nk82J20K5N8r2J2J18j41m2J47J7m7j40J56j45P8J63k02Q2OlN
5480A4m2j40J78K5j19q5K76k85K82j11k85J68M8J77p9j7J36j58j27K29j71pJ97
$$ y = [188, -67, -77, -155, -47, 47, 42, -18, 49, 154, 28, -65, -133, -183, 89, 46, -47, 182, 26, -29, -45, 8, -70, -229, -68, -112, -33, 112, 111, -232, -61, 21, 20, 162, -85, 74, 156, 36, 10, -29, 31, -20, -199, 72, 117, 63, -82, -103, -17, 172, 53, 19, -49, -21, 8, -38, -26, 16, -21, -65, 16, -4, -8, 28, 5, 91, 9, -41, 5, -28, -80, -54, 123, -35, -121, 80, -20, 6, 17, -23, -75, -9, -36, -61, 105, -1, -99, -42, 107, -206, 126, -23, 35, 0, -62, 8, -71, -21, 127, 85, 48, -177, -4, -105, -169, 2, 39, -3, -60, 94, -93, -73, -81, -59, 224, 198, 88, 5, 229, -164, 23, -27, -100, 53, 42, 119, 20, -51, -135, 143, 38, 22, -93, 64, 119, -138, 68, -67, 28, -79, 28, -67, -117, -76, 86, 31, 125, -8, 41, -40, -17, 129, -99, 41, 32, 45, 8, -214, -66, 126, 121, -161, -41, -16, 42, -50, -38, 80, -61, -103, 44, 61, 14, -126, 30, -115, -37, 126, -76, 6, 12, 9, 14, -28, -168, 10, 35, -84, -169, 107, -178, 104, -7, -292, -124, -76, 101, 22, 5, 141, -17, -144, 85, -86, -93, 104]
5503A04j3k2o5R1j85j2J04Lr3K03k12MP2nr0r6L34m9q8J0J80j20k62J24K12j32
5529cR1j84R4J04n0LQj24J16r5J1K2P1j29j9J27j12J74L3j81K10k04J63j20l2
5554b6J6l8K9J57j42J4p4J2k8M7q3J00N4q5L6m4J1m7J36l6p5J41q2j88J20J77
5580A02j36J1QP3K5N9o7j91J18J28n7n3m3k5r4O6N6j32K03nj73K6J19O5j13j60
5606a90P2J36n1j5PJ85k51J96l61L09q0O0j13L8J91Lj46N8r8k1J54l8N0j15p1
5631i1Q7L8r6m4j6J05l8P8o9J52p4k19J30J79n7J33o6p3j1j77J94ln3J59l6q2
5657E0o7J2m2j50J92n1J46k91K0K31n8RJ1O2J23l00k3J26R0k0j09J9m5J75p8L4
5683F6j19J10j43J1J5O0LR0j76K7p7O0N6l6n1n0K63j85Rj2K20q5K4j1j45P3N4
$$ y = [104, 91, 69, 4, 95, -90, -102, 2, 5, -88, 115, -97, -93, -21, -26, -116, -212, 122, 73, -15, -5, 175, 55, -207, -83, 129, -3, 88, -96, -2, 102, 52, 55, 63, -61, 55, -40, -29, -7, 64, -65, -84, 43, -69, 105, 138, -43, 167, -37, 126, 6, -26, -10, -48, -19, 138, -4, 10, -64, -52, -80, -33, -116, -16, 38, -47, -11, -55, -44, -91, 45, 9, -66, 75, -7, -195, -75, 102, -34, -23, -15, 58, 83, 142, 75, -116, 2, 130, 73, 20, -23, -48, -142, -76, -20, -152, 51, 46, -127, -101, 18, 83, -30, -190, -118, 18, -33, -48, -41, 144, -107, 89, -272, 37, -43, 17, -96, -58, 133, 136, -10, 48, -50, -71, 83, 45, 95, -20, -91, -4, 34, -62, -106, -122, -17, -55, 23, -46, 106, 32, -187, -57, 122, 65, 198, 132, 59, 48, -129, 65, 62, 9, 168, 132, 50, -17, -5, -47, -197, -5, -56, 90, -201, -181, 50, -8, 1, 12, 74, 197, -103, -126, 0, 90, 70, -39, -20, -65, 110, 32, 66, -53, 57, -86, -75, -60, 0, 3, 93, -83, -56, -133, -73, -17, -53, -104, -154, 109, -76, -67, -79, 141, 56, 80, 69, -76, -3, 51]
5710E1m1j86J49m6ML9J8J29k8r9M3n5J11j09k3o5J79N2k70O0J65n8j5J06k0l3
5736E8j59P1J33j39l7J38j34K48l04N3J49j50k8n4J82K8r4lOJ30j97K43o1O8K0
5761A67j11k9r1R1o9J3M2l4k3L8J57K34m22J8m4m4P9j39K50j65N9Pj5M8n4J23
5787H6j60N0K0m2j78K94q0j4J12o2N0j63R6pk1q8j08J83k4Q1O5R9n2j28J12j44
5813b3L9N2q5J55k82J75O4r4r3QO4j53J00P4R0j52P5j2j86Q2R6j19K0M0L1J04
5839G0j37K08k07J30nr9R8j4j49J31j58K19p9l2ML0j2j44J59o6R1m8o4J41j32
5864f5O7j0k0O7J4j36n3K06r9M0L8j19N7J02k8OK9J18l50L42k95J30j77Q8R6N
5890E3J0K1lm5l2k47M51k32p1R9J80k33Q1m1l4J40k4j42P9L5Jn9lK9l1OR0K4K3
$$ y = [51, 10, -176, -27, -73, -69, -30, -12, 117, 89, -10, 33, -22, 89, -20, -43, -108, 71, 123, -147, -87, 78, 20, 5, 111, 91, 58, -101, -30, 103, -36, -73, 65, -69, 179, -125, -72, 77, -73, -101, -155, 27, 55, -39, -42, -36, 94, -103, 140, 79, 147, 167, 56, 27, -64, 27, -42, -29, 13, -21, -44, -6, 151, 385, -37, -19, -63, -107, -28, -167, 83, -82, -23, -16, -31, 17, -37, 86, -74, -24, -4, -46, -224, 70, -10, -24, 88, 26, 76, -87, 9, 2, -19, -107, -215, -32, -56, 25, 90, 189, 137, 9, 121, -23, 16, 68, -17, 138, -144, 31, 95, 1, -92, -84, -20, -173, -73, 1, 91, -61, 14, 2, -184, -102, -6, -125, -105, -65, -34, 70, -67, 141, -66, 64, 59, -40, 58, 44, -105, 26, -132, 87, 8, -24, -20, 10, -2, -146, 13, -53, 38, -10, -74, 67, -65, 2, -8, -28, 39, 53, -83, -136, 70, -29, 11, 49, -70, -13, 89, 61, 67, 96, 214, -136, 206, -89, 41, -136, -48, 48, 53, 63, 84, 81, 36, 4, -243, 208, -24, -95, 4, 184, -49, 32, -9, -43, 97, 73, -69, 10, 45, 46, -13, -16, 13, -18, -12, 78, 102, 125]
5919A25j19K4o8J67K7l28J94k0J13n1j72M2J94r5j09Q8o2n8R5j34J54L7jl7j23
5944a17K19j72N4K8k3lN7l5N1m0k9j16o1L73l00R6j52K65k30J54m9k2J70k11Q6
5969gN4q6q8R0J33n4q7q1J22R1K6j58Q5NL9k2L3n2q6J67j28PN8M2J08k47M7LO
5998B0j88K74j22J37j16M3J89k09J05o7j26K23k30J6J19j90J75N3j82nJ85J6l2
6021H8j8k8L9j20P8k14K89n6j36J58j29J25j43P4j75L0K27j10k0K0lnP1k2J08
6046A28j77l6K05j88J34j18P5k4R2p1o8n9K1J15P2j41J10r2L1M2R0o2l8j4n1j45
6072a69K50j96K22o6n4j91J37l6jP3J29j25R3n4j48J08L9J24r3o3R5n3J82j84
6096A9K6K5L3j42j0K46k87P1n3N2O8n3M6j02J23m6N4j24J14q1J02J4n7J5j21M0
$$ y = [125, 6, 30, -38, 129, 156, -172, 22, 2, 115, 64, -108, -66, 128, 33, -76, 12, -50, -108, -13, -147, 7, 44, 43, 6, -117, 102, -70, -16, 12, -11, -14, 43, 8, 59, 19, -10, -126, -187, 186, -114, -18, -170, 95, -135, 19, -30, -52, 118, -93, -7, 47, -39, -127, -37, 96, 42, -45, -126, -4, 87, 113, -45, 40, 45, 84, 62, 95, 43, -43, 124, -4, 3, 61, 103, 211, -36, 11, 14, 20, -168, 106, -16, 121, 5, 48, 237, 28, 133, 66, -60, 163, -67, -51, 68, -122, 53, 106, -76, -81, 104, 120, 88, 70, 42, 81, -39, 39, -175, 114, 58, -78, 80, -49, 76, -67, 7, -168, -138, 89, -21, -41, -21, -24, -29, 42, 20, 128, -49, -85, 120, -68, 66, -52, 23, -1, 91, 20, -48, -107, -86, 29, 101, -40, 70, -22, 9, 51, 141, 79, 41, 27, -24, -169, 81, -115, 107, 41, -13, -204, -67, -103, -104, -31, 98, -27, 66, 12, -136, -28, 11, 135, 42, -21, 74, 21, 203, 19, 45, 70, 103, -39, -49, 197, -90, -19, -72, -20, 48, -5, 41, -61, 62, 16, 70, -54, 60, -21, 81, 95, 38, 53, -68, -28]
6122b8k0m3J09n9K7l5j7J03n9q9R1%n7R5j18J8J24Pm8L0j05r3J54J33r6o6K02
6149A60j33N9J03j79j37R6m4J19o8O4j36n8M7KJ33j2k42L84l77L32rj81J7R1m1
6174a0Ok0Q7n4j17J80j58J5Qj62O6J1J12L2o9R3m7Lj15K04j01p4J1k9J15K0P4
6201H1o6J7m9J66Q1k69L8j7R1j38q3K31n7%P6j26k3J45j96J9N2J4P8l3j90J15
6227d3M5o9p2L2N1J23j82K16M2j46J43j05j38J25p1l7m7J59J88j64j46L4J11j35
6251h6K45j22J6l7k03k7J14N4p4J70j17R1r2j9M7K7N8k4J7n3J05k5m2J0J4j90
6277a43K45j15Q2o5l4L4J02jj19o1J96l4p6n2M2p6Q5N2j55q5l0J58m4K36j69J02
6303G5r5p7R1j8K1J4p6pJ27j01R2Q5q6Q0r8j00Q8O0k72J84J73j72Q4j03P9n5L9
$$ y = [-28, -48, -91, 18, -41, -14, -49, -66, 37, -22, -111, -20, -20, -77, 18, -100, -82, 42, 49, 1, 31, -74, -167, -13, 120, 24, -42, 160, 27, 86, 189, 10, -127, -31, -75, 44, -24, 40, -96, -154, -107, -105, 28, 16, -226, 158, -219, 113, 104, -77, -60, 31, -10, -4, -24, 63, 9, -108, 72, -86, -71, -63, -225, -159, -148, -36, -4, -73, 20, -27, -24, -139, 65, -36, -110, -99, -128, -13, 7, 81, 15, 32, -17, 149, 230, -39, -1, -18, 73, -65, -148, 83, 26, 26, 102, -24, -47, 98, -98, -79, -27, -13, 65, 32, -158, -43, 2, -67, -139, -107, -56, 67, -115, 101, 143, -3, 140, 35, -103, 22, -49, -86, -133, 26, 214, 50, -96, -62, 49, -86, 159, 37, 53, 16, -187, -214, -100, -46, -120, 50, -67, 24, -68, -87, -40, -13, 45, 21, 38, -15, 90, 65, 23, 33, 47, -143, 102, -13, 69, 4, -30, 4, 106, 105, -14, -75, 121, 87, 11, -41, 1, -75, 10, 62, -93, -178, -208, -50, -94, 142, -27, 75, -20, -97, -6, -24, -3, 11, -65, -72, 55, -46, 46, 131, 45, 125, 27, -73, 15, 75, -197, -13, 160, -12, 72, -31, 48, -7, 32]
6330C2j34P1R1k4j66kJ72j58J30O5j44K08k02O5O9j48J04p6k7J05j73K37j55M4
6354a6j1P4l7J6r0R9j7o2Q3j45J85r4Oj43J08O8J76k18J0N6p2MQj0O8r1P2O7q9
6383EM0q9J73k18O7k3P3p5M0M6q5L7J18k54J31j7j4J54n0q9M4j8o2lR3m3k3J16
6411G4m5L2j36j00J61j31K39q9L1q3J3J19k86K62P5j30j56J67o9k7J36j05L9K3
6435A4r8L7m9K27j14J27k10J80j29K18k03QM2J57k35kQQ5j33O6J09l00L38k49
6459a06K50j22M2j05J01j64J12lnL8o7j64J40N1J19j5j83J80L3k26K17k67K86
6482A42j1l03K79j38m0N2p4J32j06R3O5O4k59M7o4J06L7J1J7j56K59l11Q1P4J6
6507A3N1j17Qj3P9q1Q6J1k06P0N5O1N3o1P5j19K8o0oJ03j05M9J58%j57l5N7j9
$$ y = [32, -102, -31, 60, 36, -130, -132, 40, -118, 12, 77, -67, 141, -61, 4, 73, -75, 29, -47, -74, 31, -142, 95, -60, -16, -27, 47, 10, 26, -64, 35, 18, -44, 39, -106, 79, -15, -9, -152, -44, 24, 200, -18, -8, 48, -24, -20, -12, -22, 46, -45, 27, 94, 5, 45, -44, 129, -89, -22, -45, 28, -47, -7, 39, -46, -9, 109, -145, -14, -31, -45, 109, 59, -30, 14, -4, -66, -69, 24, -19, -42, 74, 29, 61, -75, -175, -14, -145, 94, 5, 36, -47, -34, 85, -201, 61, 136, 6, -150, 17, -52, -79, 57, -48, -9, 14, -84, -47, -96, 131, 17, 144, -66, 114, -15, 203, 0, 8, 50, 207, -28, -30, -22, 63, -70, -4, 105, -195, 143, -106, 144, 22, 64, -41, 60, -104, 8, 5, 0, 38, -29, -193, -53, -2, 117, 102, -81, 99, 132, -94, 123, -144, 142, 131, -172, 107, -31, -71, -19, -93, 39, -67, 26, 91, 155, -104, -57, -121, -15, 22, 33, 50, -106, 153, -158, -77, -3, 13, 64, -53, -45, -58, 21, -60, 26, 37, -169, -99, -44, 17, 70, 9, 84, -35, -7, -67, -73, 30, -75, -26, 132, 132, -25, -60, -3, -22]
6535b2m5J41k64R1K27j62J56j51J35j43J2l1RK09l12R5L1j07K50j9j07l1k3r5
6559a56P1J50k23J49k5l3p8P1J6m7J74j25p1J19Q4j33Q0j7j2J34j25q6J40j9o0
6584b2r5K31p5L1J55k18R1m7Q5k3j29n1l1K16j71r6K36m6j1j12Q0N1K2j37J16
6609E0K1p9kjJ97p3k01L0Q3r4l4JJ44k9j59J21N6j18J16o6J24n7P8k39N6jK1K
6637e3J33P0k09P3j5M6k17K33j45J16k17K03O0M6j79R3j05J45k5r7l8J32J4r0
6661b6r7K6J87n4j29N0P4r1P7o4J06j2p8L5o9L15k47P1q1R4j75L01k54O8o2O9
6687C4j9r9K07l3q3l6k8N4j06O2J26p0p1M5k6J24l9j60O3J04lm6%j00K10nL2j25
6715A2j12J08n2K07k52O7k2K1J88j67J20j13J2o2M7J59k65N2J36j58R7j37R1M0
$$ y = [-22, -67, 74, -190, -99, 128, -34, 122, -29, 106, -37, -25, -56, -47, 162, -150, -55, -24, -131, 119, 100, -7, -38, -61, -156, -85, 65, -158, -9, -34, -67, -145, -74, -58, -105, 69, -56, -127, -8, 76, -57, 23, 6, -6, 128, 3, -83, 57, 38, -22, -117, 114, 39, 70, 225, 7, 98, 51, 136, 113, -16, -67, -98, 118, -53, -149, 87, 41, 30, -82, -2, 49, 71, -66, 50, 71, -8, -10, -11, 186, 113, -88, -58, 25, -69, -103, -102, 42, 13, -146, -25, 31, -87, 29, -37, 87, 30, 108, -131, -75, -76, -55, -53, 80, 150, -59, 14, -1, 45, -172, 61, -84, 32, -185, 18, 78, 124, -55, 38, -67, 78, 53, -44, -82, 50, 64, -26, -123, -97, 90, 36, -93, -43, 31, -60, 17, -47, 59, 47, -31, 4, -65, 250, 3, 74, -7, 87, -88, 213, -41, 27, -35, 34, 15, -84, 123, 90, 7, -29, -57, -3, -109, -47, 79, 9, -62, -17, -43, 81, 42, -118, -55, 49, 46, 0, 0, -100, 110, 105, 137, 12, -100, 8, -44, 163, -89, -22, -44, -23, 165, -2, 118, 5, 17, -45, 2, 161, -104, -52, 84, -74, 23, -114, -23, 17]
6739A7q6On1P5rJ08J39j31k5j07J09j19K2J49k9q4O6kJ5J5q9j27K4Q8O5j24K21
6766A36q9j35o3R2K5j9J46j0j74p1J41j37K6K46o3j11m4K76j84j19M8J32Po2O2
6791E6j26J63j31%J48j74l6N5l6J66LM1p2k5o4PJ07q0O7j20M0kj11l4J57RJ46
6818A54k19j14K14P6o7mj5k60J05J19j13J43J4j03N2P4j04J63k41K31j25J15j76
6841h1J87j30K0O8q7R1k6R2j70J4P7j71J39j5mN7q5j22r0L30k15L14j9j30l1l8
6867b5q5J11J31j15J4J39k17N0l0J16K1m1j95J56o2J5l5J80m5m9J40k28J31j10
6891c3k3M7l8Q4j84J91q5J53j02p5Qn6J76j59J64K7o4%j55O5Q8Q9j94O2r8J10
6917bP3m5J48j61l7Q1k20J61m9j16J35J5j0l7J81j97K18j51l6J23j52J73j50J62
$$ y = [17, -69, -63, -114, -39, -48, 60, 199, 68, 43, -64, 45, -74, -52, 97, 68, -16, 50, 48, 63, 78, -11, -138, -114, -26, 39, -85, 136, 47, -88, -151, -59, -34, -53, 93, 83, -91, -162, -21, -158, -132, 114, 51, -60, -104, 172, -12, -131, -83, 49, 56, -6, 56, -70, 93, -38, -38, 110, -64, -100, -45, -81, 85, 88, 129, 57, 32, -32, -25, 82, 2, 69, -51, -11, -13, -124, -158, -1, 8, 154, -65, -179, 35, 111, 44, 40, 25, -235, -130, -11, -124, 19, 33, -70, -18, 56, -48, 115, -126, 105, -20, 95, -81, 106, -24, -4, 64, -23, 68, 42, 134, -36, -22, 55, -116, 23, 8, 4, 61, -24, -146, -236, 94, -121, 193, 174, 44, 13, -25, -110, 1, 132, 17, 31, 170, -47, 3, -27, 89, 110, 69, -126, 30, -32, -17, -52, 128, 83, 34, 174, -54, 77, -33, -56, -9, -47, 37, -147, 44, -41, 112, 10, -65, -57, -113, 63, -96, 68, 95, 31, 31, -124, -59, 29, 118, -76, -14, -112, -2, 71, 26, 174, 13, -24, 57, -163, -2, -51, -167, -32, -17, -27, -64, 117, -80, 138, -13, -49, 74, -78, 95, -55, 107]
6941A07k40J45R9k47M3J89n9p7O0j51J42n1J63j45L6K16j98n4Qj29Q5Rr4L23k48
6966f8rj23K79N0n4k07N2J11N9q9M8j01M2MJ9%jQ9j20j8J0O7O1q9M3m8l5J35k07
6995a00J74r5M7r2j34J48J72q9o4PO4J13p2k18R4J45j4kq0k7o7J00M8o5J3K0J51
7022A77j73k06L17j68l6Q3K7k0m3R1M5j0j70Q1k5l0J31r2j08Q5L1N4k06J23r4
7047a36Q7j05O0M2nK8J19pj29J15j47J37J12j41l3j3l5j3L18k60n5K03j17nj03
7072h3l2K89j49J42k60Q1P0j80O3n9J68j6j32J31O3m9n3L7Km4K8O5J1j23K1Q9
7098H0r2o1N8r1J68l5K3kk06J76j51J58j25J60rj18M9J04j17M4J06k22J04j33
7122a32O8R7O2o0q6j5M4J09n8r4jRpm6K61k53K4m2O2O3jR6M1k56K2N6P6K0N0j40
$$ y = [107, -133, 12, 111, -136, -93, 96, 37, -40, 20, -131, 11, -40, 123, -22, 14, 230, 32, -22, -14, -143, -58, -49, -143, 180, -68, -77, -200, 79, 129, 75, -132, -80, 31, 90, 1, 49, -52, -10, -6, 13, 13, 12, 101, -19, -37, -27, 40, 101, 12, 55, 7, -28, 107, -100, 74, -21, 26, -66, -200, -52, 120, 31, -33, -26, 38, 151, 79, -139, -45, 100, 86, 84, 4, -23, -90, 10, 58, -7, 6, 26, 177, 4, -202, 115, -53, -89, -6, 21, 1, -42, 49, 94, 84, -86, -5, -30, -60, 71, -21, -129, -44, -13, 41, -165, -42, -136, -49, -154, -94, -52, -57, -29, 90, 83, -46, 69, -78, 59, 171, 30, -3, -16, -51, -64, 254, -6, -61, 142, 25, 20, -83, -115, 174, 25, 167, -93, -12, 58, -122, -59, -118, 50, 34, -98, 33, 96, 47, -6, 31, 33, -11, 17, 82, 93, -30, -9, 80, -12, -73, -15, -106, 62, 27, 50, 48, -158, 18, -133, 25, -100, 60, 51, -67, -18, 86, -31, 13, 119, -103, 1, -132, -64, 33, 95, 35, -51, -66, -22, 87, 29, -65, -66, -57, -64, -110, 151, -102, -78, -120, -58, 5, 4, 100, 141, -115, -93, -37, 39, 59, 109, -31]
7152c1J5N2m2k1q7J19j23J16M7p0QJ34k56p4N1K33k19R3p4J34N4j62O3L7K6J6
7178C9j41K08j51K7N8K16k49k4J71j58n2N1J07K1j25j5r4J39j67M1R6P8k24J62
7202A4K4j08K5J08p8j50J16mJ73l3j18J32j06kR9j11m3O9J15m5r8q1J86lj65P
7228g7N5pM7R6k19L7KkJ28k51K51n3j51J5M9N9K1J16q9N8j50O6K7J3p9M3l5j00
7256a30P7J59r3o5J46j30J43o1Or7J77j52j4M5j29J22o5P6l8K29l23P5q2J42j46
7281a28J19Q9k28m2J73q1K8L9j22K42m1O7j80j2R1Q1j67jJ40k06J79l5K9P5r1
7306A8M9R3k26Q8lj8j80K44o6j32J36j6J8N2M7r0J79m2o1j17m6K4K59k72o2J78
7332E4j9K5j49n6J55K4j18J9M7l2J9J64rj5j96N2M9o4N5N9R5K3k33K52l65O8K02
$$ y = [-31, -16, 36, -6, -27, -114, 5, -118, -2, 45, -25, -17, 117, -139, -213, -162, 71, -148, -55, -129, 5, 59, -103, -40, -3, 23, 39, -102, 106, -45, -18, 40, 256, 7, -17, 154, -4, -56, -5, 102, 123, -2, -17, -111, 28, -139, -98, -2, 76, -148, 14, 38, -70, -45, 63, -15, -165, -49, -53, 120, 87, -31, 101, -5, -7, 92, -19, -62, 7, 122, 77, -21, -102, 84, 81, -84, -77, -22, -29, 18, 114, -105, -68, -66, -68, 60, -191, 60, 7, -144, -129, -80, -21, 0, 116, 27, 85, -65, 1, 28, 41, -38, 5, -30, -130, -53, 106, 13, -52, 94, -36, 107, 46, 52, -45, 132, -20, -34, 11, -118, 4, -61, 15, -23, 206, -117, -42, -124, 18, -128, -9, 80, -148, -190, -17, -98, -70, -31, -153, 89, 48, 115, -65, -77, 14, 95, -72, -73, 67, -139, 40, 5, 34, 109, 18, 67, 160, -66, 22, 19, 1, -179, 65, -1, -133, 3, -13, 5, 57, 104, 14, 193, 151, 90, -27, -73, -49, 210, -62, -124, 54, 35, 60, -89, -145, 10, 34, -84, -65, -18, -50, -31, 133, 124, 109, -87, -35, 14, -50, 5, 64, 159, 182, -51, 201, -164, -96, 106]
7359A06Lm8J7OJ7m3j56K61l43K27k7m4l5p7J91j48J64l3K4j68nJ40k5p2L24l04
7385d8J01K7j1m1J37k06J73O0j91J8RQ2k75J44L7rk0n1j4J73k6l2j50K06j17j33
7411a57J52LJ56j94R1j10J24K5j13oP7Q1j45J08k50N0J11J02k17J21N0m5L8m7
7435Ej00K36k23K7k0O8Q0k3M6j30Q4n4J56j97o3O4K6J39pk27J55%j6Qj44pK28
7462A11r4J17j44P7m1n7j01K8L7J03j06k8LR6j88J16R2p0K11r8j67J5J77JK6j57
7488d1K30j26j25P7p5O8j24M2J43o3N6j9Om1M6r3J08O3p9j64J76j15J80k2j4n3
7514D1j77J34j7PJ31o8J20j41J2lJ9j03nJ98l6k52R5J60k31R7J14k15j22K27j36
7539a51J58j26J51L2n1%N9l7j03l5K8J08k9j15J63Q1k21M3k6J32M2k59R0J27j75
$$ y = [106, 109, 61, 78, 84, 101, 58, -98, 163, -180, 47, 20, -24, -59, -136, 55, -93, 71, 38, 62, -106, -111, 29, 4, -68, 256, -48, 53, 80, 69, 28, 165, -41, 132, 192, 1, 19, 28, 110, -165, -21, 16, 7, -13, -64, -78, 95, 69, 37, -113, 93, -24, -157, -5, -2, 154, -40, 51, -59, 65, 90, -23, -29, 48, 129, -16, 92, -158, -108, 3, 105, -112, 9, 59, 14, 52, 5, -95, 141, -82, -55, -75, -7, 73, 50, 96, -34, 50, -4, 152, -45, -108, -44, -18, 121, 114, -113, 42, 42, 26, 34, -110, -117, 111, 17, 134, -10, 67, 26, -31, -132, -104, -67, 36, -70, -98, -95, 1, -187, -71, 21, -49, 162, 64, -103, -88, 89, 90, 116, -41, 189, 63, -62, 15, -60, 8, -116, -74, 69, 6, 62, 43, 49, 8, 54, -39, 69, 132, 53, -111, 65, -50, 130, 108, 94, 41, -136, -2, -19, -12, 119, 51, 171, 30, 42, 39, 58, -45, -50, 148, 112, -140, -45, 115, -116, -19, 95, -120, -242, -15, -151, 7, -119, 32, 64, 13, 13, 72, 35, -68, -103, -75, 33, 4, -111, 52, 133, -88, -45, -71, 61, 103, -156, -66, 61, -114]
7564a14J0R6q6rLK21j96J40j55O7K5K7K7r3m4R0JJ1L8j41K15j69j53K35p0N0p3
7591d7O8o3O7j24J51p2J12J2P9j82m1P2M8K9m6n7j25j8Q6p5J01Q9j61J05M0J02
7617A50j84J37jj15P7j66P8O8j06P3j36M0J08l2p5Q4R2j21j8M9M9l4k9L1J18k64
7643a27J92RJ8j18L5l9K1n8J96j95LjJ05M0oK4RN0j92L3m0J82k15M3Q7J18j60
7670A4Mj81J95l7L5O3j85K31k88oJ39j41R5K00j05j13N6j66N4J82J25j44k6r8
7694i7n6L85l20J23k2p7K6O8j72K53j43m1L8J05k31R2L9J45k80J0K2N8oN2nn7
7720i1l0J58J30k86Q4m7O3l8O8N0q2lJN7n2PL1J28l9j07o6J03p4L8m8p1J10j23
7748a29R9rJ23j32K12j85l0R7j11P3k9k3O1J19j04J51k25J31k47R2m1J19Q8j41
$$ y = [-114, -104, -8, -94, -103, -100, 121, -75, 65, -90, -23, 2, 29, 56, -37, -81, 9, 10, 21, 59, -82, 133, -36, -189, 46, -24, 26, -47, 21, -42, 25, -99, 52, -20, 92, 104, 183, 1, -40, 32, 80, 109, 63, 6, -119, -137, -51, -126, -25, 64, -97, 8, 48, 150, -34, 103, 102, -13, 64, -102, -24, 44, -62, 11, -125, -85, 23, -9, -84, 0, 92, -29, -47, 2, 51, 17, -12, 19, 137, -127, 65, 74, 92, -26, 9, -30, -9, -67, 129, -66, -63, -64, 41, 81, 75, 99, 108, 158, -34, -1, -41, 141, -74, -31, 56, 174, 14, 18, -163, 32, -5, 30, 93, -92, 139, -149, -155, -16, -157, -62, 138, 33, -80, -24, -190, -136, 46, 171, 27, 1, -97, -153, 232, -88, 35, 13, -64, -38, 30, -142, 111, -32, -73, -35, 70, -161, -69, -30, 115, -165, -155, -133, -75, -81, -29, -34, -91, -121, 37, 167, -119, -35, -82, -19, -57, 11, 61, -21, -24, -23, 34, -18, -11, 20, 148, 109, 2, -64, 39, -35, 3, -45, -116, -6, -129, -30, -39, 84, -48, 164, -21, -51, 46, -65, 8, -21, -44, 17, 136, 32, 183, -42, 89, -158, -66, -107, 12, 100, -41]
7772d1R0N3k49K75o5k02K90j87M5k1K11k53O3o7J3J30j05J0M7j84J45oQ7k06J70
7797D3k3Q6k03J2R4r7K39j28o7K8P0o8rJ15k61K15p2R6n3nJ46j26j87K39j80J24
7823B8j8Q0Mj07l1L9Oj4J1j45J63N7p2K2l6p3j10J88K5K4L7q8K36l59K54j42O3
7850D2j11M4J04j31Po4J44n2Q2j48J36j93J56o3m4J7Q2r7P3N9r4Oo7R0PR7n9m2
7878a9J8k6N8j04P1J5O2q4n7n9J36M9K0O4p9l8k47L17l82M25j20m0P9m4J2j16
7904h9J53q0m6l8j25R9J67j96M4J49n8n0O8J41k4q9n6km0J3L4J31k78K37Pj36
7930f4L8J70p7om4K8q2K0j47K49k1q1K7k56J55n3J53J28k99K67j47j52J41K29
7954A76j27r6K05k62O1Q5OK9j2Jj95Q6O8K3q7L4k7N2R3l51L60j02m8L9p8J20J09
$$ y = [-41, 49, 102, -147, 128, 63, -139, 151, -36, 9, -12, 199, -54, 9, -58, -45, 85, -20, -10, 37, -147, -2, -8, 79, -127, 43, 20, 106, -97, -85, 9, -88, 151, 23, -44, -16, 54, -14, -23, 92, -169, 46, -26, 70, 17, 12, 158, 32, -155, 84, -96, 28, 10, 90, 94, -13, -44, -5, 1, -13, -2, -147, 16, 73, 1, 23, -13, -86, -196, -8, 17, 41, 78, -10, 226, -133, 121, -21, 42, -69, -25, 79, -52, -45, -109, 35, -17, 65, -83, 53, -140, 16, -47, -91, -74, 8, -89, -16, 43, -51, -45, -112, -22, -15, 82, 23, -19, -1, -27, 31, -73, -2, 13, 75, -9, -66, -125, 11, 60, 80, 144, 65, 27, -220, 97, -285, 140, 20, -20, 59, 15, 27, -89, 64, -16, -62, -100, -225, -126, 41, -155, -111, 38, -20, -70, -2, 139, 115, 26, -30, -32, -72, -59, -25, 106, -172, 65, 72, -64, -26, 144, 67, 61, 17, 45, -37, -17, -164, 85, 64, -17, 10, -246, -91, -144, 9, 137, -162, 105, -42, -194, -53, 176, 49, -47, 158, -104, -43, 42, 48, 77, 65, 66, -129, -43, 25, 48, -39, -5, -32, 20, 113, -238, 122, 20, -28, 11, -67, 53, 162]
7981A62j46j29J24N5%j17l0J72r4J19j87NM7L0R2j9j95J89k6j8O8p5jJ0mN7j07
8008a8m6M7j67J67r1J13l5k9J03k8Rj02j25J38K30j13q1N3k4J02k66Q2k9K5q4
8033a69K50j38Q9J4j48Q4L5J06p8J57q3J1N9j27j65J26j78L21j75J69j76J1N3
8056D8k4Q6p5q2K8K9q3R9O8j18l5J83k27K50L7p4j13R7k61O5K07j42N2J2Q6K6
8082A39j13m6j0N9l7O0r6l8P1L1n6K56k22J00j20RN0j74K01j35M9n5J09J26r5
8107F3j85J38m8L8K4k9O6j96o0J80rk5o5J8K45k25J25O7p3K7R0m0j43O6l2m4r
8134c6M6j12j2J70k8jmj80M0M5JR6m1l4J1J34p6j4p8p6Q1J17rj21N0%N2m8J7Q
8164bR5K3j39m0Q5L8k8J03j83J29m2l1K1j48J32Q8n0k8O8j13l0J21q8J0J13j08
$$ y = [162, 16, -113, 11, 66, 66, -51, -81, 91, -3, 116, -71, -66, -19, 11, 103, 84, -111, 78, 52, 34, 102, 27, 26, 36, 32, 89, -18, -64, -17, -184, -17, -108, 5, -30, -59, 44, 16, 25, -77, -202, -64, 166, 53, -28, 25, 1, 103, -163, -81, -110, -85, -169, 81, -57, 32, 46, -102, -18, 17, 123, 45, 202, 119, 130, 189, 62, -103, 23, -155, 166, -9, 160, -16, -5, 48, 24, 110, 35, -47, -19, 10, -73, 26, 94, -24, -59, 124, -103, 147, 184, 110, -3, 94, -167, -102, 105, -37, 15, 27, 113, 139, 26, -20, -30, 29, -8, 52, -44, -82, -11, 20, -36, 220, -2, 98, -22, -13, 37, -137, 64, -71, -22, -77, 32, 158, 63, -122, 16, -32, 6, 30, 1, 67, -129, -189, -9, -18, -43, -108, -90, 155, -70, 55, 122, 49, 76, 166, 126, -17, 49, 17, -27, -36, 10, -102, -114, 56, 28, 27, 23, -157, -117, -72, -71, 25, -16, -50, -39, 95, 19, 5, -73, -149, -68, 49, 40, -81, -31, -31, 21, -27, -10, -2, 93, 116, -23, -63, 22, 60, 32, 135, -48, 81, 39, 8, 29, -119, 13, 101, 51, 23, 91, -22, -52, 69, -19, -9, 104, -4]
8190dm9
8191e3
$$ Imaginary data points
##PAGE= N=2
##DATA TABLE= (X++(I..I)), XYDATA
0@%%%%%%%%%%%qJ6j6K4l2M0m8N6p2Q0r6J20j36J60j87K17k52K88l33L81m32M92
33B62n55O28p08P93q92R95j110J239j375J526j687J863k060K272k506K764l045
50a596L353l693M071m491M963n499O104o801P612q564R715j1126J2903j5229J8410
65A0132k3053L0480m4274P8439l21554o17002K90458K77673L29441N08655K85830
76H05225k80352l99060m15984l91401m3571M05789M48170L68137K23471j48315
86E72109m96578m44281k51758l3116L05981N27230L53033R4795j14130m03372
96A09913n14287k14083P0457K11159M48139M81732O0091k69121l04268l92860
106c13128l43289Q3569L80966L38633L06320J91563k01616m52559l41185j88863
$$ y = [0, 0, 0, 0, 0, 0, 0, 0, 0, 0, 0, 0, -8, 8, -8, 16, -16, 24, -24, 32, -40, 40, -56, 64, -72, 88, -99, 118, -134, 154, -179, 202, -230, 262, -293, 335, -373, 420, -472, 523, -587, 652, -723, 803, -884, 979, -1081, 1191, -1315, 1449, -1596, 1757, -1936, 2135, -2356, 2607, -2892, 3212, -3589, 4023, -4541, 5174, -5952, 6951, -8278, 10132, -12921, 17559, -26715, 51724, -269830, -886832, -596374, -318701, 10740, 519395, 805225, 524873, 125813, -290171, -681572, -725143, -319354, 128816, 496953, 720424, 572109, 75531, -368750, -620508, -653624, -347643, 179587, 532620, 627415, 513285, 109913, -404374, -618457, -548000, -336841, 111298, 593030, 653121, 384000, 79732, -313128, -656417, -572848, -191882, 146751, 453071, 644634, 443018, -9541, -350726, -539589]
116e39589j6821L08999M61569K69406N6900j21307l91092m34772j30872R9765
126d37814K01636L90209L67123J3914k16911k79537l83343k41478J54536L05069
136a26596K65136L04399J29224k63360l73316k44556j74884J1901L20665L77474
146B26087K06444M6304j62732l62044l06633j02059M7703K35227L90585K49958
156D68840l8353j77476k63812l28152j48518J35463K38985K77601K80877K9162
166D74617k68693k81540k05821j67125N6584L19367K97026J48044M5506j55957
176B62008l45845k62664n6776P6474K26117L21963J84239l3942j57528k66038
186e1992k86854q2844J37984K11359K60599K19730k7355k22595k23405k19945
$$ y = [-539589, -556410, -247411, 214158, 483564, 540464, 419157, 28065, -406707, -537579, -437814, -236178, 154031, 521154, 535068, 318157, 38620, -344723, -586201, -431665, -126596, 138540, 442939, 572163, 308803, -64513, -309069, -483953, -472052, -151387, 226087, 432531, 478835, 316103, -45941, -352574, -454633, -406930, -171703, 218882, 468840, 430487, 253011, -10801, -338953, -487471, -352008, -113023, 164578, 445455, 474617, 205924, -75616, -281437, -448562, -391978, -72611, 224415, 372459, 417965, 262008, -83837, -346501, -403277, -326803, -100686, 221277, 405516, 371574, 214046, -51992, -338846, -421690, -283706, -72347, 188252, 407982, 380627, 158032, -65373, -285318]
196b85318j45516J27221K96650K12718J29274M0562j85330l04883j87482n7281
206c59385O2915K49465K92152J13029m8792j40349k48386k38700m9510J24115
216b43446K08212K46470J53822n3349j81769k12076k12614q1925J46377K35848
226E550J88600J38313n80k10805k53735j40761n0358P5708K43607K38975Q0495
237C15009l3765j39655k57527k00534K387J26676J77742K15684J27480o1368j73101
248I9028k05118j85867l6043J50704K00024J70889J22515l4569k03350k10060
258a31847j32175m5892J16305K38722J73546N8127j8660j54183k49735j43880
268b89672J9867J02049J80698K13052Q2652q6717j57427j84438j55771q904J38727
$$ y = [-285318, -430834, -303613, -6963, 205755, 335029, 375591, 190261, -114622, -302104, -359385, -296470, -47005, 245147, 358176, 309384, 169035, -79351, -318051, -367561, -243446, -35234, 211236, 365058, 311709, 129940, -82136, -294750, -376675, -230298, 5550, 194150, 332463, 331883, 121078, -132657, -273418, -323776, -248068, -4461, 234514, 315009, 281244, 141589, -115938, -316472, -314085, -187409, -9667, 206017, 333497, 272129, 99028, -106090, -291957, -328000, -177296, 22728, 193617, 316132, 281563, 78213, -131847, -264022, -309914, -193609, 45113, 218659, 276786, 258126, 103943, -145792, -289672, -269805, -167756, 12942, 225994, 308646, 221929, 64502, -119936, -275707, -284611, -145884]
279a45884J80331J68838R6508o6619j89163j80937j18766j9571J28694K02062
289E5493J50035O7851m1520j83990k10046q9473J4811Q6604J87763J92691M6353
300B76572q5965j43790j84495j34642K7638J39088J53009J49675Q1006p8744j79957
311A9395j61692j03159n08J33008J83014J32612N3613o3539j77443j70726p7083
322b32508N840J06657J95100J46457J4098o9789j34492j81450j04620M3276J21816
333h9615J50569J50184M4307j04697j54215j32047r4668P801J35276J69473J18776
344B01144L6547p9806j66102j44274o7350J4557J18356J76294J15662J2637o8875
355A48790j47715j62728o4122M5595J02906J50492J39265J3806j04891j32379
$$ y = [-145884, 34447, 203285, 299793, 233174, 44011, -136926, -255692, -275263, -146569, 55493, 205528, 273379, 231859, 47869, -162177, -251650, -236839, -150235, 37528, 230219, 276572, 190607, 46817, -137678, -272320, -244682, -105594, 47415, 197090, 278096, 199352, 19395, -142297, -245456, -245964, -112956, 70058, 202670, 256283, 192744, 15301, -155425, -232508, -226668, -120011, 75089, 221546, 235644, 165855, 31363, -150087, -254707, -211431, -89615, 60954, 211138, 255445, 150748, -3467, -135514, -230182, -222381, -87105, 82368, 201144, 237691, 157885, -8217, -152491, -219841, -205284, -86928, 89366, 205028, 217665, 148790, 1075, -161653, -225775, -180180, -77274, 73218, 212483, 226289, 121398, -10981]
365a0981j29537q7768L7271J40916J39814R5737K9631q0585j55830j32050n8988
376b12370L0553J27123J55407R1039N907p3369j44080j39037m8257M2728J09428
387e4928J50801J05527j0396q8474j18743j32576o9990N9682J30069J20921R1895
398A83788J5444r8564j42088j03016m8916L0843J26342J44596P6334m371q1222
409I9170j38509j18154l2481M8415J09995J35335Q1404j3160q1664j25850j24708
420a60207l4819P0109J05383J10923R2776l148j08207j24952r1302m2195N0747
431a34892J27871J14353N8320M82q2260j38268j03193j8023N5869J09618J19636
442A09513O3163j8916q5074j21837j00269j8383O1057J02317J14499P2086k7448
$$ y = [-10981, -140518, -228286, -191015, -50099, 89715, 185452, 215083, 134498, -21332, -153382, -212370, -181817, -54694, 100713, 191752, 197659, 124290, -19790, -158827, -207084, -164356, -54928, 95873, 201400, 191004, 102530, -16213, -148789, -218779, -159097, -29028, 91893, 183788, 199232, 100668, -41420, -144436, -193352, -162509, -36167, 108429, 184763, 180392, 99170, -39339, -157493, -189974, -141559, -31564, 103771, 185175, 172015, 90351, -35499, -160207, -195026, -124917, -19534, 91389, 184165, 181017, 72810, -52142, -143444, -185639, -134892, -7021, 107332, 165652, 166134, 83874, -54394, -157587, -175610, -119741, -10123, 109513, 172676, 153760, 68686, -53151, -153420, -171803, -110746, -8429, 106070, 178156, 150708]
453A50708r9650j05855q7122l3661O5468J21524R6273N1518q244r4714j27130
464g0885p3961r155M7015J07653J16847M8836l2244q6796j12407q2535n863O1466
476i2029R8047J04501N4229l4229r1847j02604q1186j1551P3889J01723Q4706
487A03649N3562k1679j06031j08096n4755r668N1924J12447R6858K9408k9064
498A18555q2525j10416p0072N554O3269R7696R3103L4625m0387q5023r4748o7260
510a37629j507O7788R8697Q6098L5735m1694r5041q7054n2678q745O3413J10938
522C8321P7827J6812k9340q2790j03834n1916J4885N6497R2368R0176K1973n0285
534I0694q1525q5706n6095J1290O9021Q7490P5082K6690m5315q8435q1741m9905
$$ y = [150708, 51058, -54797, -141919, -175580, -110112, 11412, 107685, 159203, 150959, 56245, -70885, -144846, -154001, -106986, 667, 117514, 166350, 134106, 47310, -65097, -147632, -153495, -92029, 6018, 110519, 164748, 130519, 38672, -63932, -145118, -156669, -82780, 18943, 103649, 157211, 135532, 29501, -78595, -133350, -143018, -91094, 21353, 118211, 147619, 118555, 36030, -74386, -144458, -138904, -75635, 22061, 115164, 149789, 109402, 24379, -70369, -137629, -139136, -71348, 27349, 113447, 149182, 107488, 12447, -74607, -127285, -136030, -72617, 38321, 116148, 132960, 103620, 20830, -83004, -134920, -120035, -63538, 28830, 119006, 140979, 90694, 9169, -76537, -132632, -121342, -52321, 35169, 110251, 136941, 91626, 3191, -78550, -128455]
546a28455O674P4627R4233N9465J8545l2234r0978r0973l3115J5055N4984R5504
558D3332P5668K811m6236p1238q5970m9334K4426P2039Q0561O2567J1968m6436
570G4158p8447p6915m2805J8857P2364Q3746N6625J0703m6315q5270p2887k7882
582a14068J5975O2211R1084N7364n503m3075o9519q2162l5037L4836O4722P0713
594D7541O0925O368n7965p6600o2585l1028K3938O9740P3592M8594O281m9752
606E9049q1725o4168k2340K3652O7982P8776M0389m716m0075p5581p4052j5964
618a08773L5828N5750P0456N4966q189n8002o5545n8702k6974L2837O9907O5097
630E8656L9890k361n2204p3025n5229j7368K8001O6451P0245L6288r295m9958
$$ y = [-128455, -121781, -47154, 47079, 106544, 125089, 92855, 1877, -89096, -122211, -107156, -52172, 43332, 119000, 121811, 75575, 4337, -81633, -130967, -106541, -34502, 46059, 108626, 120594, 74158, -4289, -81204, -124009, -105152, -32788, 50958, 107583, 118286, 71971, -13299, -86186, -114068, -98093, -35882, 55202, 112566, 107063, 63988, -5531, -87693, -122730, -87894, -23172, 47541, 108466, 114834, 56869, -19731, -82316, -113344, -89406, -19666, 53926, 102520, 108801, 59049, -22676, -86844, -109184, -85532, -17550, 61226, 101615, 96899, 56824, -18757, -92809, -108773, -72945, -17195, 53261, 108227, 100038, 42036, -23509, -82211, -109185, -76348, -6441, 58656, 98546, 96185, 43981, -29044, -84273, -101641, -73640, -7189, 63056, 99344, 90049, 40091]
642D0091p1844n4912r032L0355N6458P0726M2171j8713n4975n9257n4485j8348
654a01765M0712O5073N4330L6420n533n9699p0103m0615q840K7790O4478O4168
666F6416K7686j4497n1179o7700m6064k815L3397N9336O2176K6304k0741m7469
678B4850n9929n1220m514M3761N6905N1741L1813j8470o0265n6527l4682r477
690h6014L3543O7266N4425J6212j8247m8159o1343m0056R42L6645N8534N5068
702F8816J8672k5409m9342n4468l8493Q82L9618N4431N0838K3195k6725n6523
714E492m8879l1902m852M1074O3941M1180J1031j5945n0497o0366k8616Q272L3886
727c6181N5355N0318J0691k7250m6739n2386l2989R360M1177N0802M3388J2736
$$ y = [40091, -31753, -86665, -95697, -65342, -8884, 61842, 104013, 85300, 30325, -28932, -83417, -101765, -61053, 4020, 58350, 94770, 89237, 29538, -40565, -81180, -90020, -62230, 2248, 66416, 94102, 79605, 28426, -39274, -85338, -88153, -54756, 4580, 66756, 93060, 72319, 24850, -35079, -86299, -90813, -47052, 9853, 61594, 93407, 74937, 14672, -41855, -76537, -86014, -52471, 14795, 69220, 85432, 67185, 19026, -42317, -82373, -81431, -44786, 13748, 68816, 87488, 62079, 12737, -41731, -80224, -79342, -39724, 14707, 65545, 88740, 62015, 5492, -43387, -75289, -80141, -39067, 24874, 66054, 77085, 61140, 10643, -49723, -78339, -70067, -36181, 19174, 69492, 80183, 52933, 6194, -46192, -79181, -69821, -28644, 22158, 65546, 78282]
739G8282k7791m7735m7281l2600M945M6830N4464L4080J0649k2108n2881m9805
751e0951k0373P222L5632N6058M1255J847k6827m3105m9043k8168J4159M2902
763a9392M7510L6654P123k9888m7537m2714k3213J0639M2488M8262L2890P758
775G0580k8022n2486m1815j5277R689L8466N2805L0565k396k3315m3298m9206
787e3710j7954K1189L7267M2110L5398K526l3658m4944l8043j8250J6224M2116
799i729M2635K8076K105k9983m6588l6977j5196J4287M2999M5988K2566k593k5509
812C2081m5816m0392q468J8761L3627M3760L1316o192l4944l9413l3327j5113
824f4120J8925M2285L9494K2311k335l1606m3922l1687q632J6449L9053M1703
$$ y = [78282, 50491, 2756, -44525, -77125, -72180, -25350, 29114, 63194, 73843, 51735, -1146, -50951, -71324, -64102, -28470, 27588, 68843, 70690, 43863, 758, -48285, -76453, -62294, -19392, 28118, 64772, 71895, 42007, -5530, -48244, -71457, -60818, -18330, 29932, 62822, 70580, 42558, -9928, -51743, -67020, -57331, -18865, 33940, 64505, 62109, 38794, -4504, -53710, -71664, -50475, -13208, 28902, 64300, 66826, 33168, -11776, -49819, -68069, -51845, -9729, 32906, 60982, 63087, 33104, -13484, -50461, -65657, -51370, -8371, 37617, 60183, 57590, 32081, -13735, -54127, -62595, -43834, -10207, 33553, 64869, 58677, 23733, -15680, -49007, -64120, -45195, -2910, 36584, 58895, 56560, 24954, -18968, -50655, -59287, -42838, -3785, 37918]
836C7918K1402n439l0820m4346l1441l175J7845L4114M2472K2745j2256l0480
848A8539l5964l4003r204K5676L8360L2689K0982n650l5145m0381k4852n487J8387
861c6053L8974L7210J5849r487l0618l9500k7035k902K0288L7720L7815J3037
873E5298j3786k8046l5216k9244k450K4752L4540L2943J7725j2948l5666l3414
885b5512k1300m554K1757L9532L1654R643j1315k9390l6916k3307J504K2096L5286
898I178L2513J0511j4993l0037l4203k2289L016K3902L2028L0632J2055j7014
910C5299l1025k9606k2428j197K8092L6928K3391P370j1082l0933l4689j7535
922d7415M772K2476L3607K8241O153j6509k8635l1034j9336M914K5975L2701K5028
$$ y = [37918, 59320, 53881, 23061, -21285, -52726, -55901, -38056, -3942, 38530, 61275, 49019, 18539, -17425, -51428, -60632, -34956, 3404, 36093, 57075, 51425, 16280, -24101, -48953, -54440, -36053, 2921, 40131, 55980, 46493, 15875, -23625, -50660, -53562, -33274, 4446, 42261, 55298, 41512, 13466, -21750, -50994, -53444, -28692, 5848, 38791, 56516, 43568, 7902, -25512, -46812, -51366, -29609, 9923, 41577, 51220, 39905, 10515, -26401, -49708, -48204, -26108, 9178, 41691, 52202, 37209, 7172, -27031, -49320, -46304, -22402, 9626, 40258, 52313, 35299, 4274, -25332, -47760, -48957, -20865, 16063, 39454, 46824, 35742, 4809, -29880, -47415, -42643, -20167, 13440, 41681, 47834, 31325, 2690, -28344, -47680, -42766, -16791, 15910, 40938]
935D0938M936j7112k7675k8609j9575M607K8808L1320K1051O992j5446l3299k8862
948c1926j1240N024K2825L3452K3465P17j6524k6826k9573j5586R401K6450K8879
961A8538K0801L333j7751k9232k7166j2493R485K5888K6978J9852M605j8987l1222
974g371k4139j0161O922K6439L1323J5827j501j5076k7427k7991r750J2622K3836
987f447K6217J9525L68k0810k8028k2562r170J0418K6008K6230J5942l80j9451
1000A7860k7822k1250q317R325K7009K7025J3159j593j7237l0024k2103k603J1029
1013b5542K0745K7307J6973n261k0391k4739k1057o713J3266K5143K4189J2663
1025C6583l350j9758k6427j9504l920J2954K3800K3341J2415l383k0609k7243
$$ y = [40938, 45874, 28762, 1087, -27522, -47097, -42490, -13682, 17638, 38689, 45681, 30235, -3064, -31926, -43166, -38142, -15317, 18135, 41600, 42317, 25793, -1033, -30606, -46192, -36791, -10341, 18538, 39339, 42672, 24921, -4311, -31477, -43970, -34485, -8597, 18381, 38233, 42838, 23851, -7371, -31510, -41671, -34749, -8310, 23013, 38840, 37339, 22263, -5164, -33155, -42905, -30283, -6447, 19770, 39295, 39663, 18853, -9175, -31737, -40907, -30489, -4481, 21749, 37691, 37311, 17860, -9962, -31212, -39529, -30204, -3195, 23830, 36989, 35396, 18159, -11865, -33968, -36571, -25542, -4797, 22510, 39483, 34222, 13831, -10908, -31965, -38678, -25412, -269, 23920, 36583, 33233, 13475, -12952, -32456, -36376, -23422, 378, 23719, 36134, 32751, 12142, -15101]
1037a5101j7382k033J1556K3665K5279J0107q139j7618k2469k0447l753J6023
1049b0312K3762K0860J0992n488k1552k4767j4439j637J2072K4127K2593Q248
1061C4459p443j9319k3215j5481j656J2876K4917K2534N493q675j6891k3348j7212
1074c2961K165J5462J9602K0317J0344r769k1331k0308j3776j237J5413K3855
1086G776J8588M995q363j8387k1312j4324J107J5864K2173J7419N506q225j9236
1099C581k2235j2521L851J4908K0159J8555M936j1485j8068j7993j3736L99J8159
1112a1490K2764J3983L373p908j9390k1087r843M078J4783K0487J6430K820j0629
1125A8371j8149j9355j0368M396J5639K0218J6156R78j1721j6414j7913j2008
$$ y = [-15101, -32483, -34516, -22960, 705, 25984, 36091, 27952, 10334, -12135, -32582, -36335, -20312, 3450, 24310, 35302, 29814, 8262, -16505, -30944, -32581, -20509, 3618, 26211, 34459, 27016, 7697, -15518, -30999, -32655, -19779, 5138, 27672, 33165, 24490, 7599, -15749, -32961, -30796, -15334, 4268, 24585, 34929, 25160, 3829, -16479, -30255, -31492, -16079, 7776, 26364, 31359, 22996, 4609, -16703, -31027, -29920, -14056, 8117, 25536, 31042, 22817, 3581, -18654, -31175, -27324, -12416, 7743, 26298, 31234, 19749, 1681, -16312, -30048, -29649, -11490, 11274, 25257, 28630, 20722, 1332, -19755, -29598, -25520, -10737, 9750, 26180, 29000, 18371, 222, -19133, -29501, -25105, -9466, 10752, 26908, 27886, 16165, -249, -18162, -30170]
1137c0170N715J8137J6966J3313M855j1227k1161j6681p077M152J6159J9878J2512
1150B5371L38j0454j7520j7590q286N809J7062J8274J1614R64j0671j8579j7528
1163b1196o397P835J5623J6465J2362J148j2773j8615j4325o058M799J7215J9270
1176A5353R138j762j0056j7307j7030m534Q905J4112J6155J2214j106j3287j7385
1189f590j4284m581Q324J5258J5856J0785j946j3802j5906j2320o257P337J8358
1202B32J5025P225o5j1939j9740j2756m30P324J3767J6462Q942l531j2525j5924
1216g933j2586l376Q575J6129J5483O915l798j2205j5845j2429j733R396J4947
1229A540J3526P598k780j3372j6783j0446m98P493J5190J6201N377o639j1429
$$ y = [-30170, -24455, -6318, 10648, 23961, 28816, 17589, -3572, -20253, -27330, -23178, -7019, 12859, 25371, 25709, 15255, -2265, -19855, -28141, -22332, -5270, 13004, 24618, 25582, 14911, -3668, -21196, -27593, -19758, -4135, 12330, 24692, 25840, 13067, -5548, -19873, -25931, -21132, -3917, 15353, 24491, 22729, 12673, -4634, -21664, -26198, -17293, -3181, 12974, 25188, 24082, 10795, -6590, -20874, -25455, -17131, -1873, 13983, 24768, 22822, 9020, -6886, -19206, -25463, -18126, 232, 15257, 22482, 22417, 10478, -9262, -22018, -22448, -15124, -1357, 15105, 24047, 20516, 7991, -7933, -20519, -23895, -15320, 809, 16292, 23207, 19409, 7204, -8641, -21070, -22803, -13407, 1540, 15066, 22664, 19884, 6512, -10271, -20717, -21215, -13722, 1468, 17669, 23046, 16407, 4978]
1242D978j3402j2476j358J0769J4297J2666P191m465j4383j4721r212p39R628
1255a1227J5251J2308N324m866j3818j3995q028j332Q669J6697J2992K194m890
1268A5279j1232j5951r652L111R915J2463J2607M890o714j3037j2770q713M76
1281a9328J0486J4936J1294K513o349j1961j3120q590J717J1033J3917R719L079
1294A9346n302j2930j4141o913L391R567J3132J1464K037q309j1638j1027q098
1307a9421J476J2478J3512Q025K437n760j3645j3072m941L501J0278J2703R029
1320A6600J394o498j2941j2212m556L283R726J3783R200j004p448j0394j2257
1333a3324o583O086J1500R952Q058K129p727j3283j0741l919M024J0768J2109
$$ y = [4978, -8424, -20900, -22258, -11489, 2808, 15474, 22665, 18200, 3817, -10904, -20116, -20855, -11227, 4024, 16332, 21656, 16790, 2972, -11023, -19051, -20383, -11714, 4983, 17975, 20169, 15279, 4047, -11904, -21556, -18445, -8530, 3933, 16540, 21430, 14716, 1679, -11091, -19804, -19328, -8842, 6094, 17388, 19901, 13552, 1591, -11529, -20119, -18402, -7369, 6548, 16267, 19346, 14044, 1114, -13027, -19940, -16549, -6982, 6150, 17614, 19651, 11342, -296, -11323, -19421, -17945, -5467, 8045, 16070, 18507, 12747, -898, -13970, -18911, -15410, -5132, 7571, 16600, 17994, 11496, -1445, -13657, -18213, -14930, -5204, 8579, 17779, 16775, 9327, -1067, -13324, -19907, -13821, -2321, 7631, 15689, 17818, 10091, -3192, -13933, -17852, -13828, -3060, 9049]
1346I049P767o52p940j1227j0277m534M564J1293J1219O899k72p321j2230j0930
1360a4592k896O150R827J0200P566r8r220j1881q249l106L771J1423J1662N090
1374A5647j185p416j1958r775j408O040R281J0217O513j364q386j1524q924j480
1388a5722N731R572J0508O398k862r107r588q340k807O481J1125Q469M929q03
1402A3984q570j2226p556Q1N454R353R964N198l219q961r370p229j810N801J0752
1417A646R271L894k715q469j0412p132l81O913R441Q042M604k304r764j0292n235
1432a2893m53M983J0559R870K388m193p713r223p230K75P498R137P229L942l108
1447A1068r233r823n540P35O647R066Q170L146m552r048p903n162p25P017J0613
$$ y = [9049, 16816, 16164, 8224, -3003, -13280, -17814, -13250, -1957, 9262, 16161, 15889, 8568, -3662, -14592, -17488, -11338, -1511, 8689, 16255, 16157, 6937, -4944, -13193, -16299, -12528, -1105, 10557, 15647, 14462, 7046, -4912, -14687, -16095, -10055, -774, 9443, 15956, 14592, 6206, -5318, -14242, -15722, -9991, -419, 10089, 16487, 13625, 4518, -5070, -13410, -16217, -9736, 1389, 9858, 14787, 13984, 5414, -6812, -14368, -14287, -8833, 520, 10484, 15682, 12463, 3502, -5868, -13097, -14907, -9106, 1646, 10917, 14811, 12096, 3627, -6785, -13917, -14298, -7385, 2056, 10098, 14702, 12398, 2634, -7658, -12893, -13346, -8363, 2196, 12066, 14454, 10261, 2548, -6675, -13905, -13630, -6132, 3005, 10234, 14176, 11068, 1835, -7988, -13528, -12793, -6146, 2920, 11090, 14236, 9684, 636, -7267, -12429, -13154, -6137, 4476]
1462D476O755J465k908q159j0313n213K222P187Q199P252K387m483q757q103m554
1477a2547N80O791R853P064P53m418q026q209m883J773P678Q642N499J621l424
1492H747r052r092k946K198O160Q747P040K48n288p537p635m225K250P694Q126
1507E435N042J250m027q902q512k712L197O837P901N413M99m914q488p022k539
1522a1542K183O779R036M898j040m205p606q277k674M615O890O424M847P66n381
1537E713q617o530j735K897O511Q177M945j081n537p513o320k286L545O985P343
1552F497L623j23m668q315p361l81M116N375P285N228j372o671o650n441j770
1567a0628L239P093P209L566j483m772p697o349p43M700O049N974M121q81o103
$$ y = [4476, 11231, 12696, 9788, 1629, -8684, -13897, -11675, -4488, 3711, 10963, 13350, 8867, 110, -7993, -12547, -11967, -5176, 4677, 11741, 12494, 8076, 50, -8159, -13042, -11269, -3591, 5051, 10550, 12171, 8747, -305, -9397, -12343, -10145, -3985, 4762, 11802, 12050, 6762, -775, -8410, -12635, -10385, -2691, 5435, 10477, 11727, 7700, -1202, -9714, -12426, -9229, -2392, 5509, 10922, 11421, 6507, -1981, -9003, -11542, -9359, -2580, 6456, 11354, 10314, 6109, -1497, -9774, -12448, -7833, -943, 5481, 10328, 11094, 5713, -2904, -9434, -11169, -8272, -1761, 6416, 11361, 10280, 4743, -2770, -9090, -11376, -7831, -846, 6497, 10120, 9997, 5329, -2986, -10347, -10728, -6612, -1237, 6048, 11276, 9904, 3233, -3417, -8858, -10628, -7389, -296, 6913, 10479, 8996, 4224, -3473, -9822, -10565, -5865, 184, 6158, 10279, 9398, 3295]
1582C295p512n060m81L326O190P468L703k721n683o081n444j448M773O870N145
1597F340L232p91n789p639m642N9L733O224O443L233k696o286n734m082j001L886
1613e510O809O176K295k291n407o656m955M67M981N653N268K986k396o484n840
1628d904l263n48L741O765N903J606k657n648n822m272N32M943O068M468J885
1643H797k006n972o314l343Q92M303N886N332J756l570n853m819l380o9M847O848
1659C335L884Q83j933n440o719k836J676M213N705M673J029l092n811n071k579
1674h083O99M313O328M536J74l219m893n406l418J937N522M820L285J404k617
1689E382o376n095j816J477M032N812M293j40l393n146m915k111J648M967N378
$$ y = [3295, -4217, -9277, -9758, -6432, -242, 7226, 10929, 8208, 2525, -3556, -9000, -10448, -5675, 1195, 6340, 9572, 8781, 2992, -4647, -9289, -9230, -5497, 727, 7170, 10403, 7707, 1421, -4313, -8395, -9396, -5510, 1299, 7475, 9770, 7479, 2072, -4584, -9539, -9072, -4091, 1562, 6830, 9816, 7420, 936, -4904, -8167, -8715, -4974, 1791, 7694, 9300, 6643, 995, -4827, -9099, -8567, -3624, 2444, 6912, 8797, 6791, 819, -5495, -8838, -7946, -3643, 2243, 7575, 9331, 5761, -92, -4911, -8291, -8360, -3513, 3335, 7219, 8102, 6169, 729, -5990, -8826, -7150, -2937, 2768, 7441, 8470, 5378, -433, -5504, -8083, -7384, -3071, 3257, 7793, 7967, 4748, -145, -5551, -8969, -7032, -1510, 3310, 6595, 7999, 5382, -994, -6089, -7905, -6428, -2396, 3416, 7709, 7569, 4176, -970, -5885, -7996, -6348, -1381, 3997]
1704C997K916L23k488n726n720j377K584M239M708L952K11l954n588l789j357
1719g069J006M585N974K847o93k990n141n043j274K932M316M479L122q0l644n595
1735b268l781r45K050L935M994L583p57m414m732l499j522K613N046M197J858
1750F358K13l591n767l647j77K316L911M786K913j119m380m693k993o68K180M610
1766B52M368K046j067l431m734l710l09K918M174L984K416j014m311m932k398
1781e748j11J788M128N085J931k103l647l914l429m78L423M129L601K018j411
1796E262m200m405k512M6K317M351L998K030j919m489l904j992n56K652M858L617
1812E154N76j135l190n010k776Q70L019L776L677J345j847m305l612k020N4K578
$$ y = [3997, 6913, 7236, 4748, -978, -6698, -8075, -5491, -1252, 3456, 7408, 7619, 3665, -1923, -5712, -7069, -6063, -1478, 4496, 7343, 6650, 3660, -1481, -6524, -7798, -4866, -550, 3929, 7051, 6971, 3327, -2268, -6049, -6994, -4944, -1009, 3985, 7568, 6811, 2397, -2335, -5834, -7356, -4743, 303, 4500, 6358, 6571, 2980, -2787, -6434, -6611, -4295, -384, 4402, 7315, 6196, 1816, -2877, -5870, -6538, -4358, 252, 4620, 6666, 5599, 2168, -2566, -6276, -6585, -3667, 507, 4491, 6907, 5893, 1582, -3350, -5748, -5859, -4071, 57, 5142, 7073, 4970, 1323, -2591, -6020, -6498, -3075, 1054, 4655, 6673, 5262, 1062, -3343, -5855, -5809, -3492, 859, 4857, 6887, 4968, 479, -3425, -5417, -5973, -3321, 1537, 5154, 5730, 4595, 1405, -3605, -6381, -5511, -2492, 1284, 4961, 6306, 4459, 154, -3458, -5478, -5424, -2846]
1828b846M442L733O94k173l353l717k908O10L441M086K701R00j490l937m031j910
1844e758R66K525L730L834P99k867l525l038k412M42L870L909K287L83j419l814
1860h8l845j713J005L127L552K872M92j884m216l337j010O70K660M181K892k66
1876E092k047l378l582j903J751L557K888K205O11k181m064k947j002Q64K796
1891a340L671K834j93k511l456k959j412J458L385L266J664L00j989l751l089
1906d122j039J594K828L094K605J10l211l536k046r65P04L574L472J450j42k001
1922B369l965k688m46J697K745K979K096k12k742l888k037k61J081K786L414K056
1938D984p80k849k653k550r48J799L518K423J322o5k475l703k258J26J247K619
$$ y = [-2846, 1596, 5329, 6023, 3850, 497, -3220, -6128, -5518, -2077, 2009, 4710, 5610, 4120, 183, -3848, -5758, -4792, -2267, 1463, 5297, 6096, 3229, -296, -3334, -5746, -5304, -1434, 2475, 4762, 5145, 3726, -88, -3933, -5646, -4641, -1514, 2038, 4910, 5402, 3518, -698, -4035, -5045, -4375, -1715, 2466, 5358, 5092, 3045, -333, -3915, -5818, -4067, -510, 2378, 4583, 5194, 3013, -1051, -3998, -5000, -4136, -1340, 2331, 5165, 4972, 2461, -995, -3954, -5366, -3908, -523, 2743, 4407, 4707, 2718, -1033, -4122, -5161, -3567, -739, 2355, 4960, 5070, 1859, -1677, -3723, -4688, -3984, -410, 3062, 4512, 4370, 2369, -1596, -4284, -4730, -3033, -288, 2691, 4787, 4575, 1833, -2055, -4092, -4353, -3272, -486, 2928, 4984, 4204, 1355, -1298, -3848, -4796, -2997, 521, 2944, 4266, 4201, 1726, -1977, -4235, -4109, -2862, -243]
1954b43L314J772r99k987k669k063n16J505L380K752R60n67k396l063k248l36
1970d404J972K816K657J340p01l040l026j188j74J015K969L536N59j307k111k832
1986a919k273P2K046L004K384Q84r84k559k832j787L45J409K797K776J117j376
2002C104k892k365j448l15J836L433K082K03p67k166l078j770O64J885K423K429
2018C258J085j730k748k108j313j39J950L076K166J65j145k122k803j576N08K264
2034a212K520J833M72r82k633k825p86O15J533K615K590J46j752k170k199j874
2050d109O37K716K444J378M26j162k425k601j084R39J873K264K074L74j784k485
2066e25k152p07M17J933K915J578m37j078k178k514j229J267K324J877J722M24
$$ y = [-243, 3071, 4843, 3844, 857, -1812, -3875, -4391, -2886, 494, 3246, 4206, 3639, 1243, -1820, -4068, -4404, -2432, 384, 3041, 4381, 3680, 640, -2386, -3574, -3748, -2733, 236, 3772, 4331, 3024, 913, -1919, -4192, -4120, -2074, 930, 3314, 4198, 3214, 655, -2177, -3964, -3619, -2210, 587, 3363, 4480, 3104, 212, -2153, -3601, -3916, -2080, 1353, 3435, 3638, 2871, 705, -2373, -4143, -3479, -1594, 829, 3258, 4343, 2613, -135, -2243, -3556, -3695, -1745, 1331, 3497, 3662, 2517, 395, -2408, -3984, -3476, -1212, 1308, 3141, 3613, 2631, -2, -2827, -3613, -2998, -1465, 1150, 3740, 3886, 2134, -36, -2235, -4109, -3472, -756, 1688, 3066, 3492, 2330, -95, -2696, -3780, -2841, -968, 1296, 3370, 3744, 1960, -525, -2677, -3384, -2967, -1034, 1881, 3459, 3022, 1944, -234, -2748, -3977, -2710, -386, 1491, 3213, 3637]
2082C637j789k849j714m03N15J769K717J650k90j632k200j934j139R05K450K255
2098A948J163j44j280k490k238k68J077J852J959J916j27k379j967j463n37L95
2114b583K296K579P52k24j297k519j994j73J094J981J912J583m58j988k111j616
2130b766o4O41J896K450J153p93j653j534j880j006J414K565J535Q78j18j754
2146I64k604j043QQ06J741K381Q62p52j801j941j222k38R69K242J914N91n97j542
2164G38j968j720J36J172J813J778J216p59k025k039p78k44R85K265J903K40r44
2181A769j186j743j799l4J791J859J396Q40n51j974j969j139K58J149J916J756
2197B339N56q85j894j700r46k27J289K605J154%m86j435j931j138L62J165J750
$$ y = [3637, 1848, -1001, -2715, -3118, -2603, -834, 1883, 3533, 3243, 1611, -589, -2523, -3662, -2757, -307, 1948, 3111, 2967, 1687, -803, -3041, -3309, -2232, -380, 1579, 3495, 3368, 989, -978, -2441, -2978, -2583, -287, 2292, 3044, 2820, 1523, -996, -2990, -3163, -2069, -88, 1824, 3407, 2949, 961, -1150, -2766, -2830, -2189, -293, 2157, 3310, 2517, 864, -670, -2550, -3556, -2142, 423, 1958, 2836, 2718, 964, -1640, -2683, -2675, -1869, -128, 2253, 3115, 2363, 562, -1379, -2601, -2839, -1870, 372, 2286, 2877, 2280, 738, -1230, -2950, -2814, -1642, 171, 1949, 3165, 2406, 381, -1658, -2436, -2680, -1695, 570, 2473, 2713, 1769, 583, -1160, -2959, -2993, -1202, 657, 2053, 2893, 2342, 368, -1601, -2740, -2482, -1333, 583, 2339, 2895, 2010, 116, -1584, -2530, -2757, -1468, 1137, 2291, 2291, 1805, 370, -1561, -2699, -2337, -1172, 578]
2214E78J823M30j207j706j557q62M8J295K129J532m3r13j184j739j420L72J726
2231f98J578J269M94o81k238j545p04N85R08J775J793J4j229j440j398j203M46
2248b274J763J755P98K20o63j852j691m08N34J258J492J286L26j333j561j502
2264a852m70L44J548J879Q65m21o47j306j912m02N81J280J480J232K89j293j772
2281e77j237m13M35J298J807Q99j86j073j218j306p86N30J841J431M40R7p68j942
2299g28j168k37O61J119J531J246k87j586j106j096o06L19J824J724L85k77o88
2316A030j559j571j36R82J005J505R22k75j240j423j147mL88J535J601O59o83
2333A589j042r48j397n34J109J407J138P62j91j551j479o30q4P31J135J433P26
$$ y = [578, 2401, 2831, 1624, -82, -1639, -2501, -2453, -1158, 971, 2503, 2460, 1547, 363, -1376, -2796, -2424, -698, 880, 2149, 2643, 1962, -276, -1821, -2525, -1940, -1032, 743, 2536, 2550, 1321, -119, -1517, -2720, -2274, -511, 1244, 2042, 2262, 1599, -253, -1944, -2352, -1818, -560, 932, 2218, 2544, 1211, -350, -1852, -2322, -1978, -430, 1449, 2314, 1893, 1246, -60, -1972, -2374, -1793, -513, 967, 2199, 2488, 1195, -577, -1814, -2227, -1792, -494, 1313, 2212, 2026, 953, -265, -1571, -2357, -1827, 14, 1445, 1885, 1982, 1214, -728, -1896, -2133, -1472, -353, 1178, 2424, 2137, 551, -555, -1651, -2257, -1938, -114, 1610, 1995, 1718, 1030, -529, -2100, -2236, -1254, -249, 1256, 2178, 1903, 663, -760, -1907, -1911, -1523, 12, 1613, 2272, 1589, 547, -401, -1798, -2332, -1223, 184, 1322, 2084, 1893, 342, -1137, -1767, -1851, -1120, 15, 1448, 2174]
2350B174o06j238r94r66n45R27J693J054K79k05q11j606r66K9Q40J113J096Q73
2368B141n31j313j457n73R7M67J646J329Jo82n89j219j317J60R11J281J029N42
2386A923m78j248j428n02J21P94J267J008M10o72j181r65p31l81J309J496O19
2403A361K53j40j278j441n74N46L55J241J149N87j014j014j253n41o5J132J573
2420H77O55M6n04p24j398q36M89R62J098P46L82o69j291j105m52K59R29J163J181
2439A808l52m97q99j120p57O0J421J195O69J70q52j079r89m40L90Q51J198P29
2457A506L50q81j292q34n20L05J017J499L71k82l22q47j443j80N52P74Q90J017
2475A680K9r41j258p87j61J46R14J366M94j09o93r59p07o44L68J095J132M79Q4
$$ y = [2174, 1568, 330, -664, -1630, -2175, -1248, 445, 1499, 1778, 1573, 762, -844, -1810, -1781, -941, 172, 1268, 2141, 1610, 297, -1160, -1733, -1636, -1169, 477, 1806, 1807, 1125, 536, -683, -2000, -1840, -929, 352, 1381, 1923, 1445, 197, -1231, -1733, -1612, -818, 449, 1457, 1867, 1195, 14, -951, -1682, -2063, -754, 742, 1361, 1614, 1474, 196, -1245, -1819, -1273, -918, 323, 1472, 2059, 1045, 31, -1222, -1763, -1828, -696, 877, 1532, 1578, 1074, 350, -1048, -1884, -1395, -433, 665, 1411, 1793, 1124, -167, -1272, -1724, -1465, -536, 627, 1808, 1456, 959, 60, -1060, -1817, -1757, -336, 859, 1528, 1698, 846, -233, -1222, -1662, -1272, -421, 777, 1506, 1856, 975, -317, -1151, -1671, -1366, -349, 1150, 1521, 1239, 917, 70, -1373, -1553, -1001, -227, 663, 1680, 1709, 768, -490, -1277, -1438, -1292, -378, 988, 1482, 1373, 680, -279, -986, -1630, -1262, -167, 965, 1444, 1528]
2494A528q71j259p98n0M04P37J029Q38k01r81p30q06m49L26J444Q87L32k10n00
2513F70j034r72l3L71R18J074M09lq65j131o12p5J43J195R46L24k58o74o80j228
2533a515j52Q11J004Q24M91j17q68j134m63j19L28J003J023M11m89p25p17o39
2551a043m00P49J138N25L06k56n39j201p22K54N88O63O30Q26l97j034p67l48l41
2570a369M05J280P29K60o16l57q35q30R0O44R15M86M90k38p84j168m91J85P31
2589d73P51P66K47n97n66o69o87k00J039Q67M44J87j10p64j249j34K20N19N99
2608A90P64L80m82p72p95m51n1P39R26N71L3k26q16q04l47K42N97O75O71R9j65
2629I78r98q06l50N9P43P97P36j86k61n97o86p11J21R58P93L38J70k62q30q99
$$ y = [1528, 657, -602, -1400, -1450, -1046, -309, 720, 1558, 1357, 376, -354, -1160, -1609, -1283, 161, 1048, 1380, 1170, 670, -364, -1336, -1369, -998, -80, 994, 1403, 1400, 535, -596, -1208, -1283, -1140, 55, 1001, 1325, 1067, 393, -287, -1515, -1667, -856, 148, 972, 1463, 1346, 478, -656, -1119, -1238, -910, 93, 1116, 1527, 1038, 313, -404, -1043, -1443, -694, 444, 969, 1275, 1019, 480, -721, -1443, -1189, -601, 62, 692, 1518, 1121, 87, -680, -1028, -1369, -964, 316, 1045, 1305, 689, 332, -503, -1333, -1243, -599, 316, 802, 1292, 1054, 270, -898, -1389, -1204, -473, 278, 1044, 1291, 694, 128, -541, -1228, -1428, -389, 478, 922, 1109, 999, 235, -1014, -1148, -928, -409, 190, 954, 1334, 852, 80, -715, -1166, -1217, -478, 448, 1019, 1052, 826, 10, -794, -1141, -899, -302, 373, 1044, 1143, 978, -20, -826, -1176, -1117, -374, 423, 1159, 973, 712, 115, -571, -1282, -1161, -203, 590, 928, 1098, 836, 6, -893]
2649h93k84M79L97P37P50p4n39o61p40k90M6O90J020M29j62l73q11p24k84P33
2669e54L96N05N90K10n89q45n58k64K78P86P74J79p4j63p10p57l55M04O00Q23
2689F76L10Q7l09j051p13l1M17L91R48L54k77m46o49m53l26K13Q67O83L78j9n80
2710D70q03o33j84M58N69P30M27l1o43p41m25p7K86O64P61K07l37l84n28o10j10
2731i34K49P63O44J73J00o98o76m93o4J71R00O49O9k28n52o18l78j55N40Q11N01
2752G74M1q9l33r06n16J54O15K53O85K87l42n49m31m19k56M09P78Q49j09k39l10
2773C46p64l92O0M53N45L54L25k42m51q51k28P8L20N64O53K40n85m16m87l62k07
2794a047O50O82J74M18j17o59p19k29J27M23N49N77k2j63n60m49m14k5K57Q90
$$ y = [-893, -1177, -698, -301, 436, 1186, 1112, 573, -88, -828, -1118, -1072, -382, 638, 1067, 905, 532, -279, -1003, -1287, -554, -158, 347, 937, 1147, 558, -287, -845, -1109, -831, -45, 729, 908, 834, 671, -39, -796, -1151, -747, -147, 676, 986, 1073, 764, -287, -1000, -1031, -614, -223, 725, 1079, 802, 356, -293, -746, -1072, -859, 8, 691, 1069, 1050, 470, -333, -966, -1150, -692, -123, 607, 1034, 1003, 360, -381, -806, -883, -597, 67, 828, 1035, 698, 314, -214, -824, -934, -685, 78, 722, 895, 995, 297, -379, -872, -936, -765, 135, 784, 853, 625, 73, -545, -923, -1078, -538, 273, 774, 815, 726, 393, -513, -1029, -875, -260, -7, 678, 965, 623, 74, -357, -776, -1032, -623, 155, 1004, 895, 656, 346, -418, -810, -750, -297, 248, 602, 927, 685, 234, -617, -845, -767, -447, 117, 770, 1010, 425, 9, -478, -840, -1047, -397, 285, 459, 877, 760, 101, -618, -847, -720, -297, 252, 829, 807, 644, 84, -365, -779, -804, -547, 343]
2814C43N32k78k71k52n66m51L58M95J90L96M48k93o32p02r6J7M24O52O01m8l82
2835D85m43n28m69J57Q82K44L82J49k75o52o60m5OO69L59N09J24m40o69l08l74
2856h97J46M81R15J41k98M0o53o18l2K78L67M51K66J75m27m85l86k54K14M69N22
2877D15N62l50m03k46o96j27K95N21K72J79L99l99n91o03k4L56J57O99K86k4m36
2898B42m48l68q8J70N55L76L15j25j28p66m48j06K69M73K25M60j7l22o25j16n3
2919e25J49J97Q51j35m2k46n17m91R5K39M35N56J41K3n18n53l27MK47M55M56K56
2941G50m32l0m44m77o6K78O09J83J29J23m01o49k00N8K35K59M95L72k19n35m26
2962c88j69j80K65O58M64J62l78k78m81m49j8O72M10J41J95j35k83o94oM7P9M17
$$ y = [343, 875, 597, 326, 74, -492, -943, -585, -90, 100, 496, 944, 651, 19, -683, -779, -762, -338, 314, 915, 867, 485, 42, -486, -955, -798, 84, 328, 710, 859, 584, -68, -728, -773, -767, -98, 261, 770, 894, 454, -215, -523, -897, -751, -270, 645, 786, 488, 528, -125, -743, -775, -497, -130, 321, 587, 762, 335, -150, -536, -790, -576, -107, 415, 977, 627, 224, -22, -718, -845, -550, -29, 243, 422, 821, 422, -169, -772, -796, -440, -283, 416, 702, 678, 242, -206, -574, -662, -492, 63, 439, 754, 629, 501, -265, -713, -819, -550, -77, 148, 608, 591, 269, -356, -472, -525, -376, -179, 672, 537, 495, 249, -268, -759, -664, -425, 10, 566, 707, 730, 212, -341, -668, -664, -417, 38, 494, 750, 318, 288, -156, -633, -699, -421, 188, 371, 500, 623, 222, -427, -627, -569, -334, -75, 420, 792, 573, 38, -388, -557, -737, -472, 186, 650, 812, 434, 156, -325, -774, -792, -120, 290, 431, 626, 491, 208, -486, -492, -445, -366, 51]
2984E1N54J50l44j92n75k84K5M21L27K17K89l6o08n05j40N0K75L59L97L60k22
3005E69n30l67k83j51M70M76L35J25k40l14n80j63J34L44L78J51M99l34o73n9
3025b13k78L7J22O58L09j01l09k65m33l97M45K97K80K86R2m3m36o94j51M39J59
3046a96L58L92J34m33l68k21l44J05M05M35K87m8Rn05n82M7L5L72L55K11K59n18
3068A89k93m06K32r4K12M17K40p6j05l16n23n7L63L08M01j49K43o3p77l72R0O2
3090d74L21M51K26o2k68k33l87j80L31K22M59k7K54k89l43l89j61K46L99K81K18
3111E95N2n15l84j84L5j42O50L39K59j07m47r8o40M7L11L49K43J05O7l84k60l72
3133d81r4J40L17N37J47k16k98l19j27k04K32M16L10J28j38j36m52l19K78m6K24
$$ y = [51, 605, 755, 411, 219, -356, -640, -615, -194, 133, 350, 639, 603, -5, -510, -650, -600, -325, 34, 431, 791, 569, 39, -328, -611, -762, -292, 184, 519, 644, 404, 90, -490, -653, -519, -175, 203, 354, 853, 519, -154, -213, -491, -454, -332, 326, 635, 534, 225, -40, -473, -870, -425, -128, 152, 438, 530, 487, 51, -643, -794, -355, -196, 162, 554, 688, 255, -113, -334, -678, -573, -168, 267, 554, 506, 515, 10, -572, -525, -490, -118, 237, 448, 707, 189, -104, -510, -278, -372, -160, 257, 497, 421, 316, 0, -523, -580, -217, 91, 492, 343, 586, 523, -254, -626, -536, -474, -153, 298, 524, 462, 194, -39, -426, -606, -275, -53, 406, 379, 633, 344, 1, -388, -549, -303, 96, 377, 595, 647, 132, -252, -436, -401, -543, 107, 446, 705, 598, 151, 53, -587, -540, -229, 120, 363, 468, 535, 151, -109, -481, -575, -435, -118, 419, 566, 350, 52, -267, -394, -598, -366, 50, 360, 488, 350, 214, -238, -557, -279, -325, -101]
3154a01N52J67k99k66j77l06k20L04M28R7J31K16m04m40l63K30K34M31M5K62j8
3175E03m87l51j43J46j29M95L10J33j83k67l13j58j2K75L52P4J97J32m56m70k9
3196c81m5J70L62N26p3k45l13k36j67O4R4J90K84K38l9l13n02k12J85M18R8K60
3218C63L07j15o90k66j51O5L09K67L23o7o9k48m34Lj5K56L12K95%r1l50k29j95
3241d20J84O9L07M36K2m43m03R1k31j81M64L77J90j62J0l11m01l7N7K71K13L92
3263D94l7l65j17m50J09J2J73L10L80k3m12o3l04l91L13M25L2K15J34q2l82l45
3285c74on0K68L27K71j08j80k00k06j57M8K57M87JM5l10j29k74k37J47K61K86
3307A67K03Q5m64j88m0rj87M71K8K75M1j94l77l16m6M58J09J19L84k34j18l67
$$ y = [-101, 451, 618, 319, 53, -124, -430, -650, -346, 82, 179, 310, 526, 122, -318, -681, -451, -217, 214, 259, 521, 503, 16, -335, -478, -332, -461, 34, 344, 477, 294, 27, -286, -444, -456, -181, 171, 245, 442, 574, 118, -352, -381, -426, -256, 106, 632, 559, 314, 1, -235, -402, -338, -244, -54, 230, 468, 429, 116, -386, -598, -413, 5, 103, 363, 670, 555, -135, -401, -552, -487, -178, 89, 412, 345, 276, 28, -406, -403, -418, -162, 150, 445, 445, 354, 4, -225, -420, -236, -167, 140, 576, 598, 155, -248, -157, -388, -569, -105, 272, 462, 300, 310, -1, -402, -439, -382, -111, 102, 494, 457, 92, -25, -475, -366, -354, -181, 129, 509, 486, 74, 11, -293, -684, -371, 54, 86, 301, 435, 353, -29, -374, -380, -430, -162, 165, 436, 328, 148, -52, -258, -415, -367, -110, 377, 378, 423, 113, -16, -290, -527, -380, -119, 167, 370, 455, -9, -197, -237, -246, -433, 38, 66, 341, 382, 188, -189, -505, -551, -93, 16, 135, 519, 285, 167, -200]
3329b00k81n9J58K00M20K22o8k82l19k3l03L29M10p4L01j19k84j07m68J03K71
3350a73J21K82J32k5l23r4k31n1j09N03P9J77K7j88j91j71n1Q7K15J81J46k2j50
3373A71m25r9J46M6R5K83J95j13k06j19n29K52L52J19MJ01Pl52j09j90mK56J19
3396@L45P4q7m17j87P5j44J29L35K11p8Q7j99m57j7J38M5K08J66K17j55k99j92
3419b02Q1j79J13M36K6o6J87k39k66l53J20J69K00K45J74l27k22m7j27J20N8J16
3441A7K15J83k19j42k41j00OL50R2LK56j57l50k33p4K39o0L90K52q8j90p7l74
3464c02M8j44L53L24J07j79%j74l69O8o7K66J26K17O5k22k05k69K36J0O5K14J72
3487C40o4j92o5k86j58J52J83K87LK09l12j21k22j2J05J98P1K22l1m73P2j30k9
$$ y = [-200, -481, -540, -382, -182, 238, 460, 392, 110, -209, -232, -535, -206, 204, 130, 431, 312, 28, -79, -547, -444, -173, -52, 230, 362, 337, 14, -80, -311, -362, -471, 32, 111, 288, 315, 127, -64, -235, -286, -199, 16, 197, 343, 321, 171, -254, -353, -207, -161, -66, 217, 412, 299, 93, -26, -555, -303, 49, 168, 172, 273, 280, -72, -181, -371, -375, -119, 0, 345, 419, 332, -85, -272, -197, -341, -212, 123, 334, 256, 343, 144, -313, -330, -192, -147, 61, 227, 444, 289, -10, -202, -121, -300, -187, 249, 275, 209, 396, 157, -109, -462, -342, -173, 27, 272, 446, 119, -103, -150, -277, -157, -99, 17, 232, 415, 196, 54, -187, -287, -281, 69, 161, 164, 420, 263, -87, -320, -394, -155, -215, 175, 427, 339, 149, 72, -302, -254, -398, -45, 279, 386, 207, 207, 33, -336, -268, -335, -69, 57, 274, 339, 117, -88, -357, -121, -111, -46, 168, 340, 276, 84, 19, -267, -425, -273, -90, 197, 200, 409, 97, -24, -246, -258, -153, 45, 116, 338, 307, -166, -94, -224, -253]
3510b53K9K79K56N2j21O0m25r5kM2R0L17K1K8k31k60J02j64o3L35K28L02l07j26
3534I4j26m52N8L22J90J05J12Q5l03j63k48J22K1M3L26J11k19j63J5j25l04K08
3556b91L11N1K6R2o7k52j11p1J13J30L38K8q2l36J33j21q8l3J71L72j37Q1j11
3579A46k64j65R3J53L5K05pp2j34k10j63K57j03J86J65K31k44k28M7k88J12K30
3601a8R8J53pk6k62j56N5O7M9K60mJ35j81k83N0j9k90K65K69J03o4N8j83k98P7
3626a52j63K66L3K59Pr5k87q2Q3j51J10K68K67N2l00q5j99l5K4J45K27Kp2J0j93
3651f1j85r8K36r6N00%Mj67j89r2r7j41L37L68n1j65k6R2k64n12M66P6K8K30j1
3676A82Pk72j80j16J85M1K86J3j41M2n0k69Q6j08K85K11J04M7j16n49J80j14p4
$$ y = [-253, -224, 55, 311, 363, 242, 302, -123, -218, -220, -178, -88, 229, 250, 278, 47, -213, -111, -275, -338, -3, 225, 527, 220, 94, -32, -484, -426, -104, 86, 191, 303, 388, 85, -78, -326, -204, -183, -140, 186, 297, 78, -85, -70, -195, -499, -291, 20, 71, 97, 189, 122, -130, -241, -312, -199, -69, 269, 297, 215, -121, 12, -109, -197, -230, -59, 313, 176, 257, 146, -118, -283, -190, -37, -2, 203, 196, 124, -10, -220, -383, -126, -229, -43, 122, 353, 109, -119, -72, -360, -248, -18, 80, 233, 226, 200, -62, -218, -163, -96, -47, 213, 209, 344, 163, -120, -70, -89, -379, -114, 155, 258, 194, 252, 69, -229, -152, -315, -49, -16, 243, 250, 155, -132, -214, -131, -282, -172, 96, 363, 415, 115, 30, -169, -204, -180, -35, 192, 194, 122, 132, -61, -246, -344, -108, -204, 296, 296, 300, 133, -56, -148, -245, -386, -49, 319, 268, 103, 77, 169, -95, -607, -141, -65, -37, 193, 182, 189, -83, -263, -379, -194, -153, 133, 146, 5, 47, -3, -272, -186, -294, -9, 202, 306, 353, 237, -312, -132, -246, -320]
3699c20K10K48mJ33j77j76r4p7J15L48Jm3J19o3k20l05L9J38K03N0J49Rj72k17
3723a06p0Kl1J08M36j14j14n2j9l35o3R1K91J02P5o4m1k80M7j19O7J70R9K40q2
3748B38j62Nl64P6J05M15o0l9k06P6r7j76r4jL02J49J21k22m7o5j01j41J93K4
3772g1M33j49j15j2j4p5j57K7K35R6oqj42j67l7p5J48K3K93J24l33L5k1k80N6
3797a92K60P8j58M2J11m1k59m9j04K16J06J31Ml5j22m6m0k8l4K51N9j09J67k45
3821c7J35k57r2J88R6R2J34o8j91k20L7J1M5Q3K66j07K0q6j94Oq1J16J26K05j41
3846H6M3j66r4O6j69J69N3K30J31k60k17j88J66j6J14J54J29j54Pq4l31P4P7K02
3870B2J4K13L6q4j31k14qm0J25K05J58j52O9j79j21k6j69K31J65P4M5k01k09K8
$$ y = [-320, -110, 138, 134, 267, 90, -86, -180, -257, -142, 206, 207, 164, 283, 220, 0, -305, -266, -128, 75, 125, 274, 283, 111, -106, -176, -174, -205, -97, 339, 225, 111, 59, 40, -295, -358, -267, 24, 126, 201, 137, 96, -184, -137, -256, -189, -19, 80, 320, 238, 76, 81, -283, -207, -102, 313, 253, 214, 8, 84, -13, -189, -283, -284, 18, 167, 288, 66, 19, -46, -147, -288, -95, -71, 362, 213, 98, 86, 72, -3, -160, -133, 102, 198, 192, 184, 42, -125, -162, -237, -89, -66, 227, 351, 18, 53, 32, -248, -192, 68, 146, -12, 30, 141, 100, -159, -208, -312, -96, 10, 141, 145, 110, -12, -58, -98, -126, -160, 91, 150, 41, 208, -37, 98, -159, -251, -63, 33, 125, 259, 191, 0, -220, -183, -172, -127, -44, 222, 115, 135, 49, -145, -139, -220, -104, 22, 227, 86, 129, -37, -131, -65, -234, -65, -12, 218, 349, 89, -128, -316, -150, -166, -52, 102, 231, 77, 84, 0, -331, -257, -180, 22, 36, 249, 285, 201, 70, -144, -152, -192, -67, 138, 296, 144, 213, 34, -87, -113, -282, -51, 114, 188, 233, 32, -177, -149]
3894a49j19J87L2R3K47j44J1j23q1k03N9K11L08j74j4j9l51pJ27j10L32r0J76
3917A99k4j52j8j54J8j5K23OJ04J0k0j53j00m0j01J82P3J02Q6k15j35q1N3J46
3941fm4J72J22k20m5J27l56M6L3L78q2P0Qk42j06l1M6J54l4K11n5J42k76Oj13
3966i5m3J09J40J40j51N1j26M9m45J69O8J12K28j36J02j38j90J13n7nJ46J56K4
3989B21j60j40J53k54j24K85K35j46J8P9j96P0k64J28O8K6p0K27M7j24j15p7p4
4012a87Q4J68O0m6l7K2j49k14L43j9J55j8P0j42k91R1M0K4m5K53o7K15j53q9j9
4037D9l49J42O8J90l4M4R6k03j60k6QL54j71R6K11k43j24j8j39j19M22LJ15q4
4061A28J11l22Q5q8K0O5RK6J60m8j91M2j19k0J56J04P8N9j75j09j54j57K08O9
$$ y = [-149, -268, -81, -49, 44, 291, 147, 158, 35, -46, -249, -190, 21, 329, 155, 141, 122, -229, -236, -109, -219, 113, 23, 199, 175, 23, 5, -149, -131, -146, 77, 83, 187, 197, 177, 24, -76, -116, -217, -35, 38, 140, 226, 11, -124, -205, -152, -6, -50, 122, 244, 24, -21, 106, -250, -204, -171, 207, 125, 195, 203, -39, -145, -176, -130, 24, -10, 201, 146, 288, 12, 18, -95, -138, -29, 111, 251, 100, 151, 25, 74, -371, -202, -134, -22, 206, 70, 172, 34, -156, -43, -100, -105, 41, 197, 221, 61, -79, 74, -180, -304, -19, 216, 70, 88, 167, -29, 41, -223, -95, -27, -1, -71, 156, 203, 79, -36, -113, -187, -103, 65, 125, 79, 42, 64, -85, -299, 44, 25, 180, 162, 232, 90, -201, -110, -70, -46, -91, 162, 95, 310, 157, 68, 49, -300, -158, -90, 100, 66, 110, 206, 3, -157, -183, -175, 179, 8, 104, 315, 72, -52, -70, -209, -328, 94, 97, 212, 128, 239, -83, 2, -86, -66, -1, 8, 34, 194, 146, -45, -3, -122, -142, 14, 118, 196, 255, 80, -29, -183, -340, -132, -63]
4085f3J71L9k20K67l02n3J25PJ30pJ34k96M9K2j85l3J22J96o9j6J23k50j18O7
4109a60J31J24rj22K03J01m06O6L7j00K0K62N3j26q9L37k82k89J81N7N7l2m5L
4133b8J70k56k4l8J63l0J72l8j64J04o6rj8L9J01Q6k35k2J49k19J35m6M4J5K05
4158A90M0j71K8k70Q5K9o5K36J1K8j68J65k76J33j36K27j41J00P8L2o4k82J07
4181h4j27J50R5J39j9r0j47J8q9j29M09n2j7R6j55KM6j98J18q4J23l8L27k26k41
4206a73M3k44L48K1L4j3NJ72j05j21j64J31R5pn3P8K0j62K4J23j96J28J85Nk42
4231f8K60k33m8j42P1J98j48K22j35J59m2k50J18%p4k7K36j3J6j95M2j54k1L07
4255G9o1J26k7j16q7l5J1J61j10l6K31Lj21j29M6M6j34J39K01j10j43J58n6l01
$$ y = [-63, 108, 147, -73, 194, -108, -161, -36, -29, 101, 94, 228, -68, -19, 3, -182, -215, -93, 103, 34, 18, 141, -109, -227, -160, -29, 95, 86, -36, 167, 268, -138, -72, -35, -135, -115, 147, 200, 74, -15, 322, 40, -249, -68, -11, 46, 14, -31, -28, 142, -114, -138, -176, -13, -43, 129, 91, -73, 31, -35, -44, -62, -23, 78, 164, -71, -93, 56, -163, -28, -74, -30, -15, 190, 230, 59, 87, -183, -98, -69, -134, 102, 113, 141, -27, 138, -138, -5, -141, 86, -55, 45, 123, 155, 91, -191, -84, -211, -61, 34, 173, 154, 64, -83, -65, -154, -283, 126, 74, 57, 153, -2, 0, 46, -152, -34, -118, 5, -33, 294, 68, -173, -130, -374, -26, -5, 29, 16, 21, 193, 88, -33, -197, -66, 29, 22, -31, 47, 67, -95, -71, 52, -144, -16, 169, 174, -68, 192, -41, -89, -231, -160, 38, -110, 112, -23, 136, 94, -156, -38, -38, -112, -139, 97, 84, 100, -95, -53, -207, -228, 79, 18, 144, 117, 1, -86, -121, -110, 51, -59, -95, 136, 139, 18, -111, -65, -19, -153, -14, 187, 77, -66, 92, 36, -265]
4279b65nK24J14q5N2K0Kk01jJ20M8j27J26K75j63j35Rn3n3J08K6P4k1k1N8r5j41
4306a10R8l3K07k04J10j4j02k5r1J32j64J99j7K33k46m2j1J1j61P3J9P6J95N5
4330A88j34n6j27kr7L34O0p5o2n4k3m6J65k16K24J34k07J2j03N7m0K1P2MP9o8
4356D0l4J13j69l9J54k86J56K44j23K2j92J10j53J72j06J01j6M9pP2k49O2J48
4379F9k28J17K11q6j9p9K6l6j31J04K0O9k1J52j38j69Q3J00Qj08l0J96j14k5k5
4404e4J3K16k36K66q1k5J32j59k43J51k3j9Q3J0J12J5j68k39L54j44J18k7k3o8
4428c9J64j94K0%n7J92o1J13j50k47K32m5P1R7j35J20n9j07K04o8j38p2J32k6
4452e3J9J71Rq0q9r9j42K00OJ14p7k1N5k38J42N6k4J17n9P7j41J02k51Q8LJ08
$$ y = [-265, -270, -46, 68, -17, 35, 55, 57, -144, -145, -25, 23, -104, 22, 297, 134, -1, 8, -45, -98, 10, 36, 110, 89, 68, 126, 31, -110, -12, -45, 162, -42, 68, 54, -48, -73, -164, -32, -196, 3, -14, 219, -27, -69, -80, -69, -230, -157, -138, -62, 133, 188, 54, -2, -129, -131, -228, 106, 166, 91, 29, -25, -48, -94, 71, -145, 79, 213, 6, 18, -85, -28, -68, -47, 25, 29, 108, 40, 6, 119, -50, -89, 65, -221, -65, 179, 56, 78, -114, -4, -157, 15, -91, 10, -6, 43, 36, 108, -141, -79, 69, -159, -42, 169, 83, 64, -15, 11, -25, -156, -52, -32, 37, 16, 168, 30, -139, -56, 44, 52, -56, -86, 110, -4, -29, -54, -41, 175, -61, 205, 124, 99, 231, 72, -171, -20, -43, -62, 21, 31, 143, 158, -10, -249, 105, -39, 79, 52, 29, -39, 125, -69, -49, -49, -106, 86, 25, 138, -12, -259, -27, -72, -1, 96, -39, 81, 22, -85, 119, 51, -87, -159, -27, -53, -34, 137, 146, 66, -23, -122, -264, -64, -58, 56, -21, -42, 13, -225, -83, -27, -51, 66, 7, 84, -57, 45, -206, -118, -115, -7]
4478gJ5k9j11K79q2O3k75K44n0j66L11o5o4j96J15j8k01K07J53kRo9m0n8j75K15
4504CQ9j77Q3O5%j35L0j72J37N0p2K52k48J84l2j03j3K76k23J16R8j16j11M3q5
4529f1k7k1n3J67P3J00j75q2m1K77k49K16j81L10k51Q3jk16r7J56R4j2r9J27L1
4554F8m8q0j1l5M9J58m2j15J28j38O7m0l1J47q2P7l5J98k86K9J6k9O0K2q1K6j59
4581a67Q2J1o1J00Q0rr8J85j12j28J15K0n0L2r2J22mO8l9M1jj98J87q4L4K1L2
4608H7j33L0p3J81O5j23R1q1k6j3j59N4Ol1L68k63J7q8Q4r7J10o1K91k34r0O4
4634b4J14j20l0k7J01mk1J82k80J88j36J40j36J7N7l7M1N6j05R8m1p6J26j34J01
4659E0N0p1l1o8Q3M1k30K29jL6mj92q8Q8n1L00j4j67K30k54J62k31J71L8k8N8
$$ y = [-7, 8, -21, -132, 147, 65, 128, -147, 97, 47, -119, 192, 127, 63, -133, -18, -36, -237, -30, 123, 121, 130, 61, 21, -37, -212, 3, 92, -85, -2, 63, 63, -72, -42, -214, -77, -27, -99, 153, -95, 89, 57, -46, -59, 217, -6, 110, 208, 92, -19, 24, -61, -88, -109, -162, 5, 78, 178, 3, -79, -120, 157, -92, 124, -57, 253, 2, 85, 84, -132, -229, -73, 21, 9, -90, 37, 68, 20, -60, -71, -106, -57, 101, 59, -56, 72, -66, 1, -39, -70, 77, -5, 72, 37, 235, -51, -22, -6, -35, 25, 47, -34, -8, -167, -85, -74, -135, -35, 45, 36, -62, 123, 11, -117, -2, 18, -32, 0, -92, 30, 26, 94, 55, 96, 95, -103, 84, 0, 34, 55, 87, -46, -16, -89, 92, 157, 34, 125, 44, 18, 5, -154, -100, -94, -125, 243, -20, -3, -91, -7, -104, 6, -55, 236, 2, -88, -24, 90, -30, -60, -87, 14, 10, -11, 171, -109, 79, -57, 83, -53, -36, 21, -16, 25, 81, -24, 74, 33, -43, 83, -51, 50, 100, 29, -2, -70, 13, 54, -176, 53, 52, 88, 84, -108, -196, -108, -159, 141, 127, -40, 190, -64, 98, -133, 38, 76, 48, 106]
4685A06j07k4j0J5P8j49K22j16O5N7o3O3j5j66k5R1N6n5J4O5l7k01k1J93n3l8
4711e5Q4n0RM0m7O4j39J03j20J42j02J44p7l3m4rJ08l4mR5J22j74j43P1j26J31
4737d4P7n5L1k6J04Po7k01J39l2Rp2K63j09n4n6j69Q3kJ72J52j60OK4j3j07K4
4764g6J17J60n7k01J00l5j2J15l1j51J39J16j40p1J47q9r4J84j25J25l8j62J02
4787B3q2K2q0J51L7n6J35j9k15N0R5J0j22pj13J19L8m0K6lN9j82Q4Q5J68k77N9
4814c5N5r8K34r3r6R8j68K45p8m3j6n5J16LJ06j96p7n7K01j01p7J24l4J96j27
4839B7Q4j6l1j71M2K30j87Q8Rj42J7j63J01J15j0k4J30P5j12q2j44K43m9k00J29
$$ y = [106, -1, -25, -35, -20, 58, -91, 131, 15, 80, 137, 74, 137, 122, -44, -69, 22, 78, 23, 37, 102, 65, -136, -157, 36, -17, -55, 29, -21, -12, 28, -19, 45, -94, 9, -111, 31, -71, 73, -4, -37, -81, -90, 18, -16, -20, 75, 197, 23, -120, -49, -175, -44, 33, -22, 9, -17, 87, 94, 27, -174, -35, -67, -58, -130, 133, 24, -30, -86, -255, -172, -174, -2, 150, -10, -4, 20, 7, -100, -76, 41, 201, 144, -57, 43, 8, -4, 111, 80, -71, 68, 184, 44, -27, 120, 31, -63, 121, -4, 121, 83, -79, 23, -59, -37, -117, 34, 71, 15, 150, 131, -84, -34, 61, 71, -51, -58, -171, -52, -14, -54, -28, -31, 28, -154, -70, 15, 183, -94, -35, 20, -78, 156, 63, -33, 65, -103, 142, 64, 21, 5, -50, 66, 69, 175, -21, -98, -155, 46, -55, -132, -8, -42, 154, 27, 111, 95, 64, -107, -65, 165, -22, 66, 75, -67, -50, -213, -112, 3, -7, -31, 99, 174, 62, -20, -164, 79, 30, -170, -41]
$$ [...]
8191e
##END NTUPLES=NMR FID
##END=
