##TITLE=1H_MTBDP0807-1217
 CDCl3, 8 sc, 
 9.07.2021
##JCAMPDX= 6.0         $$ Bruker NMR JCAMP-DX V2.0
##DATA TYPE= NMR FID
##DATA CLASS= NTUPLES
##ORIGIN= UXNMR, Bruker Analytische Messtechnik GmbH
##OWNER= root
$$ XWIN-NMR		Version 3.5
$$ Fri Jul  9 09:21:16 2021 Russian Standard Time (UT+4h)  she@DPX200
##.OBSERVE FREQUENCY= 200.131506
##.OBSERVE NUCLEUS= ^1H
##.DELAY= (6, 6)
##.ACQUISITION MODE= SIMULTANEOUS
##.ACQUISITION SCHEME= undefined
##.AVERAGES= 8
##.DIGITISER RES= 18
##SPECTROMETER/DATA SYSTEM= spect
##.PULSE SEQUENCE= zg30
##.SOLVENT NAME= CDCl3
##.SHIFT REFERENCE= (INTERNAL, CDCl3, 0, 15.7039)
##AUDIT TRAIL= $$ (NUMBER, WHEN, WHO, WHERE, WHAT)
$$ ##TITLE= Audit trail, XWIN-NMR		Version 3.5
$$ ##JCAMPDX= 5.01
$$ ##ORIGIN= Bruker BioSpin GmbH
$$ ##OWNER= she
$$ F:/spectra/data/she/nmr/H-F/1/audita.txt
$$ ##AUDIT TRAIL=  $$ (NUMBER, WHEN, WHO, WHERE, WHAT)
(   1,<2021-07-09 09:19:41.73 +0400>,<she>,<DPX200>,
      <created by zg, POWCHK disabled, PULCHK disabled
       configuration hash MD5:
       00 E9 B6 7A A2 85 ED C7 34 08 36 98 17 FE 4E 26
       data hash MD5: 16K
       05 23 45 B8 3B 44 08 D6 EC 36 2A CB 38 5A 02 07>)
$$ ##END=
$$ 
$$ hash MD5
$$ 2D BA 2C 05 3C D4 E6 27 D7 AC C2 45 4D D2 0C CE
##$RELAX= 
##$RELAX= 
##$RELAX= 
##$RELAX= 
##$RELAX= 
##$RELAX= 
$$ Bruker specific parameters
$$ --------------------------
##$DU= <F:/spectra>
##$EXPNO= 1
##$NAME= <H-F>
##$PROCNO= 1
##$TYPE= <nmr>
##$USER= <she>
##$AMP= (0..31)
100 100 100 100 100 100 100 100 100 100 100 100 100 100 100 100 100 100 
100 100 100 100 100 100 100 100 100 100 100 100 100 100 
##$AQSEQ= 0
##$AQ_mod= 1
##$AUNM= <au_zg>
##$AUTOPOS= <>
##$BF1= 200.13
##$BF2= 200.13
##$BF3= 200.13
##$BF4= 200.13
##$BF5= 200.13
##$BF6= 200.13
##$BF7= 200.13
##$BF8= 200.13
##$BYTORDA= 1
##$CFDGTYP= 0
##$CFRGTYP= 5
##$CHEMSTR= <none>
##$CNST= (0..31)
1 1 145 1 1 1 1 1 1 1 1 1 1 1 1 1 1 1 1 1 1 1 1 1 1 1 1 1 1 1 1 1 
##$CPDPRG= <>
##$CPDPRG1= <>
##$CPDPRG2= <>
##$CPDPRG3= <>
##$CPDPRG4= <mlev>
##$CPDPRG5= <mlev>
##$CPDPRG6= <mlev>
##$CPDPRG7= <mlev>
##$CPDPRG8= <mlev>
##$CPDPRGB= <>
##$CPDPRGT= <>
##$D= (0..31)
0 1.2 0 0 0 0 0 0 0 0.06 0 0.03 0 0 0 0 0.0002 0 0 0 0 0 0 0 0 0 0 0 0 
0 0 0 
##$DATE= 1625807981
##$DBL= (0..7)
120 120 120 120 120 120 120 120 
##$DBP= (0..7)
150 150 150 150 150 150 150 150 
##$DBP07= 0
##$DBPNAM0= <>
##$DBPNAM1= <>
##$DBPNAM2= <>
##$DBPNAM3= <>
##$DBPNAM4= <>
##$DBPNAM5= <>
##$DBPNAM6= <>
##$DBPNAM7= <>
##$DBPOAL= (0..7)
0.5 0.5 0.5 0.5 0.5 0.5 0.5 0.5 
##$DBPOFFS= (0..7)
0 0 0 0 0 0 0 0 
##$DE= 6
##$DECBNUC= <off>
##$DECIM= 32
##$DECNUC= <off>
##$DECSTAT= 4
##$DIGMOD= 1
##$DIGTYP= 9
##$DL= (0..7)
0 120 120 120 120 120 120 120 
##$DP= (0..7)
150 150 150 150 150 150 150 150 
##$DP07= 0
##$DPNAME0= <>
##$DPNAME1= <>
##$DPNAME2= <>
##$DPNAME3= <>
##$DPNAME4= <>
##$DPNAME5= <>
##$DPNAME6= <>
##$DPNAME7= <>
##$DPOAL= (0..7)
0.5 0.5 0.5 0.5 0.5 0.5 0.5 0.5 
##$DPOFFS= (0..7)
0 0 0 0 0 0 0 0 
##$DQDMODE= 0
##$DR= 18
##$DS= 0
##$DSLIST= <SSSSSSSSSSSSSSS>
$$ [...]
##$SUBNAM2= <"">
##$SUBNAM3= <"">
##$SUBNAM4= <"">
##$SUBNAM5= <"">
##$SUBNAM6= <"">
##$SUBNAM7= <"">
##$SUBNAM8= <"">
##$SUBNAM9= <"">
##$SW= 20.0188882624521
##$SWIBOX= (0..15)
0 0 2 0 0 0 0 0 0 0 0 0 0 0 0 0 
##$SW_h= 4006.41025641026
##$TD= 16384
##$TD0= 1
##$TE= 0
##$TE2= 300
##$TE3= 300
##$TEG= 300
##$TL= (0..7)
0 120 120 120 120 120 120 120 
##$TP= (0..7)
150 150 150 150 150 150 150 150 
##$TP07= 0
##$TPNAME0= <>
##$TPNAME1= <>
##$TPNAME2= <>
##$TPNAME3= <>
##$TPNAME4= <>
##$TPNAME5= <>
##$TPNAME6= <>
##$TPNAME7= <>
##$TPOAL= (0..7)
0.5 0.5 0.5 0.5 0.5 0.5 0.5 0.5 
##$TPOFFS= (0..7)
0 0 0 0 0 0 0 0 
##$TUNHIN= 0
##$TUNHOUT= 0
##$TUNXOUT= 0
##$USERA1= <user>
##$USERA2= <user>
##$USERA3= <user>
##$USERA4= <user>
##$USERA5= <user>
##$V9= 5
##$VALIST= <valist>
##$VCLIST= <CCCCCCCCCCCCCCC>
##$VD= 0
##$VDLIST= <DDDDDDDDDDDDDDD>
##$VPLIST= <PPPPPPPPPPPPPPP>
##$VTLIST= <TTTTTTTTTTTTTTT>
##$WBST= 1024
##$WBSW= 4
##$XGAIN= (0..3)
0 0 0 0 
##$XL= 0
##$YL= 0
##$YMAX_a= 258295
##$YMIN_a= -277375
##$ZGOPTNS= <>
##$ZL1= 120
##$ZL2= 120
##$ZL3= 120
##$ZL4= 120
##$ABSF1= 10
##$ABSF2= 0
##$ABSG= 5
##$ABSL= 3
##$ALPHA= 0
##$AQORDER= 0
##$ASSFAC= 0
##$ASSFACI= 0
##$ASSFACX= 0
##$ASSWID= 0
##$AUNMP= <proc_1d>
##$AZFE= 0.1
##$AZFW= 0.1
##$BCFW= 1
##$BC_mod= 2
##$BYTORDP= 1
##$COROFFS= 0
##$CY= 11.3945322036743
##$DATMOD= 1
##$DC= 2
##$DFILT= <>
##$DTYPP= 0
##$F1P= 17.5019972093344
##$F2P= -2.517084195857
##$FCOR= 0.5
##$FTSIZE= 0
##$FT_mod= 4
##$GAMMA= 1
##$GB= 0.15
##$INTBC= 1
##$INTSCL= 1
##$ISEN= 128
##$LB= 0.24
##$LEV0= 0
##$LPBIN= 0
##$MAXI= 10000
##$MC2= 0
##$MEAN= 0
##$ME_mod= 0
##$MI= 1.114404
##$NCOEF= 0
##$NC_proc= 0
##$NLEV= 6
##$NOISF1= 3.799351
##$NOISF2= 2.8
##$NSP= 1
##$NTH_PI= 0
##$NZP= 0
##$OFFSET= 15.70392
##$PC= 1
##$PHC0= -12280.18
##$PHC1= 21.80101
##$PH_mod= 1
##$PKNL= yes
##$PPARMOD= 0
##$PSCAL= 0
##$PSIGN= 0
##$REVERSE= no
##$SF= 200.130013532006
##$SI= 16384
##$SIGF1= 3
##$SIGF2= 2
##$SINO= 400
##$SIOLD= 16384
##$SREGLST= <1H.CDCl3>
##$SSB= 0
##$STSI= 0
##$STSR= 0
##$SW_p= 3612.71676300578
##$SYMM= 0
##$S_DEV= 0
##$TDeff= 0
##$TDoff= 0
##$TI= <>
##$TILT= no
##$TM1= 0
##$TM2= 0
##$TOPLEV= 0
##$USERP1= <user>
##$USERP2= <user>
##$USERP3= <user>
##$USERP4= <user>
##$USERP5= <user>
##$WDW= 1
##$XDIM= 8192
##$YMAX_p= 0
##$YMIN_p= 0
$$ End of Bruker specific parameters
$$ ---------------------------------
##NTUPLES= NMR FID
##VAR_NAME=  TIME,          FID/REAL,        FID/IMAG
##SYMBOL=    X,             R,               I
##VAR_TYPE=  INDEPENDENT,   DEPENDENT,       DEPENDENT
##VAR_FORM=  AFFN,          ASDF,            ASDF
##VAR_DIM=   8192,          8192,            8192
##UNITS=     SECONDS,       ARBITRARY UNITS, ARBITRARY UNITS
##FACTOR=    0.0002496,     1,               1
##FIRST=     0,             0,               0
##LAST=      2.0444736,     0,               0
##MIN=       0,             -277375,         0
##MAX=       2.0444736,     258295,          0
$$ Real data points
##PAGE= N=1
##DATA TABLE= (X++(R..R)), XYDATA
0 0 0 0 0 0 0 0 0 0 0 0 0 8 -8 8 -8 16 -16 24 -24 32 -40 48 -56 64 -72 88 -102 118 -136 154 -176 201 -230
33 -230 260 -294 331 -372 417 -466 520 -578 643 -713 792 -874 966 -1066 1176 -1296 1428
50 1428 -1572 1732 -1911 2108 -2327 2577 -2860 3184 -3560 4002 -4531 5179 -5991 7046 -8478
65 -8478 10538 -13780 19658 -33750 142220 59365 -68882 258295 150741 -50278 88231
76 88231 216580 50599 43929 124186 73845 35315 84720 40911 41702 90272 35695 -11899
88 -11899 65848 44223 -29577 28225 64504 -22245 -2472 59938 -9513 -35297 50960 17248
100 17248 -46824 25505 44737 -35486 2246 59102 -11653 -22635 55272 16373 -31917 46749
112 46749 55907 -24161 19276 78979 4406 -12214 77684 55637 -18483 40148 85303 6984
124 6984 -3433 72564 54319 55 34589 58506 21443 15319 32244 25733 33892 34208 1667
137 1667 18041 52252 960 -25634 46666 44644 -32343 -768 55779 -3500 -30655 32137
149 32137 24101 -19218 15186 23975 -15247 11005 27595 -19273 3237 49274 -7608 -26100
161 -26100 49908 25600 -43324 22640 60789 -24949 -15799 63233 13131 -34638 34913 41345
173 41345 -21520 3654 37863 400 -1574 22161 2447 5905 20998 -12583 -4838 37635 -5185
186 -5185 -33910 34418 28441 -48294 -5466 51444 -20993 -41688 37863 18124 -44035 2265
198 2265 30696 -20732 -13984 23480 -2515 -11081 17320 -407 -12468 21279 9705 -19203 17125
211 17125 29360 -15996 -4449 37016 7716 -17981 20583 29059 -6634 -1435 23789 12883
223 12883 -524 6512 12011 12804 5202 -4493 8513 19083 -5184 -12658 19394 14995 -23008 -4820
237 -4820 28618 -5896 -29054 13738 18753 -26676 -14316 23952 -3052 -26735 7682 12986 -19053
250 -19053 -8319 11781 -5905 -8259 7655 -2839 -5557 12182 -696 -13316 15236 14984 -18220
263 -18220 2434 29927 -4931 -15781 24657 17153 -15620 5544 23755 -1032 -3569 12802
275 12802 5412 3063 7909 -3280 4127 16690 -8120 -11693 22243 4952 -29073 7551 25908
288 25908 -25058 -20447 29393 -315 -36597 7355 19198 -25572 -16118 16174 -4798 -18773
300 -18773 1746 -242 -9070 355 -5602 -9290 9537 521 -18559 5837 17117 -14763 -10183
313 -10183 21486 4887 -16177 7995 16204 -5720 -1834 11090 3617 2896 6348 -858 5740 12730
327 12730 -4976 -5857 17936 6670 -17702 5369 22426 -11017 -16907 18572 9950 -23480 -5009
340 -5009 20141 -5691 -21624 6166 11408 -15383 -12944 7724 502 -13569 -5755 3674 -1810
353 -1810 -8980 -6007 2169 1660 -9140 -6501 9088 2167 -14151 1357 14567 -7265 -11503 13985
367 13985 8907 -12608 1973 15402 -2540 -4582 9583 2426 -884 8008 -1116 -3046 14090
380 14090 2098 -15959 9928 17484 -18642 -10684 25577 -360 -27187 9344 18214 -20265 -13356
393 -13356 16097 -1452 -17941 601 4777 -7991 -6238 -3253 -2670 975 -6940 -10209 6615 2557
407 2557 -16908 -949 14637 -9904 -13781 14686 6122 -16819 3010 15291 -7102 -5528 12772
420 12772 2401 -4942 7385 4411 -2473 7553 4913 -5856 6866 11472 -7972 -2800 16878
433 16878 753 -13938 8491 14043 -11278 -8923 13621 4036 -14859 -2180 10896 -2488 -12132
446 -12132 -766 6811 -3432 -12103 -2211 7424 -3625 -13921 315 10438 -7692 -15471 7147
459 7147 10141 -14435 -9216 14975 2832 -15954 2395 13799 -6299 -8052 10302 4905 -6112
472 -6112 3360 5894 -1462 2799 4178 -2522 3562 7388 -4319 -1251 11063 -1110 -8869 8429
486 8429 6461 -10797 -343 10486 -5221 -8152 6188 1230 -8256 -492 797 -4049 -137 -3055
500 -3055 -6221 4440 0 -13981 1365 11854 -12422 -12397 16249 3942 -20767 3405 18312
513 18312 -10554 -12012 15113 6725 -11204 2053 10916 113 -1349 3481 3529 5841 2779 -3254
527 -3254 6534 11278 -4360 -3550 13540 5479 -9320 3800 12628 -2843 -6072 6748 4699 -4379
541 -4379 -1940 2452 1521 -1681 -4784 -737 3990 -4090 -8973 2592 4342 -10271 -7103 8271 -1064
556 -1064 -14518 543 9396 -9083 -11418 8690 4863 -13211 -3464 11351 -2150 -11135 4632
569 4632 8478 -5190 -4232 6300 3899 -2341 -100 3111 4296 2201 -2475 1372 8518 503 -6125
584 -6125 6042 9165 -5440 -3424 9894 3031 -7175 1819 6218 -1537 -2316 1139 581 1967 -1249
599 -1249 -5482 3476 5432 -9211 -4888 11606 -963 -14259 5242 11246 -11521 -7677 12705
612 12705 1219 -11732 3275 8161 -4712 -3238 4882 1837 -483 640 -5 4139 3718 -4317
626 -4317 1170 9622 -1516 -6073 8972 7162 -8111 308 11519 -1573 -6922 6683 5656 -4968
640 -4968 -879 4317 265 -1161 -871 -1102 2162 896 -5852 -994 6189 -3485 -8794 4066 5230
655 5230 -8965 -5273 7694 378 -10282 -427 7711 -3363 -8178 3162 5911 -4653 -5170 4839
669 4839 4482 -4889 -3068 6571 4043 -4995 -1021 8046 2825 -6052 1329 9502 -192 -6158 5688
684 5688 8610 -4658 -3349 8860 3505 -6203 1871 7019 -1740 -2589 3548 1082 -1098 1108 -1197
699 -1197 -1034 3590 -1649 -5872 3955 4030 -8549 -3018 8688 -2335 -9793 3886 6184 -7341 -5079
714 -5079 5519 1483 -5608 -1827 3258 1772 -3016 -3498 4130 4349 -6085 -2738 9264 1266 -9296
729 -9296 4061 10196 -6019 -5775 10145 3521 -8382 2129 8327 -2616 -3805 4291 2443 -2101
743 -2101 -145 961 1092 1121 -2250 -1514 4043 -73 -5933 1491 5000 -4463 -4970 4685 1885 -6486
759 -6486 -1742 4778 -819 -4827 154 2942 -884 -3527 -96 3379 -46 -3959 484 5068 -501
774 -501 -4775 2579 6122 -2839 -4186 5801 4978 -4903 -1409 7721 1669 -5592 2218 6864 -1711 -3321
790 -3321 4060 3476 -2369 -847 2760 1539 -1091 -1246 1200 2336 -1500 -3421 2481 3079 -5180 -2592
806 -2592 5790 -468 -7177 1491 4990 -4710 -4794 3730 1276 -4334 -1153 1451 526 -1166 -2881 616
822 616 4136 -2244 -5406 4731 5328 -7210 -3054 9638 467 -9543 3676 8862 -5159 -5266
836 -5266 6832 3654 -5553 -824 5032 1032 -2869 -847 2906 1981 -3107 -2353 4276 1849 -5477
851 -5477 -580 5306 -1584 -5525 2582 3191 -4121 -2224 2961 114 -2704 -337 818 -94 -824 -1014
867 -1014 307 1562 -1034 -2023 2114 2200 -3172 -962 4543 395 -4189 2035 5096 -2322 -3215 4859
883 4859 3434 -4390 -739 5991 589 -4476 1587 4662 -1108 -3176 2191 3127 -1123 -2390 1034
898 1034 2912 -918 -3886 1067 4065 -2688 -4551 3415 2879 -5435 -2636 4797 -248 -5247 436
913 436 3041 -1822 -2730 308 1379 -347 -2618 -1376 2890 482 -4783 414 5541 -2786 -5462 4985
929 4985 3975 -6455 -1339 6856 -933 -5528 2839 4225 -3191 -2043 3231 1460 -1654 -934 1247
944 1247 2074 -869 -2736 2266 3348 -3625 -2661 5078 1354 -5761 694 5553 -2509 -4431 3609 2867
960 2867 -3589 -1646 3051 1030 -2215 -896 1726 1591 -1108 -2065 1843 2900 -2287 -2298 3658 2177
976 2177 -3862 -1062 4539 484 -4231 911 4390 -1234 -3354 2038 3111 -2026 -2446 2527 2192 -2338
992 -2338 -1929 2361 1744 -2805 -1848 3091 1204 -4236 -698 4368 -890 -5032 1825 3844 -3797 -3348
1008 -3348 4330 1203 -5130 81 3771 -1493 -2990 1440 1491 -1319 -916 80 697 801 -1849 -1057 3074
1025 3074 507 -4038 1067 4234 -2540 -3307 3770 2135 -4297 -580 3847 -482 -2690 642 1909
1040 1909 -57 -1845 -512 2446 755 -3559 -419 4491 -988 -4935 2612 4416 -4307 -2782 5220
1055 5220 701 -5065 751 4026 -1878 -2681 1937 1658 -1413 -801 646 1240 134 -1865 268 2729
1071 2729 -743 -2745 1874 2917 -2708 -1979 3717 1332 -3841 -123 3648 -636 -3111 765 2566
1086 2566 -1256 -2662 648 2156 -1137 -2686 527 2551 -1611 -3564 1565 2783 -3150 -3344 2990
1101 2990 1666 -4536 -1477 4093 -401 -4611 985 3322 -2344 -2914 2048 1700 -2385 -1252 1750
1116 1750 983 -1500 -1337 1608 1937 -2064 -1746 3329 1367 -3938 46 4553 -1162 -3814 2968 3207
1132 3207 -3408 -1176 3686 111 -2669 832 1638 -487 -727 -151 603 966 -1208 -1774 2292 1460 -3534
1149 -3534 -357 4098 -1381 -3937 2557 2501 -3511 -1567 3416 247 -2973 340 1852 -298 -1235 -306
1165 -306 1091 988 -1757 -1106 2560 742 -3226 143 3557 -1270 -3148 2257 2284 -2756 -1239 2592
1181 2592 463 -2149 -197 1570 -59 -1300 -619 1080 515 -1814 -1128 2079 431 -3205 -303 3303
1197 3303 -1471 -3739 1697 3039 -3319 -2759 3424 1037 -4210 -575 3549 -719 -3473 889 2688
1212 2688 -1334 -2303 1346 2027 -1040 -1897 1213 2459 -1184 -2201 2206 2389 -2564 -1396 3546 1000
1228 1000 -3408 563 3472 -967 -2292 1851 1629 -1405 -666 1148 777 -333 -899 116 1609 -307
1244 -307 -2406 1175 2319 -2558 -2127 3055 579 -3816 161 3142 -1681 -2590 1963 1134 -2088 -693
1260 -693 1230 -58 -888 -658 181 1072 -947 -1809 1404 1700 -2573 -1357 3276 275 -3484 979 3169
1277 3169 -2066 -2519 2188 1567 -2437 -865 2118 433 -1703 -640 1254 921 -1645 -1108 1883 1008
1293 1008 -2624 -894 2725 -177 -3185 533 2889 -1553 -2464 1746 1396 -2325 -1168 1843 398
1308 398 -1925 -305 1578 29 -1520 -359 1453 566 -1783 -274 2383 46 -2307 989 2912
1323 2912 -1166 -2365 2465 2263 -2633 -816 3427 308 -2551 928 2611 -846 -1401 1298 1215 -498
1339 -498 -1032 322 1307 -26 -1945 258 2085 -1290 -2337 1614 1736 -2589 -1332 2620 -25 -2784
1355 -2784 193 1578 -951 -1557 159 679 -280 -1260 -573 1449 278 -2284 13 2470 -979 -2731
1371 -2731 1809 2182 -2613 -1077 3049 269 -2595 872 2104 -999 -1141 1036 881 -478 -648 324
1387 324 973 -244 -1357 725 1656 -1261 -1690 1931 1317 -2718 -701 2779 -474 -2870 1062 2413
1403 2413 -1645 -2077 1677 1382 -1831 -986 1650 792 -1430 -860 1623 752 -1772 -701 2005 600
1419 600 -2093 26 2603 -126 -2253 1098 2449 -1431 -1476 2162 1258 -1648 -335 1661 397 -1162
1435 -1162 -4 1001 357 -715 -647 1116 828 -1625 -919 1879 50 -2559 272 2190 -1667 -2428
1451 -2428 1673 941 -2590 -734 1685 -613 -1663 100 559 -528 -1080 -259 673 232 -1423 -627 1838
1468 1838 -49 -2402 720 2315 -1490 -1817 2167 1392 -2263 -252 2232 170 -1315 614 1466 178
1484 178 -661 -121 1338 870 -1256 -368 2332 195 -2325 826 2439 -1541 -1906 2065 1040 -2270
1500 -2270 -479 2059 -355 -1889 378 1240 -510 -1225 252 684 -332 -1205 154 1293 -719 -1570
1516 -1570 1005 1607 -1499 -1261 2169 994 -2278 65 2692 -350 -2067 1187 1924 -1116 -1136 1625
1532 1625 882 -1145 -413 1036 576 -823 -486 962 856 -1167 -842 1326 469 -1917 -284 1968 -501
1549 -501 -2168 791 1303 -1393 -1309 931 503 -1181 -574 492 301 -542 -923 198 1059 -886 -1569 1453
1567 1453 1291 -2165 -605 2714 -164 -2602 1267 2348 -1639 -1170 2210 778 -1681 239 1764
1582 1764 122 -789 252 1074 518 -883 -191 1471 541 -1730 199 2355 -613 -1999 1396 1728
1598 1728 -1815 -1037 1788 245 -1660 8 1335 -227 -941 -169 622 255 -1107 -579 1175 267 -1682
1615 -1682 -245 1769 -516 -1987 908 1441 -1495 -1200 1631 346 -1766 -79 1209 -248 -959 287
1631 287 871 -154 -673 8 749 247 -1028 -10 1175 -162 -1556 597 1287 -1219 -1178 1525 521
1648 521 -1919 -193 1611 -510 -1602 651 902 -862 -826 437 306 -663 -827 184 909 -484 -1400
1665 -1400 827 1258 -1488 -1210 1810 705 -2183 -53 2187 -695 -1653 1219 1335 -1004 -826 988
1681 988 699 -447 -521 728 1143 -323 -1074 1016 1467 -1373 -868 2019 374 -2232 492 2100 -954
1698 -954 -1621 1479 782 -1654 -365 1084 -206 -935 -157 258 63 -611 -906 316 511 -1235 -996 1269
1716 1269 204 -1985 -92 1647 -850 -1788 742 1052 -1291 -880 1110 324 -1049 -258 808 351
1732 351 -686 -362 930 433 -1025 -230 1403 202 -1462 285 1674 -778 -1464 1264 1005 -1445
1748 -1445 -486 1412 -31 -1262 237 832 -424 -618 38 200 63 -451 -577 565 257 -1261 -297
1765 -297 1319 -497 -1577 693 1322 -1482 -970 1611 338 -1594 264 1383 -304 -694 651 989
1781 989 -94 -334 170 1098 158 -952 598 1643 -594 -1314 1457 1278 -1668 -518 2050 -236 -1628
1798 -1628 649 1161 -1024 -987 687 189 -771 -507 29 118 -432 -974 -61 515 -848 -1385 524 646 -1749
1817 -1749 -604 1214 -227 -1723 445 841 -1014 -806 777 298 -761 -221 470 589 -140 -452 380
1834 380 1080 -334 -755 1051 1107 -1143 -498 1853 392 -1580 591 1799 -567 -1100 1161 964 -1197
1851 -1197 -523 1030 319 -819 -405 602 286 -884 -754 864 394 -1229 -476 1283 -144 -1709 473
1868 473 1361 -1030 -964 1205 500 -1103 -107 1023 -106 -458 161 441 252 48 -461 338 818 -582
1886 -582 -356 1404 353 -1452 552 1689 -782 -1070 1672 637 -1621 18 1426 -613 -1133 506
1902 506 503 -727 -529 137 68 -346 -737 -51 445 -432 -1137 477 613 -1154 -783 1102 162 -1490 145
1921 145 914 -600 -850 483 455 -320 -175 27 413 385 -590 -44 1162 385 -1041 415 1608 -486
1939 -486 -947 1467 1047 -1185 -182 1754 59 -1180 467 1161 -377 -645 558 562 -292 -556 85 759
1957 759 -334 -942 373 851 -884 -1064 1199 453 -1561 -68 1472 -624 -1265 780 880 -1160 -550
1974 -550 959 194 -807 37 519 24 -379 -346 507 664 -550 -558 1154 610 -1194 26 1742 -250
1992 -250 -1224 854 942 -876 -697 871 160 -816 61 455 172 -222 -316 90 417 -639 -752 695 342
2011 342 -1495 -221 1308 -635 -1459 778 795 -1337 -433 1036 -178 -937 468 454 -400 -160 181 42
2029 42 242 -24 -175 538 403 -535 162 1139 38 -755 1001 1008 -604 -302 1043 350 -632 268 733 -49
2049 -49 -296 132 449 182 -533 -142 857 135 -1268 77 1165 -746 -1447 807 830 -1621 -672 1320
2067 1320 -108 -1586 240 941 -735 -927 543 288 -454 -251 239 95 -165 -434 254 675 -296 -527
2085 -527 535 835 -722 -401 1248 415 -951 177 976 -507 -594 571 397 -269 -43 180 367 14
2103 14 -501 56 691 -213 -1108 363 937 -1143 -906 1070 54 -1598 249 1203 -773 -861 782 448
2121 448 -1066 -227 494 -60 -355 -172 288 379 -226 -355 661 674 -708 -131 1224 110 -944 716
2139 716 1155 -604 -590 1135 395 -673 322 780 11 -108 217 255 168 -52 -246 333 437 -539 -577 820
2159 820 141 -1211 137 1031 -833 -1010 724 372 -1181 -566 738 -236 -998 -54 521 -259 -730 -90
2177 -90 515 -93 -875 -60 866 -221 -1032 775 1012 -829 -570 1204 258 -1009 309 947 -228 -462
2195 -462 616 395 -458 147 328 34 165 30 -267 441 190 -680 -124 873 -315 -1060 714 509 -941
2214 -941 -468 983 -90 -947 46 434 -339 -436 252 145 -191 -428 4 558 -2 -1005 376 923 -661
2233 -661 -747 1174 719 -1034 141 1409 -250 -910 852 747 -574 -92 757 157 -229 6 148 361
2251 361 166 -347 75 722 -376 -614 589 413 -1026 -261 854 -258 -1144 363 474 -932 -497 347
2269 347 -33 -503 -282 121 -94 -390 -558 56 217 -456 -522 658 262 -891 112 1166 -334 -804 820
2288 820 742 -732 -217 1041 131 -660 472 649 -138 -24 382 377 293 -186 -64 480 151 -582 -181 805
2308 805 -163 -908 596 645 -925 -398 620 10 -852 10 394 -115 -258 -109 -126 193 -367 -421 406 531
2328 531 -919 -161 1073 -62 -1146 578 1081 -896 -669 1132 215 -1074 242 907 -283 -368 565
2345 565 476 -142 -248 308 263 221 -428 148 577 -341 -620 499 564 -827 -384 931 -207 -908 115 567
2365 567 -625 -591 262 -13 -447 -102 -145 144 -43 -484 -126 671 -136 -1059 376 914 -852 -595 1179
2384 1179 285 -1006 233 872 -123 -558 704 465 -355 35 426 99 -92 114 288 339 -19 -252 428
2403 428 472 -518 -206 671 2 -857 320 710 -581 -568 674 -16 -689 -72 345 -231 -170 -70 -90 71
2423 71 -118 -573 118 419 -672 -424 773 287 -1103 244 1065 -667 -943 668 573 -887 -338 788
2441 788 52 -746 -8 495 -11 -256 -153 507 253 -577 -63 885 -99 -956 426 830 -853 -787 928
2460 928 228 -1274 158 759 -390 -572 444 205 -353 -72 -17 -72 111 -91 -237 393 160 -631 93
2479 93 728 -353 -502 633 475 -628 -59 703 -40 -519 265 300 -219 -141 102 306 138 -316 -111 653
2499 653 121 -639 194 921 -501 -578 753 483 -1070 -11 897 -197 -775 423 410 -739 -296 452
2517 452 -19 -194 -17 44 30 -74 -425 -127 492 -290 -582 384 473 -666 -344 749 -18 -803 256 567
2537 567 -432 -385 265 241 -343 -144 226 308 -18 -405 155 640 -474 -465 844 479 -1034 -74 1039 -414
2557 -414 -1081 632 652 -953 -486 912 107 -766 37 320 -103 -230 -43 248 125 -357 -184 547 118
2576 118 -606 16 772 -344 -671 507 383 -669 -134 794 -151 -397 187 377 -142 -10 72 211 110
2595 110 -85 -356 442 305 -515 -254 857 -76 -826 466 717 -763 -558 799 194 -828 -72 543
2613 543 -305 -369 141 241 -172 -401 -140 258 -95 -583 -50 571 -288 -812 486 436 -710 -432 912 127
2633 127 -750 156 634 -356 -324 163 46 -142 103 36 -51 131 -223 -95 483 19 -588 292 776 -571 -456
2654 -456 823 200 -768 28 879 -200 -599 457 324 -386 -204 393 31 -202 -185 238 285 -241 -314 489
2674 489 327 -700 -247 788 31 -767 376 596 -636 -233 669 128 -499 158 355 -138 120 32 127
2693 127 379 125 -436 221 633 -369 -364 751 370 -895 -85 901 -139 -603 479 471 -547 -425 487
2712 487 232 -261 -230 218 320 -403 -395 291 331 -568 -353 659 -72 -960 268 749 -625 -758 616 316
2732 316 -787 -36 829 -300 -532 243 368 -240 -176 104 39 -9 -157 64 341 20 -458 149 646 -256
2752 -256 -461 566 334 -600 -75 590 -111 -385 115 336 -131 -202 83 212 110 -309 -241 362 138 -537
2772 -537 -84 669 -348 -769 574 455 -885 -293 820 -38 -652 317 508 -463 -308 479 85 -296 -6
2791 -6 63 -11 -21 -188 125 363 -147 -341 452 295 -626 -7 637 -94 -427 236 249 -385 -172 364 37 -133
2813 -133 -190 -69 163 -72 -421 -76 491 -236 -645 540 556 -844 -424 986 -11 -1029 379 758 -473
2832 -473 -566 665 377 -592 -191 592 24 -321 -26 290 266 -229 -276 412 221 -435 -129 795 51 -555 432
2853 432 606 -409 -319 618 65 -357 70 286 -209 -116 5 -64 226 -6 -232 185 257 -481 -294 671 -8
2874 -8 -783 126 722 -479 -642 561 228 -681 -49 584 -70 -400 174 299 44 -196 -191 289 43 -437 -117
2895 -117 564 18 -579 230 717 -445 -422 514 208 -704 71 617 -311 -381 263 196 -128 -49 78 18 17 -245
2917 -245 -201 304 -12 -611 233 595 -445 -447 571 307 -600 -105 697 -236 -502 292 303 -260 -209 248 278
2938 278 -4 -152 60 386 -14 -424 413 456 -446 -291 726 236 -788 201 873 -303 -578 479 389
2957 389 -330 -237 252 -94 -114 8 -30 103 109 -278 4 362 -283 -653 240 441 -587 -206 626 -165 -550
2978 -550 75 411 -421 -272 189 136 -255 -252 95 328 -82 -421 99 556 -468 -504 696 269 -723 -15 970
2999 970 -309 -695 501 609 -632 -488 625 56 -546 128 267 -52 -83 118 56 179 -177 -353 239
3018 239 81 -597 -89 542 -151 -634 262 484 -449 -219 494 103 -534 143 255 -145 -39 39 277 -52
3038 -52 -274 -163 478 114 -561 95 733 -279 -559 551 427 -694 -270 781 59 -741 375 499 -303
3057 -303 -346 178 140 -77 -157 85 103 -16 -335 44 365 -157 -409 267 474 -535 -435 506 -20 -567 57
3078 57 417 -269 -488 -48 50 -117 -367 -140 110 109 -404 -197 400 156 -775 182 685 -365 -512 717 304
3099 304 -718 3 659 -275 -438 214 472 -244 -245 551 135 -189 -262 269 449 -190 -272 325 314 -470 -270
3120 -270 687 87 -636 304 560 -425 -509 530 202 -417 -140 247 46 -253 -78 -35 169 63 -294 -18
3140 -18 473 -210 -240 550 272 -613 43 716 -280 -505 441 474 -399 -179 464 163 -457 -151 319 5 -188
3161 -188 -149 246 223 -363 -256 402 -19 -709 86 482 -506 -446 421 254 -569 -122 510 -176 -323 251 153
3182 153 -149 -130 86 269 77 -196 -18 282 120 -309 -74 629 -151 -606 417 498 -418 -225 544 70
3202 70 -520 199 426 -17 -258 217 182 97 -184 67 381 60 -488 169 703 -299 -506 523 376 -546
3222 -546 -248 688 -84 -680 266 460 -255 -137 265 74 -214 -182 140 110 89 -28 85 353 -39 -390 368
3243 368 331 -403 -140 478 104 -513 129 410 -116 -222 241 63 -149 -154 -16 64 131 -329 -233 327 -77 -422
3265 -422 233 424 -551 -300 569 150 -691 4 724 -237 -408 331 109 -404 -156 261 45 -235 -71 65
3285 65 86 -63 -306 253 281 -450 -89 513 97 -492 62 571 -270 -237 448 131 -349 -20 346 -3 -260
3306 -260 134 179 141 -106 -194 294 231 -496 -393 468 126 -685 131 591 -495 -474 513 240 -626 -103 537
3327 537 -151 -345 71 258 -95 -113 16 203 -7 -367 -33 457 -64 -568 271 455 -355 -401 582 230 -453
3348 -453 -54 383 -54 -390 -24 164 33 19 82 -1 95 -131 -127 309 72 -533 -45 465 -210 -483 452 405
3370 405 -507 -194 508 -61 -472 147 224 -71 -191 196 179 -10 -222 69 336 -33 -328 132 448 -327 -435
3391 -435 375 288 -619 67 717 -175 -399 149 318 -382 -259 279 47 -132 -24 50 96 124 -150 -17 327
3412 327 -226 -285 262 402 -464 -158 632 -40 -573 186 434 -387 -230 301 114 -215 33 62 127 -258 -142
3433 -142 209 218 -151 -255 368 188 -526 -193 593 -231 -629 292 339 -448 -210 432 23 -493 4 269 -30
3454 -30 -163 45 127 -41 59 -181 246 332 -289 -36 594 33 -524 226 496 -277 -292 522 287 -317 -119
3475 -119 315 79 -116 -84 188 151 -232 -189 244 236 -443 -146 545 -74 -650 203 544 -459 -300 486 124
3496 124 -585 45 375 -231 -402 273 164 -132 -56 -66 93 -51 -154 -12 401 -10 -425 162 333 -298 -172
3517 -172 405 195 -348 -44 349 -155 -192 226 91 -55 -58 -62 29 0 -23 -275 156 -18 -393 90 357 -258 -414
3540 -414 420 257 -519 -69 426 -199 -547 285 239 -287 -237 123 126 -81 -3 28 202 42 -437 138 336 -310
3562 -310 -283 366 198 -427 -67 641 -171 -389 467 245 -254 -245 258 95 -21 -111 151 215 -101 -277 216 250
3584 250 -332 -307 449 223 -599 2 578 -173 -574 225 398 -491 -183 376 133 -341 -180 151 -46 -142 -48
3605 -48 88 150 -227 -209 263 71 -432 58 468 -177 -264 358 341 -243 -108 334 22 -266 189 149 -207 -111
3627 -111 -42 -47 268 -28 -171 174 153 -336 -184 466 65 -298 51 385 -413 -302 394 106 -413 -29 239
3648 239 -154 -194 165 60 136 -149 -189 175 46 -317 -146 373 43 -484 199 460 -322 -110 548 -32 -323
3669 -323 197 316 -77 -239 200 92 114 -20 22 178 22 -277 35 267 -91 -463 214 397 -512 -264 493
3690 493 35 -557 14 374 -122 -347 139 137 -292 -121 34 -38 -110 -245 167 205 -257 -221 165 307 -355 -240
3712 -240 303 150 -507 142 519 -326 -326 349 170 -395 -125 184 15 8 -27 168 147 -52 -105 62 382 -55
3734 -55 -186 391 112 -333 -104 385 27 -284 192 244 -367 -243 211 -86 -166 -5 -48 78 -89 -312 70
3755 70 246 -91 -332 457 142 -410 112 636 -188 -499 354 462 -469 -173 476 -153 -222 151 251 -116 -129
3776 -129 72 62 73 -129 -108 288 162 -253 12 327 -345 -309 343 229 -392 0 307 -83 -271 41 262
3797 262 -294 -199 22 -106 -101 -89 -83 72 -5 -214 -115 320 -160 -399 276 258 -254 -241 423 9 -311 207 277 -204
3821 -204 -190 90 60 84 4 -45 265 76 -182 37 367 8 -278 252 230 -218 -107 553 111 -385 62 444
3843 444 -21 -298 224 84 -21 -144 42 105 -54 -250 91 187 -45 -310 101 275 -322 -271 267 54 -547
3864 -547 -66 400 -189 -306 188 169 -251 -121 241 27 -93 -206 77 238 -174 -173 234 279 -369 -85 419
3885 419 -96 -459 186 462 -168 -279 252 -2 -347 -5 223 -81 -127 5 -7 -68 -74 -236 133 183 -330 -116
3907 -116 330 -79 -430 99 303 -255 -352 267 182 -202 33 297 -44 -117 -10 224 68 -36 -107 152 205 -66
3929 -66 -91 230 133 -472 112 536 -118 -233 426 197 -367 53 482 -21 -148 237 146 14 -28 46 128 -45
3951 -45 -197 -172 115 6 -433 -10 369 -230 -459 172 126 -404 -180 354 -183 -372 35 140 -206 -172 -98 87
3973 87 -11 -249 84 129 2 -296 166 450 26 -277 271 371 -325 15 524 -211 -308 193 200 -107 -122 136
3995 136 40 -136 -93 -77 281 114 -77 -164 224 -106 -284 278 228 -349 -33 413 -127 -266 -1 156 -252 -83
4017 -83 196 57 -59 85 37 17 41 -41 -43 161 -63 -235 200 232 -409 -129 317 -107 -440 174 427 -253 -242
4040 -242 327 120 -228 -48 187 87 -165 -65 64 8 -219 -174 249 129 -222 -167 390 -154 -499 139 203
4061 203 -316 -201 329 27 -275 125 174 -2 -53 -19 33 95 -83 -100 72 39 -217 -71 279 124 -342 209
4083 209 466 -217 -75 317 146 -502 4 269 -94 -226 50 121 44 -162 -34 98 195 -231 -14 396 6
4104 6 -469 43 392 -111 -268 239 27 -404 -3 251 -50 -173 59 -23 67 17 -51 163 149 -178 -130 246 26
4127 26 -465 146 288 -301 -201 197 142 -404 -115 323 84 -352 -27 159 -89 -92 110 97 38 -72 -32 144
4149 144 -2 -75 60 189 -268 -135 302 189 -482 -116 487 -199 -372 138 221 -205 -272 242 -43 -258 -108
4170 -108 -11 182 -76 -148 187 195 -190 -176 373 143 -350 -4 464 143 -274 162 236 -356 -121 292 13 -53
4192 -53 -33 59 19 -217 -80 49 221 -64 -189 184 119 -171 -200 366 -96 -348 101 159 -418 -174 311 57
4214 57 -183 -67 120 103 -171 -34 143 19 -61 -100 121 34 -380 -14 367 47 -427 194 243 -294 -160 360
4236 360 -53 -347 37 122 92 -147 -48 99 8 20 -198 124 147 -199 -118 409 -88 -302 36 151 -274 -357 378
4259 378 166 -276 138 267 -123 -91 151 25 -100 121 73 81 121 -135 19 267 -7 -244 140 320 -194 -162
4281 -162 321 63 -297 78 319 -19 -239 176 156 -125 -54 -4 85 22 62 -120 113 33 -165 123 262 -143
4303 -143 -166 276 86 -258 -62 312 -91 -280 170 57 -15 -67 58 20 69 35 -15 195 40 -246 41 362
4325 362 -233 -218 283 163 -427 -39 228 -205 -292 231 208 -359 -59 79 76 -105 -48 162 63 -110 -149 117 259
4348 259 -423 -122 390 42 -478 -111 281 -95 -249 297 168 -154 -42 304 151 -28 53 18 47 -79 37
4369 37 64 155 -105 -208 168 83 -289 40 331 -91 -272 159 194 -214 -86 221 -25 -154 127 183 -23 44
4391 44 4 -49 3 -54 6 106 146 -166 -53 157 -36 -313 176 196 -224 -98 199 33 -277 195 173 -20 24
4414 24 13 49 73 -100 -141 119 -30 -120 -47 296 18 -204 143 246 -427 -101 356 -102 -237 38 224 -194
4436 -194 -12 53 147 -66 -72 -29 169 -111 -104 30 257 32 -302 259 295 -124 -24 420 -40 -434 96 324 -226
4459 -226 -169 106 65 -29 79 174 87 3 -20 22 107 50 -311 42 122 -220 -41 368 -89 -333 -40 147 -45 -236
4483 -236 170 39 -116 -92 205 58 -19 -110 100 120 -2 -192 0 116 -102 -95 205 -29 -396 45 189 -183
4505 -183 -215 137 191 -338 -54 130 -29 -153 50 -156 44 -3 -84 -89 255 -124 -270 219 -1 -246 -9 305
4527 305 -107 -242 117 165 -344 -67 171 57 -20 101 69 -64 179 -48 88 120 -81 -172 186 85 -407 54
4549 54 300 0 -236 208 202 -330 -45 397 -61 -240 219 46 -35 61 78 21 0 -234 -174 231 55 -223 0
4572 0 152 -214 -177 223 169 -387 -25 197 -9 -203 38 138 -48 -85 130 114 91 -80 -157 65 84 -140 69
4595 69 165 -95 -179 128 232 -220 1 290 133 -367 121 227 -73 -39 90 41 -55 -117 -65 211 -54 -231 130
4618 130 249 -137 -221 69 72 -265 -63 355 49 -333 30 195 -106 -312 299 9 -86 22 34 -18 164 77
4640 77 -28 137 88 -107 20 317 -175 -81 363 -7 -346 90 301 -248 -149 188 150 -143 -28 152 -18 -77
4662 -77 -22 3 82 -167 -195 179 64 -303 -173 207 -123 -136 -3 195 -282 -128 225 21 -245 52 48 -16 8
4685 8 50 45 53 -8 -116 17 184 -57 -212 368 45 -347 68 292 -129 -240 246 227 -256 3 330 34 -195
4708 -195 18 56 -60 9 10 -32 40 -16 -86 237 51 -223 9 291 -137 -243 220 239 -169 -99 291 -130 -151 122
4732 122 167 -60 -90 53 86 -38 9 -7 174 58 -181 -44 235 -162 -238 238 38 -320 26 200 -97 -281
4754 -281 51 77 -87 -25 -30 -3 68 -35 10 44 115 -195 -34 409 -107 -212 174 109 -233 -20 333 61 -277
4777 -277 182 57 -136 -37 236 22 -151 -30 -19 99 -170 16 58 25 -84 -72 179 113 -196 -97 164 -7
4799 -7 -148 53 257 -102 -200 199 139 -5 -41 118 43 -173 -74 12 160 -6 -253 135 198 -336 -70 350 -143
4822 -143 -280 233 313 -177 -75 276 164 -158 52 240 43 -136 144 130 -38 123 -121 -28 35 10 4 187
4844 187 50 -71 129 209 -128 -117 283 93 -187 30 131 8 88 96 -216 51 85 -184 55 140 -215 -135 126
4867 126 -20 -191 -5 325 -93 -69 207 92 -149 47 351 -38 74 -27 187 -84 -60 198 95 95 -139
4888 -139 -35 81 72 -181 0 108 -115 -12 258 77 -124 19 196 -51 -84 101 65 95 -30 34 114 132 -98
4911 -98 47 174 15 -182 -14 148 -55 -45 283 65 -230 7 150 -33 -279 57 104 29 -175 227 31
4932 31 -77 -18 29 86 -28 22 98 100 -231 -115 156 27 -365 49 274 -125 -389 213 71 -200 -79 244 -108
4955 -108 -152 -73 129 -68 -21 -104 -110 -9 -36 -92 108 78 -225 -143 232 -97 -327 207 97 -116 -124 135 -25 -90
4979 -90 -49 -94 -11 49 -39 73 93 -226 -186 268 89 -136 -49 197 -95 -302 224 155 -171 -156 81 116 -124 -70
5003 -70 113 -104 30 93 -16 -6 127 -112 50 153 -85 -95 444 -47 -167 128 56 -21 -137 204 134 -202
5025 -202 65 1 -157 51 -17 1 -12 -77 -103 55 -21 -134 -107 134 -114 -345 22 103 -215 -202 324 45 -48 -31
5049 -31 194 -108 -177 63 34 -132 -113 79 61 22 -70 50 186 -31 -189 218 113 -151 -105 178 167 -248 4
5072 4 136 -16 -204 142 -48 -20 41 82 -9 4 -29 -109 246 18 -85 144 211 -187 -211 121 -37 -178 -107 396
5096 396 -104 -194 139 194 -149 68 195 60 -35 51 3 7 -42 -89 130 -8 -139 -146 258 -12 -252 80 248 -93
5120 -93 -138 83 118 -264 -64 82 -82 -22 -81 82 -57 97 -111 12 74 -144 -238 103 58 -104 -84 52 -59
5143 -59 -208 244 57 -277 -79 108 -266 -201 79 12 68 39 -71 8 156 -56 -116 237 -10 -126 -5 310
5165 310 -80 -272 96 90 -91 95 203 -72 -248 109 127 -48 48 83 7 54 -49 -62 58 47 -228 -78 165
5188 165 -24 -276 69 157 -156 -112 271 63 -168 147 199 -162 -226 8 34 72 -206 -20 187 -135 -17 7
5210 7 249 14 -208 165 260 -135 -46 312 -103 -228 188 -89 -180 -37 70 38 -102 -68 40 -37 1 33 17 102
5234 102 0 -142 -26 115 -100 -101 182 -31 -207 7 191 -168 -31 77 -86 -57 103 71 -41 33 -77 -84
5256 -84 128 -97 -192 -5 166 -67 -125 191 133 -231 76 250 -125 -101 91 42 -148 -10 -4 -53 51 113 72 11
5280 11 -23 119 -3 129 -80 40 192 114 -81 -6 131 -95 -145 179 42 -138 70 54 -77 45 86 11 21
5303 21 -12 -40 -43 76 -56 75 116 23 -66 161 282 -148 -332 261 52 -90 -9 312 -34 -125 126 133 -163 -60
5327 -60 -2 151 233 -77 8 172 57 -245 99 175 -73 -193 136 226 -176 -51 258 -80 -119 54 -52 -43 13
5350 13 -6 -16 -6 -29 83 184 95 -58 43 174 -33 -85 117 231 -288 -70 176 77 -193 -18 -37 -127 -47 25
5374 25 29 -58 38 22 28 55 -77 66 155 81 -247 36 52 -276 -111 265 18 -272 286 148 -186 4 114 -102
5398 -102 -67 -65 59 -132 39 61 -49 75 93 -138 -69 205 -188 -95 166 -70 -235 132 131 -202 -56 45 -41
5421 -41 -158 -10 62 -14 -21 -27 150 39 -29 -12 -28 123 -111 -13 186 -83 -161 182 64 -60 21 188 73 -48
5445 -48 -55 90 -98 -10 102 83 -6 9 -40 3 61 -98 -22 163 28 -130 91 100 -84 -96 104 132 23 105 135 25
5471 25 20 108 32 124 84 -104 116 75 -167 1 208 84 -143 74 120 -217 -95 168 -43 -330 131 179 -191
5494 -191 -12 -56 37 33 11 -6 92 -5 -32 65 166 -112 -83 224 219 0 -174 39 12 40 55 178 -89 -59 166 -5
5520 -5 11 89 57 -2 103 -15 -5 122 96 -87 122 203 -31 -63 199 42 -263 24 52 20 -196 142 57 -97
5544 -97 81 227 13 -71 39 55 9 -1 -7 57 4 -79 -124 84 101 -139 18 172 31 25 168 96 -71 -90 -17 93
5570 93 -172 33 -51 3 100 -50 -103 149 -60 -113 127 30 -45 4 104 -14 -209 63 171 -72 -99 10 72 -157
5594 -157 84 156 130 -135 -3 57 150 23 -33 147 57 -106 -165 208 26 -33 91 91 -109 -64 169 27 -15 21
5618 21 29 -57 -10 113 -143 106 66 -121 -47 140 -47 -142 185 -5 -181 37 -63 -147 -111 248 128 -62 55
5641 55 -38 28 -137 1 -76 -48 -155 -40 137 -70 -71 -76 132 -71 -157 77 46 -88 15 145 -11 22 43 -10 -167
5666 -167 -135 84 8 -110 -107 107 64 68 -142 -20 47 -14 -142 40 24 -170 -67 189 93 -91 104 7 -165 -201
5690 -201 75 11 52 19 51 194 46 -41 41 150 75 -95 145 166 -114 24 54 6 -81 74 177 5 -72 185
5714 185 94 -141 91 34 -49 37 125 0 -117 -23 -82 108 53 -65 -37 205 90 -49 -29 63 -62 -148 46 69
5738 69 -69 52 165 -183 -14 -158 106 50 -113 -74 -79 93 -46 -142 101 107 35 57 133 140 2 182 20 -167
5762 -167 -71 153 61 -193 9 -19 66 -43 81 94 -56 -47 -61 118 87 -99 -41 31 -35 -86 -28 170 -152 -6 17
5787 17 31 -85 88 -63 -185 -47 53 84 5 46 48 -41 -31 -213 -10 105 -134 43 67 35 -75 -15 236 -68
5811 -68 -123 129 20 -35 -133 174 -70 -15 12 107 63 -93 -109 79 85 -70 -148 -133 -7 -151 -30 155 40 -257
5835 -257 -29 108 -102 -102 38 41 50 3 8 -35 -16 -25 -57 93 -43 -10 -69 94 -67 -53 54 53 -156 43 181 -29
5861 -29 10 159 -47 -139 107 29 70 -90 -80 45 93 16 -117 124 131 -72 -40 65 -41 -160 29 132 -107 -19
5885 -19 57 -25 -77 52 -55 -96 59 56 -104 -39 51 -20 -21 50 -66 -25 93 145 -167 -23 141 -145 -145 40 -47 -59
5911 -59 -5 92 -160 -153 48 78 -151 -81 -28 168 -27 -123 12 -76 -38 -68 33 150 -73 -95 161 -58 -220 54
5935 54 105 -128 -175 -26 -25 -29 -64 4 -7 -2 46 87 72 49 16 -8 -25 -86 -75 9 60 -13 113 266 -1 -106 186 92
5963 92 -83 21 83 -64 -122 -164 94 44 -27 0 16 150 -64 -100 140 87 -244 142 137 -31 -19 10 24 -140 77
5988 77 21 15 -14 62 -52 -48 -20 1 -22 66 -121 -167 0 20 -122 171 213 -66 -31 104 19 -74 -7 66 -119 -79 -15
6015 -15 32 -2 86 -103 -32 53 86 -53 124 15 -76 -146 71 -23 -203 156 159 -83 -100 56 -37 82 -14 176 -76
6040 -76 32 107 -45 21 -131 -147 57 -34 -8 70 51 85 -102 229 85 -213 26 106 -88 -44 51 -27 7 -46 -64
6065 -64 68 11 12 -27 177 138 -108 -136 40 108 -72 138 83 -160 -12 185 -40 -192 -97 126 -234 -18 -153
6088 -153 -57 14 35 -7 29 73 -5 -51 -15 58 -172 -22 7 -141 -112 129 4 -155 -13 126 -83 -8 38 -130 27
6113 27 19 -83 -88 107 -149 -111 -15 23 -154 -107 -15 -65 -113 74 -31 -35 28 107 -111 -101 94 186 -45 -14 8 -128 104
6140 104 -70 140 75 -10 -127 54 120 5 -98 136 8 -303 -11 91 -55 7 153 -82 70 55 142 -71
6162 -71 30 43 -58 31 -98 -11 -12 81 49 -101 -10 -103 -2 35 77 -15 -46 114 -60 -69 34 89 29 -2 -21 17 -109
6189 -109 65 -17 25 222 -14 -224 71 -104 -12 140 95 -18 -130 3 87 -325 -70 134 19 -74 -18 63 -78
6212 -78 44 24 -63 82 1 -16 -29 44 -53 -92 161 -15 -10 126 248 -162 52 37 -7 -130 46 106 51 46 137 58
6238 58 107 -53 -44 3 63 12 -126 210 -36 -142 -30 88 -93 -6 129 37 -85 25 55 -30 -91 207 -16 -59
6262 -59 45 40 -16 82 123 -62 181 9 73 -56 -65 -44 -157 90 -108 -160 17 -107 -128 -12 37 -85 -119 55 7
6287 7 -61 81 -152 12 123 -17 -38 137 6 -115 -113 45 -58 -32 158 56 -179 -43 236 -54 -65 -40 19
6310 19 -44 9 -111 -128 75 -39 41 17 123 -71 -50 69 38 -80 111 66 -118 -68 154 46 54 -102 85 22
6334 22 -44 38 110 -40 48 -14 -71 81 -42 -37 101 53 -39 4 124 -100 -113 16 -63 -15 36 73 136 -72 -54 46
6360 46 -116 -73 14 25 109 11 1 149 142 -49 71 109 -51 -106 140 64 -13 135 13 57 -39 96 -5 -91 -30 -3
6386 -3 27 57 20 -118 -23 -11 -174 -33 80 -158 -43 41 11 -179 -12 88 -114 -18 53 -22 -51 18 0 -39 60 125
6412 125 -161 61 76 -18 -84 129 161 6 123 64 -240 17 137 -157 77 67 3 -86 52 62 -56 4 -100
6435 -100 -26 25 86 25 -88 74 -21 -172 175 84 -98 -52 88 -100 -148 105 -47 -116 -32 78 -96 7 43 -27
6459 -27 66 -119 -80 -11 -39 36 -77 15 160 -149 107 123 -152 -25 75 -1 -177 -11 -80 -81 -92 -6 -126 -85 -49
6484 -49 -128 -51 3 59 -38 5 131 -7 -40 59 -35 -166 127 40 -145 -71 190 59 -106 -8 -8 16 76 16 21 -34 3
6511 3 9 143 238 -90 -72 122 4 -141 77 54 -41 -28 67 -24 -134 139 77 -180 -34 32 20 -39 30 -37 -70 170
6537 170 95 66 176 -214 -141 115 117 -69 -61 -26 89 -110 83 -64 -93 -113 178 -135 -77 -29 -25 -75 89 64 -36
6562 -36 85 -60 15 28 -69 -58 -65 -62 -143 -47 65 138 6 -26 44 31 -44 -102 65 -66 24 67 -88 -33 70 -71 -48
6589 -48 121 -111 68 109 28 -220 49 187 -114 -64 -73 23 14 -112 -10 -53 43 74 -28 3 28 6 12 -14 112 26
6615 26 178 80 5 32 75 -102 -69 144 1 -120 25 -49 -103 36 56 33 46 -45 -40 13 -36 -90 40 141 -28 -24
6641 -24 -44 96 -29 37 10 -143 -62 -38 138 -56 -82 48 -14 -296 1 -32 101 120 129 6 53 114 -84 -23 96
6666 96 -107 -34 30 -23 -86 -23 127 41 -48 107 15 68 164 104 -73 -19 -14 2 -44 77 13 -31 37 -58 -21 196 -27
6693 -27 -11 -105 54 -27 -63 -1 24 -74 44 32 -91 19 122 83 -1 127 -16 46 -73 -6 -148 102 110 -121 -70
6718 -70 211 -19 -138 -77 141 -87 96 134 4 23 28 64 -76 -14 -31 -22 65 8 9 104 33 -94 -101 -23 55 -53 -80
6745 -80 178 -55 -78 113 131 -13 -20 20 -29 -10 -58 -111 -24 7 -60 -76 40 -48 -81 48 6 -155 73 94 -49 -40 10
6772 10 21 -97 116 -39 -36 37 90 -29 -27 0 91 126 123 -16 34 116 114 -110 -121 182 -60 -81 104 -62 -85 -98 33
6799 33 -65 18 34 27 -29 115 -147 -144 -44 -32 67 -44 -40 -62 104 69 -105 -154 58 -12 -146 110 -22 -77 44 36 -12
6826 -12 -96 12 73 -1 26 7 48 64 -33 -42 -47 197 -154 -64 8 32 -131 93 116 -92 -18 151 5 -8 -24 66 21
6853 21 35 106 92 96 68 83 -163 57 -30 -58 -18 -20 -114 -62 1 67 86 -60 13 -37 61 98 -131 -30 -57 14 -31 -10 32
6882 32 34 40 -49 3 51 46 9 20 47 -67 -244 113 2 -71 -6 127 66 -34 -25 -103 39 98 -50 -39 142 -22 -137
6909 -137 -40 129 -105 9 2 45 -192 66 -16 -28 2 94 -113 -10 -52 63 -7 23 39 -17 8 34 21 77 62 -12
6935 -12 -45 38 17 -69 9 81 -33 90 -20 21 -52 138 -80 -104 -12 95 -106 48 15 -61 -54 38 15 127 36 -38
6961 -38 -185 172 268 -107 25 86 108 -128 -3 -25 -66 -104 -43 -134 -153 -21 12 24 124 173 17 -50 32 -149 24
6986 24 -121 -125 -97 107 64 60 95 135 -30 50 112 -16 -202 -24 6 -132 -89 124 -184 46 -26 -106 -9 145 -32
7011 -32 -57 -57 -16 -30 -44 130 -79 110 -35 -23 33 204 -8 -12 14 -59 -63 25 70 -3 88 108 -164 -31 -30 -71 37 47
7039 47 17 -107 -185 50 -21 -12 120 54 -106 72 130 6 11 53 92 25 188 88 -3 68 86 -85 -117 -2 -36 43
7065 43 104 77 -204 -37 120 111 -13 212 -43 -87 132 -10 -32 40 -66 -58 -11 24 -117 11 223 65 -44 66
7089 66 96 -112 -72 -4 27 -85 13 99 -166 -69 38 110 -38 -55 -103 69 -16 -81 -141 111 -48 -149 136 164 -33
7114 -33 -105 132 -52 -7 37 81 -4 -27 20 22 66 -38 -43 17 -1 -168 41 -118 30 -22 38 20 -33 -82 -6 24 -108
7141 -108 65 72 -64 32 -38 -83 -38 -14 53 -32 26 -58 46 85 49 -112 154 79 18 -135 -19 -36 -122 -66 -16 -76 -13
7168 -13 -2 -104 -108 18 15 39 24 -65 -129 -12 83 -23 -98 5 -116 -64 92 65 66 8 95 -61 -188 179 -29 -9
7194 -9 56 107 48 -67 -29 -6 -89 26 -47 -23 37 118 11 170 -49 -117 118 37 -39 -148 113 40 8 92 12 -6 53
7221 53 100 -33 -17 13 21 71 144 -3 -74 21 76 79 -56 61 53 48 2 15 17 -4 94 -19 -69 -31 -28 -105 100 -38 74
7250 74 7 -6 -76 132 88 -45 -92 159 37 16 120 12 6 -6 -7 52 59 49 -29 -183 14 9 176 84 74 6 23 -31
7278 -31 -97 2 -3 -110 -7 -97 -56 114 -164 109 11 19 156 -29 -83 -42 5 64 17 181 -53 -113 -86 -13 195 109
7304 109 0 30 81 -17 27 93 160 8 -24 69 49 44 -43 126 -16 13 20 27 -80 30 -4 149 -31 63 16 -22 78
7331 78 -56 -24 -15 -47 15 104 26 -8 -41 63 51 -139 -45 66 137 127 43 -111 220 -77 -157 73 -3 -105 -27 50
7357 50 -132 -63 -6 112 20 13 -16 4 -50 -4 -60 0 29 21 -65 -34 146 -64 104 93 -94 18 -19 42 -145 -35 -107
7384 -107 -39 -11 78 -167 91 156 25 -58 22 52 -15 -6 -17 -22 -124 -34 -20 -49 40 29 -124 71 80 44 72 57 42 -140
7412 -140 67 -47 41 18 31 -35 -9 -14 72 101 26 81 -2 49 -144 35 -99 68 -24 115 136 9 -39 173 175 -63
7438 -63 -49 161 -64 58 -113 -158 -26 -74 -112 -26 6 80 7 -120 105 -47 -40 -19 -28 -9 33 -15 10 -124 139 15
7464 15 -9 -41 58 -8 -44 52 -51 140 82 43 -51 96 5 -55 -8 87 16 89 161 -35 -18 75 -17 84 -76 55 23
7491 23 22 74 95 107 11 -18 64 -5 -33 37 98 96 1 9 146 53 23 59 -56 -114 109 24 2 -89 68 -18 170 1 2
7520 2 -54 53 -116 -74 -49 17 -52 -25 123 45 -45 16 21 -15 -43 77 27 13 25 -55 29 100 -82 29 -12 -118 21
7547 21 -28 109 -89 -6 91 76 -90 18 59 97 -53 32 -44 -100 -20 1 -143 3 26 54 -50 -27 -30 60 14 21 -67
7574 -67 91 -68 -130 58 -7 -36 113 143 23 -137 90 99 -68 59 22 6 72 -62 12 21 -56 -21 -5 91 -14 -42
7600 -42 -124 -44 -89 15 13 -8 29 15 -14 2 -122 69 -19 -74 -2 -48 67 93 50 27 45 98 -79 65 -110 -141 -55
7627 -55 118 2 -45 28 -14 70 -31 -163 18 -31 -91 104 -14 13 -30 -131 5 145 29 109 102 -32 -68 -124 -27
7652 -27 -82 -73 18 -128 -47 49 -102 -120 -26 51 19 -24 131 -98 -53 27 113 -87 20 -110 50 -19 -3 -30 236 -14
7678 -14 -22 -29 -91 32 2 -68 -60 15 1 44 22 39 -105 -28 -35 52 30 -67 16 -8 69 -83 56 -79 -105 108 -104 -61 -117
7707 -117 64 47 26 -8 55 -94 66 -4 22 22 -74 -40 14 -22 -27 44 127 9 -104 -27 43 -27 -47 19 -80 -100 -38 -8
7735 -8 -71 36 -86 -38 -74 136 -44 -129 23 56 32 11 2 26 81 193 -178 115 -90 -120 -126 107 -45 20 -15 34
7761 34 30 39 128 -152 -151 119 103 -20 57 -82 -149 -111 15 -133 7 -30 -60 -31 -66 18 62 -38 65 -91 -20 -24 -23 -7
7789 -7 -210 32 41 -46 89 -146 103 72 64 34 -139 35 -26 -13 176 -53 66 58 0 -163 -7 8 -85 -16 133 -116
7815 -116 11 -6 -143 21 53 -39 117 83 -13 -132 108 100 37 72 100 -32 19 -154 -45 -89 -63 -82 78 -101 48
7840 48 49 55 14 -19 244 151 49 -21 -21 23 -20 -78 22 61 -106 13 47 -78 6 -59 -23 16 28 34 25 -45 -86 1 -25 17
7870 17 6 4 92 -180 23 76 98 -132 51 59 -73 50 36 -21 -294 40 -39 55 68 116 -44 108 73 54 -48 -75
7896 -75 71 100 78 -66 -5 -90 -50 -54 23 53 -45 -48 108 -43 22 -128 -44 -81 42 158 31 10 36 135 5 -19 37
7923 37 -31 66 49 -50 -54 42 50 2 48 -42 -64 69 -15 31 -2 80 88 -52 3 31 -15 81 -70 -51 66 149 -20 -84 -25
7952 -25 32 75 65 0 -88 38 89 12 48 15 48 -38 -79 126 -69 38 99 48 103 -72 43 -6 35 -83 29 87
7978 87 45 -84 -67 -10 -16 108 -51 35 -22 -57 -97 -11 46 -70 -121 -123 -20 -150 -61 49 214 -15 25 -69 -62 22 -63
8005 -63 50 -74 87 162 50 -33 -78 -74 56 186 -152 28 -23 -40 2 119 -31 53 -32 72 39 -111 3 31
8029 31 -56 119 26 -25 47 39 -5 -37 -67 -115 -66 55 137 -7 54 -1 -81 -212 -51 -10 -50 -21 85 11 -19 63 12 -16
8057 -16 31 96 -76 118 10 -30 17 25 69 -18 0 -17 17 5 -45 -97 -94 151 -35 -84 87 -61 -18 -32 33 -24 -22 -2
8085 -2 -25 96 228 -73 -48 47 97 40 -40 68 -130 -68 11 -21 25 -132 -132 -58 93 86 -48 -9 -36 -43 37 -45 -73 51
8113 51 97 85 149 21 3 -2 -37 3 -36 81 38 -1 7 3 -129 -46 -96 -27 -96 73 -14 -89 56 19 9 -10 1 -18 -4
8142 -4 -77 103 51 -9 97 72 -123 86 14 27 26 126 -29 37 -5 -21 -20 -110 3 -56 -44 77 27 -22 92 137 -35
8169 -35 12 -102 -74 -28 5 53 2 -100 52 31 174 38 -28 -128 -39 21 -120 105 -129 42 -14 42
8191D2
$$ Imaginary data points
##PAGE= N=2
##DATA TABLE= (X++(I..I)), XYDATA
0 0 0 0 0 0 0 0 0 0 0 0 0 0 0 -8 8 -8 8 -8 16 -16 16 -24 24 -32 38 -40 48 -56 64 -74 86 -97 111 -124 140
35 140 -157 177 -196 220 -246 273 -302 336 -372 411 -452 499 -551 606 -669 736 -810 894 -988
54 -988 1093 -1212 1350 -1506 1693 -1914 2182 -2516 2947 -3524 4333 -5553 7593 -11619 22454
69 22454 -110660 -277375 67917 53020 -194381 -69460 109305 -56465 -112246 13205 -7998
80 -7998 -67762 -3759 -10084 -32906 17908 -7842 -61521 12765 27809 -48777 -6469 54631 -21852
93 -21852 -29298 49024 2624 -45260 37486 32156 -47698 6921 49579 -33615 -25019 45149 -13868
106 -13868 -51746 24970 7437 -61841 -3597 23332 -63091 -47003 24576 -37961 -78807 4535
118 4535 -1047 -87911 -47997 12015 -59057 -85871 -5013 -8918 -74809 -45823 -5999 -43163 -55358
131 -55358 -24205 -23199 -25105 -17136 -36810 -28789 9159 -21589 -50970 15848 31894 -43459 -25337
144 -25337 44937 -845 -42064 24188 35913 -17892 6648 33959 -6540 2407 32737 -6275
156 -6275 -3678 46307 5218 -30643 37168 33586 -43768 1234 56060 -24219 -40944 43615 10561
169 10561 -56691 4821 30523 -40370 -30071 19353 -16057 -34662 -1648 -13040 -24625 -4055
181 -4055 -23854 -29369 12393 -11826 -49473 8821 22315 -52477 -27055 44122 -14426 -52931
193 -52931 27991 29427 -43065 -6664 40714 -10484 -19412 28387 11199 -11350 19276 14216 -7660
206 -7660 20055 20804 -12806 12180 34106 -8762 -9228 35664 13688 -21319 13075 29133 -10128
219 -10128 -11644 18885 8911 -10810 -1962 5853 1702 -4303 -10402 -1119 9587 -9329 -19738 8569
233 8569 10541 -25188 -13730 23711 -2376 -31265 8473 23082 -21828 -17653 25782 6450 -24466
246 -24466 8319 23681 -10296 -6586 20766 5479 -5599 12798 8246 -1680 13986 9569 -6840
259 -6840 14405 21014 -11666 -1779 29872 697 -19564 19263 20163 -18470 -3663 21945 -2784
272 -2784 -13525 7813 3563 -6960 13 -5750 -5855 7592 -8455 -17962 12518 6055 -29670 -2622
286 -2622 24990 -19910 -26955 25951 8817 -35197 3566 28370 -17248 -17588 22728 6515 -16130
299 -16130 6819 12400 -2590 4801 6556 -1162 12258 10739 -9842 7533 24007 -5373 -9039
312 -9039 23495 12480 -14932 6396 20916 -3837 -5983 11582 4187 -3323 3056 -1352 -572 7275
326 7275 -5513 -10888 9861 4261 -21275 -4113 17519 -11440 -23106 12112 10465 -24824 -10894
339 -10894 18973 -3850 -24175 3742 14562 -12675 -13430 10779 5724 -11153 -2672 9274 2948
352 2948 -4671 -135 7329 5837 -3348 -1862 11900 7725 -8526 2601 17763 -1657 -11158 13106
366 13106 12559 -11659 -1342 16446 -1006 -9051 7356 3505 -6093 2817 -506 -7104 6873 2003
380 2003 -17056 1662 15060 -16866 -17389 20070 3053 -29317 3063 21188 -17602 -17960 16955
393 16955 4125 -18621 867 11188 -4938 -5267 3223 2011 3489 203 -3895 9233 9619 -9282
407 -9282 809 19391 -1375 -11639 16050 13851 -12693 1886 19882 -2669 -8440 12737 5802
420 5802 -7417 4530 6129 -4539 2193 4128 -7643 -365 7910 -9109 -9470 10790 -574 -18376
434 -18376 1124 11132 -13331 -14992 9458 3330 -17834 -6203 9941 -3403 -14294 -1523
446 -1523 7154 -2973 -10637 -333 8836 -1313 -10864 1975 12681 -3005 -11936 9083 14894
459 14894 -8880 -7804 16899 8334 -13452 2311 17756 -1689 -8499 11206 8784 -6543 1411
472 1411 7895 -1230 -72 4374 -1957 272 5602 -4081 -5036 7348 -421 -11460 3595 6727 -11677
487 -11677 -5352 9309 -4622 -11717 4237 2891 -9532 -2356 2889 -3996 -2009 -322 -4625 2752
501 2752 3191 -9885 20 13379 -6789 -12561 15041 9258 -18244 938 21600 -5748 -13930
514 -13930 14891 10785 -12033 -336 12731 39 -4406 3312 3281 2025 936 -3965 2090 7945
528 7945 -5324 -7888 9011 4376 -12430 -1594 10306 -4478 -10612 3951 4029 -7193 -4597 1916
542 1916 -44 -3317 -4358 -994 3235 -2618 -7664 2492 5790 -7230 -6375 9346 3390 -11591
556 -11591 1189 12825 -4284 -9844 9850 9219 -9675 -2617 14057 2112 -9993 4973 11290
569 11290 -3582 -4686 7494 5422 -3101 -710 3585 2790 539 -2404 15 6045 -16 -7643 2480
584 2480 7636 -6355 -6999 7344 2883 -9250 -1167 5838 -2975 -5237 643 221 -472 -1226 -4539
599 -4539 1650 5391 -6871 -6044 10181 2182 -13155 3442 13730 -8330 -9163 12956 4935 -11797
613 -11797 2265 11076 -3294 -4675 6140 3198 -1734 747 1282 2488 3307 -3081 -807 7684 -855
628 -855 -7903 5495 7042 -8741 -3617 9917 -1341 -9958 3886 5680 -6956 -3852 3995 -563
642 -563 -3525 -1206 -1260 383 28 -5082 -1874 5459 -1737 -8374 3298 6559 -7115 -5592 8165
657 8165 2955 -8902 -181 9426 -1093 -7710 3605 7470 -3408 -4753 5481 5636 -4146 -3043
671 -3043 6387 4034 -5119 -1713 7062 2538 -6305 -383 8157 -692 -7989 3022 7513 -5316 -6163
686 -6163 6508 3142 -8271 -1526 6068 -2750 -5619 2234 886 -3412 -554 -790 -2142 1583 -869
701 -869 -5568 2067 4574 -6937 -4207 8463 -17 -9842 3305 8102 -5643 -5374 6761 3284
715 3284 -5598 -1269 4448 1915 -2530 -2127 3711 4368 -4710 -3415 7979 2193 -9421 1424 10078
730 10078 -5155 -8382 8181 4478 -9972 -979 8056 -3121 -6509 3240 2334 -4002 -1681 692
744 692 -216 -338 -2232 -2019 2721 434 -5447 427 5207 -3100 -5034 4743 3544 -5470 -1365 6057
760 6057 690 -4299 1258 4755 189 -2224 1273 4393 979 -2721 1020 5412 490 -4102 2500
775 2500 6507 -1940 -4648 5025 5065 -5095 -2762 6644 1768 -6597 141 6085 -2466 -5536 2452
790 2452 2782 -3999 -2778 1736 329 -2899 -2264 168 786 -1941 -3796 1174 2741 -4616 -3678 4912
806 4912 727 -6999 903 6082 -3253 -4930 4394 2984 -4136 -757 3389 1023 -809 -844 1202 3867
822 3867 -597 -4170 3987 6125 -5188 -3632 9123 2512 -9235 1989 9744 -4138 -6663 6563
836 6563 4564 -6258 -2068 5399 669 -4021 -895 2730 1324 -3073 -2564 3325 2007 -5325 -1574
851 -1574 5329 -699 -5609 1906 4284 -3348 -2992 3573 1133 -2933 140 1900 349 -371 -212 710
867 710 1830 -161 -1359 2057 2771 -2186 -1402 4228 1078 -4034 1248 5095 -1896 -4067 3704 3450
883 3450 -4798 -2059 5251 476 -5339 484 4254 -1821 -4267 1246 2636 -2045 -3036 632 2013
898 2013 -1308 -3872 431 3487 -2474 -4805 2736 3536 -4721 -2966 4911 985 -5318 376 4353
913 4353 -1233 -2902 1378 2251 -152 -1556 -162 2961 1269 -3492 252 5544 -1174 -5291 4275
928 4275 5093 -5327 -2373 7019 368 -6205 2215 5118 -3016 -3009 3384 1787 -2361 -1035 1381 1451
944 1451 -1024 -2428 1509 3095 -2959 -3098 4350 2023 -5620 -403 5805 -1703 -5101 3101 3655 -3682
960 -3682 -2201 3257 1404 -2730 -773 1991 1048 -1340 -1644 1492 2503 -2005 -2661 3066 2267 -3824
976 -3824 -1644 4173 611 -4671 -5 4253 -1265 -4125 1488 3006 -2285 -3142 1716 1982 -2771 -2425
992 -2425 1971 1311 -2887 -1956 2529 1231 -4024 -1302 4040 -285 -4657 1223 4292 -3043 -3960 4202
1008 4202 2238 -4767 -359 4575 -839 -3330 1710 2264 -1299 -853 864 863 647 -941 -930 2629 1127
1025 1127 -3464 437 4504 -1539 -3743 3352 2798 -4006 -1383 4233 -7 -3332 661 2162 -496
1040 -496 -1679 -294 1856 788 -3036 -775 3746 -288 -5061 1528 4717 -3698 -3810 4827 1770
1055 1770 -5408 13 4453 -1501 -3469 1922 2028 -1810 -1129 982 919 -407 -1473 -263 2175 -499
1071 -499 -3023 1078 2929 -2504 -2731 3129 1517 -4029 -990 3576 -477 -3622 698 2627 -1046
1086 -1046 -2802 589 2166 -950 -2528 744 2575 -1032 -3032 1336 3023 -2237 -2868 3105 2673
1101 2673 -3722 -1500 4594 725 -4153 1001 4154 -1391 -2861 2501 2409 -2029 -1303 2483 1372 -1387
1117 -1387 -800 1697 1851 -1578 -1607 2715 1947 -3485 -487 4501 -538 -4294 2126 3583 -3258 -2090
1133 -2090 3797 702 -3245 480 2161 -761 -1216 172 504 569 -810 -1445 1673 1611 -2905 -1096 3870
1150 3870 -405 -4087 2018 3371 -3203 -2144 3573 746 -3176 213 2403 -366 -1450 40 1108
1165 1108 622 -1364 -1098 2072 1070 -2916 -399 3462 -763 -3538 1781 2642 -2737 -1915 2653 398
1181 398 -2599 -173 1618 -86 -1613 -354 983 471 -1596 -1056 1852 646 -2668 -418 3398 -457
1197 -457 -3548 1583 3466 -2473 -2844 3719 2121 -3653 -567 4095 104 -3384 1144 3526 -983
1212 -983 -2320 1604 2446 -1104 -1743 1344 2598 -875 -2168 1952 2344 -2240 -1948 3072 1315 -3409
1228 -3409 -335 3365 -932 -3159 1478 1891 -2042 -1196 1139 526 -1037 -1027 -104 981 -369 -2225
1244 -2225 569 2365 -1922 -2481 2759 1212 -3745 -321 3437 -1271 -2991 1855 1784 -2147 -749 1780
1260 1780 201 -970 -139 563 875 -471 -1484 1209 1913 -1786 -1618 2835 864 -3569 430 3465
1276 3465 -1469 -2741 2220 1953 -2336 -1228 2241 574 -1798 -685 1348 680 -1494 -1049 1679 1212
1292 1212 -2333 -978 2646 325 -3069 353 3054 -978 -2630 1962 2066 -1969 -1187 2215 821
1307 821 -1709 -184 1970 376 -1372 -143 1661 661 -1343 -144 2314 557 -2264 423 2831
1322 2831 -999 -2698 1827 2454 -2710 -1577 3027 437 -3338 229 2360 -1054 -2282 908 1089
1337 1089 -1165 -1187 200 722 -618 -1770 -144 1772 -958 -2570 1104 1906 -2378 -1580 2462 435
1353 435 -2841 222 2136 -525 -1466 728 1146 -104 -776 -112 1478 629 -1679 -11 2834 -207
1369 -207 -2654 1826 2716 -2116 -1449 2928 727 -2481 384 2436 -844 -1588 1161 949 -975 -697
1385 -697 408 570 -304 -1298 418 1394 -1120 -1924 1330 1341 -2422 -997 2763 -81 -3086 609 2557
1402 2557 -1462 -2210 1554 1733 -1713 -1178 1866 1161 -1468 -658 1645 1017 -1322 -652 2186 819 -1968
1419 -1968 -182 2527 153 -2432 796 2421 -1211 -1874 1600 1362 -1920 -849 1702 113 -1579
1434 -1579 -351 844 -224 -1125 -831 648 452 -1688 -1144 1628 79 -2511 -203 2128 -1238 -2428
1450 -2428 1492 1477 -2255 -828 2255 -7 -1626 370 1357 -255 -545 368 899 594 -655 -175 1846
1467 1846 543 -1748 530 2698 -876 -1888 2213 1894 -1898 -472 2371 371 -1683 365 1475
1482 1475 15 -907 -163 996 541 -1337 -580 1605 195 -2318 71 2215 -1194 -2366 1672 1414
1498 1414 -2441 -891 2151 11 -2045 398 1506 -604 -1150 481 871 -41 -861 319 1331 -222
1514 -222 -1493 833 1746 -1152 -1392 1907 1379 -2167 -398 2638 -74 -2287 841 1976 -1249 -1583
1530 -1583 1410 1009 -1549 -871 1196 253 -1167 -766 758 489 -1174 -1081 1164 602 -1837 -596 1682
1547 1682 -228 -2207 574 1718 -1202 -1197 1172 803 -1133 -509 851 509 -374 -505 456 1029 -499
1564 -499 -1254 1301 1580 -1667 -678 2585 424 -2324 914 2682 -1329 -1504 2183 1090 -1867 -68
1580 -68 1701 -48 -1068 195 898 182 -895 -573 1013 408 -1742 -359 1849 -688 -2330 899
1596 899 1677 -1895 -1425 1734 514 -1964 -312 1249 -291 -1230 -194 481 155 -848 -608 799 457
1613 457 -1461 -359 1719 -421 -1935 675 1851 -1346 -1241 1671 791 -1678 -238 1508 -48 -1205
1629 -1205 231 871 -158 -698 156 801 135 -870 -146 1122 -228 -1457 346 1295 -1017 -1389 1458
1646 1458 802 -1885 -295 1709 -319 -1650 633 1244 -853 -856 813 472 -515 -535 424 834 -206 -1103
1664 -1103 687 1454 -928 -1159 1783 1012 -1929 -177 2500 -138 -1801 1080 1696 -974 -769 1041
1680 1041 686 -702 -504 501 835 -392 -1031 726 1172 -1444 -1372 1714 523 -2362 -212 1981 -930
1697 -930 -2041 1186 1281 -1821 -768 1205 -65 -1274 -136 567 -19 -525 -590 424 671 -871 -852 1224
1715 1224 646 -1553 -64 1818 -242 -1407 923 1560 -1082 -855 1450 700 -942 -165 1125 371
1731 371 -662 -243 1068 449 -843 -421 1384 424 -1370 134 1594 -530 -1474 1119 1241 -1374 -788
1748 -788 1457 162 -1411 36 1018 -444 -773 299 247 65 -360 -252 458 644 -838 -321 1500 69
1766 69 -1411 528 1694 -919 -989 1908 730 -1702 145 1625 -130 -946 641 900 -390 -569 348
1783 348 717 15 -1220 194 1445 -602 -1447 1040 1124 -1720 -1086 1632 12 -2038 367 1403 -1094
1800 -1094 -1205 617 334 -876 -440 327 193 -168 -498 -70 863 -311 -931 864 989 -1125 -359 1554
1818 1554 384 -1466 499 1494 -426 -698 1137 813 -546 11 595 533 56 -314 320 1002 -333 -715
1836 -715 606 1075 -1127 -920 1501 198 -1874 6 1715 -832 -1671 874 1132 -1508 -946 1003
1852 1003 77 -1002 -420 578 201 -818 -568 820 310 -1057 -321 1341 169 -1415 422 1529 -649
1869 -649 -1169 1270 1046 -962 -117 1276 204 -588 191 494 127 -65 -269 317 750 -551 -737 1023
1887 1023 443 -1385 101 1379 -890 -1377 1045 760 -1806 -483 1246 -627 -1362 329 594 -888
1903 -888 -863 193 224 -416 -580 -119 619 -271 -943 509 1031 -847 -710 1310 599 -1196 115 1458
1921 1458 -188 -775 724 787 -328 -83 338 329 170 -135 -17 951 546 -1034 212 1338 -395 -1299
1939 -1299 1048 1083 -1516 -620 1330 -13 -1585 199 1007 -649 -1077 280 314 -513 -771 -63 355 -349
1957 -349 -922 290 793 -854 -1060 1057 664 -1346 -228 1470 -130 -1419 741 1220 -782 -582 1115
1974 1115 414 -878 58 676 197 -301 -190 492 631 -381 -664 760 511 -1142 -286 1293 -278 -1461
1992 -1461 600 1149 -1069 -875 831 245 -1002 -188 512 -36 -429 -380 198 338 -554 -720 773 508
2010 508 -1171 -345 1322 -40 -1313 721 1348 -1048 -525 1424 238 -948 435 997 -267 -155
2026 -155 527 208 -20 82 7 344 429 -474 -308 863 82 -906 451 887 -748 -717 856 269 -839
2045 -839 -11 597 -229 -677 -135 271 -87 -709 -550 496 64 -1135 -215 987 -530 -1380 661 1065
2063 1065 -1326 -892 1500 386 -1419 201 1393 -669 -748 679 574 -435 -111 632 312 61 -188
2080 -188 152 594 34 -538 340 801 -590 -515 1105 392 -1049 46 946 -232 -775 420 455 -568
2098 -568 -268 277 247 -52 -385 -142 545 -254 -859 371 859 -744 -947 1225 503 -1331 46 1383
2116 1383 -502 -1020 1029 904 -843 -152 878 150 -290 76 331 342 -140 -142 543 710 -566 -355 967
2135 967 310 -1211 308 1176 -639 -870 813 440 -934 -185 647 -329 -661 29 -36 -191 -177 -451 -33
2154 -33 275 -623 -714 677 255 -1200 4 1026 -456 -1116 782 721 -1037 -359 1078 274 -855 140
2172 140 782 -23 -409 186 714 207 -491 108 959 53 -626 443 1185 -524 -707 1190 520 -1011 159
2191 159 1112 -348 -774 451 455 -445 -127 226 -195 -274 -31 -305 188 59 -630 -191 673 -151 -1128 238
2211 238 750 -888 -693 871 57 -1094 179 747 -436 -555 278 516 22 -234 32 588 193 -527
2229 -527 382 1082 -233 -704 924 738 -924 -148 1334 -73 -1233 562 808 -755 -470 601 -17
2246 -17 -637 -28 36 -63 -235 -482 -110 290 -400 -857 345 419 -1065 -505 931 -44 -1368 368 841 -729
2266 -729 -462 583 301 -375 40 292 151 -27 -115 284 473 -151 -274 899 440 -497 -10 1172 -181
2285 -181 -987 889 881 -707 -324 984 194 -917 165 668 -309 -470 252 158 -318 -329 -423 172 142 -725
2305 -725 -291 709 -102 -1028 121 746 -793 -667 747 365 -777 -118 499 -146 -435 118 261 198 -298
2324 -298 -310 479 558 -536 -355 1025 222 -865 367 1104 -677 -852 1280 488 -938 172 968 -350
2342 -350 -617 375 298 -458 -344 184 113 -210 -430 -78 458 -239 -774 396 432 -928 -607 729 6 -1054
2362 -1054 185 813 -521 -528 489 250 -330 -63 209 150 187 -196 -97 681 214 -758 376 966 -320 -487
2382 -487 1010 491 -1061 64 1169 -102 -828 627 584 -665 -174 355 100 -238 -92 21 204 -112
2400 -112 -415 152 282 -626 -481 528 29 -952 17 702 -543 -630 448 244 -762 -104 261 -111 -324
2419 -324 97 25 -109 -48 -250 78 475 -326 -458 777 494 -826 43 1035 -299 -1015 697 695 -972 -376
2439 -376 1015 313 -727 146 540 -8 -403 -142 390 53 -525 -316 787 -3 -1103 179 974 -656
2457 -656 -841 846 400 -1115 -60 898 -183 -640 513 388 -355 -125 346 -82 44 -52 -154 249 289
2476 289 -368 -57 637 -227 -394 693 551 -621 -95 694 56 -595 239 458 -318 -291 49 174 79 -395
2496 -395 -386 436 37 -657 10 620 -449 -800 546 597 -965 -462 944 -226 -779 325 522 -653 -470
2515 -470 419 54 -338 19 216 199 -29 -251 -64 369 -98 -647 394 482 -628 -276 768 14 -567 164
2535 164 636 -198 -339 361 159 -260 -171 254 207 -54 -364 212 697 -284 -699 667 539 -954 -258 1088
2555 1088 -170 -1208 509 912 -773 -528 853 259 -831 40 569 -237 -375 164 209 -18 -149 -141 414
2574 414 273 -667 -26 588 -79 -733 402 540 -557 -222 670 118 -653 182 510 -180 -192 94 117 -9
2594 -9 -108 -286 215 296 -570 -242 674 16 -926 136 844 -671 -739 722 282 -884 -33 701 -153 -548
2614 -548 85 344 -231 -249 -13 360 170 -612 -3 628 18 -663 331 755 -581 -403 676 216 -656 243
2634 243 741 -211 -264 386 247 -236 139 72 2 61 -197 -44 470 42 -628 9 655 -356 -557 554 437
2655 437 -691 -4 672 -180 -569 411 358 -501 -230 304 151 -219 81 134 293 -75 -481 409 394 -586 -97
2676 -97 892 79 -768 191 726 -514 -559 676 310 -745 -111 404 -99 -153 69 -61 39 -18 -364 76
2696 76 559 -272 -722 575 203 -944 -214 801 -158 -933 274 695 -506 -510 472 299 -474 -160 288
2715 288 282 -230 -373 372 322 -459 -288 755 166 -839 89 987 -349 -642 725 478 -658 -95 888
2734 888 136 -542 243 354 -122 -65 297 298 -95 -65 -19 392 49 -377 -74 697 -217 -674 430 576 -563
2755 -563 -317 596 66 -605 -12 430 -262 -385 16 101 -78 -203 -257 300 360 -669 -177 550 -207 -735 431
2776 431 552 -764 -440 781 -5 -768 238 566 -414 -422 349 248 -413 4 163 127 77 -186 -39 429
2796 429 -40 -448 435 360 -538 -184 601 -37 -641 207 443 -349 -335 374 170 -270 -175 -100 24 -116 -383
2817 -383 -1 460 -239 -616 453 673 -578 -293 974 319 -906 84 958 -331 -668 641 569 -566
2835 -566 -131 458 221 -262 -170 425 186 -359 -107 289 230 -434 -139 499 -140 -814 234 544 -377 -424 505
2856 505 99 -524 -147 313 -56 -238 124 -5 51 -75 -382 19 264 -302 -450 546 181 -781 105 871
2876 871 -228 -685 611 480 -605 -140 806 -27 -514 104 340 -41 -206 -65 226 237 -487 -143 609
2895 609 208 -629 23 588 -452 -535 583 387 -682 -46 590 -123 -445 273 142 -339 -105 194 12
2914 12 -79 -138 -25 302 172 -501 142 573 -301 -510 438 545 -696 -254 723 -111 -468 245 448 -224 -74
2935 -74 390 327 -31 -68 249 342 4 -385 336 484 -419 -394 649 267 -786 -208 651 -202 -792 380 492
2956 492 -624 -335 333 1 -267 -42 -49 84 -3 -311 -81 437 -167 -574 215 357 -474 -430 461 138 -652
2977 -652 120 557 -194 -394 155 217 -101 -128 153 366 -61 -246 93 568 -299 -478 616 539 -621 -198
2997 -198 855 -114 -772 277 679 -538 -454 613 263 -573 -47 256 -137 -355 -131 12 -82 -9 -147 158
3017 158 117 -383 -270 557 -79 -584 287 575 -538 -365 577 187 -455 4 436 -156 -177 61 222 17
3037 17 -123 -84 298 80 -429 -44 632 -120 -689 355 594 -559 -246 622 -16 -658 109 463 -452 -485
3057 -485 225 218 -371 -121 193 -2 -196 -222 47 277 -153 -454 107 451 -439 -372 382 101 -597 -49 563
3078 563 -227 -256 230 168 -129 -20 -9 196 73 -222 -154 494 341 -488 147 566 -330 -684 562 554 -541
3099 -541 -156 796 -35 -587 301 518 -333 -223 390 267 -256 -257 97 269 -204 -340 306 490 -516 -362
3119 -362 652 152 -659 41 753 -358 -378 432 218 -552 19 318 -97 -318 169 141 77 144 -50 49 470
3140 470 -178 -523 500 157 -669 -148 624 -205 -675 235 442 -423 -351 360 200 -328 -141 158 -68 -234
3160 -234 -235 104 122 -334 -262 264 93 -622 -32 553 -221 -545 494 380 -550 3 694 -59 -381 328 435
3181 435 -64 -82 286 167 142 52 0 262 202 -343 -127 494 96 -510 261 475 -445 -364 591 188 -684 8
3203 8 589 -85 -318 113 167 -44 -277 -33 291 64 -403 -99 486 -166 -432 432 495 -630 -406 654 86
3224 86 -654 122 522 -282 -313 234 31 -221 29 104 103 -5 -178 165 308 71 -376 280 435 -315 -413 524
3246 524 128 -468 140 497 -281 -461 199 146 -286 -119 -115 -128 -29 -264 -112 149 43 -430 302 536 -341 -366
3268 -366 601 210 -567 -20 632 -242 -435 372 445 -265 -187 306 79 -220 -58 222 36 -188 -93 348 368
3289 368 -362 -242 493 203 -515 118 410 -320 -270 312 285 -505 -240 407 -15 -315 -20 159 -60 -183 -179
3310 -179 221 166 -524 -324 271 173 -630 74 618 -390 -776 448 262 -734 -318 569 -19 -480 245 370
3330 370 -201 -246 -23 210 -64 -125 -45 254 -56 -446 133 342 -236 -415 473 256 -399 -92 512 -65 -278
3351 -278 184 188 -47 -12 74 41 145 -48 -245 318 66 -433 -44 403 -19 -512 216 343 -386 -291 535 75
3373 75 -584 -23 447 -154 -305 -18 132 30 -247 3 211 19 -361 139 320 -194 -532 296 308 -527 -161
3394 -161 649 -67 -635 238 409 -242 -305 309 84 -239 46 201 43 69 -36 -99 301 -164 -434 280 259
3415 259 -454 -249 390 37 -590 235 445 -229 -331 301 195 -360 -148 112 -31 -325 -322 115 35 -241 -254
3436 -254 213 233 -413 -156 393 88 -536 364 606 -335 -301 463 245 -449 142 450 89 -132 31 48 89
3457 89 -80 -69 221 289 -192 -169 517 151 -528 44 434 -287 -319 344 332 -512 -154 409 67 -328 -83 199
3479 199 11 -114 -192 209 192 -263 -221 440 -96 -726 -24 388 -397 -451 429 62 -597 -33 494 -183 -385
3500 -385 82 300 -169 -88 97 186 11 -61 -8 209 202 -293 -69 442 -125 -322 316 240 -458 -200 445 -87
3522 -87 -370 245 172 -180 -230 49 -108 51 -50 -150 97 112 -386 -14 380 -260 -438 342 313 -389 -136 456
3544 456 27 -315 200 382 -156 -180 299 217 -121 103 50 96 58 -229 66 462 -96 -427 398 343 -385 -83
3566 -83 482 -64 -595 123 419 -272 -321 275 105 -222 -33 109 95 -8 -207 4 330 -325 -467 309 283
3587 283 -665 -207 518 25 -678 234 351 -345 -403 407 153 -430 -147 290 194 -285 -55 184 200 -186 -145
3608 -145 324 222 -280 -94 442 -49 -428 259 358 -281 -192 264 50 -215 32 308 -39 -152 33 33 112 16
3630 16 -236 135 185 -244 -149 429 -9 -386 72 408 -385 -267 407 47 -410 64 430 -30 -213 90 274
3651 274 -180 -106 -44 140 56 -218 -66 386 -44 -377 281 383 -344 -274 564 122 -363 -27 285 -242 -364
3672 -364 226 90 -85 -56 3 118 73 -282 -279 245 59 -407 86 292 -299 -406 319 166 -661 -46 468 -266
3694 -266 -443 276 293 -230 -147 125 184 -52 -183 -44 194 -68 -386 229 302 -270 -247 506 268 -465 28 584
3716 584 -171 -378 328 290 -275 -115 215 60 -144 94 -8 101 21 -265 35 260 -160 -363 392 114 -374
3737 -374 -156 283 -115 -307 177 386 -244 -236 372 14 -147 -190 58 3 33 -290 46 375 -188 -417 307 276
3759 276 -384 -112 662 122 -422 348 397 -325 -277 462 142 -318 39 333 -92 -244 54 152 -55 -126 -140 154
3781 154 51 -329 -65 479 -212 -430 240 123 -387 -195 334 9 -394 66 -4 -102 -131 -2 86 -41 -90 -57
3803 -57 117 155 -121 -19 373 -41 -292 288 342 -302 -187 417 45 -341 65 344 -71 -67 261 192 -59 -22
3825 -22 79 143 85 -268 -46 316 42 -402 174 329 -142 -350 310 113 -494 -27 289 -102 -361 118 149
3846 149 -64 -55 93 291 22 -137 -97 253 65 -347 -90 375 -180 -285 226 210 -310 -52 414 -29 -153
3867 -153 212 240 -138 -13 165 86 -14 -206 172 47 -21 -247 118 284 -356 -401 497 112 -462 94 330
3888 330 -191 -346 286 86 -399 -213 185 49 -165 -31 16 -73 -38 -12 184 93 -214 -72 316 79 -313 -85
3910 -85 565 -161 -341 316 301 -263 -79 247 189 -303 17 18 75 -24 -26 202 48 -142 -165 242 193 -364 2 468
3934 468 -200 -260 290 221 -488 -181 235 16 -288 198 107 -102 -115 71 -20 -110 -46 -148 212 37 -345 -88
3956 -88 436 -119 -407 286 285 -515 -114 423 158 -278 9 243 -169 -153 -26 167 4 -64 -47 162 63 -337
3978 -337 84 353 -70 -275 210 257 -321 -338 470 67 -396 110 173 -119 -195 13 93 -29 -13 -88 61 59 -206
4001 -206 -29 295 -47 -287 171 312 -392 -191 496 50 -368 187 263 -224 -155 162 131 -180 -3 79 164 0
4023 0 -64 -4 136 9 -334 126 226 -341 -255 438 117 -453 -16 272 -266 -255 253 273 -264 -168 172 -90 -192
4046 -192 -88 58 74 -137 -79 72 293 -367 -129 445 -90 -380 318 437 -245 -257 364 171 -285 -36 356
4067 356 -105 -152 105 168 48 49 -163 128 141 -83 -177 331 124 -414 30 385 -268 -254 363 176 -261 -43
4089 -43 264 -5 -166 20 213 -19 -105 45 -21 -9 -68 -223 195 97 -353 -3 404 -124 -254 181 274 -378
4111 -378 48 253 -172 -213 78 32 -144 -34 -10 93 79 74 -104 203 66 -311 -3 291 -61 -386 159 167 -327
4134 -327 -138 418 -7 -352 148 266 -211 -257 82 -18 -164 -250 8 85 63 -288 47 325 55 -362 138
4155 138 284 -279 -202 419 -55 -302 44 313 -144 -191 317 95 -119 -74 123 93 -27 -56 110 193 -142 -219
4177 -219 322 192 -333 -120 378 -159 -287 125 137 -243 -168 279 -20 -149 -29 174 -50 -66 -87 -54 183 44
4199 44 -180 55 175 -300 -261 312 47 -329 200 204 -206 -289 263 149 -336 -29 307 -46 -155 43 75 80 -106
4222 -106 -138 135 119 -362 -181 391 51 -329 -41 360 -260 -357 386 78 -277 -66 110 -40 -173 -106 -2
4243 -2 75 -146 -113 75 268 -154 -233 260 9 -413 102 436 -167 -253 216 248 -300 39 292 -219 -307 149 68
4266 68 -91 93 156 53 -33 -142 -146 182 -38 -252 106 250 -227 -140 271 216 -353 -166 314 -189 -274 212 61
4289 61 -275 -212 76 -97 150 -77 -9 66 -52 -300 132 201 -343 -292 250 173 -306 20 289 -131 -302 139
4311 139 144 -62 -246 92 122 -25 -77 -62 38 132 -149 -3 308 -68 -405 322 108 -408 -1 407 -52 -435
4333 -435 177 265 -157 -163 260 148 -171 63 -42 141 -145 -139 123 211 -133 -232 226 168 -276 -46 332 -58 -360
4356 -360 270 209 -216 -126 237 59 -94 -6 167 89 -22 -44 26 55 84 -247 175 179 -407 -98 339 -40 -240
4379 -240 162 198 -266 -129 201 -37 -348 69 -59 -43 16 90 -16 -39 35 -18 105 75 -273 -91 140 9 -243
4402 -243 104 183 -244 -130 138 45 -277 -48 116 -41 -57 132 -94 -20 -3 55 19 213 -237 -231 326 106 -173
4425 -173 113 204 -102 -261 370 27 -361 125 325 -43 -197 159 149 -78 33 68 61 41 -87 83 274 -55
4447 -55 -297 94 160 -174 -164 272 55 -377 -44 344 -96 -148 280 138 -224 -81 57 -3 -48 60 -94 25
4469 25 48 -139 25 372 -100 -201 349 104 -205 6 365 -65 -301 155 68 -79 -76 153 53 -136 -49 158
4491 158 4 -72 -255 48 213 -85 -132 330 135 -353 -46 349 -320 -250 281 178 -240 -127 161 -130 -125 80
4513 80 -25 90 60 -86 86 84 -48 -163 145 -3 -231 -58 314 29 -206 263 282 -133 -158 176 62 -340
4535 -340 -1 68 -2 21 50 101 158 -227 -191 159 28 -257 -32 172 -173 -223 277 145 -339 -244 245 -15 -226
4558 -226 181 -32 -187 -164 71 -49 79 -90 42 22 -11 -281 -46 305 -214 -223 98 126 -193 -260 348 -69
4580 -69 -313 85 150 -84 -152 -37 162 -37 12 54 109 87 -160 -118 193 -10 -304 99 268 -202 -146 362 -73
4603 -73 -370 64 302 -54 -165 3 37 9 -2 -30 83 -31 -134 67 202 -90 -65 136 320 -173 -105 299
4625 299 57 -275 67 232 -76 -124 184 59 -192 93 211 108 19 -1 -60 73 141 -134 16 217 -179 -297
4647 -297 191 24 -284 36 200 -89 -247 134 -1 -373 -120 129 -21 -112 -44 -39 -74 -40 10 -3 -10 -95 -98 199
4671 199 -78 -333 -13 359 -28 -320 172 127 -138 -5 186 -68 -55 126 20 26 73 -15 -63 93 -82 -110 138
4694 138 183 -196 -88 213 23 -254 184 178 -220 -164 342 -5 -130 -107 177 79 -140 19 156 -19 -189 -193 79
4717 79 139 -309 -63 314 -37 -243 160 231 -288 -104 179 92 -276 136 123 -22 -59 -19 98 -95 -26 -142 134
4740 134 64 -179 -52 179 -178 -211 197 102 -185 -103 188 -83 -210 41 18 -89 -120 104 -43 8 -49 -140 82
4763 82 158 -156 53 144 -54 -197 246 267 -152 -14 214 89 -274 102 198 -140 -117 152 42 -207 -31 -6
4785 -6 136 35 0 39 151 -71 -97 87 185 -201 -168 238 -89 -230 -30 217 -127 -26 234 128 -138 -61 66
4808 66 37 -15 47 -15 135 23 -204 154 165 -123 -120 257 61 -367 119 229 -240 -173 228 93 -330 -95 248
4831 248 -27 -217 91 -14 -132 -47 85 166 63 -68 -89 69 -27 -151 -60 227 -188 -101 192 126 -272 56
4853 56 155 4 13 75 23 -2 78 -76 56 51 -25 -5 323 140 -258 -26 418 -117 -228 252 181 -300 -24 208
4877 208 -4 -48 116 71 4 -39 138 -36 -74 -103 33 102 96 -214 147 327 -132 -158 161 71 -288 -107 179 -56
4901 -56 -215 63 261 -114 -163 202 53 162 25 -61 109 -37 -175 192 103 -203 -124 188 96 -261 -119 268
4923 268 23 -177 22 150 -92 -173 44 8 -39 -81 83 86 -95 -12 -57 92 -303 -93 213 83 -337 -62 244
4946 244 -97 -247 316 126 -256 80 216 62 -65 91 -22 -26 35 22 23 60 -19 -146 113 15 -136 -41 240
4969 240 -15 -234 87 78 -92 -20 77 189 -15 -32 121 -59 55 -104 -1 67 -122 -177 141 91 -219 -129 380
4992 380 -48 -282 174 330 -307 -117 245 126 -223 -19 284 -156 124 103 -17 57 0 -97 6 97 -67 -94
5014 -94 94 32 -372 -55 249 -187 -93 139 114 -261 13 239 -53 -123 156 19 72 6 -138 4 76 -96 -68
5037 -68 216 84 -54 153 129 -172 -141 373 146 -131 77 287 -32 -217 156 105 -147 48 216 -59 -48 -7
5059 -7 122 31 49 -95 166 197 -139 -133 297 161 -194 -95 303 -94 -118 73 24 -53 -115 69 64 48 -3 -98 120 112
5085 112 -146 6 224 -211 -289 133 191 -287 -26 168 -134 -264 90 216 -201 -90 182 58 -89 138 166
5106 166 1 -180 -132 168 50 -98 -76 10 71 -193 -37 154 -134 -302 61 107 -187 46 164 -116 -93 42
5128 42 26 -64 -19 -62 130 16 24 -143 17 213 -127 -44 236 2 -121 126 291 -115 -58 185 143 -82 93
5151 93 83 20 86 -103 -26 11 32 -58 139 -34 -91 -112 220 -11 -110 94 177 -208 -195 192 143 -227 38 66 -173
5176 -173 -22 -12 53 112 -34 -55 59 82 -138 -61 34 -108 -169 137 174 -193 -173 194 87 -334 74 231 -42
5199 -42 -249 114 18 -51 28 -25 37 33 -130 -21 238 163 -72 76 223 -240 -120 79 127 -185 12 104 -27 -86
5223 -86 139 5 -63 54 225 54 -179 145 -10 41 96 -62 -100 166 -15 -157 145 16 -133 113 66 -49
5245 -49 -22 112 9 -127 73 20 115 -69 125 -10 37 128 -73 51 197 -126 -194 72 78 -206 -36 224 6
5268 6 -314 148 61 -241 -80 248 -52 -121 82 -155 -119 -142 -100 -16 198 -164 -35 79 190 -169 -16 135 -263
5291 -263 -164 188 171 -159 76 117 4 -86 85 42 37 104 36 -61 23 -2 -27 185 63 -151 102 322 6 -183
5315 -183 152 26 -92 -82 167 -76 -127 62 106 6 -76 -10 53 156 -93 70 174 1 -137 -66 217 -57
5337 -57 -135 95 140 -165 -123 246 3 -196 13 79 -81 -35 130 -66 101 19 26 146 61 -200 -10 91 -84
5360 -84 -180 163 140 -79 -42 215 90 -76 149 177 -144 -12 117 104 11 -123 101 45 -49 -66 7 16 32 -144 -4
5385 -4 168 -115 -77 255 -16 -233 225 178 -12 -8 77 -154 -106 -3 -37 -99 -142 57 -125 119 109 -136 -105 160
5409 160 -116 -152 192 164 -22 -56 169 -44 -89 247 93 4 50 129 34 -60 101 -36 46 30 -32 87 56 -227
5433 -227 37 304 -86 -122 -42 239 -144 -98 78 165 -164 -19 195 -102 -63 -43 7 -102 -12 10 44 170 -118
5456 -118 -54 168 12 -193 3 161 0 -105 129 172 -259 -149 233 61 -169 115 38 145 96 -10 36 55
5478 55 -66 114 192 -3 -223 27 132 -61 -66 184 23 -250 -58 248 9 -9 108 50 12 -100 -39 38 33 -40
5502 -40 8 29 -18 -168 133 237 -221 -244 134 -5 -143 115 95 -79 36 30 110 -186 14 154 13 46 11 -16
5526 -16 59 34 -17 -53 80 25 -91 312 43 -139 -163 159 5 -297 36 -47 -257 -99 73 16 -127 -63 50
5549 50 -20 44 -139 -112 -15 8 -161 309 7 -60 -129 43 -84 -213 83 16 -68 24 157 -55 -96 -78 12 -41 -36 -97
5575 -97 -7 90 14 31 31 93 0 -18 372 42 -238 33 210 -138 -78 125 25 -146 -71 185 -58 67 125 -33
5599 -33 -40 1 -8 -35 30 53 -8 119 -34 -187 61 35 -133 -143 69 103 -140 172 -41 -52 -8 86 -139 55 -36 -67
5625 -67 -48 48 -94 -165 124 -34 -291 -58 47 -159 -140 153 56 -228 32 7 -153 -9 13 18 -194 -121 -36 -137
5649 -137 -98 -77 -27 -6 -87 -69 115 137 -206 -18 126 58 -291 -16 218 -220 -6 136 125 -125 176 8 98
5672 98 -30 32 -48 156 -56 -26 50 112 -128 -190 270 -73 -253 53 90 -93 -68 127 99 -117 -72 83 -46 19
5696 19 16 -44 40 -15 14 69 98 -61 28 164 -35 -58 33 213 -59 -254 79 77 -110 -146 184 -71 -119 -37 -54 -50 33
5723 33 -141 -15 33 -2 -114 126 -14 -173 -114 152 -138 -173 145 2 -113 -49 1 -23 -31 -92 -72 2 70 -14 64
5748 64 56 32 -48 270 207 -143 -116 93 -41 -128 30 91 -192 -60 45 -84 -109 -23 85 -71 62 38 27 56 -139
5773 -139 -13 -30 159 -50 -68 64 -117 -128 20 63 -44 -13 119 -17 -211 -5 152 -47 -98 119 -16 -156
5795 -156 64 -28 124 -24 -202 0 127 -62 -30 56 -2 -109 -50 117 -44 -136 -37 86 -98 -117 73 140 -89
5818 -89 -3 -48 -85 -15 -87 61 60 -18 -60 130 36 -106 -61 125 75 -228 92 108 -66 99 234 -29 0 -13 0 17
5844 17 147 82 -7 144 101 35 -17 217 -28 -145 149 -39 -157 17 191 -62 8 100 175 -114 -3 34 -89
5867 -89 -31 -130 231 165 -70 -144 193 -1 -110 -60 160 92 -132 -92 103 -19 -89 79 184 -14 18 50 -17 -12 -28
5892 -28 -116 -37 -52 58 -100 18 -106 -68 72 72 -32 51 35 -77 -145 -13 79 -240 36 134 25 -55 46 15 24
5917 24 -50 22 -26 -50 -82 -69 190 -34 -105 59 132 -132 -161 131 29 -264 46 98 -8 -268 -77 113 -143 105
5941 105 127 0 57 -86 134 48 71 -250 -71 147 19 -144 139 131 -84 39 159 -14 -8 -44 -90 -29 -57 175
5965 175 -39 -63 7 39 13 -38 -152 -81 159 91 -125 28 124 -144 -46 31 -32 -75 136 29 -123 -67 175 -32
5989 -32 -141 16 -25 103 72 -68 -23 74 33 -115 178 133 -100 -132 93 -20 -52 107 21 -159 6 116 89 -49
6013 -49 74 99 81 -6 6 -163 6 -82 -264 87 -41 -67 -89 201 64 -245 57 193 -81 -152 159 -111 -63
6036 -63 61 159 -79 -75 49 81 25 82 35 89 158 -150 47 -48 -166 -239 57 27 -60 -79 189 113 -70 -86 153 3
6062 3 14 52 -84 24 -49 49 88 -11 -34 -139 60 -13 -50 61 87 -163 -111 147 49 -117 17 -12 -89 -165 -40 -11
6088 -11 -181 44 40 0 -175 22 13 7 -17 42 72 71 -143 -65 86 32 -48 41 12 -2 -60 -20 -1 -95 36 -50 2 13 -56
6117 -56 35 179 -45 -66 52 191 -25 -92 76 176 -130 -18 159 -100 -55 -42 72 -105 13 119 12 -36
6139 -36 14 -79 -22 15 3 -30 76 -109 -77 90 2 -111 71 45 86 -100 171 153 -76 54 61 -112 -76 21 160
6164 160 -64 -31 19 34 155 -62 4 191 -47 -116 74 73 -57 -173 110 134 8 51 173 -133 31 -26 33 -25
6188 -25 -125 -46 44 -7 12 -53 161 92 -204 -95 78 17 -186 98 77 -102 -128 61 -52 -84 -22 63 -11 -39 11
6213 11 -2 65 150 -22 27 -63 -227 18 134 -17 -124 -39 152 -134 -187 39 55 -29 49 -66 -48 56 -109 128
6237 128 55 -37 -89 -64 -34 -137 -107 -11 92 -177 -32 -35 26 -33 155 86 -112 -30 149 -205 36 67 -26 57 32 155
6263 155 -11 -31 100 17 44 21 -117 -20 -2 -30 -142 87 25 -77 75 31 -66 -213 122 -65 3 -92 -2 -46 80
6288 80 31 -53 106 50 -112 -37 -56 -132 -116 -36 87 -52 26 14 -68 -91 107 -35 -51 44 45 5 19 122 -104 165
6314 165 57 -30 -14 -8 -12 -74 185 148 -13 -79 108 -162 -44 43 3 -140 31 20 -104 -138 3 -48 100 -10 -50
6339 -50 12 91 -31 -96 -8 59 -104 87 251 -32 -111 54 -17 -259 -33 114 -9 -84 80 49 -112 15 104 28
6363 28 140 -172 -9 147 37 1 1 97 -21 -90 92 45 -169 23 41 -154 -38 162 -24 -213 -5 73 14
6386 14 -5 57 27 74 19 46 -103 81 -53 -78 21 47 -43 -27 53 -149 -82 -5 94 -138 -168 78 16 33 -43 78 134
6413 134 -28 79 62 93 -40 -146 136 -20 -124 104 43 63 -146 35 -6 -127 -163 113 -8 3 42 -67 39
6436 39 -13 -22 99 49 -17 -133 -32 48 -94 -143 100 -88 -169 197 1 -117 52 226 -16 -30 36 69 159 -35
6460 -35 15 -102 -20 91 -124 155 -127 -96 -26 41 87 -136 -7 9 -140 -102 30 6 -97 92 167 35 -161 -22
6484 -22 70 4 111 -60 89 87 -174 -118 140 -37 -140 -17 179 72 -12 87 7 5 37 55 86 171 12 -74 113
6509 113 37 21 73 30 172 -102 62 88 -97 143 -28 -100 -161 75 75 43 -53 63 -102 -48 212 6 -64 -60 45
6534 45 -22 -5 82 -128 62 -77 -52 64 3 -127 -7 26 33 -9 73 121 -69 -46 -2 -17 -191 150 -67 -87 15
6559 15 100 21 -33 -58 -61 -156 63 -73 106 69 11 -95 -2 104 58 -187 176 59 -22 -27 7 35 -56 64 -35 -80 28
6586 28 -208 21 7 -99 78 67 22 13 -35 -56 189 -100 137 -90 28 -20 71 -79 -11 0 -71 -47 6 54 113 -43
6612 -43 7 -168 131 51 41 -32 134 -38 -27 -10 78 -247 -160 -3 -34 -150 47 91 -69 159 15 46 -19 88
6636 88 -77 158 70 -5 -84 83 -26 -87 31 106 -124 -58 163 -60 -33 -21 4 -177 -38 51 34 102 103 -99 -34
6661 -34 71 49 -55 187 2 -23 19 -17 -63 94 118 -117 -123 56 -50 185 95 76 -34 169 129 9 -80 5 -54
6686 -54 145 81 -1 -62 25 -11 -89 -11 157 79 -244 116 25 -174 -71 158 -148 14 23 140 137 -65 -35 81 148
6711 148 99 -20 70 36 -107 30 70 -34 -64 40 151 -52 -46 122 52 35 46 22 -126 46 -111 -1 97 -11
6735 -11 84 64 106 2 -28 57 -20 -17 99 116 -193 -45 25 6 -89 138 -15 -55 49 54 95 200 226 -89 23 97
6761 97 -80 -37 37 11 84 -92 141 -81 -93 1 41 112 -115 29 -30 -20 150 30 48 77 -21 -45 17 -96 -153 -17
6787 -17 -27 -81 -231 10 -84 -160 136 82 -41 27 10 129 -77 66 -85 -14 -53 10 -99 165 50 42 2 37 -111
6812 -111 -94 172 -26 -150 74 141 -102 -133 197 28 -43 202 -59 -9 22 76 -34 52 77 -23 -53 1 -5 -53 200
6837 200 -56 -22 69 47 -20 42 233 89 -80 113 114 -46 -20 1 9 -41 7 94 13 6 31 70 86 -7 23 28 115 -57
6865 -57 -104 109 26 -16 162 139 -134 -72 19 14 137 57 16 -41 -99 -93 -42 -4 1 -47 56 99 30 -102 10 -10 -142 -44
6893 -44 -50 -17 -37 150 -139 -126 16 14 -150 -16 151 -80 18 9 74 -49 19 -37 -107 121 27 -7 27 113 -24 -153
6919 -153 21 12 -5 -26 22 -96 -88 -44 -66 98 64 6 19 42 -38 -118 187 7 -62 39 -53 -92 121 -33 -49 39 -11
6946 -11 31 -29 103 7 102 -49 9 75 89 27 43 -42 -23 -96 -94 22 23 -19 -44 -34 -4 -65 -54 5 -110 -16 68 -17 -71
6975 -71 -38 125 -22 -44 63 43 2 -20 -175 -202 14 -197 11 70 48 -65 20 112 -84 63 60 -88 -165 75 -7
7000 -7 -70 2 16 -55 68 143 29 129 135 6 -41 94 72 -28 -19 162 -13 45 110 -54 198 -83 16 -139 1
7025 1 140 4 -58 -133 -96 -115 -45 -49 -97 37 -11 -129 4 -7 -73 -131 59 -68 -47 20 96 -147 -51 22 142 14
7051 14 68 156 -58 -26 -72 43 19 75 1 24 98 -13 -74 60 -117 -57 -35 130 79 -121 79 -50 -11 131 87
7076 87 -64 -27 -56 2 32 33 -223 -19 105 -12 32 -29 -6 -55 -12 188 74 17 154 95 -116 -58 -48 -120 -111 60
7102 60 98 -58 19 -118 -22 -83 7 -50 29 70 58 -118 43 -14 -112 140 -40 20 -111 -63 -107 -54 22 43 -86 -29
7128 -29 -113 -3 -51 11 -92 -46 77 -89 20 14 116 -44 107 -24 -17 77 18 70 -17 54 -38 -138 -5 39 76 52
7154 52 20 -180 19 38 -60 -78 38 20 -80 -30 73 -118 -136 135 83 -84 -66 169 39 -140 -3 109 1
7177 1 17 -71 -56 -21 -19 26 -74 36 -5 17 80 6 -35 -41 -88 -72 -53 -28 -13 43 0 -55 -9 4 -75 84 0 -5 41 23 76
7208 76 -42 145 90 -43 -26 35 -25 -12 21 35 -7 -55 -52 29 93 1 62 31 70 3 -101 16 -6 -60 -25 25 -64 46
7236 46 84 -62 -69 27 76 51 -86 -11 157 -36 -28 56 -80 -43 -93 40 53 21 -9 -14 26 -27 -103 20 48 -92 38
7263 38 -23 -55 27 30 2 -77 98 -41 -97 100 -19 42 -104 -46 -18 23 16 -95 -9 113 -28 -42 -84 71 63 60 23 46
7291 46 -97 -81 25 37 84 89 9 -102 118 -70 -23 25 33 -93 56 15 -101 -52 123 -48 1 18 -10 -102 13 118
7317 118 99 17 150 58 -115 190 -35 -135 105 -8 -5 -38 37 -11 -113 61 42 -34 68 -52 0 -29 78 53
7341 53 -36 153 -120 -61 95 -66 -62 0 -104 -40 -40 12 -66 -56 37 -5 -97 53 30 -56 -20 -51 -51 1 -82 -35 108 48
7369 48 87 -91 -21 9 51 -79 152 82 -87 -66 -5 64 -2 2 -70 -16 13 5 -19 1 28 -92 -89 -65 -33 -41 26 163 -63
7398 -63 67 -10 58 22 71 -44 49 -16 -32 48 187 -66 -25 -2 -77 -17 -95 195 -63 -80 53 59 33 -26 167 -23
7424 -23 86 -131 -53 -9 -29 -62 100 203 169 2 136 30 -98 -50 21 13 -121 -20 66 9 -93 -55 -60 -51 44 -100
7450 -100 105 119 -46 83 -15 -36 -93 -107 147 59 -12 40 -52 -83 17 -87 -12 61 21 -30 -88 11 49 -10 84 -5 110
7477 110 -16 -146 -35 16 92 -66 104 60 46 -160 -13 -15 41 17 64 10 70 -18 1 21 23 -58 17 -13 16 -32 -7
7504 -7 -18 56 55 41 13 -53 22 56 23 -123 -91 -81 -42 -88 -55 -120 -43 -50 64 42 78 -68 -107 -81 12 -49 97 67 -102
7533 -102 74 -3 -37 -72 6 -90 -28 17 35 -64 -13 -20 14 -199 -47 78 259 -8 -24 -104 -12 53 30 40 88 70 -71
7560 -71 -36 -9 -23 -40 -48 75 -42 154 -38 130 -68 -5 38 -5 -40 -45 -1 -7 58 -138 -28 59 -3 -41 48 -87 54
7587 54 146 62 -49 25 16 61 -93 -106 -43 31 -36 -69 51 113 -86 70 129 -42 -77 109 -18 -87 -53 93 -28 -10
7613 -10 99 5 25 55 -47 -89 153 -89 30 15 -56 2 -71 8 10 1 29 -149 -94 26 -39 19 -41 95 -9 12 84
7640 84 39 -85 96 66 -99 36 -17 148 -133 -84 2 -32 -85 7 0 -124 -111 42 -89 57 -36 -83 -31 187 -75
7665 -75 -103 75 58 5 118 -41 42 53 34 -101 26 -48 -113 108 -6 15 35 -37 125 -25 -32 -66 -25 -43 14 57
7691 57 18 -32 -43 31 112 153 -46 -2 -35 -64 -234 180 114 -6 30 -44 -83 -77 109 -59 -63 33 -6 -18 52 140 41 -182
7719 -182 129 57 -13 -43 -5 -137 43 -20 -116 49 84 -4 -94 -30 -26 -148 188 16 -80 114 -138 6 -44 -27 34
7744 34 -41 15 -39 -33 64 98 -119 -18 133 -107 -134 53 -9 -80 -146 8 79 -83 128 -9 -47 44 63 76 87 -51
7770 -51 23 -7 123 -88 19 42 -84 -20 -72 -36 65 -59 79 49 10 -1 12 80 -104 -2 -6 73 35 37 -34 0 -139
7797 -139 -80 43 -31 -115 99 14 82 163 38 -15 40 -80 -19 -55 -55 21 -58 -63 122 103 37 29 57 -61 30 28 51 66 48
7826 48 -149 -107 69 10 -61 55 76 -40 119 79 5 14 -28 44 26 28 -69 92 -9 -3 -111 53 27 -40 2 -55 -70
7853 -70 86 110 -36 13 -81 -48 57 -53 59 -6 15 33 -101 -67 121 52 105 -11 -7 65 64 -34 62 47 -56 -70 -114
7880 -114 20 132 -164 -122 -5 -47 -30 -35 61 24 91 -31 -69 108 -94 -2 -185 61 74 26 13 28 -89 100 67
7905 67 -3 49 5 -56 8 -50 65 -53 -90 19 -16 95 73 0 57 48 -56 -114 61 47 -53 50 -25 -9 49 156
7931 156 -1 -23 66 95 -35 -23 79 -6 94 -23 -41 -37 22 105 3 17 -69 -192 -47 -63 -64 -132 57 -7 16 -57
7957 -57 -99 -3 96 79 33 101 76 -53 -82 15 102 -56 -74 24 127 -27 -68 32 -38 -28 32 18 -99 109 29 29 -2
7984 -2 -98 37 -39 -32 7 21 87 10 -63 -32 0 -149 18 -71 -130 -72 -20 -87 36 71 -43 -83 -190 -20 46 -54 -22
8011 -22 -30 -44 -33 -4 86 93 6 -43 26 138 133 29 -27 -59 -53 128 55 68 -30 44 -22 -128 16 52 34 -97 -130 173 158
8040 158 -35 62 -125 139 -135 -82 -159 -32 1 18 9 -113 59 24 -11 -147 16 -13 35 53 -13 12 -64 26 -34 -93
8066 -93 -9 59 18 97 -79 31 -38 23 -69 -15 64 -147 -93 79 93 8 46 80 -74 -72 8 64 -76 -193 -164 -73 20
8093 20 36 -126 25 20 108 -77 59 74 -66 83 156 -14 -103 186 -43 96 17 -42 19 -47 65 75 105 40 -97
8118 -97 -49 -67 -128 -41 -71 -23 -22 23 66 59 -7 -32 -87 -55 -53 52 -2 -46 31 -19 -43 -67 -146 -33 107 121 7 -17 -102 -13
8148 -13 46 -44 55 115 100 -8 -43 -46 97 -13 70 -37 -4 -15 18 -57 25 61 13 -58 -30 -37 -166 -22 -19 119 -27 66
8176 66 97 -4 68 -19 60 103 -8 53 -149 32 -13 -69 35 20 113
8191A13
##END NTUPLES=NMR FID
##END=
