##TITLE=1H_MTBDP0607
 CDCl3, 8 sc, 
 7.07.2021
##JCAMPDX= 6.0         $$ Bruker NMR JCAMP-DX V2.0
##DATA TYPE= NMR FID
##DATA CLASS= NTUPLES
##ORIGIN= UXNMR, Bruker Analytische Messtechnik GmbH
##OWNER= root
$$ XWIN-NMR		Version 3.5
$$ Wed Jul  7 09:44:48 2021 Russian Standard Time (UT+4h)  she@DPX200
##.OBSERVE FREQUENCY= 200.131506
##.OBSERVE NUCLEUS= ^1H
##.DELAY= (6, 6)
##.ACQUISITION MODE= SIMULTANEOUS
##.ACQUISITION SCHEME= undefined
##.AVERAGES= 8
##.DIGITISER RES= 18
##SPECTROMETER/DATA SYSTEM= spect
##.PULSE SEQUENCE= zg30
##.SOLVENT NAME= CDCl3
##.SHIFT REFERENCE= (INTERNAL, CDCl3, 0, 15.7039)
##AUDIT TRAIL= $$ (NUMBER, WHEN, WHO, WHERE, WHAT)
$$ ##TITLE= Audit trail, XWIN-NMR		Version 3.5
$$ ##JCAMPDX= 5.01
$$ ##ORIGIN= Bruker BioSpin GmbH
$$ ##OWNER= she
$$ F:/spectra/data/she/nmr/H-F/1/audita.txt
$$ ##AUDIT TRAIL=  $$ (NUMBER, WHEN, WHO, WHERE, WHAT)
(   1,<2021-07-07 09:42:34.37 +0400>,<she>,<DPX200>,
      <created by zg, POWCHK disabled, PULCHK disabled
       configuration hash MD5:
       00 E9 B6 7A A2 85 ED C7 34 08 36 98 17 FE 4E 26
       data hash MD5: 16K
       D4 7A 58 6F 4F 49 56 EF 4C B2 AA 7B 8A 12 10 D4>)
$$ ##END=
$$ 
$$ hash MD5
$$ 46 9A 43 F7 78 4A 67 5D C4 B9 7E 95 C1 1E F1 77
##$RELAX= 
##$RELAX= 
##$RELAX= 
##$RELAX= 
##$RELAX= 
##$RELAX= 
$$ Bruker specific parameters
$$ --------------------------
##$DU= <F:/spectra>
##$EXPNO= 1
##$NAME= <H-F>
##$PROCNO= 1
##$TYPE= <nmr>
##$USER= <she>
##$AMP= (0..31)
100 100 100 100 100 100 100 100 100 100 100 100 100 100 100 100 100 100 
100 100 100 100 100 100 100 100 100 100 100 100 100 100 
##$AQSEQ= 0
##$AQ_mod= 1
##$AUNM= <au_zg>
##$AUTOPOS= <>
##$BF1= 200.13
##$BF2= 200.13
##$BF3= 200.13
##$BF4= 200.13
##$BF5= 200.13
##$BF6= 200.13
##$BF7= 200.13
##$BF8= 200.13
##$BYTORDA= 1
##$CFDGTYP= 0
##$CFRGTYP= 5
##$CHEMSTR= <none>
##$CNST= (0..31)
1 1 145 1 1 1 1 1 1 1 1 1 1 1 1 1 1 1 1 1 1 1 1 1 1 1 1 1 1 1 1 1 
##$CPDPRG= <>
##$CPDPRG1= <>
##$CPDPRG2= <>
##$CPDPRG3= <>
##$CPDPRG4= <mlev>
##$CPDPRG5= <mlev>
##$CPDPRG6= <mlev>
##$CPDPRG7= <mlev>
##$CPDPRG8= <mlev>
##$CPDPRGB= <>
##$CPDPRGT= <>
##$D= (0..31)
0 1.2 0 0 0 0 0 0 0 0.06 0 0.03 0 0 0 0 0.0002 0 0 0 0 0 0 0 0 0 0 0 0 
0 0 0 
##$DATE= 1625636553
##$DBL= (0..7)
120 120 120 120 120 120 120 120 
##$DBP= (0..7)
150 150 150 150 150 150 150 150 
##$DBP07= 0
##$DBPNAM0= <>
##$DBPNAM1= <>
##$DBPNAM2= <>
##$DBPNAM3= <>
##$DBPNAM4= <>
##$DBPNAM5= <>
##$DBPNAM6= <>
##$DBPNAM7= <>
##$DBPOAL= (0..7)
0.5 0.5 0.5 0.5 0.5 0.5 0.5 0.5 
##$DBPOFFS= (0..7)
0 0 0 0 0 0 0 0 
##$DE= 6
##$DECBNUC= <off>
##$DECIM= 32
##$DECNUC= <off>
##$DECSTAT= 4
##$DIGMOD= 1
##$DIGTYP= 9
##$DL= (0..7)
0 120 120 120 120 120 120 120 
##$DP= (0..7)
150 150 150 150 150 150 150 150 
##$DP07= 0
##$DPNAME0= <>
##$DPNAME1= <>
##$DPNAME2= <>
##$DPNAME3= <>
##$DPNAME4= <>
##$DPNAME5= <>
##$DPNAME6= <>
##$DPNAME7= <>
##$DPOAL= (0..7)
0.5 0.5 0.5 0.5 0.5 0.5 0.5 0.5 
##$DPOFFS= (0..7)
0 0 0 0 0 0 0 0 
##$DQDMODE= 0
##$DR= 18
##$DS= 0
##$DSLIST= <SSSSSSSSSSSSSSS>
$$ [...]
##$SUBNAM2= <"">
##$SUBNAM3= <"">
##$SUBNAM4= <"">
##$SUBNAM5= <"">
##$SUBNAM6= <"">
##$SUBNAM7= <"">
##$SUBNAM8= <"">
##$SUBNAM9= <"">
##$SW= 20.0188882624521
##$SWIBOX= (0..15)
0 0 2 0 0 0 0 0 0 0 0 0 0 0 0 0 
##$SW_h= 4006.41025641026
##$TD= 16384
##$TD0= 1
##$TE= 0
##$TE2= 300
##$TE3= 300
##$TEG= 300
##$TL= (0..7)
0 120 120 120 120 120 120 120 
##$TP= (0..7)
150 150 150 150 150 150 150 150 
##$TP07= 0
##$TPNAME0= <>
##$TPNAME1= <>
##$TPNAME2= <>
##$TPNAME3= <>
##$TPNAME4= <>
##$TPNAME5= <>
##$TPNAME6= <>
##$TPNAME7= <>
##$TPOAL= (0..7)
0.5 0.5 0.5 0.5 0.5 0.5 0.5 0.5 
##$TPOFFS= (0..7)
0 0 0 0 0 0 0 0 
##$TUNHIN= 0
##$TUNHOUT= 0
##$TUNXOUT= 0
##$USERA1= <user>
##$USERA2= <user>
##$USERA3= <user>
##$USERA4= <user>
##$USERA5= <user>
##$V9= 5
##$VALIST= <valist>
##$VCLIST= <CCCCCCCCCCCCCCC>
##$VD= 0
##$VDLIST= <DDDDDDDDDDDDDDD>
##$VPLIST= <PPPPPPPPPPPPPPP>
##$VTLIST= <TTTTTTTTTTTTTTT>
##$WBST= 1024
##$WBSW= 4
##$XGAIN= (0..3)
0 0 0 0 
##$XL= 0
##$YL= 0
##$YMAX_a= 1041011
##$YMIN_a= -971787
##$ZGOPTNS= <>
##$ZL1= 120
##$ZL2= 120
##$ZL3= 120
##$ZL4= 120
##$ABSF1= 10
##$ABSF2= 0
##$ABSG= 5
##$ABSL= 3
##$ALPHA= 0
##$AQORDER= 0
##$ASSFAC= 0
##$ASSFACI= 0
##$ASSFACX= 0
##$ASSWID= 0
##$AUNMP= <proc_1d>
##$AZFE= 0.1
##$AZFW= 0.1
##$BCFW= 1
##$BC_mod= 2
##$BYTORDP= 1
##$COROFFS= 0
##$CY= 11.3945322036743
##$DATMOD= 1
##$DC= 2
##$DFILT= <>
##$DTYPP= 0
##$F1P= 15.9154993809931
##$F2P= -4.1035820241983
##$FCOR= 0.5
##$FTSIZE= 0
##$FT_mod= 4
##$GAMMA= 1
##$GB= 0.15
##$INTBC= 1
##$INTSCL= 1
##$ISEN= 128
##$LB= 0.24
##$LEV0= 0
##$LPBIN= 0
##$MAXI= 10000
##$MC2= 0
##$MEAN= 0
##$ME_mod= 0
##$MI= 1.114404
##$NCOEF= 0
##$NC_proc= 0
##$NLEV= 6
##$NOISF1= 3.799351
##$NOISF2= 2.8
##$NSP= 1
##$NTH_PI= 0
##$NZP= 0
##$OFFSET= 15.70392
##$PC= 1
##$PHC0= -11911.7
##$PHC1= 9.40099
##$PH_mod= 1
##$PKNL= yes
##$PPARMOD= 0
##$PSCAL= 0
##$PSIGN= 0
##$REVERSE= no
##$SF= 200.130013532006
##$SI= 16384
##$SIGF1= 3
##$SIGF2= 2
##$SINO= 400
##$SIOLD= 16384
##$SREGLST= <1H.CDCl3>
##$SSB= 0
##$STSI= 0
##$STSR= 0
##$SW_p= 3612.71676300578
##$SYMM= 0
##$S_DEV= 0
##$TDeff= 0
##$TDoff= 0
##$TI= <>
##$TILT= no
##$TM1= 0
##$TM2= 0
##$TOPLEV= 0
##$USERP1= <user>
##$USERP2= <user>
##$USERP3= <user>
##$USERP4= <user>
##$USERP5= <user>
##$WDW= 1
##$XDIM= 8192
##$YMAX_p= 0
##$YMIN_p= 0
$$ End of Bruker specific parameters
$$ ---------------------------------
##NTUPLES= NMR FID
##VAR_NAME=  TIME,          FID/REAL,        FID/IMAG
##SYMBOL=    X,             R,               I
##VAR_TYPE=  INDEPENDENT,   DEPENDENT,       DEPENDENT
##VAR_FORM=  AFFN,          ASDF,            ASDF
##VAR_DIM=   8192,          8192,            8192
##UNITS=     SECONDS,       ARBITRARY UNITS, ARBITRARY UNITS
##FACTOR=    0.0002496,     1,               1
##FIRST=     0,             0,               0
##LAST=      2.0444736,     0,               0
##MIN=       0,             -971787,         0
##MAX=       2.0444736,     1041011,         0
$$ Real data points
##PAGE= N=1
##DATA TABLE= (X++(R..R)), XYDATA
0 0 0 0 0 0 0 0 0 8 -8 8 -16 16 -24 32 -40 48 -64 80 -96 120 -144 168 -200 240 -280 328 -381 440 -510 584
30 584 -669 761 -865 982 -1110 1249 -1402 1572 -1759 1964 -2186 2429 -2694 2987 -3305 3651
46 3651 -4027 4442 -4895 5395 -5941 6545 -7213 7957 -8791 9728 -10791 12010 -13424
59 -13424 15084 -17073 19497 -22532 26460 -31761 39347 -51159 72207 -121115 467146 -64538
71 -64538 -380275 1041011 190288 -469745 573513 648342 -261759 329637 572657 -119760
81 -119760 136784 559050 -47765 95213 539429 -22467 -175377 379894 17878 -217821
91 -217821 356584 180311 -274612 243541 228246 -409634 6799 409329 -283351 -250735
101 -250735 397527 -56770 -480221 128801 172361 -335273 -63254 227738 -141019 -171784
111 -171784 97330 -51213 -141229 64571 26485 -88573 12545 9810 -102270 -34764 70854
122 70854 29164 -10992 69977 101664 -15288 -23355 114373 49553 -69944 95801 139173
133 139173 -88696 -6930 174797 -32429 -54798 207405 44855 -126441 141447 80499
143 80499 -191883 49119 134061 -184797 -27818 173117 -170582 -128478 197157 -114683
153 -114683 -224658 201675 -28994 -360155 113809 113989 -415526 -54602 263355 -317857
163 -317857 -252730 293570 -132314 -392796 194872 68307 -388837 40013 161135 -325474
173 -325474 -88219 195481 -222947 -150275 210431 -128277 -194552 209538 -49709 -257252
183 -257252 191664 71482 -301656 112952 200668 -296395 -30748 303683 -185697 -182364
193 -182364 309054 -14059 -278657 202021 141610 -272941 42281 218663 -177192 -88064
203 -88064 193332 -62510 -130212 127013 6291 -116996 71222 19335 -108252 48773
213 48773 35352 -118873 16844 71876 -109193 -43971 86755 -54649 -79268 68703 100
224 100 -91198 22218 35553 -72120 -27345 45664 -22888 -55121 22974 29252 -51431 -31315
236 -31315 55106 1345 -72890 25220 58320 -68313 -27629 83076 -33959 -69868 81255
247 81255 8690 -98468 64330 58879 -117731 18104 109879 -105057 -49634 136113 -55541
258 -55541 -108686 128184 9810 -147001 85059 70778 -151817 29243 116327 -132314 -28162
269 -28162 146466 -97159 -90303 155861 -43305 -143955 146615 30645 -190025 97624
279 97624 119439 -198323 3837 187684 -144075 -95040 206320 -51668 -173485 163413
289 163413 50014 -200001 79351 126820 -168561 -10805 153786 -107061 -75864 138936
299 138936 -45856 -104294 111114 -4619 -120099 85651 31503 -136171 52471 78015
309 78015 -138299 -4912 118791 -104578 -71515 128856 -41076 -123786 96350 29220 -140949
320 -140949 30431 84243 -101940 -38683 86236 -38497 -73406 44556 10659 -56860 4251
331 4251 21695 -25235 -16402 754 -8705 -9995 -10472 -1295 3252 -16450 -7035 7684 -18897 -12113
345 -12113 14284 -13218 -13729 15349 -18079 -21444 22835 -17912 -34972 40258 -1816 -66237 36073
358 36073 32864 -88238 7823 77406 -81295 -43721 101290 -47466 -99467 98424 16976
369 16976 -131183 59643 76157 -135910 -4699 116229 -100246 -61178 129069 -49720
379 -49720 -110740 108424 2588 -139058 77935 65415 -142633 22647 106438 -125377 -41143
390 -41143 126584 -77612 -86173 124815 -28368 -128510 96263 26042 -148135 56678 86763
401 86763 -140134 -6628 120731 -108905 -72363 132129 -45394 -118308 107502 19187 -141015
412 -141015 53495 75633 -121485 -4470 105358 -75888 -57051 92083 -25881 -73409
422 -73409 68646 12910 -70359 40028 30935 -62753 17883 46795 -43788 4217 52766 -33784
434 -33784 -17034 52481 -15414 -29964 49560 10688 -39091 25804 27277 -32526 -389 36188
446 36188 -3730 -16060 14476 13148 -13585 -15001 14053 12363 -25812 -4794 32547 -21669 -38298
459 -38298 36997 7654 -58718 18095 38982 -59617 -19164 51422 -37817 -42894 51817 -11274
471 -11274 -57327 40193 8518 -63643 30391 31396 -66972 13565 54778 -65968 -15556 76537
483 76537 -43989 -43074 88993 -11810 -75734 80584 32812 -95982 50488 82630 -88493
494 -88493 -722 108680 -56509 -48509 110187 -6951 -74839 89102 35367 -86688 52349
505 52349 66635 -80961 14198 88882 -59990 -24956 92715 -29470 -55968 81648 5929
516 5929 -72492 57284 35250 -77571 23840 57222 -66608 -8783 67824 -44972 -37480
527 -37480 65729 -16792 -56862 51799 12911 -64619 25420 34951 -56758 -2871 45903 -34978
539 -34978 -23324 41869 -11804 -33332 27588 7412 -29192 11558 15713 -18333 -1582 11402
551 11402 -6079 -2493 3718 -237 5623 -62 -5336 9795 2236 -10910 8460 6958 -11387 5616
565 5616 7529 -12650 4873 9912 -15351 3405 15290 -18695 -1532 23720 -21651 -14351 33655
578 33655 -14967 -33109 37919 4989 -50741 26739 32941 -55395 -1251 53713 -39505 -31254
590 -31254 56887 -12556 -50062 44503 12565 -55326 26758 31885 -51724 7522 45484 -42034
602 -42034 -11501 52118 -29265 -30691 55291 -9914 -48235 49148 15316 -58732 31793 39761
614 39761 -59193 4805 59620 -43265 -25638 63964 -15937 -47958 51633 13077 -55478 29317
626 29317 35227 -46909 5472 42765 -32133 -11162 41985 -18135 -21710 40568 -3501 -31399
638 -31399 33409 12507 -35742 19583 27019 -30166 3910 33168 -18112 -8832 30696 -5414
650 -5414 -15102 24717 5053 -16691 17117 12673 -14342 7915 14867 -7564 1723 12046 -1175
663 -1175 1137 7580 920 1867 3431 838 5476 1057 -3313 9487 4343 -9743 8758 10482 -15478
678 -15478 3777 20085 -14970 -7752 25440 -7041 -18561 24254 4403 -25634 17694 17618 -26030
691 -26030 6918 25768 -22223 -3304 29991 -16187 -11938 33392 -7997 -22082 35253 4561
703 4561 -33971 29567 23701 -40276 13585 42194 -35257 -10181 51520 -17321 -31628 46354
715 46354 6917 -40941 29974 25792 -39470 10449 35510 -30595 -6463 37106 -19446 -17459
727 -17459 35411 -9006 -27064 31534 3752 -34760 22236 17511 -37480 7868 29672 -32969
739 -32969 -10499 35760 -18914 -26277 32186 -117 -33980 18685 14971 -30738 2582 20742
751 20742 -20325 -7862 18765 -10214 -11414 14446 -4015 -10977 11520 -611 -11262 9880
763 9880 3556 -12100 5275 7181 -9433 1156 8476 -4835 -1625 6671 -493 -854 2265 -1089
777 -1089 2981 1780 -4589 4340 4505 -7661 2564 9221 -8585 -2152 13126 -6366 -7727 14327
791 14327 -2440 -13637 13132 3483 -18013 9514 10925 -19743 3290 18405 -18600 -6375
803 -6375 23393 -12647 -17356 24870 -1791 -27098 18550 12193 -29914 6716 22808 -24395 -5868
816 -5868 26832 -15119 -16495 24792 -5302 -22410 20054 3533 -25673 15099 13134 -27867 5989
829 5989 22503 -25277 -6364 28906 -16610 -20336 28615 -1704 -29713 19141 13217 -29367 5422
842 5422 21786 -21333 -6748 22608 -11356 -14032 18092 -2626 -16119 12724 2925 -15612 8735
855 8735 7250 -15326 4598 11557 -13765 -950 14497 -9818 -7549 14814 -2789 -12494 10868
868 10868 5220 -11583 3763 8730 -6674 -1638 6788 -1832 -2480 2604 110 260 310 -1856 3126
883 3126 1763 -4526 2238 4612 -5148 -384 6069 -4511 -3013 6360 -3100 -4687 6494 -2061 -6342
898 -6342 7582 -83 -9851 7313 4041 -12778 3591 9493 -12852 -2482 13680 -9139 -9057 14563
912 14563 -3153 -14063 12270 3645 -16318 7220 9111 -16073 1327 13455 -13489 -4746 16569
925 16569 -8848 -11184 16819 -2408 -16741 14232 6005 -19730 7506 13474 -17894 -1767 17950
938 17950 -11642 -9721 17675 -3216 -14511 13147 3629 -15144 7633 7504 -13592 3379 10091
951 10091 -11850 -394 12992 -9461 -6158 14699 -4290 -11546 12916 2941 -14377 7466 9163
964 9163 -12495 268 11480 -6784 -4546 9807 -1691 -6081 6364 938 -4956 3648 1558
977 1558 -3479 3138 1266 -3973 3234 2182 -4531 1999 3730 -4051 -34 4341 -2897 -1937 3613
992 3613 -982 -2184 2128 -463 -1009 1385 -2082 -372 2813 -3486 -2007 5148 -2828 -5206 6281
1007 6281 811 -8536 4219 5135 -8804 0 7559 -6620 -3185 8122 -3968 -5855 8011 -1063
1021 -1063 -7833 7219 2078 -9434 5201 5567 -10437 1906 9865 -8990 -2955 11839 -5296
1034 -5296 -7739 11528 -154 -11171 8720 5230 -11548 3979 8838 -9871 -376 10659 -7251
1047 -7251 -4481 11238 -3360 -8046 9944 857 -10323 7402 5182 -11049 3261 8905 -9429
1060 -9429 -1767 10886 -5498 -6129 10105 -906 -8269 6915 2995 -8050 3506 4854 -6393
1073 -6393 964 5297 -5279 -709 5965 -4090 -2776 6148 -2059 -4804 5617 585 -5802 3397
1087 3397 3363 -5121 284 3748 -2781 -1243 2733 -915 -1467 814 -564 -43 452 -1881 733 1374
1103 1374 -3110 -215 3105 -2831 -2181 3884 -1435 -3738 3173 150 -4371 2231 1737 -4325 1069
1118 1069 2304 -4311 584 3345 -4597 -235 5189 -4530 -3099 6667 -2354 -6199 7120 1628 -8645
1133 -8645 4564 5724 -8637 191 8398 -6067 -3314 8770 -2583 -6147 7296 821 -7218
1146 -7218 5919 3496 -7588 3506 5824 -7514 458 8491 -5783 -3184 9407 -2553 -6875
1159 -6875 8121 1840 -8368 5202 5428 -8020 1389 7169 -5820 -1909 7460 -3044 -4148 6484
1173 6484 -693 -5844 4897 1910 -5816 2904 3463 -6226 339 4836 -4754 -2050 5651 -1994 -3778
1188 -3778 3797 -207 -4360 2090 1646 -3492 230 1657 -2321 -345 852 -1657 188 467 -1955
1203 -1955 300 935 -2334 -228 1886 -1542 -1063 1802 -956 -1557 1195 -473 -668 1369 -1040 -859
1219 -859 2252 -1439 -1933 3718 102 -3823 3201 2328 -5173 1291 5128 -4389 -1731 6444 -1958 -4381
1235 -4381 5594 626 -5550 3935 3370 -5290 1616 4095 -4432 -221 5124 -3730 -1888 6097 -2517
1250 -2517 -4118 5998 -487 -6150 5294 2864 -7536 2414 5654 -6831 -1592 7521 -3921 -4830
1264 -4830 6617 -706 -6533 4466 1855 -6136 2296 3266 -5363 357 4227 -4646 -1471 5166 -3223
1279 -3223 -3378 5044 -1210 -4933 3633 1272 -5403 2010 3180 -4325 -664 3543 -2523 -1646 2782
1294 2782 -1192 -2136 2279 -493 -1948 1553 50 -1942 1596 613 -2025 1135 931 -1611 679 1504
1310 1504 -1354 128 1571 -1046 175 1329 -688 383 1125 -1179 595 2080 -1786 -120 3266
1325 3266 -1262 -2159 3929 486 -3638 2983 2506 -3666 1452 3828 -3174 -415 4029 -1966 -1363 4080
1341 4080 -1181 -2428 4059 -214 -3713 3829 1300 -5064 2804 3820 -5384 406 5799 -4216 -2750
1356 -2750 6356 -1503 -5180 5154 1303 -6012 2674 3300 -5545 597 4286 -4101 -1374 4426 -2988
1371 -2988 -2504 4639 -1715 -4188 4431 292 -5318 3261 2468 -5637 968 4713 -4838 -1851 5437
1386 5437 -2261 -3894 4292 368 -3886 2450 1761 -3313 1344 1979 -2489 568 2040 -2327 341
1401 341 2842 -2183 -698 3322 -922 -1738 2932 457 -2219 1707 1391 -1854 742 1675 -1019 230
1417 230 1172 -944 675 843 -1152 819 1218 -1766 509 1911 -1855 -405 2944 -1277 -1892 3046
1433 3046 -27 -2833 2352 998 -2880 1532 1678 -2974 536 2382 -2968 -80 3421 -3120 -1664
1448 -1664 4498 -1886 -3690 4422 404 -5240 3141 2873 -5319 839 4577 -4442 -1743 4893 -2363
1463 -2363 -3224 4489 -800 -4005 3863 806 -5039 3257 2456 -5509 1371 4598 -4978 -1251 5883
1478 5883 -3050 -3944 5598 -32 -5462 3876 2538 -5499 1434 4011 -4318 -874 4252 -2371 -1947
1493 -1947 3595 -1135 -2461 3049 -216 -2987 2836 901 -3474 2160 2084 -3732 681 3458 -2826
1508 -2826 -1344 3749 -873 -2711 2433 848 -2146 946 1190 -855 226 441 -412 783 -169 -878
1524 -878 1543 205 -1813 1233 1536 -2001 136 2242 -1361 -546 2110 -1024 -960 2221 -625 -1259
1540 -1259 2069 -549 -1962 2301 190 -3054 2203 1782 -3770 890 3478 -3936 -1029 4539 -2505
1555 -2505 -3463 4571 -110 -4946 3092 1841 -4720 1273 3379 -4210 -499 4147 -3298 -1816 4687
1570 4687 -2128 -3289 4679 -419 -5032 3967 2540 -5947 1719 4932 -4715 -1349 5872 -2545 -3446
1585 -3446 5077 116 -4191 3143 1746 -3559 1924 2632 -3247 881 3373 -2859 -449 4105 -1698
1600 -1698 -1788 4327 -235 -3169 3376 1662 -3295 1246 3018 -2375 -504 2814 -955 -1258 1822 87
1616 87 -938 901 157 -232 569 -659 -182 1302 -824 -803 1646 -410 -1682 1465 511 -1935 478
1633 478 1471 -1571 -85 926 -1152 226 787 -1701 139 1565 -2377 -493 2812 -1943 -2335 3661
1649 3661 -72 -4039 2733 2231 -4349 592 3738 -3410 -1324 3756 -1857 -2678 3624 -256 -3365
1664 -3365 2959 878 -3912 2104 2078 -4148 870 3753 -3650 -1107 4774 -2472 -3299 4727 -118 -4904
1680 -4904 3432 2561 -4988 961 3975 -3608 -998 4228 -1923 -2114 3554 -708 -2572 2939 153
1695 153 -2991 2535 1348 -3376 1451 2746 -3321 -147 3774 -2116 -2078 3311 -189 -2765 1852 1018
1711 1018 -2242 350 1206 -1329 -63 758 -1063 231 634 -1513 100 1077 -1729 -389 1356 -1339
1727 -1339 -1020 1367 -617 -1592 1102 49 -1305 311 45 -1089 686 36 -1499 824 280 -2113
1743 -2113 1188 1286 -2791 242 2539 -2398 -1333 3302 -907 -3048 2715 828 -3455 1731 2236 -3108
1759 -3108 313 2906 -2362 -402 2732 -1695 -1036 3378 -1415 -2313 3606 48 -3745 3103 2166 -4647
1775 -4647 1221 3992 -3662 -1394 4748 -1776 -3012 3827 167 -3630 2554 1663 -3566 1437 2355
1790 2355 -3052 528 2823 -2760 -624 3474 -1938 -1939 3642 -536 -3409 3014 1167 -3876 1759 2709
1806 2709 -3191 -412 3177 -1818 -1485 2582 -521 -1773 1642 -30 -1736 1209 289 -1588 1096
1821 1096 503 -1921 1004 1109 -2234 126 1896 -1340 -1043 1622 -655 -1147 1074 -153 -998 578
1837 578 -112 -740 693 -476 -1097 1531 -58 -1715 1298 789 -2214 646 2015 -2210 -491 2562
1853 2562 -1205 -1394 2404 -410 -1843 2071 383 -1883 1612 747 -2394 1383 1776 -2810 643 2978
1869 2978 -2716 -863 3900 -1679 -2614 3983 319 -3773 2742 2211 -3857 766 3492 -2835 -784
1884 -784 3461 -1645 -1724 3068 -677 -2410 2994 121 -3237 2417 1350 -3715 1149 2844 -3610 -579
1900 -579 3945 -2049 -2561 3993 -254 -3676 2383 1467 -3236 782 2165 -2379 -230 2054 -1700 -867
1916 -867 2085 -1026 -1289 1950 -638 -1840 1863 460 -2325 1119 1292 -1980 39 1652 -1304 -713
1932 -713 1408 -226 -1167 726 172 -395 335 -209 -88 258 -680 -60 1101 -710 -907 1483 -17 -1642
1950 -1642 1038 815 -1662 201 1323 -1271 92 1564 -1076 -206 1513 -1179 -839 2173 -978 -1542
1966 -1542 2586 123 -2677 2265 1800 -3566 676 3225 -2779 -1167 3453 -1419 -2621 2994 230
1981 230 -3140 1825 1257 -3080 1001 2135 -3101 113 2844 -2578 -1312 3305 -1661 -2773 3449
1996 3449 -7 -3933 2174 2040 -4041 363 3430 -2981 -1500 3412 -1206 -2588 2515 256 -2806
2011 -2806 1312 1081 -2254 754 1293 -2297 332 1729 -1966 -368 2189 -1177 -1410 2364 -14 -2122
2027 -2122 1504 1316 -1864 136 1397 -751 -393 967 -23 -390 240 -89 151 191 -419 599 656 -959
2045 -959 -2 1067 -790 -367 1405 -269 -936 1148 165 -968 727 228 -957 1044 598 -1399 999
2062 999 1223 -1884 521 1821 -2207 -650 2872 -1191 -2027 2947 416 -3110 1993 2029 -3104 69
2078 69 2750 -2238 -1080 2689 -1326 -1672 2260 -563 -2277 2251 635 -2974 1638 1698 -3576 506
2094 506 3156 -3046 -1635 3591 -1156 -3088 2977 719 -3282 1433 1941 -2834 66 2404 -1910
2109 -1910 -548 2249 -1511 -1247 2248 -667 -1584 2004 174 -2191 1664 1159 -2245 639 2064 -1824
2125 -1824 -458 2018 -725 -1548 1638 220 -1297 762 744 -1090 -38 783 -313 238 125 -321 464
2142 464 204 -803 557 705 -1060 -58 961 -840 -478 810 -302 -695 285 -283 -247 481 -555
2159 -555 -401 1021 -686 -1177 1541 -66 -2053 1054 1204 -2313 59 2261 -1742 -1226 2375 -710
2175 -710 -1962 1878 446 -2177 1210 976 -2000 569 1604 -1803 27 2017 -1789 -833 2420 -1156
2191 -1156 -2075 2553 107 -3050 1912 1803 -3176 130 2831 -2263 -1403 2956 -651 -2254 2168 36
2207 36 -2411 1367 1021 -2141 742 1396 -2203 343 1828 -1934 -695 2376 -1023 -1788 2576 107
2223 107 -2503 1474 1464 -2111 225 2045 -1394 -722 1631 -331 -895 1231 -65 -797 1070 162 -761
2240 -761 923 381 -931 714 543 -907 287 784 -948 -226 846 -375 -425 411 39 -470 -188 263
2258 263 45 -142 -630 227 599 -922 -322 1342 -520 -1326 1191 496 -1723 354 1059 -1356 -137
2275 -137 1295 -802 -853 1159 -583 -853 1148 -369 -1088 1436 226 -1813 1485 1214 -2370 453
2291 453 2193 -2133 -745 2831 -855 -2355 2458 589 -2565 1424 1742 -2247 480 2034 -1812
2306 -1812 -495 2413 -1157 -1103 2268 -573 -1621 2154 446 -2307 1647 1317 -2424 640 2502 -2102
2322 -2102 -908 2904 -682 -2102 2346 780 -2309 998 1335 -1948 213 1386 -1302 -297 1350
2337 1350 -860 -669 1229 -456 -878 1563 -52 -1444 1045 889 -1447 97 1200 -911 -456 1098
2353 1098 -162 -694 269 457 -421 -69 67 169 -234 -287 322 116 -604 -16 536 -663 -271 830 -89
2372 -89 -643 480 64 -732 482 459 -815 417 496 -860 166 889 -1207 -202 1547 -914 -1111 1968
2390 1968 -159 -2201 1460 1418 -2357 365 2409 -1764 -905 2380 -675 -1789 1950 407 -1784 1401
2406 1401 835 -1897 972 1372 -1891 253 2098 -1745 -829 2704 -1098 -2147 2417 612 -2634 1227
2422 1227 1855 -2511 -41 2448 -1734 -1153 2209 -452 -1596 1690 327 -1702 867 835 -1496 513
2438 513 1208 -1440 0 1435 -1024 -791 1688 -378 -1228 1443 480 -1511 435 1054 -1122 -316 1072
2455 1072 -165 -812 239 302 -512 -8 106 -11 -201 -189 -102 270 -483 -194 532 -245 -436 55 -143 -105
2475 -105 193 -214 -94 500 -185 -255 813 -148 -749 928 589 -1444 506 1528 -1326 -308 1759 -693
2493 -693 -1368 1845 304 -1902 1084 953 -1704 149 1606 -1276 -264 1555 -740 -850 1687 -270
2509 -270 -1448 1756 180 -1958 1430 1166 -2407 219 2167 -1812 -1158 2406 -596 -2096 1684 502
2525 502 -2216 856 1293 -1832 315 1430 -1347 -451 1454 -1144 -1021 1629 -133 -1472 1252 352
2541 352 -1809 930 991 -1739 11 1644 -916 -952 1561 -199 -995 879 546 -1047 120 614 -532
2558 -532 -109 547 -478 -201 479 -271 107 275 -261 -74 511 -152 -257 354 62 -407 30 308 -41 -216
2578 -216 -37 116 123 -471 189 694 -562 -319 865 -135 -1003 943 592 -1259 64 1191 -996 -546
2596 -546 1154 -333 -728 876 -69 -1015 872 314 -1008 542 720 -1333 164 1233 -1249 -429 1783
2613 1783 -702 -1361 1749 171 -1968 1187 1034 -2093 509 1512 -1483 -591 1675 -670 -1330 1355
2629 1355 -110 -1404 1081 516 -1504 674 774 -1750 152 1421 -1509 -472 1991 -731 -1557 1544
2645 1544 278 -1785 727 1200 -1729 -132 1364 -1024 -543 1125 -504 -932 956 -4 -614 655
2661 655 200 -782 480 555 -1014 163 894 -711 -278 1141 -98 -658 697 297 -753 223 475 -385
2679 -385 -51 408 130 -344 -23 261 34 -487 -64 422 -296 -208 489 335 -428 278 362 -417 157 289 -368
2700 -368 -23 473 -527 -182 695 -453 -443 1042 -378 -1116 1031 462 -1411 684 1174 -1482 -298
2717 -298 1504 -927 -1063 1466 -41 -1425 836 681 -1245 649 1038 -1146 -9 1159 -1147 -451
2733 -451 1513 -812 -1210 1660 0 -1601 1373 742 -1784 507 1502 -1458 -553 1826 -700 -1319
2749 -1319 1558 177 -1339 788 858 -1220 329 1025 -928 -12 1112 -626 -592 1234 -302 -926 970
2766 970 241 -1237 689 896 -946 115 923 -593 -569 1095 -78 -909 418 588 -309 -130 461 -46
2784 -46 -211 113 85 -121 -15 99 -31 -106 -201 -93 -170 -50 38 -252 -134 96 -192 -15 349 -105 -533 541
2806 541 146 -915 240 648 -868 -333 1154 -368 -1070 947 296 -1183 458 816 -963 -132 1159
2823 1159 -738 -722 1062 -359 -802 1012 24 -1145 923 401 -1482 562 1139 -1463 -240 1617
2839 1617 -728 -975 1476 86 -1704 1035 876 -1471 357 1326 -1149 -397 1252 -475 -741 1052
2855 1052 -204 -1011 1030 171 -939 582 498 -1100 316 1213 -723 -372 1365 -200 -830 1027 417
2872 417 -1103 524 731 -935 -289 606 -325 -413 628 151 -257 293 74 -367 128 -154 -220 207 -9
2891 -9 -289 95 275 26 -95 155 112 -241 -94 362 -195 -490 269 342 -496 -168 455 -209 -499 423 528
2912 528 -613 -34 827 -351 -443 654 -137 -608 450 111 -690 371 145 -613 195 482 -824 171
2930 171 933 -396 -387 1044 -394 -831 1147 337 -1260 658 874 -965 -68 1092 -619 -714 1278 -50
2948 -50 -973 768 452 -1112 498 623 -831 192 716 -941 37 959 -638 -600 1238 -166 -936 884
2966 884 654 -1282 441 969 -813 -356 1033 -459 -741 857 202 -767 371 144 -529 260 414 -695
2984 -695 -52 327 -424 -176 514 -265 -473 436 150 -606 390 186 -580 -7 434 -395 -190 252 99 -251
3004 -251 75 292 -31 -232 258 399 -268 36 340 122 -110 59 73 -328 49 362 -116 52 178 -137
3024 -137 53 399 -232 -29 435 -168 -518 743 161 -944 447 785 -843 -189 1063 -307 -577 903
3042 903 84 -729 602 524 -811 202 800 -639 -57 658 -496 -414 731 -171 -770 893 82 -897
3060 -897 565 395 -944 299 924 -909 -333 1035 -452 -912 901 138 -822 453 496 -687 -14
3077 -14 691 -568 -258 817 -430 -535 644 -252 -618 512 322 -734 265 528 -970 -7 937 -404
3095 -404 -565 653 212 -707 324 376 -549 -117 448 -163 -118 229 44 -329 127 30 -224 257 52 -205
3115 -205 12 25 87 53 197 176 -245 131 312 -247 -185 519 -43 -397 229 360 -461 -26 637 -246 -467 704
3137 704 149 -738 413 550 -662 -78 471 -594 -225 535 -285 -388 838 -37 -512 565 20 -960
3155 -960 352 632 -803 -26 898 -802 -585 1069 -76 -940 712 626 -1144 29 841 -843 -310
3172 -310 840 -422 -487 869 -185 -579 664 172 -773 552 533 -637 52 700 -736 -441 924 -325
3190 -325 -773 858 253 -774 623 556 -803 -110 781 -481 -429 676 74 -476 214 249 -400 79 313
3209 313 -263 73 191 -174 -92 334 -238 -362 226 90 -370 131 438 -331 -187 362 262 -370 104 440
3229 440 -333 -198 570 96 -287 314 298 -503 -106 344 -285 -428 326 -126 -369 312 -23 -533 342 177
3249 177 -403 282 280 -564 -141 571 -376 -497 646 -2 -998 544 528 -886 79 823 -612 -430 588
3268 588 -236 -667 642 175 -805 295 367 -794 156 521 -564 -185 643 -340 -479 842 -69 -827 566
3287 566 417 -883 207 772 -653 -291 842 -277 -679 720 186 -876 315 403 -612 36 348
3304 348 -232 -102 551 -54 -206 433 -174 -296 488 77 -531 282 461 -311 -54 281 -276 -331 448 112
3324 112 -453 -24 337 -286 -313 299 92 -222 -95 165 -203 -99 185 -36 -59 150 25 -265 -31 139 -133
3345 -133 166 78 -375 -210 406 -277 -289 330 19 -485 186 430 -757 -78 629 -385 -382 645 -193 -650
3365 -650 428 195 -743 230 511 -444 157 422 -460 -239 488 -263 -537 739 -38 -651 420 445 -868
3384 -868 260 608 -666 -166 971 -114 -644 808 210 -778 405 607 -573 137 564 -366 -346 595
3402 595 -195 -343 477 94 -260 537 52 -474 245 283 -491 16 495 -308 -358 581 160 -650 177 622 -408
3423 -408 85 299 -108 -243 173 -5 -338 207 76 -123 -113 155 -45 -17 196 -35 -53 204 -18 -283 178
3444 178 176 -333 79 487 -169 -446 336 283 -442 30 543 -462 -370 732 -165 -555 594 324 -420 212
3464 212 393 -356 -201 542 -425 -276 473 -295 -460 350 133 -607 560 538 -722 188 521 -559 -258
3483 -258 904 -171 -659 665 272 -839 280 497 -713 -129 626 -473 -269 720 -188 -541 450 173
3501 173 -445 247 403 -581 47 500 -441 -102 657 -404 -750 604 63 -763 432 407 -553 -287 633
3520 633 -385 -391 675 67 -350 -8 196 -438 -73 326 -357 -98 238 -83 -93 334 -140 -529 365 189
3540 189 -413 82 323 -407 -166 506 144 -742 421 268 -358 -128 531 -325 -444 490 154 -341 215 347
3560 347 -368 -73 440 -272 -269 539 -32 -492 427 129 -478 411 401 -653 84 615 -379 -237 685 -214 -612
3581 -612 819 414 -708 252 682 -797 -199 879 -249 -485 699 29 -637 446 271 -557 306 348
3599 348 -704 -200 768 -437 -390 734 -252 -723 443 187 -855 256 585 -613 -306 704 -426
3616 -426 -490 750 255 -607 321 334 -583 -111 445 -229 -60 536 -214 -192 454 -156 -416 246 236 -411 224
3637 224 482 -306 -84 464 -121 -502 144 246 -372 33 470 -257 -144 494 -87 -555 246 235 -277 162
3657 162 341 -19 -48 282 11 -78 221 132 -249 209 272 -361 -19 423 -434 -107 679 -173 -309 503 227
3678 227 -542 113 516 -310 -344 598 -153 -667 432 354 -599 208 411 -418 -2 561 -511 -98 627 -131
3698 -131 -485 442 -63 -574 392 265 -688 317 435 -706 -381 696 -218 -671 700 150 -848 341
3716 341 511 -411 -142 555 -281 -170 483 -15 -552 121 22 -532 428 91 -487 244 558 -482 -295 533
3736 533 -222 -382 579 171 -611 113 410 -136 2 562 -94 -301 228 157 -399 -40 252 -154 104 330
3756 330 97 -80 136 93 -230 93 92 -212 188 306 -241 -165 496 -226 -343 383 170 -603 331 374 -349 -73
3778 -73 599 25 -442 350 269 -383 -68 470 -354 7 359 -227 -255 471 -192 -291 500 318 -550 302 365 -573
3800 -573 119 559 -562 -313 771 -147 -704 524 223 -720 24 622 -448 -235 719 -313 -296 673 -216
3819 -216 -359 451 184 -457 201 292 -625 146 466 -535 -269 633 -178 -307 564 14 -756 338 516 -644
3839 -644 -147 477 -295 -481 666 328 -424 260 347 -209 70 392 -91 -242 224 16 -105 334 106 -248
3859 -248 227 265 -395 70 357 -250 -449 420 -46 -471 207 294 -441 -158 302 -291 -498 408 8 -487 435
3880 435 378 -413 5 453 -31 -24 283 -189 -223 278 -5 -252 307 347 -434 18 574 -521 -443 682 -208
3901 -208 -583 588 380 -741 275 710 -624 -258 795 -153 -467 430 44 -723 421 301 -609 -61
3919 -61 376 -487 13 563 -259 -324 700 38 -619 470 350 -806 246 819 -616 -380 941 -68
3937 -68 -511 545 194 -670 179 480 -424 -115 418 -97 -145 395 -125 -429 238 52 -319 352 206 -502
3957 -502 -85 301 -263 -327 515 -54 -375 284 270 -528 -54 427 -452 -476 340 94 -556 199 362 -243 -172
3978 -172 367 -38 -182 219 54 -138 -6 -23 -551 15 273 -207 0 492 -258 -310 498 -11 -665 279 241
3999 241 -647 -41 655 -441 -223 540 54 -473 425 335 -544 151 531 -657 -119 425 -171 -280 598 -194
4019 -194 -433 432 95 -607 502 606 -689 -21 606 -427 -419 829 -130 -672 609 262 -783 304
4037 304 567 -350 -147 479 -109 -198 464 55 -288 291 229 -321 94 266 -425 22 390 -221 -375 410 0
4058 0 -539 298 343 -542 -35 508 -192 -272 397 215 -534 268 371 -501 -134 204 -139 -145 -45 27 -92 -32 -2
4081 -2 -259 87 -59 -337 -2 100 -172 -67 240 -134 -313 252 290 -505 27 505 -522 -415 588 -26
4101 -26 -459 262 354 -429 86 488 -293 -227 418 -74 -305 552 79 -278 273 373 -461 247 287 -503 116
4122 116 734 -322 -460 649 2 -633 462 443 -603 164 663 -426 -147 555 -6 -397 391 261 -388
4141 -388 208 282 -498 111 476 -451 -61 629 -376 -221 440 -57 -381 187 311 -697 26 427 -380 -155
4161 -155 458 -54 -594 311 232 -355 -37 186 -330 -358 165 -97 -60 211 -20 -155 82 8 -250 115 181 -380
4183 -380 -112 326 -176 -200 397 -21 -323 55 390 -99 -153 512 -29 -463 279 144 -624 80 335 -368 -170
4204 -170 479 -48 -310 140 193 -391 60 232 -168 98 201 -286 -67 545 -325 -312 438 -39 -680 515
4224 515 412 -718 109 606 -292 -289 687 -118 -452 419 284 -619 83 443 -535 -118 355 -349 -248 533
4244 533 -345 -477 503 118 -637 350 369 -641 -4 609 -525 -394 748 -207 -419 497 39 -716 35
4263 35 394 -249 -252 522 -441 -262 322 79 -153 229 47 -218 203 97 -361 -39 527 4 -139 470 76
4284 76 -605 572 349 -397 1 714 -322 -287 545 132 -433 172 269 -372 -84 138 -133 -149 298 -81 -142
4305 -142 145 277 -335 77 174 -209 -49 349 -188 -132 571 62 -454 382 219 -613 72 546 -315 -320 717
4326 717 98 -589 518 202 -561 157 461 -348 -124 393 -233 -270 334 -132 -427 353 146 -517 127 200
4346 200 -630 34 689 -460 -440 760 -95 -850 474 498 -760 193 731 -403 -188 570 -214 -496 410
4365 410 92 -367 299 312 -378 57 430 -232 -179 432 -271 -223 534 195 -401 177 391 -218 39 542 -216
4386 -216 -244 607 -66 -297 167 261 -278 -194 342 -183 -154 364 83 -167 151 105 -80 151 354 -149 -144 269
4408 269 -219 -46 300 -17 -395 300 323 -373 -1 399 -309 -272 734 -66 -586 254 368 -283 89 461
4428 461 -151 -206 330 43 -196 323 153 -447 219 239 -430 159 174 -455 -257 451 -223 -394 542 80 -481
4449 -481 321 508 -662 -73 507 -422 -397 512 -14 -450 405 197 -508 151 256 -305 -52 228 -88 -6
4469 -6 336 -321 -203 534 44 -410 220 187 -383 -94 376 -288 -465 412 161 -618 221 154 -287 40 313
4490 313 -199 -166 380 57 -190 168 36 -175 108 155 -183 117 -58 -327 -38 340 38 -297 300 -51 -368
4511 -368 316 178 -357 -189 525 -34 -396 258 169 -587 -95 338 -363 -344 403 -56 -313 153 83 -286 -38
4532 -38 103 -249 166 226 -304 -357 300 -410 -567 484 21 -693 233 233 -656 -19 475 -174 -330 619 16
4553 16 -425 319 322 -637 84 581 -318 -41 407 -203 -256 400 9 -80 444 51 -438 297 158 -456 39 542
4575 542 -397 -470 691 -76 -585 469 373 -570 -59 438 -289 -289 386 -95 -317 393 257 -191 192 281 -283
4596 -283 79 202 -240 15 478 -331 -256 407 -31 -402 221 389 -512 -133 516 -203 -363 532 122 -260
4616 -260 39 196 -433 -175 355 -226 -104 157 -12 -435 193 88 -156 62 229 -452 -102 304 -205 -209 484
4637 484 162 -536 237 138 -424 21 710 -464 -359 569 93 -536 135 387 -522 3 325 -188 -217 611
4657 611 -26 -233 463 5 -436 372 83 -487 217 334 -602 -129 694 -272 -274 699 256 -633 433 278
4677 278 -530 78 595 -385 -188 565 123 -235 189 214 -264 263 201 -406 56 172 -476 -95 358 -90 -292
4698 -292 213 -25 -259 353 268 -495 142 501 -254 -227 446 16 -546 129 296 -421 -92 434 -34 -460 167
4719 167 50 -141 50 70 -60 -24 117 -119 -138 344 -258 -180 407 82 -198 346 227 -452 70 585 -256
4740 -256 -193 537 17 -486 240 240 -498 77 440 -201 -130 441 55 -473 226 109 -436 259 111 -487 -4
4761 -4 233 -211 -122 378 -330 -410 646 107 -703 424 495 -602 -15 750 -117 -167 425 -105 -562 368 209
4782 209 -353 208 445 -389 -67 378 -96 -307 250 -29 -353 179 12 -350 148 182 -466 -205 434 -268
4802 -268 -406 276 40 -575 215 321 -506 17 328 -294 -280 263 123 -292 176 348 -357 97 268 -2
4822 -2 -34 64 -13 -64 250 40 -225 280 161 -399 104 491 -294 -169 363 2 -303 111 237 -350 97 399
4844 399 -130 -230 353 -108 -262 321 301 -235 -97 292 -235 -42 363 -146 -297 512 -152 -185 377 -11 -377
4865 -377 122 370 -472 -1 442 -267 -299 500 118 -450 420 292 -479 -124 466 -127 -225 374 -75 -170 315
4886 315 199 -400 279 179 -350 109 352 -345 -26 588 -109 -372 412 8 -475 255 340 -494 -169 319
4906 319 -176 -461 377 -78 -345 169 130 -231 5 119 -235 -71 94 -314 -200 107 -271 -1 36 94 -257
4927 -257 231 452 -53 -76 320 -154 -280 441 429 -397 68 258 -133 7 404 -143 -399 75 201 -128 162
4948 162 311 -88 2 209 -129 42 182 -96 -14 131 143 -362 139 125 -272 -37 424 -168 -271 275 61
4969 61 -502 121 233 -305 -142 496 -157 -307 242 -196 -433 169 15 -161 31 182 -317 184 391 -420
4989 -420 -55 501 -220 -245 344 41 -541 208 346 -369 7 374 -260 -230 167 -34 -402 165 129 -258 132
5010 132 45 -207 -80 373 -334 -94 379 -64 -177 566 -78 -283 264 108 -343 -102 372 -160 -266 432
5030 432 113 -376 -8 278 -215 -111 298 -143 -196 142 54 -301 158 209 -100 8 161 -164 -154 204 51
5051 51 -65 171 128 -331 11 165 -266 -100 423 -206 -326 211 -60 -496 205 332 -322 -56 353 -148 -253
5072 -253 220 -108 -289 297 202 -288 121 290 -250 19 288 -171 -76 186 -150 -286 346 -37 -515 28 398
5093 398 -474 -22 490 -182 -148 319 -23 -455 2 284 -531 -3 226 -356 -87 233 67 -166 364 -27
5113 -27 -226 359 -37 -269 177 381 -362 -145 630 -182 -314 208 88 -358 230 265 -263 -172 324 -46 -262
5134 -262 273 -56 -32 130 240 -106 -107 57 -281 -17 109 -9 -219 86 -15 -324 134 200 -128 -39 151 -272
5156 -272 -147 296 -64 -510 207 206 -403 80 272 -335 -346 170 181 -344 72 49 -310 31 276 -51 -149 278
5178 278 -58 -246 325 -141 -616 106 38 -342 128 354 -465 -229 313 -262 -459 453 154 -366 261 290 -270
5199 -270 -89 377 -192 -238 206 -8 -85 184 -84 -318 300 189 -162 45 235 -330 62 254 -126 -227 317
5220 317 104 -243 127 224 -277 24 250 40 -180 183 177 -219 238 98 -171 -84 326 -194 8 5 -237 -139
5242 -139 122 87 -186 102 60 46 48 5 -126 -72 430 21 -284 134 157 -273 -33 213 -95 -326 295 -47 -365
5265 -365 -26 -22 -67 -25 191 16 -29 84 -86 -163 97 181 -148 10 125 -190 180 87 -139 -110 256 -227 -384
5288 -384 132 261 -306 113 221 -227 -113 297 -54 -297 236 47 -256 59 187 -140 77 379 -205 67
5308 67 306 -172 -1 161 -63 -77 111 67 -192 321 131 -162 -168 327 -6 -132 107 -52 -259 209 63 -280
5330 -280 19 153 -2 -155 31 -183 -77 242 -105 -38 147 6 -227 -46 206 -182 -75 115 -88 -202
5350 -202 191 -34 -225 22 212 -152 -98 397 -42 -205 65 168 -176 -13 195 -20 244 5 -14 129 90
5371 90 -68 38 -10 48 -84 48 5 14 54 -14 -74 -157 240 28 -340 209 205 -326 -62 371 -55 -204 404 175
5395 175 -53 21 212 -58 73 235 -281 82 183 -65 39 151 -23 -203 127 -82 -340 230 305 -330 -169
5416 -169 213 -87 -402 314 39 -202 116 136 -172 -195 318 -190 -82 349 -77 -81 128 -57 -291 -3 150
5437 150 -90 -19 203 -206 36 115 -52 -30 201 -107 -285 160 262 -107 45 175 -151 -60 145 -272 -201 102
5459 102 84 -145 -54 112 -37 126 114 -203 -30 208 208 -34 -7 13 -67 40 138 -153 38 34 -57 -213 39 114
5483 114 -236 101 250 -79 -115 187 158 -186 161 98 -177 -31 180 -18 158 208 -87 -152 356 -64 -206 183
5505 183 0 -250 -41 214 -332 -148 298 -153 5 129 -151 -292 78 185 -269 51 311 -83 -254 136
5525 136 52 -112 54 5 -199 113 -14 -330 -132 115 -347 -63 235 63 -236 176 -25 -292 206 128 -310
5546 -310 176 73 -125 -170 143 -69 -82 75 158 24 -64 189 -241 -94 14 -105 -163 215 4 -140 72 -221
5568 -221 40 234 174 -32 -9 176 104 36 112 169 -72 157 179 -115 -175 57 103 -98 171 77 -172 -181 65 -115
5592 -115 176 -37 18 -100 150 162 -109 46 36 -101 181 45 -244 -126 25 180 -304 29 30 -145 25 90
5614 90 -196 -137 141 -124 -265 291 -21 -123 -116 13 -132 -29 245 -30 -31 100 -36 -54 72 20 -207 54 -41
5637 -41 -292 100 92 -262 -30 140 -99 -399 205 11 82 289 83 -231 -1 71 -140 127 117 -75 -47 68
5659 68 9 -104 -6 -7 -167 -37 45 -74 -141 277 -184 -34 156 37 -81 144 108 -2 -116 175 -119 -96 62
5682 62 0 -82 37 220 49 3 140 -146 86 100 -188 -108 209 -95 17 -119 3 -138 -135 -12 -60 -132 39
5705 39 21 -344 -148 61 -78 -152 153 -82 -29 76 4 -95 62 187 -130 129 98 -4 77 203 -110 -173 -3
5728 -3 0 -38 243 -53 -160 208 -61 -182 100 272 -63 -87 176 -47 -104 -23 118 -125 151 54 -332 -82 172
5751 172 -74 -31 31 -74 -78 102 38 48 35 -50 -33 85 96 -96 91 73 -153 -145 116 32 -309 83 171 26 -94
5776 -94 33 59 -13 9 -127 -47 31 -80 14 -72 -6 40 -38 -78 -60 -85 195 -23 100 -80 55 -26 19 -34 -26 59 32
5803 32 -53 -225 65 34 -301 -139 88 -151 2 173 160 -77 139 134 36 -93 -82 -172 56 -69 -19 -103 251 -7
5827 -7 -109 23 113 -44 144 264 -182 -35 201 148 -246 88 133 -28 64 114 -197 -47 220 -120 -32 69 -119
5850 -119 -10 39 26 -199 165 31 -93 -44 200 -21 10 281 -175 -158 143 185 -157 205 -8 -22 -28 247 -179
5873 -179 -242 87 193 -25 -9 -20 -212 -81 77 -134 -130 117 -101 24 91 30 -211 -94 185 -167 7 9 52
5896 52 5 -19 -69 -159 56 85 -193 -52 102 -237 5 246 -19 -127 -12 41 -13 15 -54 -130 -68 4 -133 65
5920 65 227 7 -149 101 144 46 92 249 -86 65 255 -32 86 303 -14 -70 152 66 -176 80 336 101
5942 101 85 157 83 -146 75 -23 -136 -8 184 138 -11 133 33 -79 144 -128 -46 217 122 -166 167 -6
5964 -6 -156 -45 87 -198 -219 4 -60 -158 88 -34 42 -44 -59 -138 21 60 -134 -71 170 -35 -2 64 -54 -116 -23
5989 -23 331 -146 -145 95 -53 -184 72 7 -139 -145 56 -57 90 79 -77 -56 54 172 -94 39 30 118 -162 28
6013 28 -64 -13 181 -108 46 -3 140 -39 -117 185 141 -13 259 -66 -46 108 211 -177 -22 156 -299 -134
6035 -134 20 -113 -178 123 0 14 -72 68 21 17 53 -31 88 -14 -11 -57 -13 -9 -45 75 -17 -75 -35 175 33 32 -10
6062 -10 -148 -13 144 137 -207 32 -2 -135 -140 177 -37 -13 -15 -41 31 -50 -84 -143 -37 35 -107 -13 54 -179 36 227
6088 227 -60 -247 -117 -78 -104 -7 7 -241 -19 -32 -30 -65 9 -48 -169 2 161 -175 123 201 -20 98 127 71
6112 71 29 149 -18 39 64 93 23 219 169 -4 -136 287 57 -145 93 -4 -193 -94 305 -22 -125 78 122
6135 122 -63 36 126 74 -50 -114 -228 -18 56 43 63 127 56 6 61 -33 -155 41 -12 -261 -95 117 -5 -154
6159 -154 334 -34 -255 24 102 -32 43 -22 36 -88 -5 48 -50 79 193 -74 20 88 -168 44 134 147 -34 285
6183 285 110 -134 99 60 -172 35 367 -200 -19 186 -11 1 213 20 62 115 6 -146 -94 192 30 -100
6205 -100 5 -59 -198 25 93 20 257 5 26 -6 293 -170 -60 76 109 -217 -11 230 -113 50 100 -277
6227 -277 -15 329 -35 -43 136 -27 -56 -44 70 -92 -68 85 -36 -25 -49 -27 -72 -54 192 -258 109 2 -61 -59
6251 -59 89 4 -30 234 -25 -185 -70 177 28 -41 57 18 -134 78 83 -66 12 49 -56 34 17 -147 56 60 -125
6276 -125 86 34 4 -80 168 159 85 49 73 33 -109 201 -76 -185 67 158 18 206 211 -51 -174 51 -68 -135
6300 -135 46 65 59 210 2 -60 180 -115 58 87 26 -122 -165 32 15 -106 104 50 -106 -16 84 14 -263 178
6324 178 -10 114 41 58 -34 -48 271 -100 -41 159 -122 -56 183 114 -97 -36 -8 -157 -85 157 -125 -112 65 -46
6348 -46 -128 89 71 -215 -54 108 -97 -268 109 6 -53 85 112 -200 100 62 -3 155 102 -59 43 37 -168
6371 -168 -140 117 -4 -100 9 139 -189 -80 221 165 53 182 100 -116 259 2 -247 -184 178 -218 -179 149
6393 149 -35 -116 -24 -55 -178 122 214 -23 -90 90 -33 32 69 -132 -132 114 22 -157 -57 47 -141 37 84 -141
6417 -141 -11 69 -38 107 -66 39 -237 72 73 -37 -140 106 49 -85 80 97 -140 -104 210 -122 111 -18
6439 -18 -136 -15 251 112 -45 106 11 -182 111 81 -201 -59 62 49 -101 -47 204 -168 72 46 26 53 6
6462 6 69 7 106 -80 88 59 41 -7 49 266 -188 -59 22 -45 -148 285 -108 -266 79 135 -100 -47 106 -179
6486 -179 19 52 33 -44 -2 34 -91 31 142 -85 23 39 14 -7 31 17 78 115 173 -46 41 40 188 116 148 48
6512 48 -150 58 82 -32 83 -6 31 -103 37 -6 -108 91 144 -111 70 -17 19 48 114 -235 24 203 80
6535 80 42 -11 -205 -120 199 -53 2 -2 51 -92 30 277 -105 -148 -68 -29 -59 -129 21 -35 43 -15 31 -192 136 191
6561 191 90 57 63 -38 -23 185 64 15 152 -2 14 129 48 -142 189 192 -218 -23 29 -298 -153 5 -22 2
6585 2 35 72 -181 -176 120 -212 -114 -26 -20 185 128 30 34 114 -127 -48 32 70 -67 -65 235 -159 -80 33 -9 -64 -23 89
6613 89 -154 18 165 -117 -114 16 18 -33 71 -73 -7 -74 64 -85 99 114 -86 40 99 -18 -119 65 67 -25
6637 -25 -46 20 -45 -185 114 222 37 -5 44 -10 137 -35 -180 11 105 -60 -98 196 75 -80 150 24 -60
6660 -60 114 105 -83 -72 110 -86 -131 37 77 -74 217 70 -97 -35 -64 4 -185 58 -38 -135 -64 134 -114 -165
6684 -165 115 23 62 131 -41 125 131 147 -60 116 75 -163 -219 98 11 20 72 -32 -126 -18 256 -34 92 219
6708 219 65 -230 149 -26 -127 163 -125 -123 97 59 -74 -190 161 -76 -41 -71 -112 -60 96 50 -136 46 -23
6731 -23 -19 21 244 118 -175 -68 169 -15 76 188 -127 -122 203 10 -35 171 -43 -149 97 124 64 -17 97 -9
6755 -9 -15 83 -58 55 59 49 -41 42 188 -30 157 155 -42 -95 -85 21 -102 151 89 -292 -49 46 48 21 43 74 -221
6782 -221 -105 102 -106 14 12 63 66 161 15 -84 165 -20 170 -40 -5 -52 69 -99 -60 -5 118 -1 -95 28
6806 28 78 -78 4 145 -126 -65 149 -139 -79 345 99 -41 -18 93 -145 10 -97 -175 119 238 -147 70
6828 70 279 -59 105 116 -96 -159 286 51 -111 256 140 34 -43 -10 41 -63 237 60 -164 1 9 -111 -120
6851 -120 -116 -70 -128 164 39 -60 137 34 -97 135 125 -100 -43 192 88 -197 -92 67 -320 -8 -62 -121 -79
6874 -79 134 -13 16 183 113 -80 -91 39 -20 45 178 81 1 131 -14 -114 180 17 20 169 -65 155 37
6897 37 -5 -148 -22 316 -91 -165 14 119 -257 141 110 5 -65 -115 150 -46 30 58 29 51 -152 -223 106 -16
6921 -16 -50 -50 -60 -19 -159 139 70 -116 -11 193 -74 -107 70 70 -80 193 165 14 -18 150 57 42 12 72 -29
6946 -29 130 -327 -215 125 47 -130 17 10 -116 -65 26 -19 -409 164 -50 -128 156 165 -289 192 -19 -50 -57 37 -18
6971 -18 -121 -169 -74 -30 24 87 -207 -106 -53 43 39 108 44 -78 -7 -49 2 55 -178 -48 -78 -34 -164 126 239 -41
6997 -41 -54 171 156 1 -31 121 -237 -72 51 18 -36 178 -11 1 24 54 72 -109 -3 -79 -3 106 -68 -186
7021 -186 66 131 -107 14 -2 10 15 131 -216 -78 -90 212 -32 -94 36 -71 44 56 -88 -57 99 -151 -102
7044 -102 113 32 -31 73 49 82 -72 6 -15 -112 214 71 11 141 69 -281 -210 43 -232 -56 229 56 -204
7067 -204 43 54 -201 -122 133 -32 -138 73 77 -83 28 38 -79 133 176 -88 38 253 -17 95 -88 56
7089 56 -17 36 24 -105 149 -38 -171 -23 132 16 83 154 175 -28 68 79 -201 8 140 142 -14 137 -53 -35
7113 -35 127 -77 -122 -17 79 -93 49 -40 -99 -52 53 -76 -199 -46 110 43 20 210 16 -42 99 56 -176
7136 -176 -134 -26 -126 -47 119 57 17 161 -127 67 6 -157 87 31 -44 -44 105 -36 84 -40 91 -176 -18
7159 -18 32 -112 18 38 -43 -67 65 122 -18 26 83 -80 88 -105 19 -25 91 -53 -117 1 187 -83 -76 236
7183 236 -67 -49 211 13 -70 69 -44 -63 12 298 86 171 154 -7 -163 48 13 133 -66 41 -68 -94 -52
7206 -52 55 -98 243 34 -50 20 -8 -154 52 63 -120 79 126 -152 -100 94 -21 41 97 70 -162 33 78 -164
7230 -164 -149 -62 148 -59 123 51 -42 151 -124 -163 -51 52 -28 85 167 84 -81 95 79 -218 -59 48 -149
7253 -149 -104 31 35 -82 -19 92 -71 -32 -47 83 -43 -1 -207 7 19 56 -122 32 127 -94 71 120 17 -86
7277 -86 132 -107 -8 143 -122 -127 27 -96 -104 95 148 67 -208 64 -31 53 126 2 -153 -26 115 -78 -57 -85
7301 -85 105 -146 145 -17 -29 159 87 -72 -43 262 -36 45 107 -117 -146 -187 35 -125 -163 120 -123 -11 152
7324 152 -25 -70 -17 18 -175 -232 54 -137 41 -120 -112 -62 52 -55 -22 -47 29 -69 47 -26 -116 28 106 -105 -119
7349 -119 79 119 6 37 -124 -67 8 22 -127 -61 125 -123 -22 206 67 -198 -38 77 100 77 95 -113 -22
7372 -22 -45 -29 -34 125 12 113 17 264 -7 -27 24 -154 -100 180 -20 -150 -13 171 2 43 100 10 -87 149
7396 149 15 1 180 -82 40 -43 -23 -87 -80 -96 -255 -40 17 50 1 203 29 -37 160 -36 25 43 92 30 -152
7421 -152 73 7 42 79 -44 82 45 35 124 61 -31 -156 -45 99 -30 -41 -153 130 -95 -53 18 47 -41 121
7445 121 77 53 -53 135 10 -29 198 70 -93 51 -19 -210 166 -127 49 -7 -34 -100 -67 -62 -74 -12 86 33 16
7470 16 95 113 -49 -12 -24 -49 106 -31 -114 147 254 183 -182 -36 98 -52 -108 133 -48 -120 -19 54 38 66
7494 66 -44 -91 27 32 -71 -7 145 94 139 -5 58 -77 94 15 15 -58 -15 -203 102 141 6 -79 142 224 -26
7519 -26 12 -11 -18 59 -6 88 10 30 209 51 5 90 -43 -137 -15 -50 -50 -42 -29 -49 165 -36 -168 -11 7 -176 80
7546 80 41 -136 -50 99 -68 -35 205 203 85 77 46 3 -11 118 -54 -24 199 -52 -64 60 131 -29 -33 59 -211 -93
7572 -93 76 -147 -76 82 -12 -90 -60 229 -34 66 120 42 80 27 -27 -76 -193 -76 133 -26 56 -15 123 -16
7596 -16 62 -159 -97 43 -75 -2 7 2 144 164 0 -63 44 148 -96 277 45 44 206 -51 14 -29 -7 17 -47 -84
7622 -84 39 -39 41 114 -80 31 177 -76 -187 106 78 18 -9 6 -46 -149 8 44 -105 82 -51 111 273
7645 273 -144 -151 175 118 -114 -30 82 53 119 24 -44 -88 42 13 26 223 40 -49 81 5 1 72 200 -157 -115 2
7671 2 73 -117 129 -99 -243 -51 30 -120 -1 198 -114 -82 -117 -76 -89 -172 42 43 75 -109 119 86 118 -27 -95
7696 -95 10 6 -136 -104 -10 -28 -94 -23 144 -38 16 71 -40 -103 117 159 127 29 115 -4 -25 151 6 -118 -77 104
7722 104 -11 80 122 -30 6 -21 8 155 -37 23 -18 68 -80 25 -34 7 83 126 -215 19 50 70 -101 89 165
7747 165 -123 -100 59 -56 -120 39 92 -25 127 59 -5 6 141 77 43 220 20 -112 31 24 -145 77 -40
7770 -40 83 48 34 -77 29 -36 -67 -207 38 -133 20 43 75 58 -61 -39 -61 -15 -84 -62 -1 -52 -120 30 -8 41
7796 41 66 4 124 -48 -26 100 83 -249 -15 12 33 -6 156 26 -75 -26 -8 -54 7 -36 -29 -89 -19 57 5 20 22
7823 22 228 142 108 -46 -24 199 104 66 -70 -36 -211 6 -67 117 -9 -2 61 94 111 -17 -79 151 -106 -192 56
7848 56 -94 -139 -12 -26 15 165 101 -208 -129 118 -163 30 122 12 -31 122 -66 32 109 1 -111 75 42 90
7872 90 108 96 42 5 -19 148 0 -94 -52 -16 57 9 62 57 215 53 -66 85 -3 74 -43 -42 -83 196 102 99 -24
7899 -24 84 -54 -191 62 -120 -12 -49 102 -4 -8 11 8 -54 204 -30 -87 7 -204 -108 -24 217 89 43 -44 -14
7924 -14 16 34 14 97 82 -69 87 -51 25 80 77 122 137 -74 -1 -14 61 -29 -33 136 109 -24 16 -6 -84 -20 34 58
7952 58 -73 -40 -86 -2 4 -162 18 66 -112 87 54 -97 -65 30 -10 -37 73 -131 -87 69 80 128 -6 122 33
7977 33 30 83 131 -93 -65 61 -99 86 -50 -167 33 -58 12 -42 18 -88 47 86 18 14 -182 -79 29 118 21
8002 21 -128 -26 10 -139 -82 -59 -10 -64 57 1 -55 118 -38 78 28 -272 81 58 51 -29 -106 81 46 187 8
8027 8 -32 -79 -22 -22 -116 -41 -68 -39 -47 59 12 54 13 -3 -92 57 -70 -171 -6 9 89 -101 198 19 -155 -90 84
8054 84 12 -196 -15 31 -33 13 132 143 -104 38 200 -39 -14 -19 31 45 -62 1 -10 58 38 -117 -118 39 -51 -53 70
8081 70 -90 62 88 -154 -228 25 61 -211 153 51 -108 -20 134 -211 -45 138 -14 -176 -45 91 12 103
8103 103 67 31 65 -67 -90 -64 -39 76 56 19 67 -18 57 -100 137 15 28 194 -27 170 71 -31 4 -25 -12
8128 -12 49 38 9 25 -127 -38 -21 53 151 -77 -26 93 150 -11 147 -70 -49 84 -61 13 27 -97 -30 -86 -57 -58
8154 -58 19 -16 -125 -97 73 31 -171 119 84 17 -80 -15 77 159 -161 -37 94 -4 27 9 -20 -123 -134 10 129
8179 129 68 84 -21 35 -6 62 -94 -28 -101 42 -186 -25
8191b5
$$ Imaginary data points
##PAGE= N=2
##DATA TABLE= (X++(I..I)), XYDATA
0 0 0 0 0 0 0 0 8 0 0 0 8 -8 16 -16 16 -24 32 -40 46 -54 64 -76 90 -104 121 -141 164 -190 217 -247 281 -320
32 -320 363 -411 460 -515 576 -645 721 -799 888 -984 1091 -1206 1331 -1467 1617 -1783 1964
49 1964 -2162 2381 -2624 2895 -3199 3542 -3931 4381 -4900 5515 -6249 7151 -8281 9747
63 9747 -11723 14534 -18826 26104 -40643 80251 -401931 -971787 499483 134587 -872453
74 -872453 131844 542817 -509054 -184016 406785 -275426 -251922 369088 -118625 -259474
84 -259474 299608 -87306 -414898 207936 99089 -313018 197207 227659 -347129 12654
94 12654 237536 -386078 -166171 388542 -207735 -413809 276584 1173 -570535 -10285
104 -10285 219790 -369242 -243078 158129 -202169 -370662 -44077 -126224 -314584 -123318
114 -123318 -110016 -284231 -206951 -153111 -262596 -213600 -96835 -149187 -217423 -156911 -119380
125 -119380 -213581 -231780 -94415 -109487 -236377 -111209 -10900 -205131 -176589 56995 -80571
136 -80571 -184350 71864 3112 -229364 4072 73142 -209017 -39039 164624 -130334
146 -130334 -91447 193766 -72082 -160483 204376 20252 -220448 172060 110288 -303601
156 -303601 64584 246226 -288183 -101001 352842 -147325 -287763 306284 39508 -394061
166 -394061 141510 205702 -353800 -55484 247827 -246803 -180051 232310 -126341 -236734
176 -236734 186417 -38898 -269870 135404 31971 -300846 81273 132388 -310024 -22453
186 -22453 231642 -251023 -152839 296115 -103380 -277529 246073 72189 -325230 106850
196 106850 214474 -256893 -49341 261265 -118996 -155768 204638 15677 -161072 118747
206 118747 83204 -118455 52629 84629 -89412 27037 87885 -81789 750 113273 -57821
217 -57821 -52441 111866 -1513 -83917 68906 41826 -83896 13784 64370 -53080 -35133
228 -35133 55488 -5435 -57197 17638 36493 -42362 -36587 46465 9762 -74834 236 58788
240 58788 -56491 -54266 72770 -8155 -88430 52938 35332 -104378 20145 78471 -102402
251 -102402 -29035 116718 -70204 -93320 120888 -9961 -139121 90711 57777 -153723
261 -153723 33691 110216 -135981 -32248 134953 -96582 -87720 141932 -44824 -137231 126945
272 126945 16513 -173390 89299 84133 -191198 24772 157585 -166250 -71372 196899
282 196899 -87996 -160553 178297 15334 -209312 109900 113490 -199454 11816 168463
292 168463 -139418 -76077 169867 -55546 -122507 133694 13656 -132264 85062 51536
302 51536 -127509 48954 83228 -119111 12142 116592 -102839 -45745 136443 -54511
312 -54511 -102072 124630 15624 -135485 71586 77157 -130795 -2403 114160 -75666 -66368
323 -66368 96280 -6710 -87534 40520 35305 -60510 -7104 33934 -23180 -23855 8020 -3832
335 -3832 -10637 -6544 -3441 1362 -12981 -11515 9271 -9737 -15569 13874 -5167 -21081 10848
348 10848 -5319 -23822 20314 2895 -33450 27763 17520 -59616 15614 53157 -65073 -14850
360 -14850 89275 -45688 -66766 95509 -1506 -107527 78132 65768 -119600 24181 113230
371 113230 -102717 -42826 136879 -48528 -92036 127324 10547 -124916 89058 65331
381 65331 -129125 45086 115531 -112499 -16743 140576 -72875 -72736 142586 -13384 -108487
392 -108487 115759 37731 -129720 74610 91345 -123616 23615 132796 -99715 -44978
402 -44978 145295 -48968 -97142 135397 19386 -129669 85272 74913 -131010 22009
412 22009 118505 -90761 -38696 122782 -39490 -86691 89704 14076 -88554 53016 45931
423 45931 -75062 15805 53439 -57319 -6022 60227 -32492 -20277 55129 -18701 -35292 49669
435 49669 3624 -40108 40502 27165 -40533 16706 42809 -22880 -4233 45303 6389 -16645
447 -16645 20107 24319 -2559 -1535 24847 26275 -7712 966 41023 3972 -26331 41291 36582
460 36582 -39918 13338 59398 -34012 -24896 65852 -2939 -44344 53708 21504 -56340 29200
472 29200 36765 -55963 11634 52193 -52956 -11750 63878 -45206 -42182 73284 -17426 -67576
484 -67576 68696 15416 -91342 45404 55398 -97616 5746 93423 -75476 -45709 105146
495 105146 -29543 -83445 90818 23383 -97639 54256 62084 -91005 13927 87143 -67141
506 -67141 -22578 96662 -34920 -55020 89122 4278 -72326 67848 39865 -76596 33516
517 33516 62664 -67781 -594 77722 -44168 -30649 76150 -17195 -54690 61182 11572
528 11572 -65008 37936 36847 -63418 5457 50321 -48029 -23349 51121 -21677 -39997 37678
540 37678 717 -44905 16640 15244 -36572 -2266 17989 -21984 -12823 11372 -8122 -11291 1483
553 1483 -3716 -2178 -1834 -8753 3156 3465 -12778 1664 8975 -11618 -782 11393 -8436 398
567 398 15213 -8372 -1854 19354 -9036 -7251 26187 -6235 -17456 33092 4369 -32709 30734
580 30734 24676 -43536 14450 48972 -39427 -14889 61369 -17330 -42962 54098 12726 -54142
592 -54142 33982 36720 -50812 10584 49604 -40464 -11102 54777 -24457 -28479 53540 -7041
604 -7041 -42752 47505 13281 -54138 33515 36856 -55576 11344 55493 -46784 -17231 65164
616 65164 -24117 -43931 59451 7143 -57673 38714 33835 -56159 10365 49278 -40106 -14017
628 -14017 49656 -19431 -27478 41088 -3482 -33996 32228 10089 -38012 20895 24462 -36772
640 -36772 4558 33980 -26762 -11815 34219 -11582 -21095 27669 2268 -23784 17296 10971
652 10971 -21425 8002 16650 -15301 -166 17440 -7032 -4817 12151 -624 -3714 7275 1682
665 1682 -590 4088 982 2684 2330 -3460 5658 6478 -8267 3416 12626 -11523 -3487 19590 -9476
680 -9476 -15333 21739 968 -23927 16111 11660 -27955 5396 21665 -25455 -7874 26072 -18208
693 -18208 -18328 25719 -9994 -26424 23371 -796 -33469 20109 11791 -40187 9656 27831 -40840
706 -40840 -9477 41059 -28947 -31036 43831 -6197 -46728 31923 17999 -48923 10803 33953
718 33953 -38715 -9138 39250 -23551 -23736 35701 -8143 -30313 29509 4239 -34351 21534
730 21534 16408 -36373 9145 27597 -32760 -5694 35743 -22273 -22223 36057 -5559 -34107 26505
743 26505 12629 -36461 9631 24688 -28130 -7519 25750 -14560 -16828 19450 -3561 -17662
755 -17662 12388 1893 -15617 7069 3234 -14778 3973 6335 -13571 -501 9072 -9464 -4560
768 -4560 8393 -4851 -6349 5609 -618 -4710 1268 -1322 -763 1048 -4789 512 4762 -6387
782 -6387 -1364 9191 -5752 -6529 11496 -2409 -11989 10684 3156 -15257 7913 9281 -17173
795 -17173 2682 15448 -16035 -4680 20208 -11561 -14263 21638 -3911 -23093 18788 7632
807 7632 -28784 10223 20375 -26790 -3815 27331 -17774 -16509 26540 -6234 -24300 20682
819 20682 5063 -26378 12842 13224 -25600 5572 20603 -23418 -4235 26848 -17117 -16169 28334
832 28334 -5799 -26464 24026 9987 -30955 11464 22951 -25933 -4042 27161 -14435 -15020
844 -15020 23914 -2511 -19437 16106 5905 -18379 8900 10559 -15331 3677 12992 -12735
856 -12735 -1330 14668 -9748 -6795 15511 -4640 -11784 13590 2706 -14385 7643 9425 -11794
869 -11794 -455 11142 -5414 -5092 7359 -506 -4846 2757 932 -1290 812 -1121 1545 2486
883 2486 -3894 269 5112 -4167 -2862 6036 -2154 -5184 5779 -45 -6457 5110 1337 -7426 4717
898 4717 3429 -9631 3365 7074 -11164 -1093 11362 -9186 -7014 13628 -3925 -12468 12259
911 12259 2708 -16213 7900 9128 -16007 1699 13516 -13097 -4706 15579 -8240 -10094 16100
924 16100 -2011 -14608 13941 5085 -17864 8986 12342 -18039 1212 18326 -13276 -7567 19879
937 19879 -4680 -14193 16187 3744 -16696 9574 10374 -14676 2956 12893 -11166 -1630 13586
950 13586 -7837 -5254 14187 -4299 -9814 13180 1393 -13749 9568 7995 -14341 2838 12751
963 12751 -10226 -4206 12902 -3914 -8410 9144 1226 -8562 4832 3593 -6208 1690 3383 -4492
977 -4492 920 2743 -4101 1056 3412 -4520 -472 4244 -3591 -2294 4430 -1581 -3176 3542 177
992 177 -3358 1637 532 -1945 1191 -659 -1422 2429 -1639 -2827 4310 -568 -5913 4613 3145
1007 3145 -7972 1636 7262 -6850 -2918 8619 -3792 -5954 8173 -418 -7539 6547 2561
1020 2561 -8555 4375 5371 -8652 1874 8521 -8293 -2125 11223 -5725 -6546 11609 -958
1033 -958 -10165 9568 4455 -11816 5239 8963 -10510 -234 11483 -7316 -4614 11716 -3280
1046 -3280 -7925 10247 979 -10046 7522 4964 -10595 3846 8417 -10023 -916 10929 -6788
1059 -6788 -5835 11026 -2292 -9197 8100 2480 -10203 3837 5798 -8303 -60 6498 -5846
1072 -5846 -2420 6042 -3968 -3883 5735 -2410 -5455 5044 -278 -6444 3713 2474 -6345 1073 4334
1087 4334 -4994 -1759 4419 -1933 -2896 2760 -181 -2376 872 193 -509 801 -1129 29 1915 -1910
1103 -1910 -907 3417 -1150 -2574 3684 600 -3863 2799 2348 -3818 1314 3682 -3019 206 3904
1118 3904 -2697 -576 4525 -2487 -1521 5648 -1932 -4125 6310 728 -6684 5462 4574 -8088 1950
1133 1950 7976 -6946 -2682 9248 -3402 -6086 7911 487 -8128 5569 3951 -7928 2794
1146 2794 5874 -7539 -173 7534 -6088 -3135 8681 -3656 -6496 8016 278 -9043 5525
1159 5525 4450 -9188 1751 7093 -7474 -2643 7934 -4322 -5151 7158 -756 -6627 4995
1172 4995 1660 -6992 2791 3972 -6067 305 4911 -5097 -1795 5544 -2903 -3795 5246 -225 -5060
1187 -5060 3154 2082 -4582 1206 3105 -3145 -673 2706 -1548 -788 1790 -739 -65 1422 -1131
1202 -1131 -60 1702 -1256 -689 2407 -610 -1445 1914 27 -1785 1560 611 -931 1371 84 -1379
1218 -1379 1970 16 -2377 2688 1277 -3818 1667 3414 -4597 -599 5468 -2959 -3702 5975 -11
1233 -11 -5973 4159 2718 -5935 1986 4775 -5022 -935 5105 -3331 -2347 5349 -1930 -3760 5111
1248 5111 -405 -5648 4637 1853 -6534 3180 4768 -7144 -601 7082 -5073 -4048 7477 -1293
1262 -1293 -6707 5469 2150 -7084 2733 4503 -5881 61 5085 -4402 -1735 5096 -2768 -3064 5085
1277 5085 -945 -4348 4342 1176 -5442 2869 3412 -4695 598 4502 -3254 -1645 4669 -1058 -2529
1292 -2529 3297 402 -2459 2364 1145 -1992 1819 1272 -1748 1183 1609 -1301 801 2090 -1126
1307 -1126 128 2102 -749 -296 2034 -158 -290 1704 -155 -154 1486 -570 -14 2110 -902 -1211 2967
1324 2967 -456 -2560 2929 1534 -3912 1603 3320 -3585 -627 4202 -2501 -2173 4032 -1024 -3057
1339 -3057 3078 224 -3839 2541 1054 -4380 2138 2548 -5056 428 4496 -4514 -2037 5917 -2666
1354 -2666 -4745 5461 326 -6246 3410 3469 -6158 790 4802 -4777 -1726 4995 -2650 -3224 4691
1369 4691 -846 -3927 3948 383 -4627 3309 2307 -5436 1672 4042 -5009 -914 5634 -3190 -3338
1384 -3338 5633 -229 -4928 3638 2389 -4312 1309 2954 -3089 -32 3102 -2080 -585 2839 -1492
1399 -1492 -938 2923 -1094 -1613 2929 6 -2638 2184 1357 -2669 912 2207 -1814 -227 2130 -779
1415 -779 -592 1359 -415 84 994 -868 99 1477 -1251 -428 2128 -1195 -1555 2672 -403 -2696 2283
1432 2283 901 -3242 1191 1817 -3066 155 2422 -2653 -647 2652 -2430 -1754 3245 -1625 -2869
1447 -2869 3668 -394 -4611 3198 1865 -5392 1272 4137 -4878 -1301 5194 -2870 -3453 4761 -463
1462 -463 -4524 3671 1180 -4501 2406 2741 -4943 1361 4271 -4454 -596 5673 -3294 -2788 6048 -835
1478 -835 -4895 4761 2408 -5962 2323 4565 -4771 -270 5328 -2752 -2203 4875 -616 -3104 3562
1493 3562 616 -3229 2486 1408 -3079 1750 2423 -3326 828 3266 -3124 -782 4048 -1555 -2637
1508 -2637 3475 75 -3418 1582 1817 -2700 -21 1803 -1329 -643 511 -700 202 179 -1353 660
1524 660 455 -2140 272 1609 -1906 -836 2174 -1104 -1715 1718 -257 -1982 1488 87 -2102 1449
1540 1449 611 -2428 1425 1150 -2828 1108 2722 -3244 -342 4032 -2333 -2263 4667 -413 -4246 3932
1556 3932 1849 -4617 1897 3895 -4047 -63 4644 -3017 -1846 4795 -1507 -3264 4458 -171 -4362
1571 -4362 3895 1828 -5399 2614 4046 -5297 -334 5872 -3372 -3328 5838 -733 -4771 4193 1955
1586 1955 -4918 1713 3208 -3808 163 3388 -2810 -903 3597 -1991 -2144 3729 -966 -3213 3299
1601 3299 799 -3853 1957 2360 -3837 -165 3247 -2111 -1826 2660 -372 -2152 1682 626 -1660
1616 -1660 592 410 -947 411 -205 -699 742 -397 -1343 1048 33 -1899 580 1389 -2173 -276
1632 -276 1424 -1432 -906 1118 -893 -647 995 -1329 -757 1659 -1550 -1426 2714 -923 -3080 2668
1648 2668 1232 -4300 1151 3193 -3895 -1027 4027 -2200 -2751 3882 -182 -3554 2910 1185 -3503
1663 -3503 1515 2464 -3407 679 3374 -3255 -677 4369 -2466 -2526 4917 -528 -4089 3780 1573 -5153
1679 -5153 1859 4174 -4437 -807 4955 -2530 -2545 4290 -615 -3427 2991 555 -3315 1895 1278 -3354
1695 -3354 1061 2228 -3309 113 3185 -2658 -1603 3739 -1246 -3262 2825 824 -3314 1176 1732
1710 1732 -2451 -312 1694 -1245 -990 1051 -651 -366 923 -898 -301 1302 -1102 -694 1593 -593
1726 -593 -1433 1346 59 -1780 870 718 -1323 106 824 -1108 326 763 -1162 526 901 -1487
1742 -1487 357 1970 -2097 -642 2876 -1312 -2078 3179 270 -3339 2109 2115 -3318 470 3077 -2297
1758 -2297 -813 3186 -1320 -1637 2837 -555 -1762 2942 54 -2971 2869 1693 -3726 1684 3393
1773 3393 -3997 -331 4828 -2573 -2700 4604 -249 -4093 2779 1782 -3937 1225 2783 -3168 -16
1788 -16 3120 -2369 -928 3064 -1847 -1713 3202 -1011 -3081 2858 667 -3871 1731 2156 -3942 -37
1804 -37 3368 -2855 -1789 3283 -1034 -2627 2297 482 -2457 1156 780 -2092 626 1020 -1733 592
1820 592 1204 -1750 164 1653 -1803 -618 2190 -822 -1316 1724 364 -1581 740 848 -954 439
1836 439 578 -417 503 225 -1080 1180 693 -1809 1063 1537 -1992 124 2478 -1449 -1363 2637 -262
1853 -262 -1938 2112 446 -2237 1163 1142 -2275 781 1521 -2178 258 2283 -2461 -644 3245 -1735
1869 -1735 -2055 3640 -381 -3583 2958 1556 -4426 1322 3079 -3615 -646 3751 -2018 -2329 3283
1884 3283 -459 -2877 2547 548 -3161 1785 1277 -3387 1281 2447 -3344 -284 3303 -2826 -1915
1899 -1915 3962 -931 -3683 2965 1198 -3914 1288 2534 -3039 -551 2711 -1877 -1312 2221 -824
1914 -824 -1580 2149 -235 -1869 1491 190 -1929 1286 1128 -2255 493 1863 -1755 -630 1980 -755
1930 -755 -1323 1688 222 -1280 769 723 -658 188 256 -105 536 -20 -430 883 -151 -943 1239 579
1948 579 -1759 566 1535 -1596 -141 1568 -1027 -736 1523 -691 -1034 1576 -558 -1207 1666 -250
1964 -250 -1974 1810 897 -3189 1067 2464 -2979 -659 3479 -1822 -2159 3398 -264 -3417 2357 1414
1980 1414 -3500 891 2339 -2506 -105 2711 -2201 -1169 3147 -1291 -2277 3249 -253 -3385 2830
1995 2830 1446 -3825 1349 3114 -3527 -913 3807 -1683 -2493 3387 38 -3168 2209 1409 -2867
2010 -2867 708 1743 -1976 -71 2024 -1683 -416 2243 -1190 -1236 2191 -325 -1986 1914 771
2025 771 -2270 1235 1974 -1611 -389 1731 -468 -781 986 320 -536 418 127 -107 254 -110 224 869
2043 869 -573 -441 1046 -375 -900 1070 141 -1166 888 391 -1131 369 623 -1029 317 901 -1320
2060 -1320 260 1296 -1610 -426 2127 -1482 -1543 2563 -274 -2677 2082 1293 -3179 850 2789 -2729
2076 -2729 -1086 3027 -1285 -1966 2501 -273 -2275 1894 628 -2592 1284 1530 -2614 553 2624
2091 2624 -2682 -643 3607 -1809 -2578 3543 38 -3509 2360 1789 -3325 358 2668 -2381 -870
2106 -870 2773 -1101 -1617 2282 -445 -1868 1765 273 -2066 1523 1066 -2170 703 1761 -1960 -263
2122 -263 2518 -1347 -1527 2369 -253 -1924 1242 842 -1492 477 1335 -939 -211 1163 -195 -141 192
2139 192 -134 292 462 -659 192 824 -714 -349 1209 -361 -831 821 148 -775 282 92 -537 333
2157 333 -154 -597 820 -20 -1436 1004 535 -1903 251 1627 -1980 -662 2376 -1041 -1960 2033
2173 2033 262 -2427 1158 1158 -2129 284 1805 -1677 -204 1851 -1337 -836 2283 -847 -1645 2380
2189 2380 123 -2410 2000 1428 -2858 967 2575 -2733 -615 3507 -1285 -2060 2906 422 -2430
2204 -2430 1906 1375 -2370 828 1839 -1781 47 2022 -1505 -604 2181 -1213 -1325 2478 -193 -2327
2220 -2327 1973 1376 -2731 772 2118 -2021 -759 2030 -959 -1383 1777 54 -1341 965 561 -1190
2236 -1190 536 530 -829 554 501 -1056 50 856 -870 -215 1005 -444 -731 900 57 -929 646
2253 646 501 -737 -143 247 124 -4 -371 235 709 -411 -540 1157 -20 -1259 977 896 -1554 -99
2271 -99 1400 -983 -805 1371 -363 -1023 1229 96 -1084 1173 225 -1547 956 745 -1806 674
2287 674 1517 -1993 -269 2478 -1347 -1601 2719 45 -2552 1973 1428 -2796 488 2307 -1919 -560
2303 -560 2507 -1178 -1177 2337 -329 -1646 2005 235 -2191 1360 1197 -2448 838 2022 -2225 -374
2319 -374 2638 -1398 -1715 2650 -119 -2663 1607 1477 -2481 87 1857 -1789 -545 1705 -785 -1165
2335 -1165 1249 -317 -957 986 11 -1412 890 329 -1677 552 1168 -1465 -458 1290 -669 -1281
2351 -1281 881 302 -927 365 671 -307 -145 241 179 -93 -162 137 347 -458 -201 660 -293 -509 1013
2370 1013 220 -828 300 648 -713 90 677 -671 78 798 -567 -142 889 -865 -600 1567 -330
2387 -330 -1536 1598 598 -2222 907 1971 -1892 -581 2526 -1024 -1680 2280 115 -2145 1440
2402 1440 1095 -1982 537 1530 -1770 193 1634 -1642 -567 2250 -1209 -1820 2300 -104 -2512 1795
2418 1795 1428 -2584 410 2284 -2203 -969 2613 -855 -1932 1929 291 -2097 1211 805 -1940
2433 -1940 223 1295 -1317 -311 1215 -991 -610 1538 -503 -1183 1337 302 -1638 900 972 -1393
2449 -1393 -44 1462 -707 -781 1234 8 -933 435 647 -515 -293 290 34 -36 -110 119 128 -408 -206
2468 -206 560 -92 -295 271 96 -104 -18 112 -159 380 -182 -505 691 140 -842 602 820 -1271 140
2487 140 1610 -756 -744 1665 94 -1551 1513 888 -2061 353 1828 -1441 -434 1837 -836 -1083
2503 -1083 1429 -330 -1252 1354 397 -1611 1230 931 -2026 631 1681 -1809 -547 2308 -1099 -1840
2519 -1840 2075 84 -2262 1284 1298 -2093 184 1992 -1484 -631 1757 -674 -1029 1396 -494 -1562
2535 -1562 1233 376 -1620 815 895 -1744 277 1659 -1535 -538 1869 -629 -1389 1317 373 -1533
2551 -1533 653 1083 -1201 -149 1096 -350 -445 661 122 -329 574 -184 -95 406 -195 -265 442 -65 -390
2570 -390 383 402 -332 174 421 -279 -227 207 296 92 -244 -35 686 -130 -495 637 218 -1065 401 760
2590 760 -1052 -418 1140 -529 -972 828 76 -1150 695 256 -1193 358 757 -1139 134 1076 -978
2607 -978 -67 1243 -900 -1051 1460 -47 -1435 1055 841 -2021 490 1568 -1664 -430 1903 -698
2623 -698 -1287 1596 34 -1548 1177 517 -1644 720 1129 -1486 35 1383 -1016 -406 1659 -932
2639 -932 -1143 1703 -55 -1688 1198 882 -1751 242 1622 -1314 -650 1658 -451 -1015 1000 244
2655 244 -1114 611 503 -811 389 324 -686 261 675 -768 -33 925 -632 -463 844 -171 -914
2672 -914 397 591 -632 -144 595 -252 -276 328 89 -284 -7 172 146 -99 72 474 -10 -434 369 307
2692 307 -510 103 401 -427 -162 354 -278 -287 597 -425 -289 524 -155 -827 730 186 -1016 756 590
2711 590 -1219 -6 1535 -1130 -829 1447 -315 -1433 1262 412 -1560 517 1051 -1256 73 1220
2727 1220 -939 -466 1297 -678 -815 1569 -127 -1409 1224 592 -1766 677 1291 -1634 -143 1735
2743 1735 -1150 -1012 1692 38 -1398 1029 752 -1504 313 1095 -1085 -101 1170 -500 -549 1212
2759 1212 -179 -716 831 -42 -1177 702 538 -1121 325 1046 -964 -353 1257 -391 -871 659
2775 659 135 -1005 206 699 -371 -179 439 -125 -391 269 53 -212 -94 -37 -170 -48 -170 170 -27
2794 -27 52 -39 -183 19 225 -75 -214 292 79 -530 385 307 -783 7 902 -586 -874 997 264 -1235
2814 -1235 724 823 -1169 142 1096 -859 -321 1132 -298 -760 1056 216 -896 846 558 -992 470
2831 470 850 -1136 15 1277 -1009 -492 1498 -385 -1375 1213 679 -1707 552 1394 -1328 -150
2847 -150 1461 -622 -718 1214 138 -1148 868 420 -846 504 524 -1117 188 865 -1005 -334 1132
2864 1132 -498 -820 969 135 -1167 743 740 -1061 62 863 -882 -638 913 -73 -581 477 163
2881 163 -787 201 97 -346 130 330 -171 171 96 -234 -67 262 -107 -401 187 136 -223 112 269 -173 -158
2902 -158 249 486 -405 -235 630 166 -582 258 480 -588 -116 755 -238 -619 581 211 -526 361 225
2921 225 -639 94 381 -486 17 706 -513 -179 839 -342 -525 899 129 -1126 774 713 -1354 107
2939 107 1254 -803 -557 1132 -257 -872 1090 402 -1255 614 806 -961 -56 760 -761 -157 886
2956 886 -643 -553 913 -275 -894 958 300 -1294 498 922 -1157 -140 1229 -687 -683 926 -123
2973 -123 -724 480 341 -1006 58 546 -600 -169 595 -373 -127 546 -175 -378 571 -112 -696 337
2991 337 427 -518 -121 336 -336 -27 547 -65 -416 304 255 -399 62 219 14 -219 -73 236 -166 -100 127
3012 127 119 -281 41 246 -322 -132 234 -60 -11 244 -71 -102 297 -152 -167 310 184 -612 444 478 -762
3033 -762 3 828 -644 -455 990 -179 -931 692 436 -977 67 641 -581 -40 806 -247 -371
3050 -371 782 -361 -580 732 -54 -694 606 362 -963 154 840 -901 -290 1178 -815 -707 1008
3067 1008 -1 -1200 570 593 -1067 56 772 -528 -339 941 -339 -607 582 -60 -460 486 171
3084 171 -637 339 438 -709 50 720 -569 -294 963 -161 -732 579 408 -701 206 546 -518 -228
3102 -228 542 -70 -315 239 173 -336 90 163 -32 155 140 -335 -41 186 -22 -70 174 37 -154 112 215
3123 215 -22 -188 359 -4 -469 239 425 -577 -385 561 -231 -512 416 413 -739 133 554 -577 -252 616
3143 616 -450 -445 632 31 -556 344 272 -766 327 279 -909 196 605 -659 -374 1025 -158 -846
3161 -846 991 156 -994 320 879 -871 -183 1109 -522 -570 829 -56 -728 687 299 -836 264
3178 264 363 -834 59 747 -476 -268 1002 -402 -546 942 53 -743 612 507 -975 59 660 -558
3196 -558 -310 701 -29 -645 625 204 -446 124 341 -279 -88 243 -271 -144 337 -38 -152 287 -65
3215 -65 -313 193 184 -370 -42 302 -295 -333 357 156 -398 30 320 -333 -213 349 70 -584 162 253 -502 -146
3237 -146 371 -152 -694 339 108 -470 213 227 -689 1 306 -416 42 467 -283 -483 643 -300 -681 719
3257 719 227 -868 222 864 -744 -265 967 -285 -727 868 130 -842 407 453 -772 144 705 -492
3275 -492 -96 539 -359 -628 665 -146 -638 675 156 -873 443 640 -972 -11 1000 -533 -549 872
3293 872 56 -762 380 276 -666 95 637 -374 -127 636 -234 -303 470 -181 -337 383 8 -344 278 19
3313 19 -595 -44 522 -494 -354 617 118 -505 300 196 -470 -204 419 -307 -254 261 142 -349 -51 274
3333 274 -128 -344 145 -37 -190 153 134 -215 55 69 -195 104 167 -220 4 393 -130 -572 390 202 -574
3354 -574 224 516 -567 -177 667 -141 -611 652 247 -722 97 320 -535 -30 698 -317 -302 666 -33
3373 -33 -223 643 -18 -608 422 15 -705 468 746 -514 -8 820 -492 -521 848 -66 -832 406 466
3392 466 -867 135 646 -334 -185 713 -215 -441 402 -111 -548 495 148 -581 176 171 -463 -35 563 -270
3412 -270 -216 535 -8 -552 444 175 -636 5 480 -529 -392 445 -74 -489 122 47 -277 -69 148 -190
3432 -190 47 165 -233 -45 346 94 -48 248 -10 -139 19 242 -284 -116 129 -168 -574 202 231 -524
3452 -524 34 607 -172 -426 692 100 -591 134 648 -505 113 475 -233 -324 433 -16 -504 484 107 -430
3472 -430 295 242 -635 406 565 -516 -225 848 -459 -485 669 -114 -766 463 559 -707 84 769 -456
3491 -456 -221 830 -237 -563 473 63 -735 283 366 -481 95 477 -485 16 540 -189 -481 684 -102
3510 -102 -814 479 432 -885 -3 729 -523 -308 585 -129 -670 433 194 -524 41 486 -407 -61 174
3529 174 -136 -118 153 -11 -203 281 -10 -288 344 259 -303 -61 354 -137 -415 494 184 -441 217 495 -241
3550 -241 -237 671 -190 -401 400 239 -323 65 595 -55 -98 449 -12 -350 299 296 -275 388 359 -419 50 334
3572 334 -460 -290 563 -223 -469 635 175 -664 536 659 -660 -72 758 -412 -535 545 60 -670
3590 -670 569 304 -691 -56 386 -462 -53 675 -429 -284 614 -272 -454 561 -9 -989 473 646 -814
3609 -814 45 610 -414 -590 769 -75 -861 305 170 -684 81 559 -398 -175 415 -318 -203 531 108
3628 108 -206 296 57 -319 185 324 -578 -35 518 -249 -195 536 -56 -416 185 382 -437 -169 404 -233
3648 -233 -486 422 94 -378 120 508 -222 -309 311 -32 -148 225 208 -244 139 304 -169 56 466 -199 -111
3669 -111 332 -288 -365 412 110 -608 339 432 -663 -90 646 -329 -542 548 83 -711 422 196 -759 156
3689 156 524 -351 -199 585 -286 -383 489 26 -533 476 24 -635 50 364 -619 -150 692 -458 -263 627
3709 627 5 -790 519 498 -718 80 615 -615 -376 749 -21 -437 292 200 -430 287 55 -411 280
3728 280 426 -364 40 614 -358 -230 622 -21 -428 223 442 -676 156 593 -213 -334 412 -51 -518 171
3748 171 353 -296 12 353 -118 -191 240 -58 -275 19 128 -194 94 154 -228 115 272 -231 -283 376 -31
3769 -31 -330 415 308 -467 107 450 -253 -326 411 180 -521 276 357 -342 -11 541 -364 -277 195 148 -465 156
3791 156 -48 -466 355 -86 -400 117 511 -603 -111 792 -200 -569 712 -32 -799 449 366 -519 126
3810 126 738 -434 -353 685 -196 -312 477 329 -566 161 329 -363 16 596 -320 -257 590 -202 -167 492
3830 492 44 -556 414 563 -709 237 643 -274 -354 707 -5 -384 349 180 -422 92 335 -189 -149 299
3850 299 -100 -249 298 -141 -284 198 51 -390 132 239 -66 -11 428 -201 -226 364 314 -565 109 510 -281
3871 -281 -135 525 12 -265 189 415 -356 83 347 -218 -161 348 38 -232 201 43 -331 271 277 -328 -12
3892 -12 442 -353 -189 476 -387 -500 423 122 -596 431 412 -636 -75 965 -518 -614 690 124 -685
3911 -685 449 385 -521 103 445 -546 -169 723 -222 -323 679 -64 -579 487 93 -701 365 558 -660
3930 -660 -53 707 -335 -401 723 217 -616 327 445 -554 27 496 -262 -297 530 -228 -445 341 -28 -362
3950 -362 111 35 -369 181 402 -157 -29 352 -344 -464 426 -78 -591 234 332 -340 -94 560 -119 -318 515
3971 515 343 -575 222 276 -172 -261 342 6 -295 206 133 -358 65 128 -336 46 349 -250 -115 368 -269
3992 -269 -406 439 317 -420 211 578 -596 -151 891 -114 -362 462 276 -556 420 635 -519 -162 618
4011 618 -326 -357 601 -23 -532 485 170 -656 238 185 -412 -29 553 -567 -78 849 -270 -420 597
4030 597 175 -779 360 426 -776 -75 872 -363 -371 588 143 -612 249 173 -374 145 424 -204 53 366
4050 366 -152 -323 666 -377 -380 438 253 -435 86 367 -424 -109 422 -63 -333 378 214 -237 29 385
4070 385 -185 -307 209 -63 -323 108 156 -388 4 244 -140 10 191 -192 -114 331 56 -284 317 21 -261
4091 -261 203 353 -320 -4 532 -76 -423 467 266 -605 147 465 -425 -240 676 -85 -251 319 83 -408
4111 -408 321 198 -335 160 383 -415 140 679 -236 -218 579 -181 -501 673 177 -838 244 539 -618
4130 -618 67 573 -292 -659 469 135 -535 243 239 -457 191 506 -420 -215 480 -512 -242 411 -190 -515
4150 -515 346 102 -458 386 397 -552 -43 439 -338 -217 303 -120 -616 59 297 -651 -15 332 -191 -275 156
4171 156 185 -217 139 194 -395 200 193 96 -39 224 -137 27 328 -144 -159 315 153 -374 61 592 -266 -72
4193 -72 540 20 -437 258 489 -364 -55 422 -47 -291 395 77 -324 168 414 -206 110 342 -391 -93
4213 -93 271 -305 -192 502 -250 -560 461 238 -573 70 636 -553 -243 724 -287 -736 520 112 -625
4232 -625 219 239 -531 -103 434 -412 -185 501 -219 -532 502 -206 -531 371 173 -695 128 382 -478 -231
4252 -231 602 -321 -370 515 100 -559 114 535 -450 -75 543 -204 -302 505 -127 -243 496 196 -355 178 225
4273 225 -125 204 237 -207 -184 459 -129 -432 454 37 -440 363 434 -278 -207 485 24 -522 353 182 -238
4294 -238 27 382 -61 -100 204 -18 -307 62 194 -179 35 246 -371 -66 424 -280 -133 381 -156 -553
4314 -553 316 131 -384 161 467 -501 -195 683 -146 -448 480 329 -871 315 557 -464 -95 518 -472
4333 -472 -392 488 -123 -483 335 54 -512 276 480 -515 16 427 -342 -243 661 -253 -603 521 361 -575
4353 -575 274 570 -653 -37 664 -189 -457 567 -48 -704 247 362 -321 149 273 -250 -172 412 -148 -85
4373 -85 485 -162 -210 321 241 -461 351 418 -597 -142 564 -273 -353 282 224 -479 187 406 -131 -136 284 -109
4395 -109 -328 236 3 -323 80 68 -169 -189 99 167 -24 319 29 -135 132 -25 -371 89 332 -331 -117
4416 -117 495 -287 -653 395 132 -493 122 449 -484 -163 501 -155 -264 211 232 -300 192 273 -473 -10
4436 -10 265 -405 79 510 -351 -245 496 -214 -315 606 311 -573 175 683 -536 -74 796 -101 -434 419
4456 419 76 -388 239 292 -355 54 402 -222 -185 429 -152 -275 456 109 -420 367 157 -467 253 251 -466
4477 -466 -36 631 -208 -419 598 249 -601 39 488 -423 -200 419 -225 -207 154 -72 -317 181 126 -201
4497 -201 -81 244 -18 43 134 -198 -272 121 -32 -401 257 141 -453 78 206 -347 -462 348 200 -414 166
4518 166 435 -533 -347 557 -194 -245 204 -16 -299 19 124 -155 0 257 -143 -21 240 -94 -117 352 -163
4539 -163 -434 350 333 -673 65 239 -495 -188 728 -46 -550 554 148 -510 234 506 -387 -56 456 -143
4559 -143 -267 490 131 -309 211 256 -288 64 316 -358 161 412 -310 -153 640 -176 -478 386 85 -586
4579 -586 156 434 -548 -204 502 -306 -462 416 100 -268 203 265 -396 -31 196 -83 -47 233 -111 -174 358
4600 358 -211 -399 375 189 -334 91 566 -472 -374 454 -84 -435 211 149 -374 31 171 -213 -369 404
4620 404 201 -339 63 168 -154 44 46 -300 -103 67 -190 -102 350 -127 -243 327 75 -288 178 433 -260
4641 -260 -228 470 -132 -380 595 344 -573 189 624 -318 -106 513 -29 -367 285 -56 -410 181 210 -254 251
4662 251 220 -334 54 370 -269 -411 525 -201 -548 571 243 -601 111 458 -446 -134 572 -359 -550 361
4682 361 120 -503 79 237 -478 97 396 -235 -81 210 -84 -186 281 -1 -475 17 285 -471 232 480
4702 480 -397 -146 503 -183 -287 212 323 -613 235 508 -278 -130 532 26 -351 149 139 -207 92 251
4722 251 -46 20 309 -81 -47 203 1 -254 227 179 -327 212 257 -259 -195 454 -27 -485 542 319 -588
4743 -588 171 342 -360 -117 626 142 -429 354 66 -459 141 185 -370 -60 347 -216 -91 265 -100 -303
4763 -303 473 -74 -241 305 177 -590 -102 528 -509 -205 652 -201 -403 223 182 -466 57 280 -421 -166
4783 -166 423 -256 -305 383 -53 -276 338 179 -421 279 157 -347 27 369 -384 -206 316 -187 -512 207
4803 207 397 -415 -23 421 -202 -123 509 2 -285 178 97 -320 30 266 -142 48 106 -48 -26 96 -91
4824 -91 -137 190 82 -51 134 261 -223 -39 294 -223 -181 286 226 -163 169 360 -238 -211 462 -69 -395 174
4846 174 58 -366 141 239 -200 -201 272 -29 -115 197 -53 -146 205 -131 -398 -50 283 -336 45 424 -284 -261
4868 -261 594 -72 -539 287 324 -490 111 417 -198 -334 402 -77 -305 464 164 -362 250 123 -411 125
4888 125 226 -284 -138 461 -493 -99 323 -198 -470 347 238 -453 43 309 -136 -252 638 -105 -342 305
4908 305 113 -280 89 277 -179 19 276 -189 -8 254 43 -121 263 -82 -268 210 156 -366 92 474
4928 474 -199 -234 359 -17 -258 142 218 -220 -44 254 -279 -278 482 156 -243 250 170 -215 -127 247 -328 -28
4950 -28 307 -116 6 181 -19 -339 57 196 -362 141 225 -101 -140 426 -162 -462 357 118 -587 -6 318
4971 318 -550 -270 257 -86 -309 132 -73 -422 69 138 -370 117 256 -369 -94 232 -234 -277 362 -111 -410
4992 -410 411 444 -507 139 438 -435 -87 470 -107 -295 491 161 -454 136 194 -174 84 397 -282 -61 153
5013 153 -33 -314 250 129 -311 224 186 -166 92 409 -457 -195 314 136 -228 107 320 -378 97 464
5033 464 -193 -202 341 100 -345 68 117 -289 -142 157 -219 10 271 18 -59 196 -129 -156 62 143 -216 -51
5055 -51 294 -239 -346 474 19 -256 255 180 -437 -2 367 -313 -211 519 -52 -325 184 111 -277 132 94
5076 94 -321 -19 256 -237 -157 260 -66 -215 282 137 -363 208 262 -382 14 273 -147 -212 591 73 -368
5097 -368 457 195 -452 111 328 -142 -349 325 -44 -273 312 20 -191 299 265 -207 23 146 -444 177
5117 177 172 -274 -310 453 -101 -255 381 173 -273 103 302 -137 -123 293 45 -269 107 219 -167 -16 170
5138 170 34 -80 144 -112 -162 150 -114 -159 81 210 -214 184 142 -135 -211 304 -25 -264 62 179 -552
5159 -552 212 384 -200 -195 390 80 -451 312 82 -382 -13 186 -240 -33 254 -133 -275 284 -125 -352 210
5180 210 119 -331 176 200 -328 -63 280 -19 -232 371 85 -543 425 183 -451 169 266 -385 -313 425 -68
5201 -68 -300 253 -49 -257 254 188 -326 -27 242 -300 -146 232 -113 -173 354 -8 -340 279 205 -436 -128
5222 -128 290 -149 -270 271 -34 -336 33 121 -319 -99 137 -203 -73 108 -184 -218 193 -55 -380 -4 109
5243 109 -338 55 74 -361 -53 191 -91 -81 135 155 -203 252 82 -254 -44 179 70 -50 213 174 -112
5264 -112 -104 109 -107 -49 228 -68 -146 330 -4 -123 286 55 -216 112 70 -210 -16 181 -103 -279 248 187
5286 187 -416 162 269 -237 -19 363 -231 -243 321 83 -329 369 332 -209 108 -56 -55 -156 103 -224 -186 295
5308 295 -80 -316 202 131 -171 -5 216 -438 47 395 -304 -150 353 76 -282 296 11 -210 37 165
5328 165 -129 -228 99 -70 -46 144 -205 -243 117 104 -412 -15 169 -119 -8 296 -191 0 137 -187 -50
5349 -50 36 216 -182 15 237 -74 -44 258 135 -245 -75 155 92 -12 215 8 -74 109 64 -86 178 81
5371 81 5 221 154 -207 111 201 -31 -66 101 -21 -149 156 124 -364 66 97 -70 -203 145 107 -105 359 202
5394 202 -272 142 175 -117 16 49 -42 -90 341 -143 -226 194 50 -288 128 105 -274 -38 319 -304 -175 220
5416 220 -178 -218 194 111 -295 13 241 -212 -168 102 49 -218 131 -148 -101 129 40 -230 183 219 -37 31 249
5439 249 -49 -52 232 3 -114 72 102 -388 111 183 -105 17 109 0 -225 148 63 -7 128 -54 -170 60
5461 60 60 65 -49 40 -14 -8 215 217 -172 234 35 -250 84 81 -6 -256 54 -9 -257 56 135 40 -91 161 35 -169
5487 -169 288 99 -162 46 80 -220 -8 219 -29 -302 74 68 -82 244 -70 -167 25 48 -160 -103 93 30
5509 30 -72 279 51 -286 142 64 -146 -52 193 -371 31 315 -7 -124 240 -14 -105 181 35 -132 -267
5530 -267 172 9 -64 -20 -57 -9 208 173 -260 277 263 -182 283 337 -42 -123 164 -33 -130 -59 75 -159 -83 -29
5554 -29 -25 -46 230 64 -36 170 68 -178 28 41 -112 -81 30 -83 -43 89 -127 -17 115 -70 -135 66 29
5577 29 33 99 200 -88 -112 -12 150 -161 -88 144 -141 -89 68 98 -155 230 142 -48 183 -149 72 -63 177
5600 177 -63 -175 167 -29 4 175 38 -352 72 146 -220 125 150 34 -108 186 62 -196 -125 112 -183
5621 -183 19 117 -198 -28 140 -90 -275 97 44 -183 156 54 -271 90 60 -53 25 153 -5 -44 146 -53
5643 -53 -156 255 209 -97 -5 177 -193 -148 254 31 -37 280 -99 -45 153 42 11 18 91 -35 -39 71 -267 23
5667 23 368 -57 -118 99 23 -32 -126 192 83 -85 -37 11 -11 124 -33 -89 33 -57 -131 -44 98 -172 -74 75
5691 75 45 -81 129 177 -6 -30 -133 -36 -77 115 32 -64 46 104 -51 -37 107 57 -6 117 47 -261 135 85 86
5716 86 -185 126 -119 -71 66 0 -69 102 2 -157 138 98 -135 176 179 -24 99 111 31 3 128 -45 -33 174
5740 174 18 -66 -23 244 -189 -17 172 -47 -1 46 -106 7 173 -41 -42 116 -20 43 40 70 -64 40 84 -157
5764 -157 -56 86 -13 21 -3 -32 -229 40 60 -80 110 102 -43 -90 64 26 -258 -26 -20 78 -11 101 29 -47 63
5789 63 116 -206 -11 2 20 89 23 93 -70 6 -20 -75 164 -52 -122 81 70 -59 -39 184 81 -342 186 12
5813 12 -178 -51 199 150 -100 -91 -224 -53 267 -12 48 245 -12 71 -56 83 -126 115 135 87 -32 210 65
5836 65 -166 190 113 -191 6 283 98 -82 234 87 -47 157 -60 -37 -34 84 -200 -81 2 61 -55 -135 29
5859 29 -267 83 -20 -314 210 61 -89 -218 194 -44 -14 142 -51 26 226 121 -66 29 158 216 -179 -130
5881 -130 -150 59 65 0 -89 26 143 154 -58 120 -154 -77 127 95 -87 -52 42 -153 152 13 -159 -75 34 111
5905 111 -87 63 90 -52 -61 3 27 101 -80 62 63 20 -68 -56 38 28 13 143 13 -39 -11 137 -63 -118 101 -7
5931 -7 -114 15 210 -70 -81 -95 46 20 86 -15 -203 128 190 -114 -71 149 -68 -2 -52 -50 -104 116 -90 -83 180
5956 180 83 -204 23 184 -38 10 178 -146 -106 131 -78 -236 -131 109 31 -69 45 -69 -256 55 73 -31
5978 -31 238 22 -231 -18 96 -41 29 196 -71 -130 -32 -158 -85 67 149 -101 50 17 -78 48 87 -15 20
6001 20 248 -47 71 94 76 -39 73 146 1 -109 42 -5 -151 63 65 31 0 -37 -114 187 36 -16 -120 103
6025 103 52 -40 38 -3 -104 36 -25 -105 44 -121 -27 0 76 -29 -130 -10 52 6 85 127 -29 -65 113 -123 -119
6050 -119 -37 76 -1 4 22 -70 28 164 -41 -77 280 -108 -212 127 72 -115 -89 150 -23 -229 53 -162 -70 48
6074 48 -124 -1 44 119 -115 -64 47 -23 58 325 -94 -125 94 -46 -177 119 32 -50 97 177 -102 -41 118 124
6098 124 -52 149 12 106 222 58 -73 20 1 67 -4 -3 13 -104 63 16 -58 20 -27 -82 -53 238 -55 -291 89
6123 89 -78 1 52 20 -126 -43 111 -96 -135 -36 29 -63 -34 -31 -196 -32 32 139 -12 70 239 -60 111 44 -93
6148 -93 32 -190 -120 153 62 25 29 177 140 -119 109 -20 -210 48 -44 -119 -52 244 56 -1 222 28 152 -22
6172 -22 143 97 -26 227 38 125 5 99 -8 -5 70 -99 45 180 -26 -50 32 -170 92 341 52 -33 188
6195 188 182 -111 -46 201 -15 -60 41 14 -33 127 -98 -40 -30 82 -39 -132 169 -117 -115 241 -63 -16 -105 -78 -215
6220 -215 62 118 -95 12 222 -9 -89 80 -182 -24 -33 128 -251 -84 -24 76 -119 56 -81 69 269 -62
6242 -62 -147 -130 110 -157 -193 91 14 -245 113 -33 -305 168 -19 -76 -193 82 41 -115 71 -90 -147 169 16
6265 16 -94 -59 180 -93 -153 221 -138 60 77 55 -75 114 124 55 47 -169 49 144 231 -117 -65 95 -7 -90
6289 -90 98 84 -60 59 20 85 -22 100 -56 -172 -101 -33 -144 137 -46 -179 -68 155 -90 -131 117 -64
6311 -64 18 -81 110 -202 -238 9 -106 -89 4 104 -153 -58 21 -215 115 60 -72 -14 151 -151 -241 50 11 -93
6335 -93 33 155 -101 132 119 -220 -53 -14 -198 200 123 -26 72 145 45 -248 94 141 9 -236 169 78 -100
6358 -100 81 -46 -127 -44 172 -141 -197 78 -134 136 104 -79 14 36 -22 30 -9 167 -227 61 164 -137 -142 77
6382 77 29 -127 13 36 -222 3 256 0 -142 190 -57 -108 64 -94 12 32 191 56 -104 -30 -58 -163
6404 -163 73 -147 -165 194 15 -120 -119 105 -168 -17 -18 -1 -164 -32 160 16 -73 262 -150 -20 114 -77
6426 -77 -16 51 24 -109 93 175 -32 -55 -15 -164 -65 -9 88 60 5 27 -91 49 113 -136 -165 108 -111 -70 221
6451 221 82 -66 19 94 -79 -43 251 71 -62 -15 -24 72 55 177 93 125 101 -50 35 208 -14 -185 0 201
6475 201 -53 -115 266 -169 232 201 -211 -115 216 -24 -144 116 -138 -67 113 158 29 26 59 -39 -13 201 -23
6498 -23 96 25 -43 -138 134 -70 -33 -3 -92 -138 14 340 -5 13 260 21 -156 -34 29 -6 -109 193 81 -69
6522 -69 -28 41 -161 119 -33 -43 87 112 -37 -113 71 -4 -103 102 238 -267 47 51 -28 -77 197 -53 36 -35 -90
6547 -90 -69 10 229 47 -112 37 6 -69 208 -46 -134 199 248 -26 40 48 -117 -36 131 53 -63 41 9 -263
6571 -263 -12 255 -112 -160 81 -13 18 192 -3 -158 133 80 -293 -204 93 -193 -155 -92 -218 37 135 -113 -169
6594 -169 51 1 -246 24 27 -69 91 262 -135 -21 52 19 -154 61 90 -161 -71 85 -188 -63 213 -30 -138
6617 -138 0 -107 -170 13 76 7 -89 44 -39 -18 14 21 -89 95 29 -116 109 112 -145 -47 56 22 -139 180 115
6642 115 -32 -99 47 -24 -32 167 58 -144 -72 111 -180 -103 111 -49 -192 192 -74 11 143 23 -2 160 123
6665 123 -142 -80 -36 -141 57 251 -220 27 45 110 -130 -80 74 -236 -76 -50 40 -273 143 -117 -220 178
6687 178 -30 -28 -47 -115 -187 144 7 -68 -185 168 -371 -62 124 -205 -123 -18 223 -132 176 204 95 -76 -67
6710 -67 3 -188 -26 161 -67 -36 248 -54 -162 -78 27 -224 55 48 -217 130 33 -4 246 -95 2 -73 32
6733 32 11 -277 178 -1 -196 -38 66 -326 81 201 -106 1 131 185 8 11 32 65 99 225 -75 -79 2 -11
6757 -11 -95 49 -186 -98 38 35 -99 -68 5 112 -84 191 -18 -54 -48 15 -13 -3 -64 -167 -212 15 174 -65 106
6782 106 -106 -73 -59 84 -13 -46 138 -110 -93 113 179 -154 61 71 -110 7 98 -79 -89 123 60 -5 96 -15
6806 -15 2 127 212 -126 -40 141 -15 -58 256 -24 10 200 53 -140 -61 14 23 -29 238 -153 -190 197 -54 -125
6830 -125 -45 13 -232 70 56 -115 16 135 -56 43 0 18 -151 -117 374 4 -7 -96 157 -36 108 -145 -18
6853 -18 -46 129 -88 -112 223 73 -92 134 141 -336 141 -16 -83 86 113 -175 -89 196 -32 32 60 -68 -156 -30
6877 -30 -3 -288 42 18 -167 -62 -25 30 -111 163 -70 -126 4 55 -63 49 -92 -249 140 10 41 -51 124
6900 124 106 -82 106 239 -66 -28 92 -21 -104 16 114 -286 -58 19 -85 -220 156 68 14 164 -127 42
6922 42 200 53 -133 256 118 -94 -52 -72 -226 29 84 -4 -4 56 105 56 -188 129 65 -47 66 -30 20 53 -45
6947 -45 -8 -73 -27 -146 -14 56 -21 45 90 -53 -114 156 168 29 -49 -14 -44 24 98 -125 -212 185 80 -137 -167 83
6973 83 -128 -200 -121 86 204 53 233 51 -7 24 31 150 41 15 110 28 -124 -177 22 -9 -139 320 45 -228
6997 -228 112 237 48 -9 292 -79 -182 298 189 -78 -180 51 -55 -135 288 -21 27 12 -106 117 -80
7018 -80 -77 -260 134 -25 -67 -120 125 -19 -132 236 63 -157 133 5 -41 96 71 -44 -4 183 -18 83 -119
7041 -119 67 34 0 68 -199 49 35 -60 -22 -84 2 5 -75 -23 -144 183 166 -118 130 10 124 -61 112 79 -145
7066 -145 28 256 -60 147 124 -115 -249 24 125 -25 22 -101 -85 20 90 -80 -90 197 -62 -12 196 -56
7088 -56 -106 180 137 -21 130 18 -152 83 325 19 -188 77 31 -214 102 108 5 35 254 45 52 179 -8
7111 -8 -121 -47 -119 -103 7 -78 27 -54 90 -169 -45 100 -23 -73 31 72 -66 34 4 -61 -45 169 86 48 50
7136 50 -31 -160 19 30 -112 -68 -59 -114 -20 5 -70 -286 115 220 13 236 32 -14 -74 49 10 -37 -100 76 0
7161 0 -56 77 -68 -67 -1 -155 -190 179 118 -50 0 -87 110 104 218 -139 -65 -20 20 -29 -72 120 -107 -2 131 -34
7187 -34 83 113 -108 -75 66 -51 117 152 -173 -32 13 55 56 -39 243 -100 146 11 -185 83 37 -47 -89 85
7211 85 -24 -3 13 54 -58 -146 -13 -13 -84 154 89 20 8 140 29 103 167 32 -215 -17 18 59 -77 112 -260
7236 -260 81 66 -94 20 -100 99 50 -24 -63 53 167 -32 -23 49 105 14 -309 8 53 -6 -14 108 -27 25 -8
7261 -8 33 -177 59 90 -77 -38 39 105 191 91 28 66 -39 86 13 117 -23 82 139 46 -163 -29 45 12 -102
7286 -102 115 84 -106 -145 21 -278 0 106 22 -89 222 105 -74 59 79 -32 -58 2 -44 88 6 -127 157
7309 157 116 -84 -19 97 -121 -131 35 51 -105 -54 69 -108 -307 76 -44 23 -75 8 52 -97 134 -23 122
7332 122 -147 21 73 108 -30 20 -27 -2 110 130 92 7 48 117 -108 16 38 27 -266 -53 116 -65 1 134
7356 134 -31 -85 52 -73 -209 -5 60 -248 -122 174 30 -1 231 -79 34 -11 -109 -7 -15 101 -73 -33 242
7379 242 -85 -224 -44 -14 -108 91 -57 -4 -42 202 -97 62 41 48 1 -75 -102 -249 72 5 -131 174 137 -124
7403 -124 82 -5 89 6 14 -163 -212 69 83 -32 18 113 -14 -92 313 198 -142 135 -130 -150 49 260 -126 50
7427 50 43 -38 -22 -118 1 -136 39 71 -112 106 -67 -90 -191 220 -17 -137 57 -1 -47 72 72 -38 33 78 85
7452 85 -134 29 -26 5 -102 325 -48 25 -4 -30 -244 127 -31 -182 201 -109 77 -35 -128 -48 -47 27 30 7 -18
7477 -18 2 -81 -17 249 -45 35 1 34 10 43 89 71 -4 -34 25 32 -12 -129 -39 1 -133 -39 135 0 -32 8 -80 1
7505 1 157 204 -15 -99 -139 -115 -12 148 154 -22 59 21 -69 70 -5 -79 -11 54 70 5 -82 11 -74 -27 56 -48 -6 174
7533 174 29 -152 -22 -48 -225 -26 34 -231 178 -69 -163 -11 -47 -93 -225 5 -41 -149 59 1 -35 -139 141
7556 141 -130 -132 -48 0 67 -64 -67 108 172 -157 -5 58 -100 -44 -78 97 -29 -36 142 43 -33 13 -58 20 42 -94
7582 -94 -24 130 108 -22 -102 -103 66 -96 -41 -76 -98 2 99 27 -5 -53 -83 -247 74 -181 -134 53 -69 57 -25
7607 -25 161 155 -9 -15 372 -4 -20 112 -67 -103 43 61 -56 -102 189 29 -37 -1 -18 -29 139 -113 -210 49 89
7632 89 -86 -25 96 72 51 165 -21 51 136 -44 82 226 -26 -184 5 144 43 -8 52 -137 68 54 171
7655 171 12 140 21 -158 6 3 42 161 -129 -141 23 49 -51 15 115 -115 48 -32 -45 -163 -51 59 -56
7678 -56 -235 178 -35 7 -48 -63 52 -42 158 -20 6 252 -81 -32 10 3 -90 22 -3 41 24 -39 -46 138 51 -66
7704 -66 -78 5 151 3 77 72 78 19 35 48 55 127 -23 -31 -82 -35 -3 -31 -89 56 166 30 25 45 -133 28 -55 -119 34
7733 34 41 -39 -148 32 -87 -23 1 -144 -29 -112 -13 -7 181 76 26 39 84 95 86 -31 -170 97 32 -150 -244 -24
7759 -24 31 -57 -10 -122 -12 208 -77 96 -79 135 -65 -20 -108 -85 124 66 22 56 129 52 -63 -48 22 -136 98
7784 98 -225 49 -60 273 95 -29 -17 140 -35 16 -5 -91 45 -107 -229 8 -70 109 -53 -42 41 -318 -23
7807 -23 21 -92 73 52 -23 -169 145 68 281 125 165 101 -95 185 62 42 38 -153 86 -18 90 -68 139
7830 139 110 -90 -73 -24 -38 -91 51 -26 -191 -2 117 -94 -107 -35 15 -68 -24 -64 -107 114 48 -87 -15 138 111
7855 111 -73 122 44 109 154 41 -183 127 -10 -92 -66 29 142 -71 95 -85 -146 6 -13 55 137 10 18 149
7879 149 94 -2 71 57 71 -74 95 71 -27 -100 99 -90 70 115 -119 114 19 -63 -45 15 242 -270 -58 149
7903 149 -163 -28 52 -18 -132 -63 181 -66 -30 61 -148 85 255 26 24 -97 -10 -39 -94 -171 31 14 178 1
7927 1 -65 70 -103 -64 111 47 -162 76 -83 34 91 136 -52 -17 48 96 -13 -36 36 58 156 5 -91 -11 75 78
7953 78 -74 -1 -28 -113 84 42 -47 -28 162 95 -19 -78 21 -70 202 237 -140 7 57 -102 -70 17 -51 165 -97
7978 -97 -49 24 134 142 6 -147 -30 -161 -86 18 248 -16 -63 145 -206 60 62 68 -129 143 -39 19 29 -7 -47
8003 -47 -122 7 15 112 -23 68 -20 214 48 133 -89 43 112 97 -87 -57 32 -80 -142 53 7 -126 -33 115 -24
8028 -24 -13 -104 -11 -105 36 119 -40 -5 33 -255 -7 65 -80 -159 -58 -61 95 44 -15 -188 -105 -17 -26 -74 51 -7 -173
8055 -173 -35 -14 -61 -27 -33 30 -98 148 -9 -121 154 -80 46 24 5 -103 11 164 -95 100 -118 9 94
8078 94 104 7 -121 96 90 -180 -21 -10 38 -114 20 79 21 -57 -42 -20 -5 73 -143 -59 111 -3 -64 -108 -59 16
8104 16 -11 -84 -11 10 94 -64 87 55 -130 29 56 -163 -50 -3 76 -102 -148 161 -77 -99 93 -14 -129 49
8128 49 -18 -141 -156 106 4 -22 30 204 147 140 93 -55 -127 45 176 -101 -17 -81 23 13 106 -38 -103 -6 -45 54
8154 54 50 108 62 79 -103 -190 -16 -143 -29 -159 139 74 -61 33 17 -27 122 -101 -97 84 111 -3 176 66 -221
8179 -221 -205 -28 133 -210 -123 13 -60 48 27 -55 16 10
8191A0
##END NTUPLES=NMR FID
##END=
