##TITLE=1H_MTBDP0308
 CDCl3, 8 sc, 
 4.08.2021
##JCAMPDX= 6.0         $$ Bruker NMR JCAMP-DX V2.0
##DATA TYPE= NMR FID
##DATA CLASS= NTUPLES
##ORIGIN= UXNMR, Bruker Analytische Messtechnik GmbH
##OWNER= root
$$ XWIN-NMR		Version 3.5
$$ Wed Aug  4 08:50:01 2021 Russian Standard Time (UT+4h)  she@DPX200
##.OBSERVE FREQUENCY= 200.131506
##.OBSERVE NUCLEUS= ^1H
##.DELAY= (6, 6)
##.ACQUISITION MODE= SIMULTANEOUS
##.ACQUISITION SCHEME= undefined
##.AVERAGES= 8
##.DIGITISER RES= 18
##SPECTROMETER/DATA SYSTEM= spect
##.PULSE SEQUENCE= zg30
##.SOLVENT NAME= CDCl3
##.SHIFT REFERENCE= (INTERNAL, CDCl3, 0, 15.7039)
##AUDIT TRAIL= $$ (NUMBER, WHEN, WHO, WHERE, WHAT)
$$ ##TITLE= Audit trail, XWIN-NMR		Version 3.5
$$ ##JCAMPDX= 5.01
$$ ##ORIGIN= Bruker BioSpin GmbH
$$ ##OWNER= she
$$ F:/spectra/data/she/nmr/H-F/1/audita.txt
$$ ##AUDIT TRAIL=  $$ (NUMBER, WHEN, WHO, WHERE, WHAT)
(   1,<2021-08-04 08:48:49.82 +0400>,<she>,<DPX200>,
      <created by zg, POWCHK disabled, PULCHK disabled
       configuration hash MD5:
       00 E9 B6 7A A2 85 ED C7 34 08 36 98 17 FE 4E 26
       data hash MD5: 16K
       26 05 B1 27 8C BF 28 5C E1 C4 74 0C 3F 58 6E 9D>)
$$ ##END=
$$ 
$$ hash MD5
$$ 1C 10 F5 5E A1 C0 59 FA 7C 6C F2 24 5F 02 F3 B6
##$RELAX= 
##$RELAX= 
##$RELAX= 
##$RELAX= 
##$RELAX= 
##$RELAX= 
$$ Bruker specific parameters
$$ --------------------------
##$DU= <F:/spectra>
##$EXPNO= 1
##$NAME= <H-F>
##$PROCNO= 1
##$TYPE= <nmr>
##$USER= <she>
##$AMP= (0..31)
100 100 100 100 100 100 100 100 100 100 100 100 100 100 100 100 100 100 
100 100 100 100 100 100 100 100 100 100 100 100 100 100 
##$AQSEQ= 0
##$AQ_mod= 1
##$AUNM= <au_zg>
##$AUTOPOS= <>
##$BF1= 200.13
##$BF2= 200.13
##$BF3= 200.13
##$BF4= 200.13
##$BF5= 200.13
##$BF6= 200.13
##$BF7= 200.13
##$BF8= 200.13
##$BYTORDA= 1
##$CFDGTYP= 0
##$CFRGTYP= 5
##$CHEMSTR= <none>
##$CNST= (0..31)
1 1 145 1 1 1 1 1 1 1 1 1 1 1 1 1 1 1 1 1 1 1 1 1 1 1 1 1 1 1 1 1 
##$CPDPRG= <>
##$CPDPRG1= <>
##$CPDPRG2= <>
##$CPDPRG3= <>
##$CPDPRG4= <mlev>
##$CPDPRG5= <mlev>
##$CPDPRG6= <mlev>
##$CPDPRG7= <mlev>
##$CPDPRG8= <mlev>
##$CPDPRGB= <>
##$CPDPRGT= <>
##$D= (0..31)
0 1.2 0 0 0 0 0 0 0 0.06 0 0.03 0 0 0 0 0.0002 0 0 0 0 0 0 0 0 0 0 0 0 
0 0 0 
##$DATE= 1628052529
##$DBL= (0..7)
120 120 120 120 120 120 120 120 
##$DBP= (0..7)
150 150 150 150 150 150 150 150 
##$DBP07= 0
##$DBPNAM0= <>
##$DBPNAM1= <>
##$DBPNAM2= <>
##$DBPNAM3= <>
##$DBPNAM4= <>
##$DBPNAM5= <>
##$DBPNAM6= <>
##$DBPNAM7= <>
##$DBPOAL= (0..7)
0.5 0.5 0.5 0.5 0.5 0.5 0.5 0.5 
##$DBPOFFS= (0..7)
0 0 0 0 0 0 0 0 
##$DE= 6
##$DECBNUC= <off>
##$DECIM= 32
##$DECNUC= <off>
##$DECSTAT= 4
##$DIGMOD= 1
##$DIGTYP= 9
##$DL= (0..7)
0 120 120 120 120 120 120 120 
##$DP= (0..7)
150 150 150 150 150 150 150 150 
##$DP07= 0
##$DPNAME0= <>
##$DPNAME1= <>
##$DPNAME2= <>
##$DPNAME3= <>
##$DPNAME4= <>
##$DPNAME5= <>
##$DPNAME6= <>
##$DPNAME7= <>
##$DPOAL= (0..7)
0.5 0.5 0.5 0.5 0.5 0.5 0.5 0.5 
##$DPOFFS= (0..7)
0 0 0 0 0 0 0 0 
##$DQDMODE= 0
##$DR= 18
##$DS= 0
##$DSLIST= <SSSSSSSSSSSSSSS>
$$ [...]
##$SUBNAM2= <"">
##$SUBNAM3= <"">
##$SUBNAM4= <"">
##$SUBNAM5= <"">
##$SUBNAM6= <"">
##$SUBNAM7= <"">
##$SUBNAM8= <"">
##$SUBNAM9= <"">
##$SW= 20.0188882624521
##$SWIBOX= (0..15)
0 0 2 0 0 0 0 0 0 0 0 0 0 0 0 0 
##$SW_h= 4006.41025641026
##$TD= 16384
##$TD0= 1
##$TE= 0
##$TE2= 300
##$TE3= 300
##$TEG= 300
##$TL= (0..7)
0 120 120 120 120 120 120 120 
##$TP= (0..7)
150 150 150 150 150 150 150 150 
##$TP07= 0
##$TPNAME0= <>
##$TPNAME1= <>
##$TPNAME2= <>
##$TPNAME3= <>
##$TPNAME4= <>
##$TPNAME5= <>
##$TPNAME6= <>
##$TPNAME7= <>
##$TPOAL= (0..7)
0.5 0.5 0.5 0.5 0.5 0.5 0.5 0.5 
##$TPOFFS= (0..7)
0 0 0 0 0 0 0 0 
##$TUNHIN= 0
##$TUNHOUT= 0
##$TUNXOUT= 0
##$USERA1= <user>
##$USERA2= <user>
##$USERA3= <user>
##$USERA4= <user>
##$USERA5= <user>
##$V9= 5
##$VALIST= <valist>
##$VCLIST= <CCCCCCCCCCCCCCC>
##$VD= 0
##$VDLIST= <DDDDDDDDDDDDDDD>
##$VPLIST= <PPPPPPPPPPPPPPP>
##$VTLIST= <TTTTTTTTTTTTTTT>
##$WBST= 1024
##$WBSW= 4
##$XGAIN= (0..3)
0 0 0 0 
##$XL= 0
##$YL= 0
##$YMAX_a= 78295
##$YMIN_a= -74873
##$ZGOPTNS= <>
##$ZL1= 120
##$ZL2= 120
##$ZL3= 120
##$ZL4= 120
##$ABSF1= 10
##$ABSF2= 0
##$ABSG= 5
##$ABSL= 3
##$ALPHA= 0
##$AQORDER= 0
##$ASSFAC= 0
##$ASSFACI= 0
##$ASSFACX= 0
##$ASSWID= 0
##$AUNMP= <proc_1d>
##$AZFE= 0.1
##$AZFW= 0.1
##$BCFW= 1
##$BC_mod= 2
##$BYTORDP= 1
##$COROFFS= 0
##$CY= 11.3945322036743
##$DATMOD= 1
##$DC= 2
##$DFILT= <>
##$DTYPP= 0
##$F1P= 2.36226072786647
##$F2P= -0.459571619588291
##$FCOR= 0.5
##$FTSIZE= 0
##$FT_mod= 4
##$GAMMA= 1
##$GB= 0.15
##$INTBC= 1
##$INTSCL= 1
##$ISEN= 128
##$LB= 0.24
##$LEV0= 0
##$LPBIN= 0
##$MAXI= 10000
##$MC2= 0
##$MEAN= 0
##$ME_mod= 0
##$MI= 1.114404
##$NCOEF= 0
##$NC_proc= 0
##$NLEV= 6
##$NOISF1= 3.799351
##$NOISF2= 2.8
##$NSP= 1
##$NTH_PI= 0
##$NZP= 0
##$OFFSET= 15.70392
##$PC= 1
##$PHC0= -13358.07
##$PHC1= 16.80099
##$PH_mod= 1
##$PKNL= yes
##$PPARMOD= 0
##$PSCAL= 0
##$PSIGN= 0
##$REVERSE= no
##$SF= 200.130013532006
##$SI= 16384
##$SIGF1= 3
##$SIGF2= 2
##$SINO= 400
##$SIOLD= 16384
##$SREGLST= <1H.CDCl3>
##$SSB= 0
##$STSI= 0
##$STSR= 0
##$SW_p= 3612.71676300578
##$SYMM= 0
##$S_DEV= 0
##$TDeff= 0
##$TDoff= 0
##$TI= <>
##$TILT= no
##$TM1= 0
##$TM2= 0
##$TOPLEV= 0
##$USERP1= <user>
##$USERP2= <user>
##$USERP3= <user>
##$USERP4= <user>
##$USERP5= <user>
##$WDW= 1
##$XDIM= 8192
##$YMAX_p= 0
##$YMIN_p= 0
$$ End of Bruker specific parameters
$$ ---------------------------------
##NTUPLES= NMR FID
##VAR_NAME=  TIME,          FID/REAL,        FID/IMAG
##SYMBOL=    X,             R,               I
##VAR_TYPE=  INDEPENDENT,   DEPENDENT,       DEPENDENT
##VAR_FORM=  AFFN,          ASDF,            ASDF
##VAR_DIM=   8192,          8192,            8192
##UNITS=     SECONDS,       ARBITRARY UNITS, ARBITRARY UNITS
##FACTOR=    0.0002496,     1,               1
##FIRST=     0,             0,               0
##LAST=      2.0444736,     0,               0
##MIN=       0,             -74873,          0
##MAX=       2.0444736,     78295,           0
$$ Real data points
##PAGE= N=1
##DATA TABLE= (X++(R..R)), XYDATA
0 0 0 0 0 0 0 0 0 0 0 0 0 0 0 0 0 8 -8 8 -8 8 -8 16 -16 16 -24 24 -32 33 -40 48 -56 64 -72 80 -89 102 -113
37 -113 128 -143 159 -177 195 -218 242 -266 296 -327 359 -395 435 -482 530 -584 644 -712 787
56 787 -875 972 -1086 1220 -1383 1579 -1825 2146 -2579 3201 -4182 5944 -10174 46158 12735
71 12735 -14491 78295 31144 -7061 46319 55823 10811 39117 40636 3533 23185 42598 2822
84 2822 17397 43248 10131 6456 30327 -235 656 33781 1566 -17141 34177 17500 -32960
97 -32960 13179 38003 -25118 -11567 39123 -5968 -25077 28814 15301 -18897 16222 23619
109 23619 -10182 5799 21481 -566 12331 28512 3762 12904 32690 2728 4708 37140
121 37140 14048 4259 40660 24469 -4587 31215 33611 -9327 17667 48394 3679 1294 42072
134 42072 14787 -8727 25289 20581 -2881 18838 21009 -2503 11298 18167 -6713 4380 19991
147 19991 -4874 1009 22575 -4618 -8266 22888 1408 -17735 18861 16158 -18683 6538 24893
160 24893 -10820 -5018 25057 -707 -9452 21890 8444 -9558 16950 15231 -5916 10867 16130
173 16130 -2937 8469 17517 -2516 7741 23247 -2847 -1804 25001 2402 -10769 21332
185 21332 13370 -12421 11655 18560 -11605 -660 19477 -5272 -7686 17994 2173 -11605 9669
198 9669 4121 -10865 5077 4714 -8884 4340 5605 -10733 993 8897 -10979 -3906 14020
211 14020 -6842 -10354 14642 249 -15194 10518 8686 -14094 3012 13768 -8407 -3332 13769
224 13769 -2226 -6190 11918 1548 -6465 9970 3720 -6180 8783 4994 -7304 7278 8127
237 8127 -9331 3843 13847 -8621 -4261 16862 -2687 -11788 14277 5077 -13915 7237 10353
250 10353 -11743 311 11673 -7612 -4554 11313 -3385 -7797 9291 -516 -8922 7974 1281
263 1281 -10547 6660 4116 -12526 3269 9314 -12706 -3624 13506 -7727 -11326 13249 -50
276 -50 -15609 7758 6378 -14560 1067 9130 -10567 -4141 8753 -6574 -7361 7658 -3350 -9094
290 -9094 7017 -811 -10733 5599 1919 -12102 3744 6056 -12370 -633 10530 -9787 -7850
303 -7850 12185 -3370 -13243 9134 3975 -13494 3644 7809 -10777 -991 8553 -6992 -3658
316 -3658 8230 -3482 -5592 7791 -1403 -7679 7359 1293 -9458 6822 5064 -11144 3043
329 3043 9621 -10360 -3212 12392 -5068 -8693 11234 1413 -11890 6318 6118 -10884 1707
342 1707 8338 -7820 -1515 7989 -5550 -3932 7370 -3474 -6150 7385 -806 -8957 6617 2676
356 2676 -11592 3759 7152 -11675 -1324 10597 -8009 -7154 10525 -2069 -11545 6463 3533
369 3533 -11412 1911 6642 -9158 -1567 6688 -6999 -3928 6606 -4853 -5356 6968 -2086 -8008
383 -8008 5817 976 -10187 3842 5535 -10185 415 8709 -8345 -4675 9496 -3565 -8279
396 -8279 7828 2008 -9150 3642 5201 -7687 15 6266 -5315 -1121 6329 -3913 -2216 6397
410 6397 -2637 -4138 6629 203 -6363 5658 3745 -7838 3025 6992 -7122 -777 8841 -4263
424 -4263 -4122 8638 -188 -6125 5875 3355 -6040 2820 5026 -4726 1288 5533 -4275 -138 6127
439 6127 -3977 -1864 7391 -1682 -4616 7086 938 -7116 4698 4606 -7966 1306 7705 -6269
453 -6269 -2694 8011 -3280 -5795 6173 116 -6676 3584 2609 -6345 988 3560 -5692 -602
467 -602 4668 -5109 -2025 5750 -4167 -4297 6415 -1601 -6802 5037 2184 -7689 2390 5792 -6631
482 -6631 -1461 7322 -3696 -3986 6782 -387 -4949 5136 2023 -4837 2898 3395 -4097 1768 4717
497 4717 -3813 677 6018 -3405 -1347 6913 -1628 -3839 7207 1464 -5196 4759 4511 -5488 1531
512 1531 6775 -3807 -1335 7012 -1734 -3220 5890 329 -3714 4413 1604 -3991 3197 2782 -4116
527 -4116 1619 4441 -4444 -163 5858 -3673 -2773 6872 -1300 -5291 5515 1589 -6409 2786 4543
542 4543 -5464 -449 5748 -3848 -2852 5632 -1808 -4142 4859 -41 -4737 3650 1435 -5272 2033
557 2033 3225 -5425 169 4997 -4722 -2582 6313 -2754 -5269 5888 278 -6740 3624 3433 -6356
572 -6356 464 5238 -4391 -2102 5456 -2178 -3535 5057 -475 -4477 4268 1297 -4471 2866 2846 -4308
588 -4308 1531 4321 -3873 -728 5859 -2283 -2906 6235 46 -4677 4874 2530 -4905 2353 4496
603 4496 -3780 -68 5072 -2060 -1890 4742 -439 -2645 4467 316 -3408 3806 1327 -3962 2550
618 2550 2876 -4242 672 4169 -3676 -1596 5314 -2138 -4007 4684 390 -5400 3018 2224 -5219 722
634 722 3287 -4013 -1266 3461 -2673 -2478 3492 -1639 -3986 3122 -543 -4663 2661 1188 -5344 1113
650 1113 2949 -4893 -1034 4164 -3241 -3515 4337 -973 -5167 3319 1180 -5278 1527 2871 -4541
665 -4541 -392 3531 -2963 -1649 3417 -1506 -2793 3370 -303 -3543 3049 961 -4102 2263 2538
680 2538 -4045 646 4075 -2858 -1375 4302 -1178 -3360 3811 1035 -4009 2465 2428 -3738 958 2929
696 2929 -2826 -383 3151 -1826 -1303 3212 -994 -2359 2897 -43 -3661 2589 1534 -4066 1460
711 1460 2547 -3749 -327 3275 -2735 -2105 3315 -1222 -3668 2310 495 -3959 1301 1269 -3741 212
727 212 1856 -3575 -890 1957 -2828 -1810 2456 -1884 -3367 2385 -452 -4489 1753 1176 -4888 446
743 446 2482 -4101 -1486 3032 -2579 -3030 2796 -743 -4002 1878 805 -4072 947 1644 -3682 127
759 127 2506 -2934 -821 3045 -2280 -2118 3265 -711 -3443 2766 1427 -3992 1425 2776 -3764 -22
775 -22 3569 -2528 -1563 3489 -786 -2676 2766 658 -3095 1587 1761 -3127 800 2490 -2728 -139
791 -139 2982 -2121 -1309 2988 -1258 -2308 2822 81 -3539 1711 1702 -3636 449 2683 -3164 -1190
807 -1190 2712 -1923 -2024 2346 -865 -2820 1889 124 -3282 966 1146 -3250 66 1827 -3267 -969
823 -969 2421 -2634 -1943 2588 -1620 -3138 2161 176 -3808 970 1885 -3779 -509 2635 -2911 -1487
839 -1487 2733 -1701 -2213 2374 -508 -2769 1902 724 -3136 1183 1921 -3104 41 2750 -2535 -1022
855 -1022 3293 -1307 -2037 3129 94 -2973 2258 1810 -3159 847 3047 -2295 -698 3490 -1345 -1518
871 -1518 3018 -216 -1981 2301 701 -2311 1560 1803 -2385 795 2620 -2115 -521 3273 -1456
886 -1456 -1691 3029 -500 -2485 2219 838 -2771 944 2004 -2409 -281 2446 -2044 -1269 2371 -1207
902 -1207 -1876 1770 -476 -2207 1335 304 -2606 677 1075 -2321 -212 1921 -2383 -1153 2236 -1482
918 -1482 -2043 2231 -503 -2731 1522 573 -2647 440 1686 -2267 -462 1962 -1799 -1179 2148 -1266
934 -1266 -1660 2104 -384 -2025 1787 551 -2223 1092 1736 -2185 -136 2406 -1544 -887 3072 -824
950 -824 -1881 2651 652 -2282 1728 1624 -2046 616 2502 -1413 -369 2779 -1035 -1045 2618 -215
966 -215 -1464 2142 670 -1909 1578 1557 -1964 561 2163 -1481 -610 2582 -835 -1453 2185 -53
982 -53 -2055 1483 846 -2074 728 1348 -1907 -245 1688 -1363 -1176 1939 -944 -1821 1881 -428 -2116
999 -2116 1489 311 -2359 865 1003 -2021 -245 1651 -1725 -1142 1816 -824 -1722 1756 -240 -2262
1015 -2262 1213 629 -2116 490 1139 -1814 -208 1667 -1377 -959 1936 -880 -1357 1958 -44 -1950
1031 -1950 1796 868 -2158 1107 1827 -1995 -37 2264 -1250 -1083 2478 -251 -1525 2294 540 -1831
1047 -1831 1599 1407 -1685 657 1794 -1425 -176 2341 -853 -1028 2201 -124 -1651 2168 661
1062 661 -2004 1410 1464 -2049 273 2023 -1618 -736 2087 -574 -1456 1915 131 -1918 1318 650
1078 650 -2194 543 1145 -1789 -183 1429 -1463 -833 1445 -703 -1569 1572 -128 -2356 1167 589
1094 589 -2302 557 1213 -1940 -442 1516 -1321 -1121 1368 -431 -1748 1279 132 -1980 1088 804
1110 804 -1762 774 1141 -1501 -25 1350 -1207 -795 1613 -355 -1367 1531 504 -1863 1259 1103
1126 1103 -1842 528 1783 -1435 -213 1964 -779 -680 2144 73 -1548 1586 788 -1807 1314 1272
1142 1272 -1671 568 1905 -1200 -113 1992 -592 -997 2009 149 -1629 1460 1017 -1870 933
1157 933 1438 -1876 -88 1789 -1223 -855 1737 -395 -1536 1330 214 -1848 895 945 -1974 413
1173 413 1288 -1780 -202 1446 -1391 -1017 1426 -454 -1675 1069 327 -2058 503 684 -1799 -96
1189 -96 1209 -1542 -542 1473 -979 -1093 1253 -359 -1485 1078 212 -1570 588 836 -1567 360
1205 360 1237 -1559 -268 1553 -1029 -656 1381 -73 -1151 1131 563 -1517 721 1021 -1434 468
1221 468 1454 -1057 -273 1543 -452 -409 1609 68 -823 1394 831 -1432 837 1394 -1374 457 1672
1238 1672 -1104 -232 1865 -656 -981 1554 264 -1282 1055 787 -1497 454 1384 -1637 -203 1521
1254 1521 -1202 -753 1379 -483 -1225 1028 -139 -1764 721 556 -1781 140 1170 -1381 -486 1215
1270 1215 -1212 -1003 1215 -329 -1446 962 201 -1688 320 869 -1364 31 998 -1322 -735 1225
1286 1225 -789 -920 1131 -357 -1194 682 329 -1392 578 880 -1242 110 1235 -1042 -370 1405
1302 1405 -602 -787 1470 52 -984 927 634 -1171 477 954 -988 158 1470 -785 -162 1583
1318 1583 -472 -573 1381 29 -872 1205 682 -993 620 1023 -1147 290 1551 -994 -797 1695
1334 1695 -376 -1023 1196 191 -1201 802 439 -1376 211 965 -1169 -400 1272 -956 -999 1216
1350 1216 -645 -1474 1085 46 -1481 566 623 -1556 -91 1104 -1271 -641 1400 -819 -1267 1112
1366 1112 -228 -1442 735 228 -1379 288 709 -1296 -168 995 -906 -588 1309 -568 -903 1238
1382 1238 0 -1252 885 510 -1121 437 841 -959 -238 1168 -518 -424 1265 -264 -741 1168
1398 1168 243 -997 1019 772 -799 528 873 -812 44 1040 -528 -336 1273 -207 -838 1257 428
1415 428 -803 883 600 -864 430 914 -900 -51 1127 -597 -628 1261 -267 -832 1038 117 -1031
1432 -1031 696 410 -1122 86 840 -893 -412 1088 -619 -931 1036 -211 -1066 954 -210 -1215
1448 -1215 490 567 -1584 -125 792 -1125 -717 997 -547 -1184 897 -63 -1288 636 276 -1372 407
1465 407 768 -1117 -112 852 -809 -642 936 -309 -1027 890 129 -1131 617 700 -1110 208 787
1482 787 -868 -78 1002 -348 -617 1029 59 -585 936 302 -732 770 636 -747 412 908 -480
1499 -480 241 1112 -449 -304 1062 93 -628 1187 265 -869 724 667 -914 275 1079 -596 -154 836
1517 836 -473 -625 920 -165 -873 700 208 -996 404 431 -1177 45 777 -893 -321 1010 -703
1534 -703 -858 678 -34 -1133 399 244 -1270 280 563 -1189 -100 777 -945 -558 1113 -360 -981
1551 -981 795 139 -996 527 551 -989 199 740 -743 -230 902 -674 -569 1040 29 -714 912
1568 912 310 -975 602 586 -850 379 820 -600 -289 986 -238 -324 1081 94 -624 729 386 -820
1586 -820 530 961 -799 56 942 -623 55 843 -218 -401 909 246 -449 560 493 -770 395 854
1604 854 -737 -10 940 -641 -188 702 -259 -621 673 -62 -802 595 228 -863 103 533 -899 -43
1622 -43 515 -765 -378 765 -546 -792 672 -113 -946 244 325 -931 53 498 -1047 -210 658 -761
1640 -761 -523 675 -375 -720 554 -7 -920 261 537 -1003 173 741 -718 -286 1055 -495 -503 981
1658 981 -25 -533 512 375 -677 337 708 -492 110 813 -543 -76 904 -8 -500 796 242 -587
1676 -587 598 636 -507 241 747 -636 80 968 -445 -213 779 -95 -398 682 176 -474 622 350
1694 350 -620 140 649 -517 -32 775 -500 -352 706 -214 -359 557 -37 -682 385 306 -654 61 447
1713 447 -644 -420 626 -669 -424 550 -421 -541 477 -50 -808 241 330 -751 11 531 -752 -209
1731 -209 643 -529 -651 635 -498 -685 393 92 -620 281 300 -657 66 656 -522 -300 879 -408
1749 -408 -440 892 116 -585 459 285 -535 328 815 -493 -29 856 -291 -257 1030 -93 -486 849
1767 849 -69 -558 613 530 -540 68 689 -221 -8 726 -146 -268 791 17 -357 617 374 -391 348
1786 348 186 -451 3 484 -533 -212 458 -360 -494 602 -35 -514 325 47 -636 354 118 -382 32
1805 32 233 -563 -167 436 -417 -549 629 -252 -720 378 -56 -562 179 149 -747 -1 200 -650 -173 591
1825 591 -283 -347 472 35 -722 512 50 -819 290 501 -611 -51 654 -508 -296 754 -241 -501 689
1844 689 43 -407 581 517 -688 395 727 -350 66 791 -345 -434 663 133 -474 614 165 -609 343
1863 343 413 -507 148 675 -202 -52 580 -166 -480 664 -103 -557 412 175 -454 326 416 -399 -2 324
1883 324 -296 -210 395 -230 -506 239 149 -494 116 173 -767 -41 157 -526 57 169 -429 -288 194 -300 -508
1904 -508 315 16 -550 365 99 -580 -62 197 -734 134 326 -478 -146 330 -261 -484 500 69 -572 447
1924 447 207 -522 222 354 -502 49 499 -379 -180 510 -110 -407 410 264 -388 539 373 -481 157 586
1944 586 -226 -43 681 51 -307 684 217 -417 494 307 -370 341 451 -379 -88 539 -367 -118 497 -213
1964 -213 -320 361 123 -565 233 283 -549 296 432 -599 53 335 -265 -349 389 -205 -273 380 -16 -590 145
1985 145 74 -423 151 164 -466 -147 276 -565 -318 411 -315 -471 309 -101 -451 178 109 -472 -10 267 -640
2006 -640 -55 411 -542 -222 421 -32 -304 345 84 -506 414 306 -366 250 461 -324 52 554 -149 -140 528
2027 528 65 -335 428 245 -441 416 404 -322 179 571 -293 -228 542 -173 -251 413 -2 -164 267 484 -502
2048 -502 236 595 -475 8 417 -249 -308 357 -209 -460 464 74 -449 252 445 -320 56 368 -314 -95
2068 -95 379 -213 -315 269 -81 -405 98 115 -462 242 302 -554 -59 160 -542 -293 321 -278 -422 285 -62
2089 -62 -362 460 93 -295 -46 289 -366 -79 524 -453 -197 363 -423 -271 393 -107 -471 121 51 -370 257
2110 257 269 -377 147 561 -249 30 349 -141 -144 603 67 -345 413 340 -269 358 405 -190 105 397 -258 -6
2132 -6 553 45 -227 324 128 -298 172 170 -240 87 319 -188 29 361 -196 -195 362 -70 -327 134 -15 -465
2154 -465 86 444 -505 -133 204 -165 -319 328 -240 -349 372 -294 -400 221 -2 -369 165 -66 -508 -67
2174 -67 309 -392 -226 437 -332 -213 275 -79 -371 119 -164 -359 141 212 -125 -124 186 -301 -211 313 -127 -202
2196 -202 578 -75 -227 103 18 -219 246 410 -201 212 339 -78 -113 523 -152 -99 541 243 -410 361 216
2217 216 -111 180 157 -166 93 465 -142 -136 369 20 -220 234 44 -497 367 235 -388 127 444 -340 -42
2238 -42 212 -212 -248 196 -54 -226 352 9 -365 10 251 -259 -93 245 -56 -259 346 -240 -293 275 -125
2259 -125 -480 62 91 -273 35 52 -341 -267 371 -82 -320 253 -88 -314 233 140 -404 226 70 -368 77
2280 77 196 -145 -45 219 -78 -156 283 -108 -283 92 48 -78 94 151 -220 155 251 -53 26 393 -93 31
2302 31 247 114 -148 346 125 -300 223 77 -248 -15 404 -58 54 401 -99 -175 310 -16 -206 437 107
2323 107 -296 111 90 -230 114 278 -240 -70 205 -245 -467 347 -195 -307 253 146 -330 -3 241 -477
2343 -477 -13 229 -135 -235 285 -76 -367 255 55 -550 11 135 -358 -5 44 -253 -92 194 -238 -163 275
2364 275 99 -244 -100 -20 -351 228 133 -273 56 182 -167 -69 84 -235 13 237 75 -174 239 63 -236
2385 -236 61 136 -241 41 363 -40 -28 260 34 2 297 170 -39 265 205 -67 161 339 2 127 149 -143
2407 -143 -45 307 -123 -57 277 36 -67 206 76 -310 19 188 -322 205 260 -284 -297 292 -181 -345 87
2428 87 -23 -403 241 134 -159 58 214 -225 -135 291 -256 -227 249 -166 -324 177 36 -462 145 76 -375
2449 -375 -5 288 -292 -161 231 -104 -199 168 80 -60 179 36 -169 -51 -6 -251 -33 265 -216 -39 260
2470 260 -261 44 262 40 -10 370 22 -160 93 384 -100 -10 196 85 -134 320 57 -132 168 -1 12
2491 12 169 91 -173 135 162 -20 135 223 -107 -127 280 -74 -91 233 -148 -29 130 57 -286 5 33 -301 -99
2514 -99 238 -290 -197 112 -195 -198 240 -111 -257 104 -40 -230 -100 170 -354 -121 230 -59 -226 114 -139
2535 -139 -248 161 -48 -392 38 134 -343 -131 253 -61 2 253 -169 -308 156 109 -301 214 164 -294 399
2556 399 101 -153 -153 317 63 45 218 -2 -184 301 134 -101 98 252 -147 -40 206 -336 2 144 -126
2577 -126 -152 168 -25 31 72 119 -92 12 220 -165 20 406 -291 -8 98 -73 -95 369 73 -244 245 -164
2599 -164 24 262 81 -117 116 156 18 -151 139 -75 -238 28 -304 -345 159 -143 -291 145 6 -344 -26
2620 -26 184 -281 -204 138 -202 -298 171 11 -275 108 -2 -318 48 184 -221 -62 207 -218 -140 286 -72
2641 -72 -244 202 -26 -263 184 152 -127 68 223 -193 93 289 58 -68 364 220 24 239 126 9 281
2662 281 255 -63 195 247 59 87 36 125 -76 198 30 -90 205 111 -133 131 363 -315 -96 -47 -115 45 320
2685 320 -45 -189 250 49 -67 -71 74 -138 63 138 -205 -96 128 27 -140 -18 -149 -313 152 -43 -307
2706 -307 39 166 -190 130 17 -239 -127 84 -56 -127 128 -145 -351 132 -2 -429 124 -97 -379 -51
2726 -51 15 -170 -129 101 -228 -132 112 69 -181 258 173 -40 116 113 -89 130 163 -247 -40 113 -146 -136 274
2749 274 172 95 246 144 -153 193 57 -183 122 130 -79 20 -78 -6 -29 187 81 -158 152 211 -85 139 198
2772 198 -203 26 154 -71 -145 244 -42 -11 159 -16 -304 9 -27 -275 -61 -107 -66 128 -145 -139 -260 110
2794 110 -143 -42 -123 9 -233 -68 46 -247 64 84 -24 -238 -179 -145 -90 88 107 -233 59 46 -231 183
2816 183 66 -117 50 15 -127 37 144 22 -104 100 49 -139 208 42 -82 42 58 -6 -49 222 -101 -35
2838 -35 261 -204 117 160 204 -18 -36 50 -181 191 -14 -210 -125 104 -115 -254 278 1 -119 230 197 -172
2860 -172 -60 172 -89 11 255 -129 -28 139 -99 -23 225 -75 -152 68 47 -243 176 -50 -66 61 162
2881 162 -244 -111 149 -162 29 133 -81 -222 21 7 -321 -83 -11 -367 -33 231 -254 31 228 -87 39
2902 39 168 -210 -110 95 106 -142 3 234 -140 -37 17 -92 -77 261 -83 -76 85 30 -9 151 -61 -126 199
2925 199 163 -76 98 281 -84 31 311 -94 -140 120 -5 -127 107 220 -86 32 -102 -18 -168 79 106
2946 106 -215 131 4 -131 184 165 -131 298 107 -93 32 167 15 -152 338 -7 -196 320 -25 -238
2966 -238 98 -78 -137 17 70 -96 -8 141 -61 71 29 -68 -145 -107 -68 -222 -73 -27 -135 58 -14 -246 12
2989 12 13 -95 -200 83 -61 17 50 -37 -90 152 -89 -85 190 -36 7 13 -24 36 -119 52 70 -172 253 43 -45
3014 -45 141 215 -168 228 245 -18 -70 144 -53 -45 248 -29 -208 81 188 -188 181 -15 83 42 130 -84 -173
3037 -173 303 -20 4 100 -102 -101 186 4 -108 99 92 -105 -159 30 -126 -75 180 -76 -85 -86 -21 -248 12 98 -179
3062 -179 -111 -39 -97 -153 70 -77 -13 -47 -60 -128 38 87 -167 236 -7 -168 -187 73 -50 -16 9 63 -46 35 20
3087 20 -152 120 41 -92 -4 -17 60 97 113 -86 109 43 76 -201 139 118 17 87 196 60 305 223 -13 300
3111 300 105 -35 -41 194 148 -53 64 -28 -28 85 -27 -183 119 -12 -87 76 256 -12 105 -137 -89 44 105
3134 105 129 -175 90 96 -303 -43 11 -78 -63 88 -57 -6 168 -92 -136 -28 39 -47 -47 118 -81 -167 26 -66 84
3159 84 -67 -116 -6 148 -114 -76 -19 -9 -51 -168 155 -209 -90 17 -34 -89 -62 -53 4 28 114 -198 10 175 61
3184 61 181 56 -282 29 86 -34 153 117 -20 28 59 67 -5 153 78 -118 8 74 -79 30 186 196 98 22
3208 22 -89 -78 31 72 -112 117 63 -243 34 65 -100 -6 146 56 1 79 -54 -23 20 111 -215 94 1 -122
3232 -122 -95 261 -132 -22 163 -130 -173 228 101 33 204 181 -96 -140 210 -117 -45 103 -55 -8 -2 -249 -19
3255 -19 -29 -79 -226 -24 -169 -138 -204 16 -58 -101 20 -249 -21 94 -248 67 35 -43 -105 30 48 -131 72 -52
3279 -52 39 31 67 -67 -93 84 17 90 214 -113 -41 157 104 81 158 39 55 105 37 -140 -66 226 -40 -16 0 31
3305 31 -19 -22 -101 5 128 50 -22 114 220 -69 -82 171 0 46 206 140 -39 28 -8 -201 73 69 -193 -45 80
3330 80 -130 -229 127 -55 65 177 0 -66 -70 1 -165 -89 211 70 -348 67 -173 -288 -19 -35 -1 112 151
3353 151 90 130 43 -89 33 160 35 151 22 5 -93 6 -48 -44 24 -65 -153 16 43 -40 -2 20 -95 -29 0 85
3379 85 -140 -14 -106 -82 176 -49 -36 135 40 -64 36 164 38 -53 56 86 -100 46 -50 96 212 112 -90
3402 -90 -115 39 72 -151 -82 -60 -78 55 80 127 60 -230 41 88 119 -291 -108 -43 -58 21 -19 -120 -192 52 -77
3427 -77 -181 -66 -154 -66 72 20 -103 -179 -114 -113 72 148 -136 -79 59 55 23 77 36 -142 -53 -127 -192 -58 -103 -161 -77
3454 -77 103 60 -37 50 -52 -62 -135 -38 -51 100 -20 165 256 -156 99 54 69 181 -137 135 -38 -58 151 40
3478 40 46 6 10 -135 -12 -122 136 230 134 161 -140 145 207 -81 189 -78 17 -22 4 -98 -106 166 -7 -79 29
3503 29 -44 -163 57 82 -55 -6 42 -26 24 -90 -109 33 -92 -132 94 138 31 -216 -189 -17 -211 -27 184 -63
3527 -63 -136 75 -106 -184 95 68 -134 -32 50 -104 -76 9 -200 -61 50 -52 45 27 11 -17 138 65 4 -26 179
3552 179 181 54 9 -104 242 134 72 104 203 78 -74 261 92 -40 145 157 -13 178 118 33 -38 -15 -44 -158
3576 -158 99 -25 79 76 241 -13 -7 -12 -214 -76 43 147 -70 -73 -55 -236 34 -68 -101 177 139 -117 -52 118
3600 118 -150 55 -68 -195 -9 7 -166 -143 149 -22 78 69 -19 -261 -2 120 -182 -29 -46 -24 25 -225 -69
3623 -69 16 24 9 37 191 -76 -144 -28 87 -132 129 150 -81 -158 79 8 -82 14 -13 -128 -95 130 -105 -56 43
3648 43 -84 -22 0 -134 61 -42 44 16 -12 50 -225 66 -29 106 151 116 5 -160 49 -20 -111 60 27 -85
3672 -85 21 -47 145 -20 63 -20 -18 113 -257 19 -27 1 -61 45 -44 -106 60 -95 -220 66 -93 -100 -67 -211 -145
3697 -145 -129 -65 -206 -38 -25 -56 -119 46 -154 -97 -8 -36 -46 87 228 -202 -4 -13 -62 -23 168 18 -140 -116 231
3722 231 143 -37 -73 65 69 101 -69 60 147 90 -75 56 -26 -35 -3 150 -51 9 30 -1 -63 170 -75 -59 159
3747 159 55 -52 -13 -138 27 137 -138 -22 -29 -62 46 92 153 87 -71 75 -11 -13 57 217 -72 109 -30 -36
3771 -36 6 58 10 -82 -61 -34 -59 164 -133 -179 226 -105 -110 -198 187 -51 -37 -66 63 -215 -159 -170 -72 104 -48 -132
3797 -132 -131 87 -78 13 49 -60 -137 -88 -41 -102 122 -39 -87 -55 136 -160 3 -28 -149 204 118 -47 25 62 -198
3822 -198 61 34 0 -20 46 197 -68 94 -24 15 -10 218 14 -102 82 -40 -16 -14 -4 119 144 -64 199 103
3846 103 38 -53 -13 -175 -37 -59 -99 8 -164 28 -277 -59 120 -101 -150 -90 -89 -128 -94 6 81 97 72 14 58
3871 58 -87 -119 -66 72 -71 -96 -189 -166 -70 -7 -3 -16 -187 -104 -78 -57 0 -18 -206 74 188 76 -172 -30 42 -140
3897 -140 91 -143 -12 189 -237 -96 38 32 -113 16 48 -25 100 -33 -15 53 54 -120 -156 -127 -63 -119 43 -20
3921 -20 -38 19 -19 53 -60 74 -70 36 153 200 -55 45 -113 5 115 -61 -174 254 83 -133 30 67
3943 67 15 27 161 25 -116 113 -93 109 -55 316 -83 -4 -76 -166 -3 71 12 -219 69 -79 -49 76 75 21
3967 21 51 41 -362 -90 34 -172 123 -42 -165 -46 -1 174 -37 -237 -29 -178 -52 25 -8 -200 77 33
3989 33 27 79 -98 -20 206 -60 -142 -83 -54 31 74 34 32 61 236 0 76 25 21 102 49 109 51 -53 68 25 16 20 64
4018 64 148 247 -78 -54 101 -35 -54 7 36 -146 47 -19 -114 10 38 -55 77 117 47 137 11 -34 -74 -112 165 -136
4044 -136 -85 49 16 -171 -167 63 67 -57 59 -227 -33 -218 -8 41 -69 -63 -32 -201 12 -19 -22 58 -189 -31 -75
4069 -75 -48 -59 19 133 -50 -144 -72 23 -77 -57 -106 -111 -132 -10 124 -121 51 31 105 -38 300 -142 -25 -50 -99
4094 -99 -17 216 -3 -6 252 162 -2 -1 94 88 -10 -93 121 87 135 98 -138 -8 293 133 34 59 64 124 212 106 50
4121 50 113 58 -129 49 187 -127 23 102 -51 -97 -24 -61 -9 2 -25 -105 131 64 -43 13 -117 61 -104 -36 -135
4146 -135 -82 9 -175 -71 -64 17 -60 36 -55 -48 -4 -9 -63 89 -26 -70 -30 33 97 -101 170 91 -104 23 -215 77
4172 77 -43 -98 -110 37 2 -22 -90 -187 -48 -194 74 32 68 140 142 -117 66 98 136 215 154 43 -116 119 65 38
4198 38 -6 34 21 145 37 -54 -61 -94 -176 14 162 -45 -146 119 74 103 93 -107 -34 106 -21 171 -54 -128 -11
4223 -11 -121 -34 -41 -37 74 -48 -21 -51 39 -131 -18 -59 -74 -168 150 -41 -155 -17 -65 -85 -81 50 82 -64 236 -95
4249 -95 -87 3 12 -46 -123 -105 -89 12 8 127 62 35 -61 77 -7 42 30 -51 74 -37 180 93 -33 -103 -113 -38 125 215
4277 215 -104 -45 31 -16 30 105 52 101 185 79 -26 142 73 -103 96 104 75 168 9 -61 53 224 -127 102 88
4302 88 -21 -3 54 -36 -67 -101 14 -93 -2 188 -114 -20 70 -76 -272 28 -140 47 -144 -77 -24 -115 52 -93
4326 -93 -228 -203 -31 -62 -93 -27 -127 52 -92 67 -8 56 59 20 91 -105 -151 -143 99 -50 9 19 10 160 -162 -40
4352 -40 -46 -88 50 85 -33 75 -63 -189 -4 75 -71 73 23 99 66 -30 86 99 -4 173 63 65 53 -29 51
4377 51 72 68 132 -68 -40 103 24 16 15 -89 116 62 66 -67 128 19 56 69 -96 103 38 97 -12 -57 60 -59
4403 -59 -114 -7 -158 -7 50 -35 30 93 -142 121 -93 65 -115 3 117 -1 -49 9 -133 -193 -115 5 50 125
4427 125 13 17 -11 41 -90 -76 -82 -136 -15 186 7 6 -49 -69 102 75 165 17 49 63 -35 -2 224 -61 52 -1
4453 -1 -43 0 -88 96 6 61 64 73 147 166 251 -57 206 44 52 18 120 136 59 14 157 71 36 179 7 7 -75 147
4481 147 -48 -22 90 99 -247 -23 -15 104 44 119 49 -26 87 86 -255 48 -214 -33 -295 -18 -60 23 -213 13
4505 13 -76 18 70 -93 109 -20 -34 177 261 -45 -140 73 -8 18 46 -242 -70 -136 157 -6 18 86 25 -73 45
4530 45 -72 -53 -222 -17 94 5 -24 -50 18 32 -177 10 209 -5 27 8 -59 95 95 36 -30 151 118 12 101
4555 101 64 -43 -12 -21 -40 65 110 -87 -17 125 33 157 57 184 -81 121 134 -88 23 175 7 -91 44
4578 44 -91 76 153 8 14 8 41 -75 -100 105 -2 -23 -93 -7 -7 3 -7 -103 -22 -93 -63 59 -125 58 -44 -184
4604 -184 -71 -41 -68 218 141 89 -41 -286 -26 103 -148 -90 0 -70 56 -45 -22 -53 14 47 93 115 84 124 44
4629 44 44 74 -26 -100 47 -74 88 -60 -9 -105 -28 -11 149 52 5 61 -39 42 40 84 72 -82 119 25 -13 -9 34
4656 34 -65 134 11 -12 -94 17 29 79 106 -84 -23 -28 219 -137 123 -35 73 -78 -102 -120 10 11 -133 141 54
4681 54 -126 -182 -77 -114 11 44 -68 30 22 -53 160 -14 -79 -92 19 -62 -57 126 -19 19 -37 -137 -98 -55 116 62
4707 62 -7 22 101 -72 -128 -3 55 16 -1 -118 -27 127 -20 27 77 32 -95 36 -70 203 58 91 -20 -41 -60
4732 -60 -3 56 47 -92 66 -113 -3 132 97 14 -103 -13 -38 45 25 -51 -69 -29 -109 142 -84 108 54 16 -102 -33
4758 -33 9 115 22 -22 -146 -141 8 -78 -113 -40 -43 130 -51 -87 49 -38 108 29 -33 -136 37 10 -27 -51 22 -178
4784 -178 -66 16 11 -157 95 -65 -102 -81 -213 -74 97 34 -133 -190 43 -42 -61 24 -51 -148 39 142 -52 123
4808 123 158 69 -62 -69 96 67 116 86 -116 49 249 40 -16 52 -114 75 50 61 -1 -33 -2 82 140 30 47 66
4834 66 56 96 -26 -21 -112 -55 -57 -38 -8 -71 74 25 51 41 4 -42 4 -38 -50 -158 36 197 12 100 8 75 -285 -177
4862 -177 -114 -2 -48 -176 -130 -146 -81 -68 71 93 -76 -169 -180 -117 -181 161 151 277 -160 8 -127 12 -50 18 30
4887 30 4 43 -156 -53 54 -4 38 9 216 -156 58 26 50 112 21 22 61 82 11 156 134 -10 -53 -70 17 21 -97
4914 -97 -7 84 15 40 30 -84 -52 -35 64 -89 34 -40 -4 7 -171 -6 57 63 27 -12 -160 -115 61 -6 -67 -221 6
4941 6 150 -184 -9 -95 -66 188 18 -138 40 -51 -149 -79 36 14 -137 229 -33 32 -51 -77 33 -79 -114 -47
4965 -47 -56 10 -42 78 74 122 -191 -68 118 -2 74 -170 -37 3 -77 -124 96 -83 -72 96 2 63 -24 90 17 -9
4991 -9 39 171 -154 121 23 -24 3 112 105 40 -17 -68 -68 -23 29 163 87 -2 56 51 86 -19 29 -76 -28 15 15 63 -66
5020 -66 -66 -156 -146 14 80 13 103 98 -23 61 -136 -17 -20 -60 180 54 102 -79 150 4 -125 -32 -10 5 -208 -1
5046 -1 -12 -63 12 34 -25 -179 70 -26 -119 71 -27 -9 155 -149 -139 -47 -121 -19 -7 -166 -39 -139 -62 50 16 101
5072 101 167 -31 170 123 150 52 -104 -103 35 -8 -4 17 -7 -128 9 -12 -67 128 -68 -30 12 226 -101 -25 -140
5097 -140 74 -36 -83 -12 -17 -240 46 159 -130 154 10 176 -116 74 -14 -59 17 -7 -75 142 -32 9 100 -60
5121 -60 35 149 56 -253 -14 101 -182 -50 -24 -20 -135 -16 -7 -8 142 -83 -40 -204 -35 -106 49 1 -72 -97 -114
5146 -114 105 -185 -39 -168 -138 -115 84 -3 25 -97 -173 47 46 -23 65 -179 94 2 -22 -20 26 61 58 -115 24 -127
5172 -127 131 25 69 23 24 90 -49 149 188 197 73 2 97 -26 99 140 -145 -11 -20 -76 -154 56 39 -23 127 102
5198 102 -31 107 -11 -175 -19 -114 -71 -54 -102 101 46 -80 -71 -49 64 -84 76 -160 -200 -99 17 -16 -19 126
5222 126 -156 -10 -239 10 1 -126 95 70 -55 8 9 -16 -42 -22 7 -41 2 37 69 68 -207 145 -7 -35 -2 -37
5248 -37 -48 -26 -36 23 73 200 7 82 19 133 65 128 209 -27 -11 91 14 78 -68 35 -92 68 119 -1 161
5273 161 53 -202 -106 63 3 -6 7 47 -158 34 0 86 -148 5 74 -126 -59 32 -13 37 -45 -145 -127 36 -11
5298 -11 6 -68 -33 -67 13 82 81 71 41 -5 -126 4 -16 46 -94 23 -89 9 -144 62 132 74 -31 -24 -78 -42 -3
5325 -3 -16 -28 22 -62 4 -10 -60 -111 -60 -107 91 117 -29 51 74 -52 -46 -35 -125 -3 27 134 -68 64 2 -64 204
5352 204 118 -48 144 98 -102 187 91 -7 -104 82 -91 108 -63 44 308 -184 -53 130 127 -21 -191 145
5374 145 -190 -69 145 -1 0 -14 -84 111 37 -63 61 -108 -90 -126 56 -41 13 -53 -21 -10 82 150 -52 -52 -46 -70
5400 -70 -64 106 -121 -89 -104 80 146 -118 -38 14 -133 95 -86 18 -74 -22 137 20 60 80 54 3 -229 148 82
5425 82 101 1 -72 0 131 61 18 74 96 2 22 47 44 7 -45 116 -130 -50 130 111 171 149 108 27 -118 185 114
5452 114 159 94 206 47 84 -28 -34 97 -4 6 4 79 -127 -53 39 56 170 -39 40 177 4 -90 -193 -72 -121
5477 -121 60 42 130 44 -79 -86 -80 -139 -99 -100 -43 -30 -31 -54 -170 106 110 -115 45 -28 -120 -45 -154 -78 96 67 -81 -53
5505 -53 20 28 -14 80 -12 -127 58 39 9 100 -90 -168 102 39 29 -47 -4 -119 -148 -14 8 151 179 52 175 -16
5531 -16 -13 -155 80 71 -95 -46 186 76 -249 51 88 77 -10 -36 -44 82 59 95 55 62 -34 8 -27 -105 -96 -92 65 -71
5559 -71 8 -124 -3 82 108 -144 -16 215 3 -58 -80 -136 126 -113 28 71 -29 -50 -35 -45 17 -54 -63 34 23 189
5585 189 -103 -61 -177 -80 -60 -13 -30 -29 -86 -97 -209 -91 -118 -102 -13 26 117 -193 -84 -78 -16 44 -75 -106 -18 -6 207
5612 207 87 6 13 2 133 68 90 -155 -69 36 41 4 73 2 -37 18 221 -91 -117 99 -76 -30 -172 70 -52
5637 -52 -148 -12 114 32 -47 115 32 3 -92 -28 -141 93 71 -58 -132 -67 16 -60 33 -60 70 50 -67 100 11 14
5663 14 130 -39 -34 22 -127 20 14 -70 -62 48 -98 11 -5 -137 -129 -50 -23 75 -4 47 83 -70 -160 -33 -46 -66 114
5690 114 125 113 2 -159 -57 -160 -171 -2 18 -20 187 -10 209 15 8 132 97 63 -105 56 -46 134 90
5713 90 39 -61 -44 54 29 -99 144 81 -58 25 97 6 24 90 -118 175 212 2 92 -82 -3 137 168 -152 69
5738 69 -45 -110 -145 -64 83 -92 -43 23 -82 48 138 -235 -43 -190 -118 69 59 -126 -15 -103 -238 -90 66
5761 66 -89 54 33 -50 -38 36 -219 -97 32 -263 51 -16 32 -102 -108 18 123 -142 33 71 -14 9 -52 44 -120
5786 -120 -136 175 74 -89 34 -135 -38 47 29 -65 239 133 -10 30 50 35 -26 -81 115 -240 283 31 -5 -104
5810 -104 -5 119 88 102 -14 -73 -6 75 162 -9 81 148 -6 58 -45 31 134 56 99 -59 31 81 -51 5 -84 174
5836 174 -37 -66 -145 -1 136 -172 44 -138 18 -123 -81 -20 107 -139 25 67 -187 -157 31 -140 45 124
5858 124 -63 -32 95 139 -11 89 69 99 -74 -39 90 62 -177 51 41 79 -88 -57 -222 57 68 46 -82 24
5882 24 70 -131 -37 -88 35 -61 7 99 61 23 129 20 20 -128 32 24 -73 -56 79 14 1 86 -55 110 -98 103
5908 103 -51 28 -28 -25 15 58 150 -22 -221 -82 135 -36 9 -45 -126 195 108 186 134 29 -99 -3 91 -104 125
5933 125 -76 -115 -92 63 73 50 -112 80 -76 -108 -128 39 121 74 -160 18 -38 -179 33 41 -47 56 66 115 -35
5958 -35 -254 50 -12 -32 31 9 -67 -30 -28 53 -63 32 104 60 142 116 -82 22 21 108 -25 30 117 -120 2 52 85
5985 85 -141 101 65 -49 -67 92 -3 22 -179 -61 83 -8 85 90 -131 45 -65 -121 57 -92 144 -45 -69 -85
6009 -85 126 22 -4 -35 -56 56 170 20 65 61 -30 -24 51 136 121 117 158 -110 17 -105 145 67 87 120 -149 -39
6035 -39 -104 12 -186 -65 -95 -133 -36 -60 2 -148 -117 -152 -19 22 -162 23 13 -36 -136 -44 35 56 84 -41 -75 81
6061 81 -33 29 47 133 -60 13 -23 -96 86 -120 79 -13 62 20 25 71 -13 89 168 87 9 8 -139 81 95 -33 -81
6088 -81 102 22 47 -24 26 49 39 19 28 147 -72 20 118 -152 -41 -150 -85 -66 -150 -213 -49 -8 -62 -132 16 -32 6
6115 6 5 109 -40 -91 -51 135 -107 90 -127 72 -71 31 119 48 64 44 -51 146 109 -48 174 -79 113 -24
6139 -24 -79 88 -66 -55 -24 -167 -239 -14 -1 -49 30 42 130 120 -160 -46 23 94 193 24 75 5 2 61 54 -20 -102 90
6167 90 -203 8 94 34 -95 127 -62 81 10 -21 3 213 59 -102 -35 25 108 50 2 10 -68 -11 102 99 4 -82
6193 -82 -30 25 110 57 -77 29 -43 105 8 26 -46 -11 -10 -42 -16 136 89 134 -112 91 119 -46 -217 52 -72 -6
6219 -6 -39 -9 66 -166 159 -58 -51 -31 -73 71 -19 -316 -70 -94 -133 -94 -47 -69 106 25 64 124 -10 -3 108 19 52
6246 52 78 191 92 79 50 -55 17 -108 29 -64 -80 94 208 -10 90 16 38 -57 -113 72 -3 18 -146 45 9
6271 9 17 -25 -81 -1 55 -34 -144 40 4 -42 32 19 -116 78 -81 -11 39 -82 -158 -131 -118 94 5 -47 -8 111 21
6298 21 -213 -55 81 140 0 -70 -111 45 54 71 -133 26 -51 -97 6 65 26 -65 131 -110 -8 -35 20 -30 -47
6323 -47 -86 -130 -178 -64 -136 -162 -11 1 -125 -35 -98 -156 64 119 52 124 143 -1 -67 -48 43 -8 120 96 227 112
6349 112 31 70 72 -4 -65 18 24 63 34 73 187 119 -17 -26 3 -88 -177 -187 -90 -104 -121 -44 136 28 -13 136 -75 2
6377 2 -67 -129 13 -120 -68 -222 108 80 16 87 -6 -13 -114 -104 -19 16 49 -120 25 -17 46 27 82 125 148 69 54 77
6405 77 36 111 17 -114 100 -43 -52 -92 -40 27 -12 33 137 57 57 -96 98 144 -39 -34 40 36 -194 -89 -29 8 58 74
6433 74 -29 43 -71 48 -149 -14 -23 155 51 -35 -1 -30 -1 95 -39 27 5 148 -24 230 89 204 109 9
6457 9 123 56 -75 136 31 -19 -80 -15 -39 23 39 158 50 -58 107 -7 111 -125 14 93 -32 -133 6
6480 6 -116 -100 6 32 -75 26 1 -140 88 22 156 16 50 95 -143 -72 62 -86 -146 27 -15 6 178 84
6504 84 -8 -68 -33 -78 132 75 77 113 -37 -119 24 11 -26 -17 103 -90 -68 -192 137 132 48 36 60 36 111 -186 63
6531 63 -14 -122 161 43 193 27 128 54 -49 169 19 -18 -36 90 91 -28 -25 -62 45 49 -98 37 47 -103
6555 -103 -16 -3 -165 -130 -90 -138 18 -79 53 -5 5 -106 50 -85 -120 107 37 27 -70 -195 -40 32 87 -99 -161
6580 -161 46 -113 37 52 80 199 198 -175 -77 32 126 153 97 65 45 -46 68 -97 15 -142 -54 -39 38 56 -31
6605 -31 117 126 -10 -64 138 -34 -8 19 46 64 44 90 110 -52 -53 -76 -46 -91 110 78 221 141 -100 -165 -16 -2 -105
6632 -105 30 0 144 12 -162 75 120 39 206 -197 43 67 67 9 -225 -4 44 -66 -28 46 -75 -126 -67 111
6656 111 -71 57 -62 183 57 29 -25 25 -26 -90 81 -32 75 87 -83 -23 -126 -77 51 -4 -40 -80 26 -60
6680 -60 37 -70 -78 -118 -85 238 22 -196 -7 -101 -218 12 -84 -169 202 -105 105 88 -38 119 -5 -82 137 -69
6704 -69 -37 -57 -13 94 -90 -13 156 28 -17 181 114 -81 109 -155 -43 94 117 18 142 -13 -23 -49 -179 45
6728 45 -72 60 -92 33 -24 -170 17 -75 48 -61 -142 -94 -27 -113 -25 -7 52 -95 33 18 227 -32 -82 -63
6752 -63 68 88 57 -23 97 192 -40 -171 -54 -62 -111 21 40 -31 81 -23 65 -39 266 110 60 143 144 85 38 79
6778 79 38 105 48 46 129 8 -69 -61 98 92 -215 50 95 -48 -32 -90 -32 102 -54 -120 85 -73 -74 5 -77 53 6
6805 6 42 22 -171 79 -8 -79 212 -51 95 59 -62 -203 -2 20 -93 76 76 -116 107 -105 -114 -23 -6 94 -99
6830 -99 46 -6 134 52 5 -36 -19 39 39 81 20 -113 120 114 130 -32 127 -73 -63 -135 -89 40 -19 28 -37 30 65
6857 65 -20 -18 138 60 39 27 4 49 -28 -25 73 -113 -79 64 40 85 28 -100 9 -110 103 -49 -109 180 -2 31
6883 31 -10 -15 -79 47 26 93 -150 176 34 126 -45 -99 -146 45 105 -79 19 111 -12 -188 58 51 7 -31 -101 -259
6909 -259 106 -50 27 79 165 -3 1 56 -65 27 141 52 -86 54 143 -200 -146 61 -175 -46 -5 85 45 44 -85
6934 -85 -143 8 20 -205 -145 -3 -127 181 51 -61 -72 -221 22 17 -78 2 -154 -202 -49 -28 77 -13 67 -5 -132
6959 -132 -42 109 -7 -77 39 -266 104 20 -9 93 103 -18 78 -35 49 185 -1 143 -84 -3 -53 -98 224
6982 224 -75 150 -14 42 14 -56 -36 119 -7 169 -70 -48 -34 -6 127 -119 94 102 -27 43 -29 31 59 -9 31
7007 31 -85 -53 -144 67 46 -205 125 27 -39 -91 5 -29 74 45 117 32 91 66 55 -34 178 258 201 -49 -58 -52 -65 62
7035 62 105 32 -31 -22 163 15 -36 37 -176 -74 -80 29 41 -146 -46 6 53 -18 14 228 50 -82 6 -56 -3 98
7061 98 53 -11 24 89 -148 -25 96 219 -67 -248 -28 8 189 -138 117 57 -94 156 0 222 24 31 -28
7084 -28 70 -102 124 -7 114 83 66 -26 -39 -39 34 -107 -33 35 85 79 -53 48 -90 -124 46 4 54 -108 -109 71
7110 71 -129 -160 -339 -61 84 -190 28 -168 -38 -17 -30 -74 -99 -82 -146 -23 -231 -105 -207 98 -82 -30 -4
7133 -4 -45 -45 182 -48 38 109 -3 -80 57 -29 10 -88 166 47 -68 -37 -59 43 30 -8 -2 -8 75 -55 111 -5 -52
7160 -52 47 1 -43 -22 -17 -67 -59 78 -2 -66 178 -12 -102 63 59 -77 -87 90 -92 -1 133 14 -13 -7 141 106 -88
7187 -88 -8 39 -58 -94 43 -109 19 -42 -62 -145 -260 4 30 -69 90 95 132 29 -55 121 -45 -78 165 -83 24
7212 24 -16 -115 -68 -14 8 130 63 35 -164 -30 39 72 41 -11 -43 -102 -30 39 -62 20 -18 23 69 -143 -49 10 129
7239 129 65 88 -25 101 22 -307 -62 140 -106 81 -37 -67 15 27 -25 118 -159 113 -4 -33 100 -164 -36
7262 -36 -92 -53 152 63 -173 -108 -137 210 62 -122 -126 -5 -80 157 -15 46 -8 -26 95 -39 13 -63 72 -58 -96
7287 -96 6 -71 -85 30 -43 -27 -140 9 -49 17 -99 -45 -57 -128 -30 107 -152 70 -79 -143 -109 87 -32 43 21
7312 21 -103 22 -145 108 34 12 16 -73 -16 -29 48 151 -15 56 153 -43 92 -153 26 127 -84 147 16 36
7336 36 143 21 21 42 18 161 153 222 -76 52 88 -60 102 -113 -146 -127 -124 191 48 -22 -28 -49 -26 77 -109 128
7362 128 -23 -149 23 38 -41 -182 -22 -20 98 23 -70 88 180 3 203 -76 -86 -123 -47 59 12 32 -65 4 -171
7387 -171 42 54 -80 -96 -44 128 -86 -18 -47 39 39 55 -53 -77 103 -63 49 67 -35 -67 27 7 -99 -1 121
7412 121 3 -36 29 -22 -1 17 13 -75 82 56 -161 219 29 -7 -15 247 -88 26 -88 -29 86 165 38 -77 121
7437 121 -74 89 88 37 -45 95 71 81 -86 -78 7 -38 158 -35 53 10 -77 -56 -10 -33 -126 -41 87 -147 -5 68
7463 68 76 -49 10 -31 23 111 -104 -58 145 -14 -106 -36 -30 -8 -31 330 85 59 260 103 -92 90 45 1 -70 -47
7489 -47 -20 95 -18 20 -138 79 -23 48 -54 -64 76 175 151 -20 252 186 74 -19 136 41 41 -36 -70 -104 -65
7514 -65 133 -111 -55 -66 18 143 102 91 -4 118 47 64 28 7 -129 -78 -32 99 174 -58 56 -48 47 -61 76
7539 76 168 -108 44 -69 23 -48 -161 -51 19 9 -31 -72 79 83 -201 23 104 78 -113 -112 11 -17 61 -95 -44 26
7565 26 83 11 -128 -64 -96 5 96 32 -157 102 85 -15 -3 -210 147 91 -92 18 54 79 52 77 13 -124 -12
7590 -12 169 -84 -63 -109 -162 -249 47 126 -111 34 -129 129 65 15 16 -154 77 -82 -76 100 39 -20 -41 7 8 -137
7616 -137 52 -116 0 91 14 -91 22 85 -74 -205 -64 32 -90 109 61 37 -19 -46 67 26 84 -145 -22
7639 -22 109 55 -117 -165 91 81 -94 -76 -105 16 64 56 -13 33 55 -153 -68 -11 28 200 25 15 -91 14 94 17
7665 17 -74 -57 56 142 -127 -62 94 -82 138 16 -1 35 -36 10 -2 -17 27 97 47 -6 -45 122 70 -80 -20 -12 -94
7692 -94 -3 95 58 111 10 -73 -26 -160 127 -37 -130 -58 56 0 119 156 162 25 75 87 -60 -22 52 33 -35 67
7718 67 20 -85 85 73 -61 85 -44 127 245 131 -70 -2 -14 -129 41 -102 -42 -91 -56 -91 -106 76 41 -121
7742 -121 -88 -83 -62 70 -58 -151 101 -8 -11 107 104 27 -22 -185 -44 210 -102 -25 146 108 86 -2 -110 -136 144
7767 144 -50 74 -2 -94 78 -90 177 20 -82 -38 18 0 -90 -110 59 86 46 -8 -51 -29 3 157 156 -5 -62
7792 -62 -154 37 48 226 29 -73 -11 -130 -7 -64 -28 -125 -77 41 -3 170 23 199 35 -155 -78 -156 25 -69
7816 -69 15 -46 -117 -32 -42 100 -69 64 11 85 202 -150 23 22 -101 23 -47 191 6 -79 8 14 0 -38 -42 -64 161
7843 161 111 -147 -149 102 -135 -178 -81 1 15 -219 -60 100 -109 -97 82 -60 -18 -162 -127 -187 -61 -21 -48 12 -12
7868 -12 -21 72 26 21 -85 193 3 -45 -10 -101 -103 -105 -27 120 87 23 49 -8 22 -16 127 -31 74 60 -38 69 26 87
7896 87 159 -80 90 35 114 -115 -155 109 -179 104 -115 -168 -151 -71 -236 -24 29 85 34 -184 49 48 6 73 -46
7921 -46 70 34 -18 92 8 -3 23 91 -19 -68 10 -164 11 -119 -49 58 -49 -55 -97 -110 -61 -36 61 -17 150 80
7947 80 -181 2 37 32 15 -173 -69 33 51 -118 -120 -130 -25 -86 -54 -8 -26 29 299 -34 186 45 -38 131 32
7972 32 96 22 -96 35 -32 -219 132 -62 -48 79 -74 97 -139 60 -3 -2 20 -19 49 -115 -4 109 -205 42
7996 42 12 221 3 75 53 40 -57 -26 -67 -18 -41 -142 -76 -103 115 25 -97 -191 -23 -26 33 17 122 -175 -31 147
8022 147 146 188 107 93 177 72 -117 149 -63 -60 125 32 226 42 -73 40 102 -105 77 44 127 2 -34 -57 82
8047 82 -129 126 -45 33 37 95 -154 64 8 -31 48 67 -136 -13 71 -8 134 46 -2 29 169 -27 76 51 40
8072 40 -70 -21 110 131 91 -130 33 43 -46 126 -158 -87 133 161 -211 -212 157 -49 -90 15 -39 -203 -65 -108
8096 -108 -80 90 -90 61 29 53 49 -74 14 -82 -42 -48 -131 -142 -61 -72 -41 -103 -56 -111 0 -41 -291 -30 6 148 31
8123 31 -194 120 71 60 -159 -120 -31 -184 29 -55 84 32 -238 -139 112 138 134 -136 -48 -82 57 15 -31 99 -100
8148 -100 91 65 -67 56 -165 83 -115 -3 21 36 -104 76 64 142 24 -30 75 100 33 -5 -53 -2 103 -33
8172 -33 -38 -30 -87 -22 -80 158 30 40 98 10 69 63 -123 -71 -179 135 40 38 -215
8191b15
$$ Imaginary data points
##PAGE= N=2
##DATA TABLE= (X++(I..I)), XYDATA
0 0 0 0 0 0 0 0 0 0 0 0 0 0 0 0 0 0 0 0 5 -8 8 -8 8 -8 8 -16 16 -16 21 -24 24 -32 32 -40 42 -48 56 -61 67 -75
40 -75 83 -92 104 -115 128 -139 154 -169 187 -205 227 -251 275 -303 335 -373 415 -463 520 -586 672
61 672 -772 904 -1081 1326 -1698 2315 -3525 6745 -31812 -74873 26314 7912 -51790 1542
75 1542 29593 -24007 -9953 13425 -20204 -9367 24554 -7657 -8323 27077 1194 -15762 16340
88 16340 433 -12049 22308 4947 -24603 18532 19224 -35863 -4535 34699 -24315 -31701 27001
101 27001 -5337 -42548 9473 9960 -37290 -11349 8828 -29071 -23923 2754 -18351 -19404 2554
114 2554 -18857 -22995 2406 -18256 -27288 8179 -3684 -25810 7134 4694 -29586 -1173 17299
127 17299 -22680 -8566 32078 -4928 -22031 23703 10613 -22493 11206 21409 -8895 6297
139 6297 19656 -5364 590 16852 -4480 -2588 19357 -372 -7010 17867 -586 -15838 15101
152 15101 5147 -22508 7667 15775 -22576 -8497 18833 -13893 -20905 13584 -3854 -24502 6142
165 6142 3236 -23264 -1203 7151 -18521 -7876 6243 -12733 -8597 7243 -9139 -8672 11435
178 11435 -7504 -15730 13351 1808 -19416 10513 13872 -16730 606 17887 -10567 -7919 19062
191 19062 3 -11301 15640 7982 -13109 7096 10817 -8801 3590 11045 -5243 2183 9837
204 9837 -6656 -1501 11905 -5050 -6125 14362 -596 -12868 11986 5824 -15962 5603 12554
217 12554 -13031 -2882 14737 -6192 -8738 11978 612 -10412 7984 4591 -9649 5306
229 5306 6405 -8122 4016 7140 -7930 2164 9722 -7730 -1270 13724 -5118 -8698 14729
242 14729 2025 -14401 10235 10161 -14194 2313 13397 -9734 -4476 12912 -3911 -8380 10416
255 10416 614 -10219 6618 3516 -10475 4324 5099 -10525 2541 7596 -11173 -1213 11124
268 11124 -9009 -7770 13294 -2934 -13793 10583 5477 -15942 3586 11411 -12504 -3050 12424
281 12424 -6701 -7208 10225 -1545 -8523 7691 2112 -9180 5739 4845 -9352 3483 7026
294 7026 -9453 1306 10210 -8381 -3168 12775 -4449 -9517 12020 2817 -12879 7084 9631
307 9631 -11725 381 11794 -7532 -4346 10918 -2929 -6202 8784 343 -7228 6615 2505
320 2505 -8456 4913 5216 -8957 3086 8175 -9592 -1400 10758 -7257 -7074 11710 -1557
333 -1557 -11701 8211 4637 -12954 1968 8693 -10084 -3093 9506 -6300 -6239 7279 -3557
346 -3557 -7738 5871 -962 -8700 4533 1782 -10493 2319 5028 -11282 -988 8615 -9512
359 -9512 -6027 10537 -4986 -10745 8299 1243 -12991 3333 6768 -11110 -1772 8533 -7446
372 -7446 -5593 7603 -4273 -6783 6642 -1583 -7085 5649 977 -8818 3713 4434 -9168 1137
386 1137 8110 -7904 -3090 9913 -5093 -7674 9414 293 -9568 5882 5267 -9160 820 7510
400 7510 -6326 -2834 7477 -3158 -4229 6413 -1749 -5096 5571 -499 -6178 4727 2102 -7283
414 -7283 2448 4945 -7674 -1186 7165 -6263 -5188 7716 -2855 -7852 6064 1004 -8913 1986
428 1986 3605 -7848 -1445 4736 -5441 -3269 4420 -4416 -4737 4229 -3465 -5849 4741 -1273 -7524
443 -7524 3380 1703 -8980 546 5133 -7779 -2921 7383 -5140 -6709 6666 -1254 -8347 4319
457 4319 2411 -7749 1182 4117 -6055 -1587 4718 -4475 -2983 5127 -3160 -4435 5313 -1745 -6195
472 -6195 5117 879 -7248 3041 4386 -7249 -655 6831 -5193 -4345 7041 -1734 -6452 5638
486 5638 1500 -6574 2767 3316 -5575 403 4259 -4153 -951 4805 -2916 -2523 5313 -2024 -4249 5561
502 5561 -48 -5727 4711 2669 -6736 1637 4955 -5731 -1732 6321 -3133 -4545 5554 -669
516 -669 -5942 3600 1218 -5848 1691 2300 -5533 39 2926 -4834 -1668 3646 -4384 -3583 4722 -2964
532 -2964 -5877 4501 -203 -7746 2669 2607 -7341 -569 4767 -5509 -3568 5050 -2784 -5658 4145
547 4145 -290 -6108 2859 1674 -5726 1563 2933 -5233 -151 4004 -4226 -1961 5488 -2577 -4198
562 -4198 5937 -174 -6256 4728 3021 -6636 2023 5464 -4969 -1213 6353 -2373 -3475 5660
576 5660 228 -4726 4319 1852 -4714 2566 3277 -4558 1303 4161 -3842 -508 4935 -2536 -2499 5344
592 5344 -656 -4724 4624 1585 -6033 2818 3771 -5468 -42 4948 -3526 -2392 4440 -1426 -3767
607 -3767 3437 380 -4344 2399 1432 -4652 1741 2100 -4600 249 3169 -4043 -1602 4033 -2711 -3701
623 -3701 4312 -683 -5178 3129 1950 -5827 1251 3754 -4813 -1006 4377 -2815 -2652 3862 -1038
638 -1038 -3606 3273 444 -3947 2691 1984 -4354 1743 3204 -4203 128 4720 -2873 -2025 5019 -604
654 -604 -3735 4505 1802 -4680 2760 3940 -4114 649 4866 -2761 -1247 4903 -921 -2067 4050
669 4050 582 -2840 3308 1935 -3412 2444 3102 -3301 1156 4392 -2748 -560 4840 -1270 -2457
684 -2457 4390 761 -3596 3074 2619 -3723 1152 3723 -2915 -453 3697 -2154 -1444 3272 -797 -2286
700 -2286 2693 99 -3045 2140 1219 -3603 1113 2335 -3648 -31 3534 -3053 -1573 3621 -1601
715 -1601 -3159 2959 427 -3672 1711 1910 -3824 253 2858 -2943 -434 3026 -2048 -1497 2759 -971
731 -971 -2142 2702 288 -2780 2428 1761 -3583 1380 3177 -3226 -164 4313 -1933 -1841 4341 -300
747 -300 -2842 3272 1624 -2964 2102 3034 -2830 669 3821 -2207 -576 3855 -1088 -1200 3843 -166
763 -166 -2253 3237 1206 -3171 2185 2818 -3232 689 4034 -2607 -1487 4445 -996 -2451 3430 525
779 525 -3128 2007 1880 -3174 631 2361 -2576 -556 2779 -1976 -1644 2800 -1405 -2252 2541 -326
795 -326 -3067 1921 959 -3632 393 2507 -3281 -942 3272 -2420 -2305 2994 -894 -3023 2215 404
811 404 -2948 1026 1316 -2915 237 2134 -2436 -653 2752 -1945 -1624 2986 -1207 -2559 2725 237
827 237 -2971 1983 1936 -3073 439 3057 -2455 -965 3644 -1216 -2141 3346 -46 -2342 2510 1299
843 1299 -2509 1657 2258 -2282 475 2914 -1915 -747 3599 -1095 -1692 3448 54 -2554 2729 1438
859 1438 -3019 1093 2762 -2658 -374 3502 -1506 -1844 3412 -304 -2881 2458 726 -2820 1307
874 1307 1428 -2684 271 2005 -2212 -739 2535 -1752 -2000 2522 -702 -2820 2108 263 -3135 1040
890 1040 1294 -3092 -341 2054 -2130 -1806 2268 -1265 -2295 1963 -377 -2596 1434 543 -2542 828
906 828 1138 -2403 19 1811 -1962 -818 2308 -1270 -1818 2404 -153 -2437 2220 719 -2578 1154
922 1154 1817 -2041 -20 2410 -1471 -880 2574 -457 -1667 2155 341 -1947 1976 963 -2015 1366
938 1366 1838 -1903 310 2389 -1374 -793 2686 -477 -1852 2728 494 -2523 1921 1477 -2690 1010
954 1010 2216 -1899 -595 2586 -1065 -1310 2488 -140 -2020 2020 237 -2395 1298 971 -2485 346
970 346 1732 -2140 -845 2085 -1323 -1889 1828 -392 -2614 1326 608 -2713 573 1234 -2278 -303
986 -303 1581 -1603 -1230 1618 -856 -1855 1574 -117 -2064 1310 461 -2226 906 1037 -2097 -54
1002 -54 1715 -1599 -663 2047 -908 -1454 1993 112 -1942 1496 878 -1965 1130 1639 -1616 354
1018 354 2033 -1049 -601 2037 -305 -932 2140 427 -1502 1773 948 -1946 1292 1729 -1819 611
1034 611 2343 -1466 -473 2375 -277 -1570 2142 708 -2136 1424 1492 -2081 617 1785 -1767 -303
1050 -303 2152 -1007 -1028 2052 -341 -1861 1744 370 -2481 1066 1173 -2500 281 1910 -2169 -718
1066 -718 1889 -1118 -1819 1672 -269 -2383 1261 647 -2317 485 1169 -2139 -187 1526 -1491 -1025
1082 -1025 1389 -830 -1330 1421 31 -1934 1179 994 -2181 688 1490 -1772 -85 2063 -1170 -755
1098 -755 2045 -386 -1447 1617 657 -1484 1163 1188 -1599 622 1537 -1287 280 1995 -818 -377
1114 -377 2082 -268 -1034 1894 233 -1588 1348 1243 -1512 830 1849 -1461 108 2177 -1024 -852
1130 -852 1969 -46 -1371 1492 569 -1820 827 1132 -1718 436 1533 -1695 -313 2010 -1167 -1121
1146 -1121 1779 -423 -1622 1371 359 -2035 564 1252 -1886 -223 1849 -1633 -1055 1839 -897
1161 -897 -1514 1416 21 -1842 713 761 -1853 194 1314 -1652 -354 1408 -1237 -847 1500 -707
1177 -707 -1416 1404 78 -1442 800 1020 -1583 86 1634 -1406 -456 1835 -818 -739 1657 -219
1193 -219 -1233 1291 636 -1217 879 992 -1183 319 1398 -935 5 1797 -808 -554 1937 26
1209 26 -1057 1598 582 -1179 922 1232 -1023 307 1661 -1097 -343 1797 -576 -904 1515 -357
1225 -357 -1068 1147 390 -1209 603 1010 -1313 135 1421 -1192 -697 1627 -865 -1129 1530 -324
1241 -324 -1592 1041 234 -1730 227 996 -1576 -442 1132 -1237 -1024 1419 -616 -1272 1103 -49
1257 -49 -1497 761 469 -1485 170 961 -1394 -419 1492 -935 -904 1482 -367 -1197 1331 197 -1500
1274 -1500 647 852 -1234 312 1486 -1021 -293 1610 -381 -701 1528 7 -1028 1502 488 -1308
1290 -1308 959 889 -932 350 1267 -870 -326 1573 -290 -698 1581 82 -1080 1179 613 -941
1306 -941 695 1112 -805 84 1226 -722 -587 1413 -628 -840 1146 -78 -1105 1055 245 -1303
1322 -1303 499 635 -1444 -28 1105 -1127 -583 1362 -572 -1265 1025 -166 -1383 770 330 -1682
1338 -1682 412 579 -1280 -417 939 -1014 -958 1138 -453 -1296 1084 230 -1395 665 455 -1493 212
1355 212 886 -1111 -357 1178 -610 -897 1338 -49 -1284 1058 344 -1501 844 1042 -1084 110
1371 110 1201 -741 -468 1305 -344 -577 1354 215 -1035 1224 746 -1232 709 995 -669 288
1387 288 1342 -626 -408 1293 -202 -677 1297 265 -1157 886 589 -1058 513 757 -843 -64
1403 -64 985 -540 -376 953 -339 -872 1038 118 -1018 708 509 -1267 351 774 -1118 -157 887
1420 887 -760 -904 857 -340 -1322 953 -50 -1559 617 496 -1237 48 835 -1223 -357 861
1436 861 -670 -808 951 -299 -1279 824 164 -1412 778 789 -1075 80 1182 -1025 -641 1139 -495
1453 -495 -875 1015 180 -965 822 666 -1259 494 842 -955 113 1215 -586 -370 1189 -301
1469 -301 -775 928 345 -969 832 931 -769 362 877 -833 37 1085 -516 -487 1124 -3 -630
1486 -630 848 509 -836 522 833 -660 287 828 -743 103 869 -648 -471 957 -189 -609 747
1503 747 57 -1060 187 567 -945 38 554 -1052 -289 791 -617 -639 754 -322 -985 423 -41
1520 -41 -1170 350 498 -1148 188 727 -1141 -297 768 -649 -611 873 -269 -1120 636 490 -1135
1537 -1135 319 632 -894 73 872 -834 -281 1177 -431 -653 918 101 -847 786 606 -973 242
1554 242 1051 -765 90 1107 -419 -236 1250 -134 -603 1090 367 -905 570 677 -723 164 945
1571 945 -614 -173 1211 -294 -608 958 9 -617 748 210 -782 511 653 -891 40 966 -715
1588 -715 -109 710 -609 -600 813 -181 -681 398 164 -942 99 595 -1038 -69 822 -959 -312 576
1606 576 -457 -419 643 -188 -815 412 138 -995 292 650 -795 -118 830 -671 -482 933 -551
1623 -551 -733 579 -54 -960 584 311 -832 359 785 -696 -284 929 -518 -374 991 -275 -587
1640 -587 914 138 -764 591 597 -738 195 807 -577 -280 1071 -380 -359 1063 -59 -538 951 512
1658 512 -612 464 774 -632 39 1021 -414 -278 922 -200 -560 858 99 -727 745 309 -791
1675 -791 195 680 -657 -212 633 -579 -578 728 -229 -585 668 58 -628 402 203 -914 -103 547 -722
1694 -722 -281 358 -449 -494 418 -349 -591 598 -186 -717 370 254 -796 86 605 -667 -105 664 -489
1713 -489 -536 508 -176 -754 586 1 -787 427 196 -722 159 744 -619 -284 782 -399 -367 824
1731 824 28 -645 779 157 -716 690 630 -541 13 797 -335 2 919 -247 -322 903 285 -498 593
1750 593 562 -699 544 542 -740 97 702 -424 32 563 -171 -666 510 268 -552 503 378 -635 159
1769 159 573 -658 -287 586 -237 -466 582 -241 -802 486 181 -668 126 263 -579 70 418 -482 -288
1788 -288 474 -635 -531 563 -303 -689 357 -61 -657 202 64 -622 68 375 -528 -240 333 -437 -300
1807 -300 350 -123 -379 471 180 -616 367 431 -538 329 597 -488 6 508 -319 -226 601 -43 -539 603
1827 603 342 -573 478 599 -507 195 855 -407 -266 821 -254 -247 614 188 -583 330 318 -620 342
1846 342 630 -402 89 930 -358 -223 779 -222 -479 520 292 -734 261 363 -569 41 535 -578
1864 -578 -161 430 -524 -633 276 -114 -422 387 100 -649 243 346 -865 -58 445 -573 -170 367 -374
1883 -374 -506 440 -92 -643 132 168 -750 121 410 -543 -86 495 -416 -94 508 -211 -310 339 0 -392 451
1904 451 128 -407 231 395 -482 33 660 -329 -55 653 -81 -269 494 56 -377 517 506 -482 363 527
1924 527 -556 93 504 -457 -167 644 -25 -291 424 290 -502 441 312 -478 190 564 -577 -116 502
1943 502 -270 -292 734 -127 -367 329 380 -618 173 439 -549 -51 210 -590 -274 425 -141 -386 357 34
1963 34 -605 81 193 -465 -136 393 -541 -53 455 -373 -390 427 -171 -570 272 -33 -473 142 253 -517 57
1984 57 272 -504 -186 226 -253 -241 499 -162 -117 332 108 -405 211 204 -354 106 510 -192 76 498 -75 -132
2006 -132 510 -122 -236 552 126 -267 468 515 -357 158 441 -235 -11 558 -103 -116 441 -92 -431 472 101
2027 101 -373 176 263 -392 -10 516 -211 -63 464 -212 -391 433 -32 -288 301 210 -511 191 380 -707
2047 -707 -91 424 -343 -230 484 -181 -434 339 -35 -485 206 140 -493 -94 234 -587 -337 464 -400 -428 228
2068 228 -134 -462 250 87 -434 236 -15 -512 53 284 -332 -4 300 -82 -278 296 75 -251 319 114
2088 114 -293 232 174 -244 113 374 -117 61 448 -15 -50 353 98 -346 307 85 -239 176 126 -174 275
2109 275 491 -118 18 329 73 -269 446 28 -197 400 108 -355 215 283 -397 66 344 -298 -277 195 -51
2130 -51 -257 401 -29 -459 219 -15 -387 167 310 -437 -64 238 -374 -313 450 -72 -514 327 -128 -618 208
2151 208 68 -465 -244 429 -461 -69 306 -163 -334 175 -15 -503 339 230 -502 120 201 -440 -38 452
2171 452 -193 -316 338 -150 -245 343 49 -288 265 152 -372 188 406 -274 170 445 -174 62 322 -61
2191 -61 -127 331 107 -307 359 163 -253 436 162 -111 11 425 -192 -89 307 155 -304 476 51 -428 269
2212 269 183 -289 124 92 -452 10 199 -251 -182 246 -126 -238 353 6 -536 174 290 -578 -5 142 -266
2233 -266 -174 290 -172 -314 261 -90 -401 4 159 -472 120 205 -475 -31 435 -480 -261 289 -143 -204 284
2254 284 -225 -338 257 84 -303 330 200 -312 159 235 -307 -119 280 -91 -273 181 233 -192 80 338 -219
2275 -219 83 307 -281 15 490 -157 200 307 88 -12 272 61 -204 198 260 -98 139 233 -331 115 213
2296 213 -82 -94 428 -57 -213 407 252 -197 86 379 -324 155 253 -361 -27 123 -307 -147 284 -35 -196
2317 -196 102 64 -378 225 -24 -492 -142 136 -551 -169 138 -107 -318 142 -74 -373 -173 186 -493 59
2337 59 189 -325 -169 102 -304 -283 352 -349 -258 91 28 -416 20 162 -332 -1 251 -204 -12 352 -210
2358 -210 -211 272 111 -162 337 211 -326 127 263 -303 115 420 -12 -110 177 -92 52 498 19 -65 112
2379 112 209 -16 83 300 -109 223 333 -193 21 95 -21 -107 213 -156 -156 66 79 -129 76 71 -418 -2 287
2402 287 -188 -9 282 -386 -301 163 -2 -148 223 -162 -365 77 94 -233 -159 351 -358 -75 235 -250 -201
2423 -201 152 -28 -441 45 -29 -424 -72 179 -135 -40 269 -237 -111 243 -204 -304 146 76 -395 126 212
2444 212 -284 35 312 -149 14 411 -72 -126 217 -66 -128 143 216 -202 187 226 -254 87 217 53 -167
2465 -167 419 116 -127 259 18 -149 157 80 -68 95 192 -36 -151 58 -297 -162 136 -72 30 148 13
2486 13 -324 12 45 -142 125 96 -135 48 25 -197 -179 92 -110 -145 205 -5 -157 -23 -64 -282 114 -4
2508 -4 -158 -121 53 -128 -112 88 -272 -289 43 -43 -105 -96 103 -365 0 -57 -226 -76 268 -231 -175 240 -71 -223
2532 -223 172 127 -320 348 20 -180 67 274 -210 7 384 75 -116 405 140 -288 274 258 -219 55 153
2553 153 -93 -27 334 -38 32 347 -144 -170 170 117 -114 176 258 -185 11 206 -99 -46 97 5 -228 85
2575 85 54 -85 69 -75 -236 125 78 -82 58 26 -164 129 29 -101 -23 206 -193 -223 -14 -78 -291 146
2597 146 77 -259 38 -34 -257 0 -67 -205 -213 131 124 -362 296 -126 -241 46 119 -174 25 186 -285 30 125
2620 125 -51 -264 81 173 -104 196 70 -259 146 322 -124 -10 401 13 -235 170 49 10 357 137 -105
2641 -105 154 110 -275 175 283 -191 119 218 72 -52 151 -9 -125 226 142 -175 62 258 -176 240 252
2662 252 -17 115 207 -150 -130 196 14 -201 -83 151 -113 -6 81 -199 -220 174 -126 -130 160 28 64 174
2684 174 -93 -383 -10 168 -77 61 -11 -256 29 180 -211 167 66 -163 -4 112 0 -108 14 17 -85
2705 -85 114 102 -247 149 165 -383 -67 181 -133 111 7 61 -155 183 136 -93 -25 148 -128 98 124 -167
2727 -167 67 220 -78 -180 105 53 -71 154 118 -51 40 136 31 -73 333 -12 -64 264 -4 -173 244 183
2749 183 -208 95 214 -256 83 132 14 -11 211 108 -173 191 148 -101 7 -145 -112 -24 191 -177 -255 95
2771 95 -239 -135 94 -215 -90 102 -19 -140 75 158 -205 -91 225 -40 -162 5 -171 -178 15 -103 -133 170
2793 170 76 -289 -127 47 -256 145 118 -98 -162 4 -275 52 182 -25 -146 140 -15 -214 70 -53 -133
2814 -133 140 338 -111 174 432 -35 161 130 -105 -51 16 -101 -207 5 90 -211 119 296 -78 -39 213 22
2836 22 -98 183 15 -155 182 104 -156 -239 26 -163 54 195 -115 -296 102 -95 -273 104 -171 -89 39
2857 39 102 -231 -178 83 -251 46 70 -105 -276 117 146 -140 149 192 -260 -5 237 -145 126 -35 -228 -219 199
2880 199 -73 -151 121 -9 -249 47 -84 -173 -64 -54 -59 -240 153 -197 -2 172 -353 -84 287 -107 0 316
2902 316 117 -27 146 105 -14 89 194 -44 19 320 -99 -68 277 42 93 268 57 -29 193 197 -197 -48
2924 -48 260 -122 49 261 -10 -12 347 74 -104 234 38 -117 -144 171 140 85 144 -108 -54 151 -174 -191 -21
2947 -21 -1 -235 -97 61 -284 -123 121 -78 -8 -34 -140 -11 22 -56 -99 -151 -120 -112 1 -27 -132 55 43 -3 -212
2972 -212 117 62 -124 150 -33 -147 74 -20 27 102 188 -115 -87 -49 -53 11 102 36 71 140 78 -188 72 137 -184
2997 -184 55 151 -107 135 116 35 70 265 -23 48 82 70 -205 152 34 140 59 -61 -15 109 206 81 -44
3020 -44 242 3 -66 227 177 -136 -1 -88 -385 120 18 -72 -114 105 95 -200 24 74 -88 -142 120 -339 -51
3043 -51 -2 -226 -54 173 -191 -117 78 -60 -209 69 54 -155 17 -7 -173 -35 153 -84 -90 42 -100 -46 141
3066 141 -169 -24 -41 174 -143 92 -22 -139 -125 196 26 156 125 -29 -120 37 -17 -200 163 -6 -17 291
3088 291 281 -174 85 39 -129 72 93 -53 17 221 -172 -41 136 132 -230 56 229 -94 -72 264 -88 1 -65
3111 -65 5 102 174 106 186 108 -76 -196 187 34 -11 98 81 -127 -119 67 -108 -5 -85 -167 -62 -91 204 -89 -250
3136 -250 107 -143 34 61 -200 -358 195 -85 -189 122 -204 -132 31 -72 146 -130 -108 -156 -110 131 -237 -39
3158 -39 168 49 -253 22 -120 -234 -146 68 -102 -1 184 24 33 102 -69 53 215 -71 -145 107 181 -30
3180 -30 97 25 14 89 225 7 -2 88 -108 2 127 25 -107 184 -109 -41 97 62 -71 -24 244 -217 -39
3203 -39 251 -8 51 23 -23 -59 26 70 -106 252 127 113 -108 35 -233 -99 84 -77 -44 123 44 -149 87
3226 87 -168 -207 -75 144 -232 29 -76 -15 31 63 -14 -177 129 -104 -183 -49 201 -111 -77 57 -15 -67 150
3249 150 -110 -98 96 74 115 138 114 -22 -13 83 -63 -130 90 42 61 58 -123 -10 40 28 -64 38 35 -32 157 56
3275 56 -105 -37 -22 -25 48 125 83 -62 264 -168 -44 43 143 -53 62 31 -16 42 7 -47 -12 20 -43 -26 117 -87
3301 -87 -17 31 -28 -63 -92 41 -273 24 110 -44 -215 -116 63 -171 66 5 -286 240 -172 -227 -97 -52 21 -179
3325 -179 3 206 -142 16 -94 -222 136 -27 -88 18 -85 -65 -207 150 -25 -86 185 77 -74 174 -78
3346 -78 -172 -26 9 -44 -116 -19 -16 35 103 41 -40 244 315 -42 189 161 -170 267 96 8 217 -71 -35 -112 -53 -19
3372 -19 91 83 -137 -51 145 -50 -46 111 -57 28 119 99 -137 -31 -2 -67 56 -150 64 -126 146 -75 -156 95
3396 95 113 -263 -108 183 -143 -2 63 -116 -202 128 -71 -199 -22 -55 -219 31 24 -113 -31 8 -148 -65 75
3419 75 72 -29 25 -156 -37 -70 -173 -155 -120 -20 -21 -52 231 18 -96 1 -50 -26 -86 60 -112 -26 114 -239 30
3444 30 175 -19 140 128 -12 -54 201 -47 -22 213 81 -31 64 221 -51 -56 193 -116 -83 4 6 28 67 0 48
3469 48 183 98 45 43 160 70 139 -67 -114 -107 -33 -79 63 134 -127 -9 103 -31 -29 -72 -43 -181 137 -2 -257 -80
3495 -80 -19 -194 -45 -150 -34 -217 -53 75 50 34 46 -165 -77 10 -46 -66 139 -38 -34 164 -132 -194 116 82
3519 82 -151 83 36 -23 -42 58 -98 22 151 -12 -6 59 73 -72 -73 64 -45 107 91 -110 -6 183 53 38
3543 38 57 114 120 110 349 50 -72 70 -121 -36 86 -143 -46 101 -40 7 202 23 195 127 47 -46 42 72 -19
3568 -19 -17 219 35 -82 157 -77 -57 82 101 -28 -244 -153 44 -144 22 -114 -26 115 -91 -92 228 30 37 -57
3592 -57 94 -150 -2 -51 -103 -59 -206 -100 -34 110 -63 -86 65 -122 -164 202 -73 -127 -98 47 -155 89 86 -268
3616 -268 -72 48 -147 -176 265 65 18 53 125 -95 87 -40 69 -87 32 -12 10 41 -140 -64 154 9 24
3639 24 130 160 -109 -19 124 58 -24 -45 61 135 87 141 -21 153 73 -156 97 18 -36 126 -36 85 -212 -64
3663 -64 -94 -36 -2 -20 46 44 -196 -91 231 71 -87 -102 67 -84 41 -195 -142 110 -81 58 -190 65 0 55
3687 55 57 -93 88 141 43 -28 -87 -40 -6 -107 118 -193 -112 80 -52 61 -74 -105 26 8 51 -59 116 81 20
3712 20 -24 73 13 -121 60 99 -225 138 48 -81 -5 -28 18 -31 191 240 65 1 104 -68 217 229 -45 120
3736 120 91 14 14 162 -20 25 -42 -33 -85 -127 155 -31 -42 86 -126 -26 -40 -20 -57 -71 -11 78 -98 -145 45 -140
3762 -140 -83 -87 28 -87 35 157 88 -26 -66 -148 -12 -108 -188 -122 -140 -60 -31 27 106 -106 -14 -34 -74 -200 -60 -52
3788 -52 53 -37 -9 -24 159 10 -35 184 134 -21 -35 29 84 -2 -10 57 2 1 3 37 46 13 -31 -21 62 26 -106 -11 75
3817 75 -12 -109 91 -22 -32 48 189 -264 38 40 44 -60 -42 69 -139 183 18 -240 -46 42 34 40 -78 13 222
3842 222 39 -189 35 -35 8 -24 63 116 -37 -35 -31 -188 86 72 -35 -57 -60 1 -43 -84 10 4 -7 -62 34 -105 32
3869 32 46 -8 -15 -94 123 168 -122 6 -37 106 10 53 -195 -90 149 156 -160 81 12 97 36 47 -205 188 44
3894 44 -13 0 19 56 -39 -57 26 33 7 109 -35 12 -24 -125 -77 129 -77 179 118 -96 195 182 146 -79 99 15
3920 15 -2 291 244 -104 -191 -17 93 -36 205 -103 133 -39 271 -61 -133 -37 -104 4 -23 -79 81 53 -28 -71
3944 -71 49 -182 -22 -8 -44 -122 -186 -8 -16 -279 -97 -96 -27 -43 -37 -240 20 -8 -26 71 -85 34 -63 -85 124 97
3970 97 54 -31 -17 -35 -77 57 241 54 -137 -22 -88 53 139 220 -81 101 112 -54 -1 68 -203 45 120 -74
3994 -74 56 -86 -82 76 -29 61 -169 67 47 146 23 -43 3 101 179 -164 11 98 -6 -209 71 96 -116 -151
4018 -151 -20 -139 -36 128 139 79 -23 -28 -78 114 -33 19 -76 125 44 -93 -105 21 119 78 42 -36 92 -48
4042 -48 54 -114 33 14 -57 -73 -5 3 3 -88 -138 -19 5 -126 -16 -4 -206 12 -129 46 107 145 82 -11 -71 58
4068 58 -112 156 35 12 -11 24 37 80 -20 -54 120 23 104 49 39 -68 48 129 74 113 72 17 -34 76 87 -136
4094 -136 -18 -51 -1 -72 63 11 -26 -43 38 88 2 -23 97 31 -28 -23 -145 160 -42 -1 -62 49 -95 70 -91
4119 -91 -77 -52 -118 33 -18 89 -43 -115 -103 -45 -47 -35 -40 27 142 107 -68 72 -115 -50 -99 -95 56 -38 -122 -35 -105 -22
4147 -22 82 -78 -32 44 17 99 -36 -31 136 43 102 137 100 51 -31 14 -110 9 152 34 48 34 20 40 148 86
4173 86 58 -18 210 213 113 222 -44 -22 -65 41 -164 -64 6 -86 -8 -30 37 -167 87 -198 -13 -41 -27 -129 148
4198 148 -29 -175 -105 -30 -59 68 -144 -38 25 -98 20 -134 -13 -208 -256 38 89 -177 -239 -26 57 -137 45
4221 45 62 27 52 -63 -201 137 22 35 -50 -30 40 -179 -53 -38 41 -128 114 50 36 104 1 39 -96 -37 134
4246 134 81 -149 124 -42 120 213 21 15 -29 169 37 297 -86 28 45 66 112 -35 117 26 -8 51 88 -15
4270 -15 -132 30 38 88 -107 -60 -118 -1 -33 58 77 -1 53 11 7 177 -112 200 42 -61 68 -27 -104 -109 -62 58
4296 58 38 96 -76 100 108 -92 45 175 -87 62 -107 -241 -144 -112 -199 -45 -86 -91 115 -65 63 -31 -23 -204 34
4321 34 37 -20 -42 -32 -72 -29 -71 -97 86 34 -71 45 173 -57 -105 103 -61 -139 54 -105 -40 149 56 61 131 102
4347 102 112 27 -85 68 -20 90 -34 62 -35 11 77 -126 78 6 -67 7 21 65 -96 15 -9 196 11 40 -37
4372 -37 -115 21 -82 -249 -58 131 178 -51 -21 168 -98 -109 -71 -138 -68 34 -44 -57 28 11 -124 35 -92 -23
4396 -23 123 72 -167 76 67 63 -36 90 -24 -56 190 -94 -32 -28 -15 147 -61 3 -68 -212 49 -42 -2 -97 68 55
4422 55 -168 147 -64 142 62 50 87 -56 -24 18 -67 101 -80 64 106 -202 157 146 97 -23 19 56 -212 8
4446 8 -61 -101 -9 118 28 2 -87 -71 180 -33 147 75 -81 13 144 -157 -56 -47 -36 -72 -10 35 -80 4 -100 -21
4472 -21 146 -25 -46 -82 37 16 -102 -120 -192 -58 -3 127 101 -9 81 -241 27 -53 0 -28 -69 2 -37 -80 -87 -362
4498 -362 -140 86 91 -39 -69 -13 83 -66 -28 199 -130 35 -27 -20 65 16 -113 78 123 -26 6 -59 -125 224 157
4523 157 36 44 -14 77 15 -20 205 22 233 154 -110 -1 29 120 67 207 -45 -188 -26 159 -4 9 27 -73
4547 -73 -68 -21 33 25 -46 -9 -98 -164 -139 -178 -84 -66 40 15 -98 101 100 -4 -105 -45 39 -88 -16 -2 -46 -141 -89 -98 -179
4576 -179 -115 17 -101 61 120 -87 25 -124 -85 -116 -84 87 -136 82 66 15 65 -101 -60 18 -62 -233 106 50
4600 50 16 21 193 -104 118 5 26 -152 -44 53 17 -12 58 2 -6 14 -4 -225 164 12 -13 86 86 -186 108 155
4626 155 -18 246 82 56 -172 27 9 4 175 -60 120 46 -120 -112 -53 -8 -95 39 -92 -72 -74 -44 -3 -53 -127 -128
4652 -128 -91 89 64 -29 -76 -158 74 122 47 -126 -113 -114 -128 -32 -181 6 -2 -52 -77 -160 4 -76 -70 24 128 -88 46
4679 46 -158 183 47 -4 20 132 -38 -89 -111 154 -18 -37 -37 55 -187 -20 26 24 114 -135 231 66 92 34 -48
4704 -48 -22 53 0 5 30 -109 -30 154 -57 12 52 159 58 54 95 110 -22 209 20 -85 -29 112 -48 41 143
4729 143 21 24 88 94 -32 -33 -74 -16 51 -23 -48 2 -48 -62 35 -62 31 114 -41 20 -45 -158 38 127 -108 -9 33 -175
4757 -175 -39 47 -100 15 -74 -193 11 -113 -17 -30 -111 104 92 -57 4 -134 98 103 57 -72 204 167 -72 42
4781 42 -11 102 -92 -20 -37 106 -16 -48 -98 -35 149 -3 22 100 -30 -104 99 123 136 80 -20 82 58 50 -40 -21
4807 -21 -53 24 15 -1 23 174 -23 132 93 48 30 -41 -143 26 15 24 130 -202 37 -49 -11 42 53 -90 -157 -37
4833 -37 3 -163 -132 -31 -111 -159 -59 -53 -161 -71 40 -9 -161 -179 107 -74 -112 82 12 -31 -69 -2 -9 -5 -2 -129 130
4860 130 6 -7 -53 -19 72 -30 109 -53 171 -155 46 103 75 -59 -1 40 -45 17 55 -60 8 48 30 -81 114
4885 114 177 1 -31 110 239 -54 102 -26 -119 63 -31 39 -52 52 -1 174 -21 -111 -73 30 -11 90 71 8
4909 8 -95 111 10 -44 73 -93 1 48 19 -168 -35 16 -75 -17 218 -69 -59 2 -130 -97 -59 32 -26 3 -144
4934 -144 39 -45 -37 6 67 -102 -246 279 155 -79 51 -153 -64 53 -9 78 0 41 -39 -46 -17 74 23 21 -21 -52 116
4961 116 -67 150 115 87 -107 -116 86 167 -14 170 138 -28 128 167 97 -20 -34 204 -136 -1 35 8 -37 98
4985 98 6 -89 -9 -218 65 -24 -62 -13 256 -3 133 20 79 64 -66 -76 94 267 -97 45 -81 -168 -246 -113
5009 -113 -5 -26 63 113 -118 13 -44 45 -143 -60 -186 -163 -9 -9 -4 -101 -34 -96 -174 -71 -168 -146 -68 -62 44 17 36
5036 36 145 12 -89 28 48 -74 68 123 108 -64 33 65 -18 -73 -98 6 -93 -171 -37 157 66 -20 64 101 95 31
5062 31 -129 -5 -181 -43 -6 132 62 -37 -11 -74 92 8 73 57 100 37 212 -107 21 105 -98 -153 -89 75 -27
5087 -27 23 -236 -121 -18 -76 -59 86 56 82 13 -55 138 -68 -39 17 7 -217 -135 -87 -20 -30 -125 -186 -226 12 111
5113 111 14 -16 -86 -127 -42 -151 -1 -184 72 -45 -117 -214 -81 132 -135 187 -16 81 19 207 73 39 5 9
5137 9 -149 125 232 27 -20 49 -5 33 237 36 -39 -86 92 106 48 8 -104 -83 38 30 112 -52 49 -5 -58 -32
5163 -32 -126 185 -14 -3 -29 175 -89 -33 -41 34 -52 -169 44 -121 85 59 -24 -46 55 -34 133 -91 35 36 -129
5188 -129 168 -67 38 159 -59 -66 -113 73 -57 -45 75 -46 24 37 83 32 -11 103 15 -122 138 -35 14 -77
5212 -77 -31 -18 -89 93 -1 75 -35 -41 -82 105 -92 80 283 -67 77 141 -16 1 -119 -49 -75 -56 52 22 -3
5237 -3 222 22 1 -66 130 116 -108 70 -54 85 -1 41 -110 153 24 39 -178 -136 15 141 -6 -16 -14 130
5261 130 123 -90 -133 -53 -4 26 53 12 115 -8 53 76 81 -12 85 -7 -43 -79 13 -86 -82 248 -58 107 24 -51 69 -125
5289 -125 202 -65 -24 41 -94 -45 -110 -41 -7 -101 -50 -171 -102 149 -112 -219 16 126 112 19 -114 -106 194 -98
5313 -98 -55 82 73 -31 34 -31 -144 4 14 70 45 -124 -17 -90 90 99 -147 0 134 96 73 25 199 83 79 107
5339 107 94 26 13 48 -13 53 12 13 -65 74 72 -62 -30 -110 -72 -107 -43 5 -87 7 -31 9 5 -100 -30 -165 42 41 -81
5368 -81 -182 -30 -137 -151 -7 -150 108 -71 -41 44 117 129 -52 99 46 -38 3 -47 -10 23 -94 -14 -143 -35
5392 -35 83 91 -22 -162 -41 -141 -74 8 2 157 -76 -153 106 -37 31 109 47 72 97 -223 -65 133 22 28 -39
5417 -39 -2 -266 -89 -63 34 63 16 27 -7 161 156 6 8 59 -25 97 36 -78 -96 167 113 118 78 13 -53 26 -48 49
5445 49 -177 9 -47 80 90 69 -12 9 43 -99 76 -20 -147 -85 107 -1 97 174 42 -279 -185 61 -80 2
5469 2 -81 65 -15 4 -104 14 53 24 6 -209 40 92 -187 -140 -42 -90 -112 64 -50 97 -155 -57 78 -115 130
5494 130 -25 -29 -23 143 100 -36 65 53 -33 61 -34 63 8 49 -96 192 3 -119 4 212 160 -13 31 -81 -8
5519 -8 125 195 258 144 98 -26 -69 123 6 27 -61 -199 -30 -96 9 71 78 236 -14 26 -138 11 9 -35 -49 -1
5545 -1 -7 19 -141 -8 -53 -67 -41 -27 -155 73 -43 -27 134 -47 52 138 -141 30 73 -73 -124 60 -44 -36 -172
5570 -172 82 -166 -41 37 58 92 81 -28 -71 -68 128 5 -5 141 -17 1 7 158 21 141 26 -40 -140 92
5594 92 -29 40 -61 -6 -138 -40 169 55 103 99 -168 -32 -61 -167 -22 -5 22 120 -147 181 99 43 172 -110
5618 -110 -61 64 65 72 89 -11 115 -176 -59 -108 -28 85 126 69 -27 42 -123 -18 16 -134 95 -109 37 38 -165
5643 -165 -59 -27 -15 -146 44 7 -138 97 67 51 13 -29 135 -57 -7 91 25 16 -145 141 127 -176 -157 90 -41
5668 -41 -42 149 147 -144 6 -181 -26 -8 -58 -48 117 77 131 77 -63 -140 120 11 -20 -44 24 -7 -61 -116 54 137
5694 137 91 48 143 -25 155 76 -63 -13 -61 173 169 23 65 -58 -138 -36 76 31 148 78 82 13 82 2 -204 -75
5720 -75 74 -34 245 215 -205 -68 86 154 -74 19 42 -61 -176 110 -13 -91 -113 -116 -59 -143 -78 -81 1 -17 -69 -121
5746 -121 -46 -74 77 -32 53 -36 24 25 -65 -117 -13 158 -86 -22 66 169 -133 136 -71 215 9 24 -4 -65 87
5771 87 -34 -17 133 33 20 29 32 -12 81 99 -27 -58 107 84 9 42 134 53 332 205 22 -4 -24 -51 -50 36 43 65
5799 65 -42 24 -41 12 -30 -39 -26 1 34 -70 36 -16 -14 -35 -204 -183 -65 -4 -149 -44 71 11 88 46 33 143 -33
5826 -33 -173 21 70 -69 -258 -80 64 -61 75 -135 -111 39 -13 -174 -64 17 -103 -13 126 -33 0 22 51
5849 51 11 151 -25 14 -12 73 45 -112 68 115 -98 7 -78 -7 167 -7 -50 -18 28 5 92 15 -5 -156 45
5874 45 -41 14 15 192 71 144 154 154 70 -93 103 65 162 67 -7 -63 -63 113 -82 36 77 -68 90 -53 117 -116
5900 -116 15 110 -53 -86 45 -13 -148 -35 1 -50 -75 16 -77 -44 20 2 -65 67 19 61 -12 -191 10 -60 15 132
5926 132 -88 -182 108 -52 73 49 -141 29 -4 -75 76 68 -14 -51 -102 -119 81 98 49 41 100 -67 -86 3 28 -26
5952 -26 5 93 168 53 37 88 144 127 -24 -8 82 -63 -90 28 -2 -175 -49 17 137 -4 -86 -56 -16 27 88 -34
5978 -34 129 -121 -82 72 -51 18 26 21 -99 5 22 33 -146 68 -17 56 57 81 199 25 21 50 -71 30 125 -193
6004 -193 57 -26 -121 112 91 123 -45 -100 -69 -71 161 30 26 -21 51 68 -43 159 -118 -43 -20 -101 -14 156 166 130
6030 130 -64 265 -101 -11 -4 13 -28 -9 -106 154 -233 40 101 -15 78 76 -28 -43 110 59 103 -114 -107 50 49 -45
6056 -45 -3 56 26 113 -38 187 74 -87 19 -32 -49 -102 -2 70 108 77 58 -58 81 25 -55 41 80 -38 -74 -10
6082 -10 -44 120 -18 109 1 -102 -19 -47 -41 -104 8 20 -67 26 -148 21 54 -90 54 -84 23 6 5 -96 13
6107 13 -258 -56 1 -6 18 1 -121 -69 0 75 -63 -120 -51 -66 -46 156 -7 -31 -6 123 37 -98 53 27 -70 -12
6133 -12 -20 50 -104 -8 83 82 -43 -73 14 133 98 -174 127 97 -62 -142 233 22 -127 203 157 8 -20 53 -105
6158 -105 184 -34 79 -37 -83 53 91 83 43 22 158 -85 53 -52 179 -121 80 -100 -107 -79 35 52 -109
6181 -109 26 -68 -25 -115 115 -83 -16 -101 -131 61 98 -172 -46 38 -71 154 -148 -19 -22 -49 -65 66 -13 51 14
6206 14 46 -109 9 33 -23 -11 -46 -112 35 11 79 24 -70 -118 85 -66 -52 39 107 -66 52 187 47 -141 -52
6231 -52 -60 110 236 55 -13 139 -90 99 18 -85 120 96 -143 -67 -155 81 55 -73 -69 -57 -146 23 -31 183 -51
6256 -51 21 -113 -92 29 79 -7 64 -32 -103 -90 -66 123 -24 -9 52 -106 -144 -82 67 8 -102 30 -41 -85 193 99
6282 99 -75 94 211 -80 4 -14 103 155 -53 -132 55 -50 90 -193 -65 -87 48 42 50 19 -64 -56 -32 41 -51 35
6308 35 74 -1 -82 70 -125 79 46 -61 26 201 79 -17 6 -4 55 140 66 58 43 12 -44 135 -150 211 18 27
6334 27 -8 119 10 -83 110 -36 -207 17 -40 -28 16 111 -187 -60 27 88 -102 150 -139 -120 -120 -107 -36 -38 -9 -157
6360 -157 150 47 -18 -64 -3 -54 -261 84 -43 111 -104 -249 124 -19 -27 -28 94 -184 -38 -164 -32 37 160
6383 160 -117 -169 112 176 -72 97 -7 -104 24 -75 -14 -11 -60 85 20 -26 -51 -37 -10 118 -24 -110 -30 109 66
6408 66 67 -13 84 -79 118 110 -49 57 -168 43 -27 -19 -2 81 -73 157 -116 -58 -104 -69 -59 15 -118 9 24 92
6434 92 64 106 50 -50 -68 -27 -155 -57 13 78 -97 -68 -46 -112 -17 16 24 -48 94 71 -42 -29 90 -64 -93 90 -11
6461 -11 -15 -69 95 -169 -46 18 50 86 -74 -46 -152 -117 41 -110 -38 -36 -22 135 -146 -81 2 26 -71 -19 -62 64
6487 64 -93 78 -55 37 54 -4 -124 -32 40 49 -151 -109 16 -24 161 -63 36 -25 127 -34 -31 285 37 -22 87
6512 87 -84 36 -135 -40 43 10 6 -105 23 108 -24 -61 -4 46 -75 -157 -74 -177 -18 -108 -27 -63 87 -30 256
6537 256 -62 -67 -28 -156 -147 -72 -74 -51 -72 45 46 27 -73 130 -18 106 46 -139 185 -144 19 -59 43 -21 -213
6562 -213 120 9 -12 -84 -32 146 137 -18 41 50 97 286 -92 -169 -54 62 -6 188 7 -39 -94 -55 -114 -111 260 53
6588 53 -27 -48 91 -14 40 -121 89 91 -28 19 96 -186 8 -51 111 9 51 -68 -72 -1 189 -26 -2 100 -93
6613 -93 14 15 40 18 -42 -91 115 -72 -156 118 45 -47 -155 -104 230 -131 -126 -118 3 88 68 -25 -83 -104 71 -143 -75
6640 -75 11 -126 120 53 24 48 -49 8 -35 -202 67 61 65 -237 71 -21 119 85 -65 110 -139 18 -9 10 -28 -76
6666 -76 55 168 67 75 71 18 -46 -16 12 223 52 195 27 -63 -71 -94 41 76 24 -123 -52 -240 179 -14 137
6691 137 48 -11 45 0 102 105 113 -6 16 10 64 16 -74 -106 176 -98 -21 -91 -190 -36 64 -63 29 -42 -251 -79 -40
6718 -40 -51 55 32 88 -36 -107 25 -64 -28 163 64 -58 56 -61 -11 -118 31 -104 -87 40 -66 22 -20 12
6742 12 83 28 40 -62 35 23 14 125 -70 42 104 -87 18 -33 -50 42 -185 17 -12 39 27 -59 10 -120 20 62
6768 62 -19 38 -20 140 138 83 47 107 -39 -94 -229 161 43 -6 -45 55 -8 -20 89 20 -77 -39 -16 -65 -8 -77 -64
6795 -64 -52 83 -174 114 53 67 48 -203 118 112 -86 20 38 -56 -123 21 -41 6 108 -61 -209 -208 42 73 -141
6820 -141 121 -88 -133 -120 237 54 22 -54 -81 32 -183 74 -8 -196 52 -15 103 167 38 -125 56 164 -8
6843 -8 -115 16 -25 31 121 3 -74 -30 -201 -16 -114 62 80 95 -57 56 127 -132 70 -1 64 66 66 10 51 -189
6869 -189 -101 4 73 -128 -19 70 99 0 35 139 -6 -32 -1 -17 80 -109 124 -100 -35 -52 19 -97 133 -57
6893 -57 -45 24 26 -63 -24 -26 -9 -30 -13 -61 -6 -48 11 -135 -84 -44 -66 95 -189 51 -122 82 52 -145 105 -65 43
6920 43 176 -187 23 4 -10 129 -25 27 29 91 99 103 -4 34 -210 -82 120 220 269 34 -69 109 -65 -54 -17
6945 -17 -94 67 163 -7 96 -5 78 -45 -121 87 -25 40 -41 -24 12 100 -95 13 -43 -66 45 -33 72 133 -107
6970 -107 56 30 -69 -102 -48 22 12 -98 -86 114 175 0 24 -126 9 1 16 -23 -133 -104 108 -27 23 -97 -112
6995 -112 93 84 -53 -112 76 -10 64 -108 -2 -106 -86 -57 74 -85 -121 41 -2 94 -180 -36 -32 131 -27 -57
7019 -57 16 298 169 169 102 38 -83 8 96 69 -70 6 80 -36 -101 -106 96 -74 88 26 76 -11 -23 0 118 -33
7045 -33 -122 78 -74 -7 -54 118 126 -23 -12 -38 62 144 58 49 27 97 -3 -56 102 162 -46 -74 -19 -238 231 50
7071 50 79 -139 -97 86 64 119 2 -72 -18 -125 -113 66 35 -40 4 -164 -25 -175 -176 6 9 7 -72 -30 173 -97
7097 -97 40 5 -36 -153 47 11 113 2 76 -36 142 110 -3 -34 65 -159 12 55 -97 1 85 -218 37 -134
7121 -134 -70 53 -140 -82 -22 63 102 48 12 -96 -67 46 38 120 -40 57 68 -59 -61 10 -7 -21 -95 -44 28 114 3
7148 3 43 214 -25 96 13 -47 -12 6 -197 156 -136 -39 -145 -28 70 -72 51 1 28 -31 42 -5 -82 92 12
7173 12 55 116 19 0 -19 -61 135 141 110 76 36 111 -184 -35 -104 180 -2 30 60 19 -74 -74 -113 -111 -43 48 143 2 -174
7202 -174 -79 -108 42 0 138 134 -22 84 -83 68 -36 -117 38 -27 -54 -48 -5 88 35 -112 25 50 -3 121 80
7227 80 183 -114 -201 123 -44 -83 -18 -106 -7 -16 -64 261 -114 35 114 70 -33 -18 138 125 172 -149 131 -25 -63
7252 -63 44 -145 140 -34 -128 -31 161 -73 -120 52 85 -4 -85 -190 14 68 59 -45 4 -96 124 0 -82 -3
7276 -3 153 130 -148 57 68 -120 28 44 1 13 -54 7 -18 70 -69 65 -1 106 0 -69 122 -20 -63 -17 -149
7301 -149 108 56 -203 97 -96 -124 -149 -56 -19 -137 -25 -51 1 -74 29 0 55 73 57 22 -113 -1 -9 -74 15 -51
7327 -51 -101 28 2 -170 16 -58 142 63 -87 69 -73 108 32 30 85 22 0 -175 18 -51 60 -1 -20 -140 175
7352 175 31 -107 -51 -70 -220 -18 52 -19 20 17 52 102 50 79 -49 39 -20 -90 -21 -52 -113 -12 -81 -127 -117 -66 -127
7379 -127 23 25 35 32 -42 -38 38 1 23 107 -107 105 -75 95 -128 15 174 157 25 -72 77 -25 98 -54 -21
7404 -21 -21 -126 -30 30 40 116 -107 -22 122 126 128 -18 30 37 -21 16 -129 -174 135 -4 23 119 92 63 7 -131 49 -50
7432 -50 -150 -85 -111 -42 122 38 134 86 40 -95 87 122 -183 -20 -12 138 -6 -6 81 128 -45 57 -90 -145 74
7457 74 51 -7 -43 -189 -168 17 76 152 142 -150 65 102 66 162 64 53 193 23 108 105 143 126 -71 -32 -58 100 3
7484 3 4 -74 -105 -35 141 -37 -18 49 -28 15 7 -37 103 -66 4 103 -77 31 133 150 -102 -89 -205 -66 -83 -84 5
7511 5 91 -38 -70 9 -41 32 -89 -147 -110 193 -86 -78 -104 -64 -35 -2 19 -133 -130 11 -166 4 7 -16 -25 -120 11 40
7539 40 -27 42 -85 -133 -52 -148 -151 -80 32 37 -74 19 320 -11 9 69 158 -166 125 -52 172 202 -37 246 87
7564 87 15 -60 21 -158 9 100 80 -132 -18 228 -81 47 159 -148 -79 -13 97 70 30 24 -66 49 121 -8 141
7589 141 -1 -7 22 -40 240 -13 -210 -10 26 -67 -236 -23 9 -65 -207 8 109 65 -20 -56 -75 85 -92 -13
7613 -13 -43 -36 -113 24 -38 84 30 62 -5 146 146 -10 -55 71 91 -73 -121 -18 -68 135 70 134 16 -93 22 68
7639 68 54 111 -59 78 -29 34 18 -16 79 9 36 34 -68 -116 68 -211 -13 -6 25 -144 92 104 -140 94 144 -96
7665 -96 -17 28 -67 17 -44 -10 70 37 -93 -73 74 121 41 -10 215 -101 25 2 129 76 172 -94 -22 -90 -3 185
7691 185 6 -2 48 -46 -14 106 134 -42 -55 23 -185 66 -105 -14 37 -85 29 9 43 129 -118 -65 -135 2 -19
7716 -19 48 10 -44 -2 33 -159 -96 5 -21 -32 -46 135 -11 122 -19 -91 -58 -56 -37 -229 -210 -104 -51 121 73 -173
7742 -173 -17 -26 41 -213 -53 96 -82 -36 16 17 -140 -84 -66 35 -9 16 -71 -16 -87 -105 15 89 43 -89 201 51
7768 51 -40 182 189 90 61 30 5 65 -21 -35 30 -44 78 -59 34 -142 12 -65 40 -186 -20 52 -42 -59 122 -47
7794 -47 16 119 70 131 -94 6 -122 -288 -223 96 -6 83 -76 -38 -42 -119 -123 77 22 25 36 5 -68 -38 12 19 58 20
7822 20 165 45 -49 12 83 15 -189 -58 29 32 -47 -121 40 -16 95 -215 -3 -38 -113 -14 69 -17 63 -172 93 57
7848 57 162 -42 14 -64 -87 86 24 -12 99 -157 84 62 -183 -1 -59 17 144 120 40 -61 99 30 37 143 103
7873 103 -11 -35 33 102 32 64 -88 -83 -67 -156 104 23 -32 -142 -167 68 95 -29 -38 153 -100 -80 -44 -51 -62 -253 -171
7900 -171 -26 -140 -153 -63 -51 49 6 -59 -46 -54 92 -118 -33 -25 -33 108 25 100 105 31 65 194 77 -31 12 120 147
7927 147 146 -59 -105 -259 34 222 -37 41 -160 -121 12 41 64 -106 -60 51 128 33 5 146 -96 -211 77 -23
7951 -23 123 -84 -109 50 -76 -121 61 165 -43 -159 65 67 91 90 -17 72 46 114 -19 18 58 32 7 -80 -177 21
7977 21 76 -60 -43 94 -11 -85 -16 55 -67 56 18 68 -74 -51 -40 -40 -45 90 27 -148 -101 104 26 77 -193 53
8003 53 28 -78 -43 135 105 -5 29 10 -20 112 152 -97 -9 81 90 -84 -69 119 28 110 -26 -14 -6 89 28 -10 51
8030 51 -11 -48 125 -25 -60 78 -11 77 -79 67 -138 160 62 56 -131 -158 110 21 -92 41 -80 -176 -201 141
8054 141 -34 60 55 -202 120 59 -89 -34 77 -13 -55 -8 -45 -48 -54 24 95 -34 -126 20 -109 -14 -105 -151 20 -78 -56
8081 -56 -64 -36 228 -93 -49 -14 -56 -58 -23 116 14 201 172 -54 -143 -53 -124 38 103 33 15 -91 -5 -68 152 -32
8107 -32 -58 -97 20 91 -20 -14 67 -53 -103 102 -28 -84 153 -44 24 262 -52 88 -158 51 -1 78 32 -106
8131 -106 -92 -94 158 -1 103 -53 -125 241 -170 -46 -67 13 -4 41 0 33 -130 -192 -58 -78 -103 -79 176 -62 -105
8156 -105 -36 95 -141 -126 50 -19 64 -95 -164 -103 -72 -60 -50 85 -85 15 81 151 -28 -89 -74 -81 1 -76 -4 -91
8182 -91 30 142 -47 -68 -115 -119 22 107 28
8191B8
##END NTUPLES=NMR FID
##END=
