##TITLE=1H_MTBDP-5-0208
 CDCl3, 8 sc, 
 3.08.2021
##JCAMPDX= 6.0         $$ Bruker NMR JCAMP-DX V2.0
##DATA TYPE= NMR FID
##DATA CLASS= NTUPLES
##ORIGIN= UXNMR, Bruker Analytische Messtechnik GmbH
##OWNER= root
$$ XWIN-NMR		Version 3.5
$$ Tue Aug  3 09:04:16 2021 Russian Standard Time (UT+4h)  she@DPX200
##.OBSERVE FREQUENCY= 200.131506
##.OBSERVE NUCLEUS= ^1H
##.DELAY= (6, 6)
##.ACQUISITION MODE= SIMULTANEOUS
##.ACQUISITION SCHEME= undefined
##.AVERAGES= 8
##.DIGITISER RES= 18
##SPECTROMETER/DATA SYSTEM= spect
##.PULSE SEQUENCE= zg30
##.SOLVENT NAME= CDCl3
##.SHIFT REFERENCE= (INTERNAL, CDCl3, 0, 15.7039)
##AUDIT TRAIL= $$ (NUMBER, WHEN, WHO, WHERE, WHAT)
$$ ##TITLE= Audit trail, XWIN-NMR		Version 3.5
$$ ##JCAMPDX= 5.01
$$ ##ORIGIN= Bruker BioSpin GmbH
$$ ##OWNER= she
$$ F:/spectra/data/she/nmr/H-F/1/audita.txt
$$ ##AUDIT TRAIL=  $$ (NUMBER, WHEN, WHO, WHERE, WHAT)
(   1,<2021-08-03 09:02:56.37 +0400>,<she>,<DPX200>,
      <created by zg, POWCHK disabled, PULCHK disabled
       configuration hash MD5:
       00 E9 B6 7A A2 85 ED C7 34 08 36 98 17 FE 4E 26
       data hash MD5: 16K
       E3 16 4D 92 92 4C C7 67 9E F4 7F 7C 6A 2A F3 FD>)
$$ ##END=
$$ 
$$ hash MD5
$$ 4D AD C1 D5 05 2F 5B 84 2B 22 7A B1 73 B9 D3 CC
##$RELAX= 
##$RELAX= 
##$RELAX= 
##$RELAX= 
##$RELAX= 
##$RELAX= 
$$ Bruker specific parameters
$$ --------------------------
##$DU= <F:/spectra>
##$EXPNO= 1
##$NAME= <H-F>
##$PROCNO= 1
##$TYPE= <nmr>
##$USER= <she>
##$AMP= (0..31)
100 100 100 100 100 100 100 100 100 100 100 100 100 100 100 100 100 100 
100 100 100 100 100 100 100 100 100 100 100 100 100 100 
##$AQSEQ= 0
##$AQ_mod= 1
##$AUNM= <au_zg>
##$AUTOPOS= <>
##$BF1= 200.13
##$BF2= 200.13
##$BF3= 200.13
##$BF4= 200.13
##$BF5= 200.13
##$BF6= 200.13
##$BF7= 200.13
##$BF8= 200.13
##$BYTORDA= 1
##$CFDGTYP= 0
##$CFRGTYP= 5
##$CHEMSTR= <none>
##$CNST= (0..31)
1 1 145 1 1 1 1 1 1 1 1 1 1 1 1 1 1 1 1 1 1 1 1 1 1 1 1 1 1 1 1 1 
##$CPDPRG= <>
##$CPDPRG1= <>
##$CPDPRG2= <>
##$CPDPRG3= <>
##$CPDPRG4= <mlev>
##$CPDPRG5= <mlev>
##$CPDPRG6= <mlev>
##$CPDPRG7= <mlev>
##$CPDPRG8= <mlev>
##$CPDPRGB= <>
##$CPDPRGT= <>
##$D= (0..31)
0 1.2 0 0 0 0 0 0 0 0.06 0 0.03 0 0 0 0 0.0002 0 0 0 0 0 0 0 0 0 0 0 0 
0 0 0 
##$DATE= 1627966975
##$DBL= (0..7)
120 120 120 120 120 120 120 120 
##$DBP= (0..7)
150 150 150 150 150 150 150 150 
##$DBP07= 0
##$DBPNAM0= <>
##$DBPNAM1= <>
##$DBPNAM2= <>
##$DBPNAM3= <>
##$DBPNAM4= <>
##$DBPNAM5= <>
##$DBPNAM6= <>
##$DBPNAM7= <>
##$DBPOAL= (0..7)
0.5 0.5 0.5 0.5 0.5 0.5 0.5 0.5 
##$DBPOFFS= (0..7)
0 0 0 0 0 0 0 0 
##$DE= 6
##$DECBNUC= <off>
##$DECIM= 32
##$DECNUC= <off>
##$DECSTAT= 4
##$DIGMOD= 1
##$DIGTYP= 9
##$DL= (0..7)
0 120 120 120 120 120 120 120 
##$DP= (0..7)
150 150 150 150 150 150 150 150 
##$DP07= 0
##$DPNAME0= <>
##$DPNAME1= <>
##$DPNAME2= <>
##$DPNAME3= <>
##$DPNAME4= <>
##$DPNAME5= <>
##$DPNAME6= <>
##$DPNAME7= <>
##$DPOAL= (0..7)
0.5 0.5 0.5 0.5 0.5 0.5 0.5 0.5 
##$DPOFFS= (0..7)
0 0 0 0 0 0 0 0 
##$DQDMODE= 0
##$DR= 18
##$DS= 0
##$DSLIST= <SSSSSSSSSSSSSSS>
$$ [...]
##$SUBNAM2= <"">
##$SUBNAM3= <"">
##$SUBNAM4= <"">
##$SUBNAM5= <"">
##$SUBNAM6= <"">
##$SUBNAM7= <"">
##$SUBNAM8= <"">
##$SUBNAM9= <"">
##$SW= 20.0188882624521
##$SWIBOX= (0..15)
0 0 2 0 0 0 0 0 0 0 0 0 0 0 0 0 
##$SW_h= 4006.41025641026
##$TD= 16384
##$TD0= 1
##$TE= 0
##$TE2= 300
##$TE3= 300
##$TEG= 300
##$TL= (0..7)
0 120 120 120 120 120 120 120 
##$TP= (0..7)
150 150 150 150 150 150 150 150 
##$TP07= 0
##$TPNAME0= <>
##$TPNAME1= <>
##$TPNAME2= <>
##$TPNAME3= <>
##$TPNAME4= <>
##$TPNAME5= <>
##$TPNAME6= <>
##$TPNAME7= <>
##$TPOAL= (0..7)
0.5 0.5 0.5 0.5 0.5 0.5 0.5 0.5 
##$TPOFFS= (0..7)
0 0 0 0 0 0 0 0 
##$TUNHIN= 0
##$TUNHOUT= 0
##$TUNXOUT= 0
##$USERA1= <user>
##$USERA2= <user>
##$USERA3= <user>
##$USERA4= <user>
##$USERA5= <user>
##$V9= 5
##$VALIST= <valist>
##$VCLIST= <CCCCCCCCCCCCCCC>
##$VD= 0
##$VDLIST= <DDDDDDDDDDDDDDD>
##$VPLIST= <PPPPPPPPPPPPPPP>
##$VTLIST= <TTTTTTTTTTTTTTT>
##$WBST= 1024
##$WBSW= 4
##$XGAIN= (0..3)
0 0 0 0 
##$XL= 0
##$YL= 0
##$YMAX_a= 316167
##$YMIN_a= -392089
##$ZGOPTNS= <>
##$ZL1= 120
##$ZL2= 120
##$ZL3= 120
##$ZL4= 120
##$ABSF1= 10
##$ABSF2= 0
##$ABSG= 5
##$ABSL= 3
##$ALPHA= 0
##$AQORDER= 0
##$ASSFAC= 0
##$ASSFACI= 0
##$ASSFACX= 0
##$ASSWID= 0
##$AUNMP= <proc_1d>
##$AZFE= 0.1
##$AZFW= 0.1
##$BCFW= 1
##$BC_mod= 2
##$BYTORDP= 1
##$COROFFS= 0
##$CY= 11.3945322036743
##$DATMOD= 1
##$DC= 2
##$DFILT= <>
##$DTYPP= 0
##$F1P= 2.36226072786647
##$F2P= -0.459571619588291
##$FCOR= 0.5
##$FTSIZE= 0
##$FT_mod= 4
##$GAMMA= 1
##$GB= 0.15
##$INTBC= 1
##$INTSCL= 1
##$ISEN= 128
##$LB= 0.24
##$LEV0= 0
##$LPBIN= 0
##$MAXI= 10000
##$MC2= 0
##$MEAN= 0
##$ME_mod= 0
##$MI= 1.114404
##$NCOEF= 0
##$NC_proc= 0
##$NLEV= 6
##$NOISF1= 3.799351
##$NOISF2= 2.8
##$NSP= 1
##$NTH_PI= 0
##$NZP= 0
##$OFFSET= 15.70392
##$PC= 1
##$PHC0= -13513.96
##$PHC1= 13.00099
##$PH_mod= 1
##$PKNL= yes
##$PPARMOD= 0
##$PSCAL= 0
##$PSIGN= 0
##$REVERSE= no
##$SF= 200.130013532006
##$SI= 16384
##$SIGF1= 3
##$SIGF2= 2
##$SINO= 400
##$SIOLD= 16384
##$SREGLST= <1H.CDCl3>
##$SSB= 0
##$STSI= 0
##$STSR= 0
##$SW_p= 3612.71676300578
##$SYMM= 0
##$S_DEV= 0
##$TDeff= 0
##$TDoff= 0
##$TI= <>
##$TILT= no
##$TM1= 0
##$TM2= 0
##$TOPLEV= 0
##$USERP1= <user>
##$USERP2= <user>
##$USERP3= <user>
##$USERP4= <user>
##$USERP5= <user>
##$WDW= 1
##$XDIM= 8192
##$YMAX_p= 0
##$YMIN_p= 0
$$ End of Bruker specific parameters
$$ ---------------------------------
##NTUPLES= NMR FID
##VAR_NAME=  TIME,          FID/REAL,        FID/IMAG
##SYMBOL=    X,             R,               I
##VAR_TYPE=  INDEPENDENT,   DEPENDENT,       DEPENDENT
##VAR_FORM=  AFFN,          ASDF,            ASDF
##VAR_DIM=   8192,          8192,            8192
##UNITS=     SECONDS,       ARBITRARY UNITS, ARBITRARY UNITS
##FACTOR=    0.0002496,     1,               1
##FIRST=     0,             0,               0
##LAST=      2.0444736,     0,               0
##MIN=       0,             -392089,         0
##MAX=       2.0444736,     316167,          0
$$ Real data points
##PAGE= N=1
##DATA TABLE= (X++(R..R)), XYDATA
0@%%%%%%%%QqQj6J6k4L2m0M8n6P2q8J04j28J56j80K14k54K96l44L92m48N15n87
32c12O68p60Q60r69J089j221J367j527J702j893K101k328K576k848L143l468L824
49B004m212M640n112N635o215O862p589Q413r356J0445j1720J3238j5081J7373
63I325k0314K4246k9801L8299n3061Q5833k85190M9727K74450m85603J56764K93778
75E8453k55930j01959K89688j28552p3129K00039p2807j23318J91413o2794j31541
86b10437J81149K6146j47014J51951J8462j68669J53646Q7975k27238J38116K06082
97B10169k74863l7971L10375j70204j96619K94688J3027k69037J58024J12930
107A50519k24484O0497J58601j54442P126J48291j33666m6854J48192q8379o9568
$$ plain form
0 0 0 0 0 0 0 0 0 0 8 0 8 -8 8 -16 16 -24 24 -32 40 -48 56 -72 84 -96 118 -136 160 -184 208 -240 275 -312
32 -312 356 -404 456 -513 576 -645 722 -805 897 -996 1105 -1223 1353 -1495 1648 -1820 2004
49 2004 -2208 2432 -2680 2955 -3260 3602 -3987 4426 -4930 5515 -6205 7033 -8048 9325
63 9325 -10989 13257 -16544 21755 -31306 54527 -230663 -180936 93514 -392089 -235325 58453
75 58453 -197477 -299436 -9748 -138300 -211429 -11390 -84197 -207515 -16102 -78896 -210437
86 -210437 -29288 -3142 -150156 1795 20257 -148412 5234 93209 -134029 4087 210169
97 210169 -64694 -102665 207710 37506 -159113 135575 148602 -120435 37589 150519
107 150519 -73965 -13468 145133 -9309 -2183 146108 12442 -34412 113780 25401 -44167
118d4167J41657n8155r7665J21632m4936j13934J46145N03j59222J39188P0653
129A01699k12161P0746J66785j83344k4348K10099j17426j21853J85680l0068
139D5809j57619J42415M7972j54882P9709Q2650j32991L6029J01048j00804J6277
150E613J04505j01080j5343J18472r1516m8913J45224o2052j02010J47921j4855
161H5966j53719J31461O5235j79345P1699J37712j68213k3994J71910r8336r3094
172e2718J51614k5592j20337R8541J1876j10080P3398L3420j03581N9911N0628
183F7080j13443L9914Q2395j13720Q677J16234j05374m4493J39982p1083j01324
194i5155J47742k956j49342J07660P1968j55940L6596J23331j12416k8354J24163
$$ plain form
118 -44167 97490 39335 -58330 63302 18366 -95568 50577 51080 -108142 31046 101699
129 101699 -110462 -39716 127069 -56275 -80623 129476 12050 -109803 75877 45809
139 45809 -111810 30605 78577 -76305 3404 86054 -46937 -10908 90140 -10664 5613
150 5613 110118 9038 -6305 112167 20651 -28262 116962 54910 -47100 100821 85966
161 85966 -67753 63708 128943 -50402 21297 159009 -9204 -33198 138712 40376 -52718
172 -52718 98896 73304 -47033 51508 63384 -46696 26702 60122 -43459 16452 67080
183 67080 -46363 -6449 75946 -37774 -29097 87137 -18237 -62730 77252 6169 -95155
194 -95155 52587 49631 -99711 7949 79917 -76023 -39427 83904 -28512 -56866 67297
205F7297n9511o1833R7882k3607o4916P9998q287p0350P2090N604q3021O7568
217A8914L3351r7154M9212O7059j04845J2833J01833r1455l7071J22884n1989
228B3572q8922J11509O222j13888P0393N5577j02970K1408P3974p3621r517O9875
240D3612m9238k0351O3015l9859k7200O5877l4355m2643P4141j9088o6586P5320
252B2645J0437r0516N9354N0536j00411K2461Q6181q5441k4611J01055m8072o2511
264e8893Q8483n607p6521O0441K2887p0738L5495L3973o0964K1812L8356n8217
276b9493J3985M8259o0397j3O6053n7032k6246Q3004l7742n9862Q6023j174q7986
289f2621O5769M0904r5711K7663P2648p9308j3208Q3491m8519m2442P4772j7368
$$ plain form
205 67297 7786 -54047 43835 20228 -44688 35310 27023 -43327 28763 34367 -48654 18914
217 18914 52265 -44889 4323 71382 -33463 -20630 81203 -10252 -47323 75561 23572
228 23572 -65350 46159 52381 -61507 8886 64463 -38507 -17099 56875 -16746 -26263 43612
240 43612 -5626 -25977 37038 -2821 -30021 35856 1501 -41142 32999 13911 -52675 22645
252 22645 33082 -57434 1920 52456 -47955 -25494 60687 -24754 -49365 51690 3618 -58893
264 -58893 29590 23983 -52538 7903 30790 -39948 -4453 29520 -31444 -9632 28724 -29493
276 -29493 -15508 32751 -27646 -27659 38394 -18638 -44884 38120 378 -59484 26539 25365 -62621
289 -62621 3148 44052 -51659 -23996 48652 -30656 -43864 39627 -8892 -51334 23438 6070
301F070n3204N8573K416n3860M5935J1185n5937M1442K2523o5767L3850M4836
313C8062p6001J0344P3660o8026k6739R1907l8381o4267Q5676L065q5048N9587
325C839M0970q4080K2821O1583o7325r388O5916m2258k6651N8935k4350l4192
337c4180N2437j4176l8986N3392l664n2704N1432J4714p0195L8288M5035p4591
349c3198Q948O9914o1643k7983P8830l0437n3559P0013L246o5586M6364K6923
361C1832o2510K3597M1008n1157M318M2506m2336o907M4003l4775j2630N1065
373B8014l0808k8186N9191j8327m9691O1606R573o9472M2932L9245p3964J1979
385a7908O1989n6959j7643O7347l3705l9937O0059r067m8175M9031J0873n1119
$$ plain form
301 6070 -47134 11439 13855 -40005 5930 17115 -38822 2620 25143 -40624 -6774 38062
313 38062 -37939 -27595 46065 -21961 -48700 43207 4826 -59441 26235 29300 -55748 3839
325 3839 44809 -39271 -16450 45133 -22192 -31580 34336 -7922 -34573 24362 12 -34180
337 -34180 18257 4081 -34905 18487 14823 -37881 13551 28265 -41930 -3642 41393 -33198
349 -33198 -24250 45664 -15979 -43962 34868 4431 -49128 20885 24131 -41455 4909 31832
361 31832 -30678 -7081 33927 -17230 -12912 29594 -12742 -19649 24354 -10421 -23051 28014
373 28014 -2794 -30980 28211 9884 -39807 21799 31372 -38100 4832 44077 -29887 -17908
385 -17908 44081 -12878 -30521 36826 3121 -36816 23243 14176 -33999 15032 25905 -25214
397b5214L2921K1957m9884K1134L1146m7691J1398L9888m9832l403N4804m2434
409e210k4496O7912k2401n2290O3000P648o8497M2986L8224o7242J3180N3737
421D6551n4672j3821N8956l3068l0540N4801j4059m1617M4818J754m4302L7363
433A2164J4199m7410K8176K4059n3706J6803M1347n3724k762N8228m4333l0660
445c7619O5699j8565n2592N7892J2334o2823L4066L4341n7805R991M6575m3568
457a2074r313M7055l0278k2367M4636j6591k8708M2150n654l5930L7673N262m2859
470b6998L3494K1009n0389J9924L8498n1874k911N4064l7316k7348N6470j3925
482A2698m4437M4381R078m6931K8440K3743m2948J2528K9841l7459J115L4378
$$ plain form
397 -25214 7707 29664 -20220 914 32060 -15631 -4233 35655 -14177 -17580 37224 -5210
409 -5210 -29706 38206 15805 -36485 26515 34163 -34334 8652 46876 -20366 -7186 46551
421 46551 -8121 -21942 37014 3946 -26594 28207 14148 -27469 17349 19103 -25199 12164
433 12164 26363 -21047 7129 31188 -22518 -5715 35632 -18092 -20854 37374 -6959 -37619
445 -37619 28080 9515 -43077 14815 27149 -35674 -1608 32733 -25072 -15081 31494 -12074
457 -12074 -21387 25668 -4610 -26977 17659 1068 -27640 14510 8856 -27074 10599 15861 -26998
470 -26998 6496 27505 -22884 -2960 35538 -16336 -19247 34817 -2499 -29847 26623 12698
482 12698 -31739 12642 21720 -25211 3229 26972 -15976 -3448 26393 -11066 -9951 24427
494B4427l0748q954L7067k4378j9142L9198j5280k8653M1046k541m1177L6285
506G150J5457m9979K1990L5770m7917q90M7016l4430k1554M6601j5061l2123L8989
519A1019M31l6493K9518J2005l7136K0309K1599l5950R695K8130l3368o84L4317
532B3392k8408j1646L9990k0676k6009M2549n594l9678L6864J4496m6642K0437
544i25L1545m2447N83L9580l0086j5123L8667j6918k4637L4351n124k9749K9055
557H772N295l3133K1997J4317l4168J3987K2751l4050M308L1348l1716q996L9703
570B0415k2582k5187M1587n515l8111L2550J3521m0722J6886K6157l4386J807
582a3580L0429k5280q421L0113j6766j5136K8404r311k0271K6470k102k4936K3860
$$ plain form
494 24427 -6321 -15275 21792 -2586 -21728 17470 2190 -26463 14583 12042 -29135 7150
506 7150 22607 -27372 -5382 30388 -17529 -18419 28597 -5833 -27387 19214 4153 -27970 11019
519 11019 11450 -25043 4475 16480 -20656 -347 21252 -14698 -5003 23127 -10241 -10925 23392
532 23392 -5016 -16662 23328 2652 -23357 19192 13598 -26080 10784 25280 -21362 -925
544 -925 30620 -11827 -11244 28336 -1750 -16873 21794 4876 -19761 14590 9466 -20283 8772
557 8772 14067 -19066 2931 17248 -16920 -2933 19818 -14232 -9924 21424 -10292 -19288 20415
570 20415 -2167 -27354 14233 8718 -29393 3157 16678 -24044 -7158 18999 -15387 -13580
582 -13580 16849 -8431 -16852 13261 -3505 -18641 9763 452 -19819 6651 4549 -20387 3473
595C473O422k9540J8336J6590l2373Q547K7568l0040n750L5021j9870k0522L4056
608A1918m448k9061K5058Q913k9040J4020J5914k4887O076J8742k1578M74K1651
621A3752j9140n725K4653j4669j3052K6320q069k0489K5812Q82k7635K1556J2741
634A6937l2032J1352K4470k9047k886L0663j9325j4882K9141p593k1024K3299
646I073J073k2543J7579P179k3265J2596J2663k3760P034J8291k2728l10K3647
659A6529j9319r135K7402j2564j8844K7766k107k7215K2416J0568l0536J1607
671c432K0982k6786o16K5579j8553j0007K4930r985j5306K1947l216j8442J8847
684E942K575k1019J5378Q600k3088J0302J5622k3559K793K2554k0449p044K6880
$$ plain form
595 3473 9895 -19645 -1309 15281 -17092 -8545 19023 -11017 -16767 18254 -1616 -22138 11918
608 11918 7470 -21591 3467 12380 -16660 -2640 13274 -11613 -5537 13205 -8373 -7899 13752
621 13752 -5388 -11113 13540 -1129 -14181 12139 4070 -16419 9393 10275 -17360 4196 16937
634 16937 -15095 -3743 20727 -8320 -11206 19457 132 -14750 14391 6798 -14226 9073
646 9073 10146 -12397 5182 12361 -10904 1692 14355 -9405 -2371 15920 -6808 -7118 16529
659 16529 -2790 -11925 15477 2913 -15931 11835 9728 -17487 4929 15497 -15039 -3432
671 -3432 17550 -9236 -9852 15727 -2826 -12833 12097 2112 -13194 8753 5537 -12905 5942
684 5942 8517 -12502 2876 11476 -11612 -1310 14312 -9247 -6454 16100 -4349 -11393 15487
697A5487j2941j7080K6371k287k4153K0297Q656k5896J0730J6416k2341J106J9628
710A3993j6242n378J9308j1009r062J8675p168j2750J8663k807j7605J7477M067
723A0162k2063J2713J2408k3185M632J9617k0101m736K3558j3001j3479K2883
735I408l828j9032J8094M378k0275J1276R950j8849N555J3054j6695J358J5476
748I870j4920l023J8652j2288r184K0968o839j6357K0258J500k1806J5142J0337
761A2310k3298P075J7504k0513j937K1437j4371r718K1279o510j5058J8109L31
774F640j7286J3534N239j7847R490R521j8403N319J4295j7691q03J8929j4202
787c265q403K1375p731j5612J9869O61k0222J4598Q805k1243P284J5027j8868
$$ plain form
697 15487 2546 -14534 11837 9550 -14603 5694 14350 -11546 -816 15600 -6741 -5635 13993
710 13993 -2249 -7627 11681 672 -8390 10285 3117 -9633 9030 6223 -11382 6095 10162
723 10162 -11901 812 13220 -9965 -5333 14284 -5817 -10553 13005 4 -13475 9408
735 9408 5580 -13452 4642 9020 -11255 21 9971 -8878 -3323 9731 -6964 -5606 9870
748 9870 -5050 -8073 10579 -1709 -10893 10075 3236 -13121 7137 8637 -13169 1973 12310
761 12310 -10988 -3913 13591 -6922 -8859 12578 -1793 -11511 9768 3258 -11800 6309 6640
774 6640 -10646 2888 8127 -9720 -230 9291 -9112 -3793 10502 -7189 -7992 10937 -3265
787 -3265 -11668 9707 1976 -13636 6233 6894 -13328 1270 10075 -11168 -3884 11143 -7725
800g725n83J8448j3518p457J8819p157j2006J6655j543j4312J3622K906j5940
813i791J0659P175j7343O837J2489j7510P43J7695j4521o873K0228q045j3838
826a2095J8741j51j7995J3909P110j8680P199J2421j6402M84J4784j2212m432
839g319J5120q130p526J4376m541j0290J3963r57j3728J2571M362j6873Q506J0728
853A0262j7159J767J5750j3637n276J7303p715j0768J5833j407j3849J2187M033
866G324j4719P688Q112j3965L345J0540j2064n27J2164j0001l969J3773p484q060
880g843J4829l239j2984J3600K966j6207R249R240j6298K867J3490j3130l300
893f760J5038q406p978J4326l439j1079J2227J271j2771R083N275j3118N534Q297
$$ plain form
800 -7725 -8308 10140 -3378 -10835 7984 827 -11179 5476 3933 -10379 3243 6149 -9791
813 -9791 868 8043 -9300 -2463 10026 -7484 -6741 10954 -3567 -10440 9788 1743 -12095
826 -12095 6646 6495 -11500 2409 9519 -9161 -1962 10459 -5943 -5459 9325 -2887 -7319
839 -7319 7801 -329 -7855 6521 1980 -8310 5653 4696 -9032 3539 7901 -8972 -466 10262
853 10262 -6897 -5130 10620 -3017 -8293 9010 1295 -9473 6360 4953 -8896 3291 7324
866 7324 -7395 293 8405 -5560 -2215 8325 -3739 -4266 7898 -2103 -6072 7701 217 -7843
880 -7843 6986 3747 -9237 4363 7329 -8878 371 9611 -6687 -3820 9670 -3460 -6760
893 -6760 8278 -128 -8106 6220 2781 -8298 3929 5200 -7571 1512 6787 -6331 -797 7500
907G500j2591J896J1210j1302k382J3592q443p363J4634l533j2043J2930K552
920F657j4534Q491P694j4046L155J1139j1682j890J2723q274n884J2700m175r064
934f990J1264k4j0731Q833L272j1275O057O225j1666L320R182j1084q53J2169
948G699q732n900J3262m065j0070J1583J137j1924P927N411j1807L879Q216j0273
962c657Q0R743p822l197J0019n050n550R556k530p401Q992N4r327P752L497j1003
978e844N027P491j0984O55J0481q578l907J1267m677p239R948o73r006P772K521
993D254r484N094N108r151K461O987q345r5Q450o984k768R523n056n843J0054
1008D205j916q922Q987K343j0978N947O503j0766J700R138q404k392R830n398
$$ plain form
907 7500 -5091 -3195 8015 -3287 -5669 7923 -520 -7883 6751 3218 -8825 4105 6657
920 6657 -7877 614 8308 -5738 -2583 8556 -3126 -5016 7707 -567 -6451 6249 2074 -6990
934 -6990 4274 4250 -6481 2352 5624 -5651 406 6631 -5035 -1715 7467 -3617 -4470 7699
948 7699 -1033 -6933 6329 2264 -7806 3777 4914 -7010 917 6328 -5479 -1600 6616 -3657
962 -3657 -3577 6166 -1656 -4853 5166 116 -5434 4122 1592 -5809 3183 3237 -6090 1662 5159 -5844
978 -5844 -817 6674 -4310 -3655 6826 -1752 -5659 5608 931 -6308 3640 2967 -6039 1733 4254
993 4254 -5230 -136 4972 -4179 -1718 5269 -3076 -3171 5279 -1705 -4473 5050 -6 -5849 4205
1008 4205 2289 -6633 2354 4697 -6281 -334 6169 -4597 -2897 6241 -2163 -4555 5275 -123
1022a23n141R336k511o993Q213K49q417O635L123r235M392N702r077J510P993
1037E656p938j773R458n686n140R761k349q148Q697J393r588N816M852r431K436
1052a984P143p833p52Q236n884l365Q426l525n495P943r85p026O726J481q033
1067d927N001M111q419K792O392p972k41Q475o276l650R240l366o534Q266J00
1082B992p997N964L122q029L426N138p303R22O422o138j170P194m721l198P526
1097D150l013n226P278n44p089O302K306q308M031N323q319J160P519o727k468
1112c625Q374m057m967P670j129o588O227J235p150M362L297p089K672N048p042
1127b762P42O509o281j546P813m616m404Q214j983p096P420J386q557N133M666
$$ plain form
1022 -123 -5264 4072 1561 -5432 2781 3030 -5387 1248 4371 -4864 -472 5230 -3847 -2337 5656
1037 5656 -2282 -4055 5403 -283 -5423 4338 1989 -6159 2538 3931 -5657 159 5011 -4420 -1984
1052 -1984 5159 -2674 -3426 4810 -1074 -4439 3987 462 -5033 2910 1925 -5101 1625 3106 -4927
1067 -4927 74 4185 -4234 -1442 4950 -3022 -3263 5212 -1064 -4714 4526 1160 -5374 2892 2992
1082 2992 -5005 959 4081 -3948 -522 4616 -2687 -1765 4657 -1481 -2651 4543 -178 -3376 4150
1097 4150 1137 -4089 3189 2645 -4444 1858 4164 -4144 -113 5210 -3109 -1949 5570 -1157 -3625
1112 -3625 4749 692 -4275 3395 2266 -4322 1905 3140 -4010 352 3649 -3440 -768 4280 -2762
1127 -2762 -2020 4489 -1792 -3338 4475 -141 -4545 3669 1686 -5410 2010 3396 -5161 -28 4638
1142D638q566J851O824p037j095P845m944l600P499k518n347O828k38o537N681
1157A284J853p390M060M216p469J789O374o803j062P612m905l857P953k093o245
1172d683O906O48p429N002L497p537K492N470o646q9O471n073k276O806l014m102
1188c557O329j356n479N791Q06o407M450K858o861K472N013o456P0O576n098k557
1204c406P102l098m769O697l94o193N251J904o672L190L979o175J124N152n207
1219a515o36N622m151k343O230k626m176O097o75n905N274J734o673L564M053
1234C874o786J180N756n682j319O679l690l608O435j543n174N480O43n696L927
1249D76K397n965K434L873n688J003N127n192j117O289l875l532O662j559n382
$$ plain form
1142 4638 -3928 -2077 4747 -2290 -3385 4460 -484 -4084 3415 897 -4450 2378 2140 -4397 1284
1157 1284 3137 -4253 -193 4023 -3446 -1657 4717 -2086 -3148 4464 -441 -4298 3655 1562 -4683
1172 -4683 2223 2871 -4558 444 3941 -3596 -1104 4366 -2280 -2369 4102 -971 -3247 3559 545 -3557
1188 -3557 2772 1416 -4063 1728 2534 -3873 577 3435 -3426 -954 4059 -2397 -2327 4249 -849 -3406
1204 -3406 3696 598 -4171 2526 2132 -4061 1190 3094 -3578 -388 3591 -2584 -1460 3692 -1515
1219 -1515 -2151 3471 -680 -3023 3207 581 -3595 2502 1827 -4078 1196 2930 -3743 -179 3874
1234 3874 -2912 -1732 4024 -1658 -2977 3702 12 -3596 2839 1296 -3878 1602 2245 -3451 476
1249 476 2873 -3092 -658 3215 -2473 -1470 3657 -1535 -2652 3637 -238 -3770 2892 1333 -4049
1264d049N692J017o576L919L385o364J712M995n446o20N726l919k440N816k095
1279G53m057N380l66n017M376J434n566L115L203n768J281M781m925r09N768l461
1295B2l103N862j558m519M999N70n275L554K455n609J922L856m806L2M794l793
1311e97j652M959k396k967M808r98m016M210O13m733L116K249n050J760L816m811
1327a689jM692l689j779N146k310l226M806n33m431L987J182m886K660K649m639
1343b061J072L599l886l58M163l065j598M517k167k915M497n75m122L864J164
1358B129m858K630K803m814R45M061m061q17M570k731k366M522j163l544L934
1373A240K90m057L030J474m217K016K617m235P85L753l866p55M532k743k488M739
$$ plain form
1264 -4049 1643 2660 -3916 3 3388 -2976 -1264 3731 -1715 -2335 3391 -528 -2968 2848 753
1279 753 -3304 2076 1710 -3307 1069 2503 -3063 52 3255 -2513 -1232 3549 -1376 -2285 3483 22
1295 22 -3081 2781 1223 -3296 1703 2273 -3002 552 3007 -2602 -680 3176 -1630 -1598 3196 -597
1311 -597 -2249 2710 314 -2653 2155 1157 -2859 1351 1964 -2769 347 2596 -2454 -694 3122 -1689
1327 -1689 -1690 3002 -687 -2466 2680 370 -2856 1950 1417 -3014 973 2155 -2731 -71 2578 -2061
1343 -2061 -989 2610 -1276 -1634 2529 -536 -2134 2383 216 -2699 1798 1223 -2899 965 2129
1358 2129 -2729 -99 2704 -2110 -1165 2896 -1165 -1982 2588 -143 -2509 2013 850 -2694 1240
1373 1240 1530 -2527 503 1977 -2240 -224 2393 -1842 -1057 2696 -1170 -1925 2607 -136 -2624 2115
1389B115j127l833M015O79m477K773K186m357J293L241l839j10L884l002j394
1404a953M062j846k544L895n93l430L390O73l955K464K108m170J178L275l817
1419a263k94L942k693j865M069j284l009L655M5l552K746J314l747J719K314l653
1435a556O11L092l034n73L478k287j662L635j223k705L440K4l448K720J231l716
1451a973J731K325l559M37L246l018q07L636k049j914L510q35k891L089M77l424
1467b019K217J603l416J194K379l160K17K980k689q13L475j869k020L610r47k979
1483b237L307M82l624K353J854l838J071K880l236l04L464k365j514L445j275
1498D63k410L125j77k852K572P33l265J898J724l371R51K761l230l58L512k421
$$ plain form
1389 2115 988 -2845 1170 1849 -2628 145 2331 -2026 -733 2508 -1331 -1441 2443 -559 -1953
1404 -1953 2109 263 -2281 1614 1021 -2409 981 1654 -2301 163 2271 -1899 -721 2554 -1263
1419 -1263 -1557 2385 -308 -2173 1896 612 -2397 1258 1303 -2249 497 1811 -1936 -217 2097 -1556
1435 -1556 -945 2147 -887 -1460 2018 -269 -1931 1704 481 -2224 1216 1240 -2208 512 1743 -1973
1451 -1973 -242 2083 -1476 -1039 2207 -811 -1618 2018 -31 -1945 1565 730 -2161 928 1405 -2019
1467 -2019 198 1801 -1615 -421 1958 -1202 -985 1995 -694 -1507 1968 99 -1921 1689 742 -2237
1483 -2237 1070 1552 -2072 281 2135 -1703 -632 2248 -988 -1292 2172 -193 -1707 1738 463
1498 463 -1947 1178 1001 -1851 721 1454 -1811 87 1811 -1560 -609 2152 -1078 -1436 2076 -345
1514c45j717L728j104k910L378J94l432K391J469l500J311K447l240J66K967k542
1530g39q72L147j616j773L091p25k659K919L73l085K096J481l324J152K499l075
1546a110q1L090k277j266L218j291k130K999k28k684K336Q13k917J555J691k899
1562a181P02K417k644l11K824k003j211K973j124k022K768j54k696K328P94l006
1578a546J561J760k972N43K539k537n46K979j815j546L021q80k313K675J71k746
1594a652J961J127k877J118J985k703K79K461k284o89K890j650j553K919o53k460
1610a781K704L11k973J932J548l114R17K376k712k99K890k005j227K929j091j960
1626a555K585j36k484K197P19k730J479J560k799P00K246k538k62K782j924j371
$$ plain form
1514 -345 -2062 1666 562 -2348 1030 1224 -2208 183 1652 -1848 -537 1910 -1330 -1164 1803 -739
1530 -739 -1611 1536 -80 -1853 1238 513 -2146 773 1146 -1939 157 1638 -1686 -534 1965 -1110
1546 -1110 -1191 1899 -378 -1644 1574 283 -1847 1152 924 -1760 576 1389 -1528 27 1718 -1181
1562 -1181 -479 1938 -706 -1017 1807 -196 -1407 1566 442 -1580 1188 1034 -1662 666 1460 -1546
1578 -1546 15 1775 -1197 -654 1885 -652 -1198 1781 -34 -1580 1441 561 -1752 923 1094 -1652
1594 -1652 309 1436 -1441 -323 1662 -1041 -762 1699 -585 -1274 1616 -34 -1587 1332 679 -1781
1610 -1781 923 1234 -1739 193 1741 -1373 -456 1920 -792 -1091 1799 -206 -1433 1496 405 -1555
1626 -1555 1030 894 -1590 607 1326 -1404 75 1635 -1164 -464 1782 -756 -1018 1764 -160 -1531
1642a531L003j000k220K650J07k672J904J135k786J019J926k540J92K287j996
1657e22p05K514j346j427K558o77j957K255J47k470J838R94k546R56J850k404
1673i42P1K311j893q34K459j041j549K290l62j995J944M75k284J372J154k363
1689a187P16J822k144r3K228j631q85K263r35j547K188k62j999J885N26k266J256
1706f5J284k345O40J820k085j85K221j561r88K372q35j651K166kk190J777P37
1723A110k326J131J381k201L53J924j930l74K320j510j137K391p29j730K095J31
1739H99k285J709R74k425R22J571k170Q8K128j716o92K195j100j306K105l38j859
1756a300J882K49k101J384J033k237P75J551j997k9K091j620q44K199q88j465
$$ plain form
1642 -1531 1472 472 -1748 902 1009 -1663 241 1376 -1410 -391 1535 -1005 -813 1474 -522
1657 -522 -1227 1287 -59 -1486 1072 395 -1562 693 840 -1630 208 1202 -1344 -388 1462 -942
1673 -942 -871 1440 -453 -1287 1172 131 -1418 872 510 -1485 459 934 -1350 22 1176 -1187
1689 -1187 -471 1351 -793 -886 1342 -289 -1174 1089 154 -1393 795 533 -1466 419 945 -1321 -65
1706 -65 1219 -1126 -486 1334 -751 -936 1285 -276 -1264 1108 273 -1378 788 786 -1404 373 1110
1723 1110 -1216 -85 1296 -905 -552 1372 -558 -932 1388 -122 -1259 1132 403 -1327 768 899
1739 899 -1386 323 1297 -1128 -206 1365 -805 -717 1411 -305 -997 1198 98 -1208 897 559 -1300
1756 -1300 582 831 -1270 114 1147 -1090 -315 1236 -761 -790 1301 -319 -1163 1036 148 -1317
1772a317K082j86j888J628O12k034J011J133j939M48J555j664k34J894j309q11
1788a019J947o94j397J883r6j832J457O84j985R23J257j855J80J706j527l47J758
1805A043j127q87J789m78j450J656R5j662J327O12j802Q16J180j788J94J730j566
1822c18m40J807r53j090J886m25j480J617J87j788J270P43j853O65J346j837J63
1839e00J716j476o00J915q88j203J874l28j601J518L68j787J056Q87j786N22J464
1856A151j741j12J802j306p53J831o93j235J789j56j670J346O79j977R16J189
1872A060j781J65J640j436m38J744r81q94J724m66j307J507R7j564J172O17j761
1889i02P03J280j714J02J659j448m95J815r33j073J751k16j489J352L64j648R07
$$ plain form
1772 -1317 765 579 -1309 319 931 -1103 -92 1041 -898 -450 1105 -559 -793 1101 -208 -1019
1788 -1019 928 234 -1163 720 624 -1208 249 933 -1052 -129 1128 -727 -547 1159 -368 -715 1043
1805 1043 -84 -971 818 340 -1110 546 641 -1021 306 918 -884 -68 1112 -676 -482 1248 -318
1822 -318 -758 1049 96 -994 892 467 -1013 604 791 -997 273 1016 -837 -172 1174 -663 -500
1839 -500 1216 -260 -860 1055 167 -1036 838 510 -1091 427 795 -992 64 951 -835 -313 1151
1856 1151 -590 -702 1100 -206 -959 872 179 -1056 733 577 -1093 253 932 -1045 -129 1060
1872 1060 -721 -556 1084 -352 -790 954 -27 -921 803 337 -970 537 634 -930 242 859 -902
1889 -902 -199 1081 -633 -531 1128 -320 -815 1000 67 -1006 745 529 -960 392 756 -892 15
1906A5Q44j488L66J211j355j61J502j155n24J655q29j008J590j94j481J365M31
1923G84j673Q22J012j600K60J334j429j44J547j027o91J538n40j120J463r7j363
1940i24J174L96j470P22R06j502L30J307j382k20J518r73p74J512l17j271J422
1957D54P4j475J121O13j638O89J051j554K17J382j311m10J600p99r16J455k86
1974B67j242J345J87j497R72P67j574M84J170j411m7J439j117n27J543p08r68
1991i17J457r3j428J247M49j524P54R47j529J87J350j212l19J418q02p45J404
2008F44m04r84J211k0j232J019M53j430P18R62j541K24J315j189l54J428p76q12
2026g68J377k56j161J159J78j258Q57N06j216M23Q84j171J11J029r60l22J305
$$ plain form
1906 15 859 -629 -263 948 -407 -568 934 -221 -745 910 81 -927 663 469 -1012 353 784
1923 784 -889 -67 945 -655 -395 939 -490 -634 913 -114 -805 733 193 -927 536 439 -924
1940 -924 250 646 -824 -102 804 -698 -368 939 -443 -663 855 -118 -892 620 303 -968 454
1957 454 528 -947 174 787 -851 -162 889 -665 -448 934 -377 -787 813 14 -902 553 267
1974 267 -975 370 557 -940 32 799 -775 -291 879 -532 -579 860 -257 -784 759 51 -917
1991 -917 540 447 -981 266 715 -809 -55 892 -637 -450 900 -312 -631 787 -15 -760 644
2008 644 240 -744 467 447 -785 234 687 -743 -25 937 -604 -380 935 -254 -608 820 44 -768
2026 -768 609 353 -808 351 529 -729 128 634 -582 -159 725 -446 -335 694 -266 -588 717
2043G17p63p45J352k86j093J133J54j258Q72O13j321M08R94j160j07J224r47l81
2061e94J222n41p89J202j47j079R62L57j276O96O25j218M48R19j171r9J189q17
2079a11n54J230m30q38J118J0j091R00L81j269O40P06j207K27J094j052k58J247
2097G43p95o84J376l86r98J145L9j140Q42M99j218M19R36j132O2J062r61l23J212
2116F98o43p19J191j74j152J076K37j196P85N63j162K55R40j002j41J127q02m48
2134e67J110m15p53J044j41r31Q41K38j058O59N41j141K60R96r84j57J121p50
2152h7n38J067l49p57R41J7q88P50K61j005N63N79j003K07Q93r46j21J036o91
2171g1m15J041l66q37J002L0j027P77M55j103M15P46j016Q7R12q45k25R88n39
$$ plain form
2043 717 -46 -791 561 275 -818 315 469 -789 83 696 -625 -217 777 -383 -490 734 -213 -594
2061 -594 628 87 -702 500 353 -726 236 593 -683 13 638 -580 -132 787 -384 -483 706 -111
2079 -111 -665 565 135 -703 415 425 -666 234 615 -654 -14 692 -515 -288 806 -246 -504 743
2097 743 -52 -736 640 254 -744 401 440 -700 142 641 -577 -158 778 -354 -292 770 -191 -514 698
2116 698 55 -664 527 353 -799 277 514 -682 103 666 -496 -241 699 -303 -444 683 -119 -567
2134 -567 543 128 -625 419 278 -653 188 426 -632 27 568 -573 -313 683 -301 -458 663 -87
2152 -87 -625 442 93 -664 277 294 -594 156 417 -588 -25 554 -449 -242 651 -295 -416 620 -71
2171 -71 -486 555 189 -648 354 384 -643 134 589 -514 -99 647 -369 -282 630 -215 -440 548 9
2190In25J005l10p27Q27J11j024O92M85j088M38P30j015RJ037q00l56J038m48
2209H8o65R53j50q62Q45K06j110P25M91j070L32Q29j002k1J015p70m63J147m31
2228H7p53J082j66r41P99L07j008M77O74r74J73Q51q75j34R92o32m68R92l50p45
2248f12R23Q4r63O95M26j030M56O01q99L8Q69p93j89R44n73n03J026k44p53Q08
2268C11J1q71O26M04r73L84P38r13m4Q70o93k43Q44l39o21Q27n8o98O93J39q70
2289d76N50L99q12J98P04q44K1Q19o30l88R44m39o13R18k8q77P35K46r35N06N11
2310E09r05K13P77q24r7P82m73n09R24l30n43Q27j38p85P33K61r49M58O34r77
2330d12J69P75o77k43Q62m53n07R03k28o95Q09L9q50O00L62r10L63O62q96P5Q70
$$ plain form
2190 9 -516 489 179 -548 279 390 -634 58 543 -545 -107 623 -392 -383 654 -146 -502 536 88
2209 88 -577 376 226 -636 209 415 -695 30 521 -549 -217 612 -390 -411 604 -166 -629 518 87
2228 87 -666 416 250 -691 108 415 -593 -116 558 -416 -243 608 -267 -401 591 -41 -509 483 133 -612
2248 -612 311 395 -568 127 553 -477 -21 580 -319 -281 588 -205 -394 550 -23 -526 500 256 -497 311
2268 311 322 -549 77 481 -492 -108 630 -283 -327 543 -150 -393 451 112 -509 318 260 -438 255 394 -476
2289 -476 74 473 -339 -141 563 -281 -260 559 -71 -459 485 46 -567 351 323 -554 181 427 -508 -2 509
2310 509 -396 -183 594 -230 -327 455 -18 -527 397 67 -476 351 213 -572 161 422 -527 -69 565 -412
2330 -412 -243 532 -145 -388 474 21 -486 417 189 -506 303 342 -508 92 454 -456 -93 569 -327 -252 618
2351F18p14l49R24m56n11Q87j20q55P33K46q34M47N49r42K68O49p78q1Q16n11
2371a4m40Q97l40o43P87P4q28N98L36q63K85O34p82Q7O92o75j14P23m21m12Q23
2392D04k62n98O84P1p35M98L29q26L46N57q14L3Q30o84k68Q01l77m49P80j07o68
2413d55N71J51o91M54L54p68K82N95q35O9P05n73k22Q36l95n11P22j07o73O31
2433A40K30q28M89L98p91K90N69p54K6O53n11k67P71l44n25P45j09o09N43K88
2453D04r01M14O06p76O4O61n84k54P31l76l78P25k12n28O02Q8p32N49L58r37L27
2474a49O10p23%P12n29l27Q19l31n20P00r6n89N44K42p59L66M00p13J62O12n99
2495a68j25P00n57k40O92j88n47P38p3o65N36K42o64K37N03o80R1N60n49j03O15
$$ plain form
2351 618 -96 -445 479 23 -488 399 279 -576 157 403 -431 16 565 -377 -109 540 -238 -319 497 -14
2371 -14 -454 443 103 -540 247 321 -507 91 427 -436 -151 483 -299 -212 480 -195 -309 414 -7 -419 404
2392 404 142 -456 228 299 -436 62 391 -435 -89 468 -346 -313 517 -167 -435 366 -11 -460 320 213 -455
2413 -455 116 267 -424 30 384 -384 -102 493 -342 -273 432 -141 -363 473 78 -433 289 182 -491 140
2433 140 370 -458 31 429 -362 -72 497 -257 -231 422 -89 -356 415 71 -454 291 182 -427 116 404
2453 404 -497 -83 523 -253 -189 472 -112 -366 365 -11 -389 336 124 -404 198 286 -446 103 461 -476 -149
2474 -149 461 -262 -262 450 -79 -406 413 82 -438 262 166 -423 121 363 -396 -30 370 -343 -181 431 -168
2495 -168 -293 407 -150 -390 302 114 -433 305 232 -433 103 345 -319 -82 421 -259 -168 392 -157 -260 355
2516C55m31k73O50k10m75O16ro09N22J97o97L25L81n48OO43n89j06O23l70l59
2537c58O22j41n20N75J06o13L44L20o56K61M81o46O9N68n37j82P01l97l64O71
2557C04o1o89N58J90o54M22L17p02J99N26o16K8O12n07j96O14k71m22O67j63n42
2578c86N45J89o90L22M49p38J55N25m75j93P11m00l11N57j71m51N32K1n53M26
2598F4J96o34K69N02o67O0O19n55j44O24l13l90O38q0n43N20P7n65L41L30o36
2619b87K27M70n56l6N45m36k19O05l15l23N63k3n02M25J55n62K76L74o53J57N43
2640D28n77m3N31m16k04N69k16l66N06j05m48M59J67n78L28L14o04J58M84n27
2660a40j08N16l14k07N00j46m75M99N4n33M06J78n33K05M10n14%N25m59j35O20
$$ plain form
2516 355 -76 -349 301 91 -384 232 223 -386 136 333 -364 -39 342 -206 -200 443 -146 -252 371 1 -358
2537 -358 264 123 -397 178 284 -329 15 335 -321 -60 421 -225 -156 412 -125 -307 394 -3 -367 304
2557 304 243 -446 112 302 -352 70 387 -315 -116 410 -206 -178 434 -73 -269 345 74 -348 319 156 -386
2578 -386 159 348 -342 -20 429 -309 -154 371 -104 -297 414 14 -297 260 89 -362 170 191 -362 64
2598 64 260 -374 -105 397 -270 -210 409 -146 -290 334 21 -369 269 189 -354 166 243 -322 19 349 -287
2619 -287 -60 410 -146 -182 363 -73 -292 313 -2 -325 238 215 -287 138 293 -269 7 381 -272 -115 428
2640 428 -149 -192 339 -77 -281 288 72 -294 212 107 -341 118 285 -293 35 349 -255 -97 387 -140
2660 -140 -248 268 -46 -253 247 101 -374 125 179 -354 52 230 -303 -98 312 -202 -202 323 -136 -271 349
2681C49l57l41N97j07n17M94J28n80L43L49o29J57L61m45L1M93m11j80N73l11
2701cl44N48k7n16M53J75o12L11L43n69J20M71m89j37O24l57k76N56j25m81N15
2722A80mm52L23K61n69K05M08n57L1N82n82r7O00l55k50M99o8n09M63M8n10L70
2744A7K16m75J64L75m72n9N74m05j81N39k89l47M97K9n09M05J42m44K47K51m91
2765b16J47L44m57PM57l33j87M34j87l09M72j04m04M41J22m81K17L18n14O8M98
2786C33l88j55M42k51k66N22j89l26M24L5n06L39K09n53K76L80m88j9M49l74j48
2807b54N82l00l60N43o2m71N30K7n16K77K87m52J08L47m32jM16l22j69N12k35
2828E5l63M52Rm44L73K08n35K22K95m61PM76l69p5M08k65l10M94p0l20L65N0n19
$$ plain form
2681 349 -8 -349 248 141 -376 118 246 -334 9 358 -271 -114 247 -198 -167 326 -85 -265 308 -3
2701 -3 -347 201 174 -342 111 286 -326 -15 328 -241 -121 350 -139 -276 348 -9 -285 271 146 -335 180
2722 180 176 -276 47 308 -261 -56 352 -205 -174 408 -174 -271 329 -26 -276 223 155 -354 109 157 -353 17
2744 17 233 -242 -78 297 -175 -234 340 -65 -246 293 4 -343 154 183 -326 79 221 -223 24 275 -216
2765 -216 -69 275 -182 -175 282 -51 -238 196 9 -300 172 68 -336 105 227 -254 -37 281 -233 -165 333
2786 333 -55 -210 232 -19 -285 237 48 -278 146 181 -325 14 223 -330 -54 326 -162 -181 268 -106 -254
2807 -254 328 28 -332 211 149 -322 208 235 -281 -4 283 -169 -61 286 -146 -147 269 -53 -222 290 55
2828 55 -308 144 153 -291 82 290 -245 -23 272 -189 -182 294 -75 -150 258 -7 -317 177 107 -213 152 202 -317
2851c17L71J66m87K19L38m26L5M11l93p1L85k46k35M44%m14K94N7l77K42K40l50
2873a14J9K97l60N1L15k62j34M41k17k90L79Qm58M36N5l68J38L22m62N5M10l58
2895i7l9L50k77j78M69j32l24M19l8m30L35J27l92J98K78l94M8M22m07j52N55
2916C41l14k67M95k11l30L75ol76L40J74m89K19K95m48N8M18l64j53M50k24k50
2937b67L39Rl64M09M4m66K96K52m28Q1L55l65p3M28k79j99M69k36k73M49j5m57
2959b91L76J59n17J91L26m46J29K98l00q0L79j67k42L93r0k56K46n2k73L01Q0
2980A64l92J91K10l86R6L49l05j89M95k09k56L78j07k87L66M7l03J36J62k73M6
3001f7K89l06j2L23k86j31L78j60k46L24L8l91L15J27l98J73K11l65J44K59l00
$$ plain form
2851 -317 54 220 -267 -48 290 -136 -101 310 -83 -154 231 -15 -250 194 194 -220 74 131 -246 -4 236 -114
2873 -114 -95 202 -158 -107 208 -54 -188 253 36 -254 125 133 -325 111 166 -202 -64 258 -204 -149 261 -97
2895 -97 -136 214 -63 -241 228 96 -228 191 153 -277 58 185 -207 -9 269 -125 -77 345 -62 -214 341
2916 341 27 -240 255 44 -286 89 83 -293 47 221 -268 -49 246 -202 -144 274 -90 -243 207 -17 -267
2937 -267 72 81 -283 126 170 -296 0 252 -176 -95 260 -105 -178 250 -29 -228 241 5 -268 181 166 -291
2959 -291 85 244 -273 -82 244 -202 -73 225 -75 -155 224 57 -185 208 118 -138 108 56 -217 84 164
2980 164 -228 -37 173 -213 -117 232 -73 -262 233 24 -232 146 39 -248 118 165 -138 -2 160 -113 -67
3001 -67 222 -84 -96 227 -59 -190 188 28 -218 106 144 -247 68 195 -203 -30 181 -184 -40 219 -81
3022h1K8K75k90r2L32j77k66M40o8l52L71Q0m70K95J82l53O9K73k89p4L51k05
3044b1j94L60j47j76K73J8l33K41J53l45J40K69l85M6L38k82j27L41k18k09L71
3065A13J2l63L27J14l58J20J86k82M1K49k42l2K79j66j70L21j48k29L32j7k86
3086a99K12K41l50M9K98l91pM24k54k29M08k11j87L82r8k54K02R0l49K80J31l53
3108a65J23K43k92m6L26k53j27L34r1k76L40k1k97K59L7k60J78J53k96M3K46l00
3130a42L6L79k25k09L42j75j85L48j14k42L23N8m13K19J43k80O0K21k51J6K59
3151A68k11j09L02j60j51L15r9k57K85N9l28J79K70m24R9L02l41n0L80k69q3L21
3173A98j16k80K92L8l11K02J15k47O8K08k94R8K13j98j64L56k17j65L10K0k79
$$ plain form
3022 -81 -53 222 -68 -160 172 -5 -271 169 101 -251 120 200 -270 25 207 -146 -77 196 -93 -167 184 -21
3044 -21 -215 145 -2 -178 95 113 -220 21 174 -171 -31 238 -147 -101 237 -45 -172 169 -49 -258 113
3065 113 125 -238 89 203 -155 -35 151 -131 -90 159 -83 -115 164 -2 -172 149 1 -228 104 87 -199
3086 -199 13 254 -96 -47 251 -140 -147 277 23 -206 202 -9 -196 186 88 -166 36 126 -223 57 188 -165
3108 -165 -42 201 -91 -137 189 -64 -191 143 52 -224 116 95 -202 57 94 -166 12 165 -131 -88 158 -142
3130 -142 -106 273 48 -161 181 6 -179 169 55 -187 136 194 -219 0 143 -137 -77 144 -107 -91 168
3151 168 -43 -152 150 -10 -161 154 55 -202 83 142 -186 -7 263 -161 -62 240 -101 -151 229 -40 -123 198
3173 198 82 -198 94 132 -179 23 138 -109 -41 167 -127 -29 184 -14 -178 178 -39 -204 106 126 -153
3194a53K60P6l78J66K13l46R1K11k41K1K13j60j93L53k7k84K77j3k65K14J26l13
3216a52Q4K58l51Q2K48k77J9J77n4k03K99o2k67K44K6k32K25R4l17J47J56k10
3238f6j7L08k82r6K84j29j38K76m3k87J81J66l23J91J34l08J23J41k68P6K17j86
3260d6p0K71j77r5K63o2k68K91M5l22J75J73k93O2K64k42j0J71j17j03K60j77
3282gj14K54m0k42K33L8k98J72K02k64l6L02k30n2K20j84j01K98p7k60K73j3k55
3305a81K17Q4k76N7K09j82m6K57j77p9K31j58j05K45k4k18J81N6k20J50J75k97
3327a01O8J83j91q4L08j75j14K63j68j17K71k8k36J48J36l19J22K03k77Q6J97
3348A75k43k7K31j38j10K38n1j73J60Pj75J50N8k22J30J21k37J8J65j07r7K35
$$ plain form
3194 -153 107 183 -195 -29 184 -162 -71 140 -101 -80 133 -27 -220 133 106 -178 99 86 -179 35 161 -152
3216 -152 -68 190 -161 -79 169 -108 -89 88 34 -169 130 68 -199 45 71 -161 64 158 -159 -12 144 -66
3238 -66 -83 225 -57 -153 131 2 -136 140 97 -190 -9 157 -166 25 159 -149 -26 115 -153 -77 140 -46
3260 -46 -116 155 -22 -117 146 84 -184 107 152 -170 5 178 -115 -53 211 -31 -41 130 13 -90 170 -7
3282 -7 -121 133 93 -149 84 122 -176 -4 198 -66 -102 200 -30 -82 138 -46 -147 151 74 -186 87 74 -181
3305 -181 36 120 -156 -99 110 -72 -118 139 -38 -117 114 -44 -149 96 72 -146 35 91 -129 21 196 -101
3327 -101 -33 150 -41 -125 183 8 -106 157 -11 -128 143 115 -121 27 163 -156 -34 169 -108 -22 175
3348 175 -68 -95 136 -2 -112 126 75 -98 62 69 -106 44 102 -120 10 131 -106 -88 77 -30 -127 108
3370A08j12j13K55m0j97K30j8k32R3J51k23O9J43k26L6K06k24JJ94r0p7J63r9
3393bj84K35M5k72J13J99k86M3K15j80m4K62j83j42K93j62p8K21Nk41K06L9l03
3416b01J58J66k52Q7K25k78l0K42j32j24K28o1j32J90j6k07J42Q2j75J01J06j84
3438f5mJ84j31j21K67j45q9J49M7k16J97Qk04J26Q9j33jJ85j84k8K20j52r6K57
3462A60j30j59K04M6k53J29M9j12L1J23j99M5J85j79k7R4l0j29K72j10j40J86
3484E6j4j56J42J3j87R1J80j74pP9l8j29K68j47o1J59p3j60J68O6j84J27Q7k23
3508a17N3J61j85oK93k51l8J73r9j24K49m4j85J37N1j74J26O0k03Q6R4j28KK06
3532A37j61p4J68n4q7J30l7k17K78Ok32J09J14j41%K26j73p5J93j21j54K86q8
$$ plain form
3370 108 -4 -117 138 98 -99 131 113 -119 -26 125 -98 -29 114 -112 -76 130 -94 -93 101 11 -66 97 -2
3393 -2 -186 49 94 -178 -65 134 -152 -109 106 -74 -118 144 -39 -181 112 -50 -128 93 98 -143 63 102 -201
3416 -201 -43 123 -129 -42 183 -95 -125 117 -15 -139 89 28 -104 86 70 -137 5 87 -88 13 119 -65
3438 -65 -69 115 -16 -137 130 -15 -104 45 92 -124 73 81 -123 3 92 -41 -42 143 -41 -69 151 -1 -97 160
3462 160 30 -129 75 121 -132 -3 46 -66 -35 88 -111 -66 119 -60 -87 7 -23 -152 120 10 -130 56
3484 56 42 -114 28 41 -146 -55 125 -49 -56 23 -15 -144 124 -23 -84 75 2 -158 10 76 -108 19 106 -117
3508 -117 -64 97 -88 -94 199 -52 -90 83 -16 -140 109 65 -120 17 68 -106 20 80 -123 -37 57 -71 -69 137
3532 137 -24 -98 70 16 -71 59 22 -195 83 89 -143 -34 80 -61 -61 165 -8 -83 110 -11 -165 121 33
3555C3j92J58N1j39Q0O0q3LJ28j80M2J78j29j20K37j03j06J59j6k24J69O2j49
3578h1K7J58j85n5K09j62l1K33j80l7K01j15j07J11O2j43J25R1j99J03R4j81O2
3601@J01j88M4J52j29j0J34p1j03J43m7p2J31M4k40J24R8j80L4J46j74k3K43j42
3625A5j00J67l0j30J08N2j60J06O4k36P7J76j44J7J41j79l3K49j32j50J47K2k13
3648a66J89O7k56J63J15j67J8J61j52jJ06j2j76J97j13p6K15n7j34J20P7k27R1
3671a8J42k31J6J52r3o8J72p3j69J90Mj45J83j3k01J17J40j81P6P3j41l6J93n7
3695C2j34K16q2j43K22q4j36J34N9j80Q6J41j43L0R4j36n4J65q0n8J18m5j30K04
3719I6p5j30J27N4j66N3J13j68j1J96j37n3J66p4q0J47o0q5J52l5j17J30J9j32
$$ plain form
3555 33 -159 -1 50 -89 -9 51 -32 -29 99 -81 -39 139 10 -110 127 24 -82 77 61 -163 6 68 -81
3578 -81 -54 104 -81 -136 73 -89 -120 113 -67 -104 97 -18 -125 -14 48 -95 30 121 -78 25 119 -62 0
3601 0 101 -87 -43 109 -20 -30 104 33 -70 73 26 -46 85 129 -111 13 111 -69 -35 111 -63 -86 157 15
3625 15 -85 82 52 -78 30 82 -78 28 92 -144 -67 109 -35 -18 123 -56 -89 160 28 -122 25 47 -166
3648 -166 23 90 -166 -3 112 -55 -37 124 -28 -29 77 65 -111 86 -27 -103 112 55 -79 41 118 -109 -18
3671 -18 124 -107 -91 61 -32 -100 72 -1 -170 20 24 -121 62 49 -152 -35 105 -76 0 73 -68 -104 89 32
3695 32 -102 114 32 -111 111 27 -109 25 84 -96 -10 131 -12 18 112 -24 -78 87 7 -51 67 22 -108 96
3719 96 21 -109 18 72 -94 -41 72 -96 -107 89 -48 -101 65 -9 -89 58 -2 -87 65 30 -87 43 62 -70
3743g0R1P0k43J82O0o3p6J50o7r1J43p1j31J52nr9Q6l9n2M9J14j45k8J68j26K3
3769a8R1j14m3J59k1k00J99J0j80J06J22j66M3J21j67L0R1l9j26J88l1j19O2P1
3793F9j63J50J6j25N6O4r6rJ36j34m8J75j04r2K00p3j31J41O3j64R4J3j18K7Q9
3818C6k0p1P7l9m7J45n9r6J36Pj94O1R7q9RJ18j66J23N6r8m5O0m4l3J18pj25J33
3846D3pj31J34J0q8K2Q7o7%L8j2p7R9p4l4J04j2o7R9r1m5N4P3j45N2R7j26j0J39
3875F5q1j8J66j82n8J27L9j01J00L9j36Q9J7j05nR1r2J4J71j72k3J46j38k3J48
3900G8m2j05Q9R2k06O4J60j93N5N8q5k4J24n6m3R6n2p0J47l3r3K4M0o1J4J41j71
3927e2J2J44j11m3J30q2m2M7j5k0R9k3r1O4M2r9J6O5j29K8J43j08l8J05qq8R1
$$ plain form
3743 -70 21 91 -152 30 90 27 -49 101 34 -57 86 15 -116 36 31 -68 18 -21 -73 -24 90 -55 -83 85 -41 -18
3769 -18 73 -41 -84 75 54 -146 53 63 -117 -11 111 -55 -12 109 -58 -28 63 24 -102 86 55 -64 -2 69
3793 69 -94 56 72 -53 3 67 -29 -38 98 -36 -84 91 -13 -105 95 22 -109 32 95 -69 25 38 -80 -53 36
3818 36 16 -55 22 -17 -64 81 22 -74 62 69 -125 -64 33 -56 -47 71 -95 28 84 -14 -59 1 -43 -76 42 35 -90 43
3846 43 36 -95 39 49 -39 -17 70 3 3 41 29 -48 51 -23 -57 47 35 -32 67 -24 -69 -15 58 -87 -35 62 -64 -74 65
3875 65 -16 -34 132 -50 -108 19 58 -43 57 96 -40 49 66 -39 -44 47 -45 -31 140 -32 -55 91 -47 -70 78
3900 78 36 -69 20 112 -94 -30 130 -63 -8 50 -35 -59 65 9 -34 62 10 -60 87 54 -39 -15 25 -36 -22 119 -52
3927 -52 -40 104 -7 -50 80 -2 -44 3 -12 -32 67 44 -47 17 59 -40 -24 41 -88 -60 83 -25 -63 42 34 -54 37
3954C7n5r7J70J1j15L4M5q0k0J15j51P8Q9j18L9J4Q5j69J64j27k2N7M3r4P3N1
3980E7j03M1L5J1o4N0l0j8P0J0r9R0l1r7R1K1j07L9N7r6N6P9j27l7J84j45o9J45
4008A3Jr9J02nq6J18K6j48Q5Rq5MJ81j79k3J87o0j65J23J15k02J12N2j15M0P6
4034G7j56M0P2m4n8J60j27k1J21j00j5O4j5l3L9K9l5N2M7k14P2J21p5m7N1j6r4
4061a05J43K7j56R7L1m3K5J3o4mQ9p5l0J19n0m9N3k9n0P0M4j43J49o1K2%n7l8
4089g2LJ26j14K6M3jm6N7j9j9L1J2p0P5K7j11K4M1n9PP7q0L1Q1p4q6J12j0n6M8
4119DN9j57J35J0j12P5%l2K9J8k3l1Q6l9n0M1K1n6MM6n5L2K2p3K1O0q9j8J28r3
4149c7lR1o5j6O5L8j13Q5M3j52P4N0j02K6N8n6jP5k5q9P7J1q5P7L3j42N3J45k03
$$ plain form
3954 37 -18 -115 55 66 -49 -15 30 -50 -70 45 -106 -28 61 -57 -18 -4 81 -88 76 -51 -73 -16 27 -67 6 57
3980 57 -46 -5 30 41 -23 27 -3 -21 49 59 -40 50 19 -78 13 34 -73 -34 23 -73 -17 62 -65 -102 82 -63 -132 13
4008 13 14 -85 17 12 -74 44 70 -78 7 16 -69 -65 116 -63 -86 101 41 -124 -1 114 -88 24 76 -39 1 77
4034 77 -79 -39 33 -11 -69 91 -36 -57 64 -36 -51 13 -2 -35 4 33 -2 50 97 -117 -45 76 1 -46 5 -11 -105
4061 -105 38 65 -91 6 37 -6 19 32 -32 -36 53 -22 -52 67 17 -32 21 -8 -58 12 56 -87 62 1 23 23 -34 -72
4089 -72 -69 57 -57 -31 12 11 -35 22 3 -16 15 27 -43 32 59 -52 -28 13 -46 -39 38 -42 -11 70 -4 -90 22 12 -44 4
4119 4 63 -94 41 51 -61 14 14 -18 11 29 6 -25 61 22 -28 13 34 -22 -18 28 -27 5 27 -46 -25 35 -54 -72 56 -37
4149 -37 -40 51 -14 -30 35 73 -40 45 88 -64 10 60 -42 -16 42 -14 -15 60 35 -54 23 34 -51 26 59 -83 -30 115 -88
4178h8P2J12j22j7J06m7m2J6%q7R4j6j7J9J03j34N5j4o3O5k6m5J7J28q7j2M7k8
4206a1l9R4M2j15R9p5p4P9N2q2QJ12p3lljp8O0Oo0J28m2m6L3K2q1N5Rj6l1J17
4237H6j32J6R8r3j8N1J8q7N7Jl4L6N6j28J06K5j15N9RJ7k3M8l2j19J66l5n0L5
4265A8O1r6J4K6nl9P0o0o0J05m4oR1k3j20P3K5o8O9L6j33L4J31j45J5K0j3MR7
4294G7j06n9J47m4m0R1o4o9J07M8j54Q9O9j29K1Q0l7l2M8K4m8N4r9kL5K7n7Rq
4323b2q3Q0P1j06J0R0m3o1J02n1k7j1P5n8jR3j35O6J5k6j7J10r8P7n2Mk1L9l7
4352a7m3R3No5L8Rp9O1L5o3%M9jl1Q6o8qN0K4n1J5o1k3Q6j0r4Q2M7j32L0P5k8
4384A1n4O6mp1P2j3o6O3L3n6jK8o5oJ79j50K7J9Kn7J03k4j02J31l7p9M9Ll6R0
$$ plain form
4178 -88 -16 96 -26 -43 63 16 -26 -10 -10 -97 -3 -19 -36 -17 86 -48 7 -7 -70 -5 -31 -76 -59 69 -18 -30 17 -11
4206 -11 -50 44 86 -29 70 -5 -79 0 52 -30 -22 90 17 14 11 10 -68 -8 -2 -62 66 24 -22 11 33 -48 7 16 0 -31 86
4237 86 -46 -30 68 -25 -43 8 26 -61 -4 -3 -37 -1 55 -73 33 58 -57 2 11 28 5 53 21 -98 68 33 -17 18
4265 18 79 -17 -3 23 18 -21 49 -11 -71 34 -10 -16 75 52 -68 5 30 -38 31 67 -66 -32 99 -46 -31 -11 -24 -20 77
4294 77 -29 -88 59 15 -25 66 2 -67 40 88 -66 23 92 -37 -16 64 27 -5 43 67 19 73 -26 -28 7 34 -23 -14 -22
4323 -22 -105 -25 46 -60 -50 40 -3 -64 38 -13 -40 -51 24 -34 -35 58 -77 -11 4 -22 -39 71 -27 50 -2 2 -19 20 -17
4352 -17 -60 33 38 -27 11 20 -59 2 37 -26 -26 23 22 -9 77 9 1 51 75 24 39 -22 -45 41 31 -63 19 66 -66 -36 39 11
4384 11 -43 23 19 -52 20 7 -59 4 37 -19 -20 8 -57 -63 116 -34 -7 12 14 -43 60 36 -66 65 28 -51 -2 1 -35 55
4414E5m4L2l5RJ0nQp2jN9j3k1M5j0l1k5k3OM0M9l9m8P3on3K3N7m1P3o1k0lK6o
4448HL7l6k6K4lmn6J17o3l9O6m9L5K1m1o4P4l1NO0K5m9j7O7j24L2Qm9K0L9n0K7
4480c6J1J3k2K3K9n0J1O1j16N2L9m7K7M8p9L0ON4m2Mk4j0K1M3j11M5L8j38O1P3
4510A4l5PO8o1j2mK5n6l2R0k1K4J1p9K9O0k2l8Nk6N4J1J5o8Q8mk8k0M7n3k0Q4
4542E3r1L4L5j4n8P2o0J9qM5l2M8m8m2P2k6J1j9L6n7k5P3jp4N2Ml4N5j2J8k5K3
4574B4Jl1M6r4nR2n7L3M7n2j4j2M9m8N8n7j9O1J1l8N3j0j00P9N1r8J0Q8p9j3R6
4605G2o7m8Q5j3j24R4M9j52J19L3l7m0M7m7o4L3J06j23J01Mp5N9L9j05O6L4p3
4632b7pP5l8kM1j07L7N0K3n3Q0j02j6Q2Mq2L9nJ7o3O5p0M0Q1m6p2J6M6p7P2K1
$$ plain form
4414 55 11 43 8 17 27 22 30 -42 -43 16 3 -18 27 17 -14 -39 -62 -56 -16 33 -6 -54 19 13 -40 -17 40 -1 72 11 -9 -12 14 8
4448 8 45 9 -17 7 4 0 -56 61 -2 -41 25 -24 11 32 -9 -73 1 -30 -25 35 60 11 -6 61 -63 -31 -23 -72 -52 -13 -63 -36
4480 -36 -25 -12 -34 -11 18 -32 -21 40 -76 -24 15 -32 -5 43 -36 -6 0 54 12 16 -8 -18 3 46 -65 -20 18 -120 -59 14
4510 14 -21 -14 54 -7 -19 -23 2 -54 -86 4 -17 7 18 -61 -32 28 6 -32 -27 -53 1 12 27 -41 47 43 15 -5 42 -11 -31 53
4542 53 -38 -4 31 17 -41 31 -29 -10 -18 27 -5 43 -5 -47 25 -1 10 -9 27 -30 -55 18 17 -57 -5 -1 -35 20 8 26 1 24
4574 24 25 -6 40 -54 -59 33 -24 9 56 4 -10 -22 27 -21 37 -20 -39 22 33 -5 48 38 -62 17 68 -30 -20 68 -11 -24 72
4605 72 5 -43 42 29 -95 -1 48 -104 15 48 11 -29 18 -29 -93 -60 46 -77 24 28 -47 12 51 -54 12 46 -27
4632 -27 -34 41 3 1 42 -65 -28 22 45 -8 72 -30 -46 36 40 -42 -3 -8 9 -54 11 -59 -19 62 16 -56 -40 6 -71 1 22
4663B2k0m0L3K3k9l5PL1jL4o3P8l1n6O8n3O3J0j1n4jR8n3J7J0n4K0J7l4J5K2l6
4695cnpO4o6K7K2m1L4rj03R7kJ5l3L3o6jL4k1o5Q6N6q7N1J2Kk4M3n6k5O8l8k5
4728c3Q6p4J1K1Mk2nN4o4k8J12n3k6K3O9r8R8q5J2k0nlK0M2q1Q8p0j7O8o7O0o9
4760e2O4nm0K7m2l8M7M4J4j7k9n0Q5m2K2k6N9k5J4L9j7m7J8J0Ojrj5L1Jm3J8J4
4793A5j5k9P9Pq3K3lmJ0m4N0J7k6n6O1k5L2pk2JM9n5k2O6Kp2rO7nj5L8n1J4J7
4827El5K5RN2m7j8L5o0M5J8p7J03l5p1M2M2k2M1n2L4k8k2O3p8K2%k6m9J05%n3
4858c2R3n3l1j5O2k7k4N0q5M1M9l3%K4Km9R9r5%P4j3l4OPl0L3J0n1J0jm4O9J2
4891B4m2M9N2q2n6Q4P0j22J2J7M4o4R0q5k9P6n0m5Q6o5L6N3m3r8R5j7J2J5J6l3
$$ plain form
4663 22 2 -38 -5 18 -11 -46 -39 -8 -9 25 -38 40 9 -47 21 -32 31 41 30 -24 -25 73 20 37 47 -7 13 30 -4 11 33 -3
4695 -3 -8 -15 49 -17 10 32 -9 25 16 -87 10 8 23 -10 23 -43 -44 -10 -31 -96 -10 46 -41 10 22 24 0 43 -13 -38 30 -8 -33
4728 -33 53 -21 -10 11 15 -7 -12 42 -22 -50 62 9 -17 6 75 -23 75 -10 2 -18 -23 -26 -6 36 -45 43 -27 -44 24 -43 17 -52
4760 -52 12 7 -33 -6 -48 -86 -39 5 19 2 -27 -77 8 -34 -12 -38 21 -4 10 49 32 -15 3 13 19 18 9 -6 25 26 -17 1 15
4793 15 0 -29 50 57 -26 -3 -6 -10 0 -44 6 23 -3 -59 2 -23 9 2 -20 -19 30 -25 -47 19 21 -51 -60 7 2 -13 25 -26 -12 5
4827 5 -30 -5 4 56 9 -9 26 -34 11 29 -48 55 20 -51 -9 33 11 52 0 34 6 -16 47 -31 -9 -9 -35 -84 21 21 -32
4858 -32 61 8 -23 -38 24 -3 -27 23 -62 -21 28 -5 -5 19 21 -28 71 -24 -24 50 37 3 9 16 -14 19 29 -22 -12 -13 -57 12 24
4891 24 -18 31 83 1 -55 29 99 -23 -11 6 50 -14 76 -9 -38 38 -12 -57 29 -36 0 53 10 -88 7 -10 2 17 33 0
4921@J3L0m1K9k7JK4n8L1k4Q4o6j9J8l2pNK1j7Q2o9QPJ3k9j4M4l3mJ8M2l9K6l
4955A4n3J0M1qK4n8LJ0JM9m1nP9n9L8l5k7Orlk3J9L1m0N5Nl8Oo7O8O3q6rK3J2
4990dk1k2L4n0J2O9q6O3J5m2%m2P5m2M6j9l1P8k0n9M2K3qK4kPq6N9J9k8jmK3k5
5024cN2n7J0L1l5MJ5lJ6m9j3m6P4k6L5n1O1m1K8j3k5J09p4k0M8o2%pN1m5j8O2
5056Hkj2M3j3JqJ9k7l6Q3r0L2J2k0L0k5l9M1k6M6o3N8rj2J5n7J5M6j2j8M6J8m4
5089@k5N4l0L1n4L0j1L7k4k8J5k5M1kL6Jq1N6J6qk3j8j0K7K1m5K1j5j2Rk2RK7
5122bJ6%k6O2r8K3N2p6K4j2M8r9Q5k0N7o4J1l6L2nLM7j2m7J4K8J5n3P4j8j8Ql4
5155b1O8m1j7N3n1j2O0o5OL4J4K7j3j01Q4Kn2L5J8k0q1P3j6j3K9l2K7j4K3mk2
$$ plain form
4921 0 13 43 2 31 4 5 29 -29 2 -22 62 -4 -23 -5 -37 -44 -39 -18 -35 47 -22 -14 -7 6 -23 -37 7 -26 -30 -12 30 -9 17 14
4955 14 -39 -29 12 4 28 -30 -27 -17 -16 33 -8 -13 66 7 45 10 -17 -11 -20 -23 -46 -27 4 -36 19 24 -14 -8 -75 -7 56 -30 -39 -16 -4
4990 -4 -25 -47 -13 -63 -51 18 -68 -5 10 -32 -32 -74 1 -41 5 -14 -45 33 13 -46 -4 19 11 35 33 40 -46 13 32 4 3 -1 22 -3
5024 -3 49 -8 2 33 -2 2 17 14 30 -19 -32 -78 -4 -30 5 -46 15 -26 2 -11 -36 73 -1 -21 27 -35 -35 -42 9 -36 -54 8
5056 8 6 -6 37 24 25 17 36 9 -27 56 -34 -2 10 -10 20 -5 -44 -3 -29 17 -46 12 3 -9 6 -51 -36 10 -2 -20 26 44 0
5089 0 -25 29 -1 30 -24 6 -5 32 8 -20 -5 -30 11 9 45 46 -35 21 37 29 6 -12 -22 5 26 -19 2 -13 -25 -16 -38 -29 -2
5122 -2 14 14 -12 50 -48 -25 27 -49 -25 -37 11 -88 -3 -23 34 -30 -19 -55 -23 -28 -25 22 10 -37 -23 5 20 -33 41 23 5 13 -21
5155 -21 47 6 -11 42 -9 -21 39 -26 -20 14 28 55 42 -59 25 27 -25 10 28 8 -73 0 -16 -29 0 -32 -5 -19 4 0 -22
5186b2N4J2Kp5L4L8l6m1J5K9L4k8K7n1L9k0j8K0lN3j4ql3j0K6J2n7L6j0L3p9P7
5218C6q7J5O9j5p9J05q1%J6N4n7O1k0m6pL5j5K7kJ6l1k3O8r7N9PN3o7K9Ml6lL1
5251A9J8lk2QJ9k5OJ6p5ON9m6JJ2L6p9O2m6l4O2L5m6M9m0Lm7M1k8P6n8J4m0M5
5284bK5n3M8L9p1K9m0L9j9kK3l4O2Lj08J7N4Pj3Nl7pN0j03Q1L%o7O6l5M0N1n3
5317bj4O5p0jK9m1K7j7O4m9L9J2k9l4P7m9k1L4noj3M2n0L9jrk4k5RK1m1O9k3J0
5351A3L6j16O2J3mN6p7o3O9M0o5K2qPJ7n0R4q4M5j6j6L9M2p3K1J8J6o5K5j9M4
5382B3l5L7k6J9L2n7K6n1NoQ2j28O4K9L1J4l4r0Q4k5Lk6N6m0M6j2jm1N6J8l9J8
5414C2l6j6j5K9k8l0R9k1j15P8lM4l5N1k4J1Pk4k3L3QK2K0q2k6l7M5L6L9l4j1
$$ plain form
5186 -22 32 44 46 -29 5 43 7 -34 -19 10 44 16 43 -8 31 11 -7 13 10 63 49 41 8 -2 24 36 -21 15 5 38 -41 36
5218 36 -51 -36 33 18 -61 44 -37 -37 -21 33 -24 37 17 -29 -36 -1 -16 11 9 25 -6 -29 39 -58 1 8 61 -6 23 27 -9 -12 19
5251 19 37 34 12 20 39 14 20 36 -39 -33 26 -20 -19 -7 29 -50 12 -34 -68 -6 29 -17 32 -8 -5 -52 -11 -39 37 -21 -7 -47 -2
5284 -2 23 -30 18 57 -14 15 -25 14 -5 -7 16 -18 44 47 -61 -44 10 17 4 9 -28 -35 15 -88 -7 -4 -4 -71 -5 -40 0 51 -2
5317 -2 -16 49 -21 -22 7 -34 -7 -24 40 -9 30 42 13 -21 56 7 -14 20 15 9 -4 38 -12 27 26 17 -7 -32 -23 -2 -43 26 3 13
5351 13 49 -67 -5 8 4 60 -17 -80 -11 29 -36 -14 -22 -15 2 -48 46 -38 7 -9 -25 14 56 -17 4 22 38 -27 -2 -21 23
5382 23 -12 25 -1 18 50 -7 19 -32 -27 -33 49 -79 -15 14 45 59 25 -65 19 -6 -3 -29 27 -13 33 21 20 -21 35 53 14 32
5414 32 -4 -20 -35 -6 -34 -64 35 14 -101 -23 -26 18 -17 34 10 21 28 4 -19 14 22 44 64 -18 -44 -81 -36 0 39 5 -6
5445fL3l7OO0k5n2J9j1K6o9N0jJ8o8L8M4p3N6m1j4R8r3rN0K8m3N9Mo6N5m5L9m0
5478a0J6o2J5O8n4K7oN6r5R3pl1l4J2Km2P3pjJ1J0pn9mL9qlK1lj7j2l7O0p1O0
5513gMm4O1L7l4l7L4j9K2l0M6n4N5kk0k1l8N7M5q6M2J2j8K3k2qK2n0N8m2K7N4
5545F7l6n9O6p2mN1L3m5K2l4j5J8K5k2J2J5m8K6lN5r8J03j39O3M7n7l1N4j4l5
5575e5N5l2%nP2k2o7O3m7RN4k6K5l6m9L2%K7m2lL2K8m3J6Mk5N0k2m0R3l0l7l8
5608e9N7j1J9l9L1jL1j8Pk8J3J1qn3N4n7R2n9K6qo2Q3%j7K8n4m1JQ6oj0j2j5k4
5642d3PO4n6LK3K4J8n5K8p0J6L7k8P4n9K3l1n5J09o9L1nL7k0l4J03m4J9o3Oj2
5673b2RK0K8q7P0J6o5O0j4p8N5J3k2k9J2l0L6J8N2k1j4j4M2j9j2L4l1M3j4o4N5
$$ plain form
5445 -6 27 -10 -4 56 31 -21 -2 -13 13 -56 -6 -7 11 -57 -19 25 -48 8 -33 -47 51 -42 -51 -1 27 -16 43 47 -19 36 -9 30 -10
5478 -10 6 -56 -41 27 -27 0 -6 50 -45 48 41 10 -24 -12 -10 -52 21 14 13 24 34 27 -32 -36 3 -5 -8 13 10 -7 -19 -56 4 -67 -7
5513 -7 -3 -47 14 51 17 -20 14 -5 17 -13 33 -21 34 32 12 -9 -47 10 55 -31 11 23 5 28 6 -2 20 -30 28 -14 13 67
5545 67 31 -28 38 -34 -38 13 46 1 23 -11 -26 -8 17 -5 7 22 -26 0 -3 52 -46 57 -82 -19 28 -29 -60 -6 -20 -55
5575 -55 0 -32 -32 -37 35 13 -54 9 -38 -29 25 -1 24 -12 -61 -29 -29 -2 -44 -47 -15 13 -30 -14 -10 -35 15 -7 -47 46 16 -21 -59
5608 -59 -2 -13 6 -33 -2 -3 28 10 17 -11 2 13 5 -48 6 -51 41 -18 8 0 -62 21 21 4 32 -22 -63 -62 24 18 8 -4 -19 -43
5642 -43 -36 28 -28 -25 -2 22 40 -15 13 -57 -41 -4 -32 42 -17 6 -25 -80 29 -40 -9 -14 23 3 -31 72 28 47 -16 -10 -22
5673 -22 -13 7 35 -52 18 34 -31 29 15 -63 -8 5 -17 -46 -34 -64 -28 -10 42 21 7 -7 35 16 4 38 7 50 36 -28 27
5704B7np6M4o5Q5l5M2k7K9J1j3n2LJ8NL8qq0NR9n1K6rp8J08l8l2K5M0j7L8q9L0
5737bp5Q1pj4K3j6K6nm4O1j7K2j5j3m7K1P6r1J3k6RK7O5p0Pn9O1Pl3N4l9J5j2
5770a7N5p3N2KQl0K6l2P7o4J8nk6L6k3M6l3M8p1j8M0m0J5m1M2j9nO6n0M6p1J4
5802b7L3qJnM9m2N8n8K5l0l7O0rjJ0k2K9q5Q0oq4J46n3l8k5L2m7M4J0l4PL3mJ1
5836A3k7J7j2m8P8o5M6m7O4n5J8J3n9J04q5M1On3M6j6R1o6NK5j6o1M6nO4j02M6
5867FK8j0j6J8l0J4J3J9o4k6M5m2J8J6J1J3Mp6pM4M8J4k1n1K7K1L5k1j0l2jL0
5899A7K5j6p6Q8k3oJ0NK3p4J09j38Q4lo8K6K0Nn8O8jl1Qk9LO0pKl1Ol2j4J0O1
5933B3k9l1L2oRrm7R5k4m9J06k3l1J9k8K1J4m9M2k2Rq6Q7k0oj1n5Q6L3r5M1MR
$$ plain form
5704 27 22 -54 -10 -75 10 -25 17 -10 19 30 17 -35 -32 -14 -9 29 21 -59 -54 45 -6 20 11 -67 41 3 -29 -4 36 19 57 -32 -2
5737 -2 -77 4 -3 -17 6 -10 16 11 -33 28 11 33 18 5 -42 -21 55 -36 -23 -49 -40 -13 52 -18 -11 -70 -9 -2 -35 19 -20 -5 -17
5770 -17 38 -35 17 19 27 -3 23 -9 68 4 22 17 -9 27 4 50 17 65 -6 -24 16 -24 -9 -50 -8 -27 -32 34 -16 30 -41 -27
5802 -27 6 -2 -1 -6 43 1 59 1 26 -4 -41 19 10 9 19 -3 26 -59 21 15 -69 77 24 -14 -39 -7 -54 -10 0 -34 -27 6 2 13
5836 13 -14 3 -9 -57 21 -44 2 -45 19 -36 -18 -5 -64 40 -45 -4 2 -51 -5 -21 70 4 9 34 18 -43 3 -2 62 -40 6
5867 6 34 24 8 26 -4 10 23 42 -22 -48 -3 -45 -27 -11 0 13 17 -59 -66 -22 26 40 19 -32 -5 16 51 30 20 -12 -13 17
5899 17 42 26 -50 38 15 9 19 24 47 -27 82 -56 28 25 -43 -17 3 8 -50 18 17 -14 -6 -35 -32 28 21 23 -8 -2 -34 -48 -38 23
5933 23 -6 -37 -5 -11 -2 -11 -58 37 13 -36 70 47 16 35 7 28 42 -7 35 13 22 -64 23 3 -3 -14 -69 17 50 -45 -4 0 9
5966IJk5k3RN8j9m1J3k0M2n4L9J5j9j3J8J1L2n6L9k6K7K7n5K9K1q9N6Qk1Ql6L6
5999AmlkKjK2K0l9L2k4j0j2J1K3m8j6K3QN0J1m0j7L0j8k9%L5l4P0o1J0k9M2m9
6033d6Q1ro4M0k1L3j6K5l2j4j7L2O6m3Jk1Rl8J4M4m3L3L8o9L3nk1JK7J5l0n4K3
6066b8M5o%K6j1m7K2p3N3kkJ8K3k8k9R9m0p1N6k1N0k0kj4J1%l8J2J4Nm1L9k0l
6100b3L8k6o0O0O1m7k7k6M8rK4M5n2J3n6J01j10P8qn2K6m1K4KP6o5n9O4J9RMn8
6132b7M9n6M0j2j3m7J30n2j7nl8R2l6M0l1J5m7J3O5j6p0L5pJ4j9K2oL1j13L1P4
6163C9o7KK4%%l9J5K4J5o2K5lL8mk5J8mK5n8k0R2j5J6j9k7L4pK9k5j9n0P8l4k8
6197c2M8nm7M2N7p4l3K9Jk5P4p5M1m6N0K1p1O3k8%J6L5n3k6J5LJK5l7N0J3j1k6
$$ plain form
5966 9 10 -15 -38 -29 29 10 -31 -18 -38 4 -50 -11 4 -15 -28 -10 1 33 -23 16 -10 17 44 -11 18 39 -50 6 14 -7 1 -35 1
5999 1 -3 -6 -8 -6 -7 15 35 -4 28 4 -6 -18 -7 16 -32 -48 -25 -17 33 44 4 -13 17 -1 -30 -30 5 -29 41 -20 -10 -39 3 -46
6033 -46 35 26 -38 2 -19 14 -2 23 -9 -23 -40 -8 58 15 16 -5 4 -34 -20 24 -19 14 52 -17 16 11 -10 -9 18 33 3 -51 -28
6066 -28 17 11 11 37 26 -21 1 -72 -19 -21 -23 -5 18 -10 -39 60 20 -51 5 -16 34 14 12 -2 9 9 -29 -17 -3 2 -39 0 -20 -23
6100 -23 15 -11 -71 -11 50 3 -24 -50 -2 -11 13 58 6 19 -37 64 -46 32 24 -28 -2 -43 -19 -17 59 -6 -65 -1 18 27 31 -27
6132 -27 22 -34 6 -6 -19 -66 64 12 -5 -10 -48 44 8 48 17 32 -15 -2 63 47 -23 12 5 19 0 22 16 47 -66 -35 39
6163 39 -28 -26 -2 -2 -2 -41 -26 -2 13 -49 -24 -27 11 7 -18 0 -4 21 -37 -57 35 20 36 17 -10 24 17 46 21 2 -48 30 -4 -32
6197 -32 16 11 -36 6 63 -11 -44 -15 -14 -39 35 -40 1 -45 5 26 -45 18 -10 -10 6 41 -12 -38 -23 -20 -19 6 -31 19 32 21 -5
6230ek4J1Q3k0l8L%nM4j5l3rj3NO9p1J0kjl0k7K5mN0Kj3J1l6O1n9k0M6L3Mo5K5
6266hM5l3m1o2M2M7n6L1N4k2m9P1j9J8j8j8J0j6M3l2L3Pj5M6o5J6L0n6MkL8m3
6298b0rrK6pj1rJ5m8R2k9k6oL9Rm3N9j0K8kj4mL4l3o0M6ML9n9Q7r4J0m7K0J3P5
6333E6m4o8L7PJ7K2l8KN3q8O6k5moK6l8j8lN6j1N6j27J5RO9ll2m8P4o8K5J6J2
6366cJ1j8N9n3N0l9J7m6k2JJ7nrlM3n0J05r3K5J8K1j4L1nn1lK4m3OL8K8m4k2P9
6400E0p0O6n2m3L5m8K6L1o0Q8m3N1j0o1M3Lp3N8L8rk4L4J7l4L4o8L3l1m3M3P4
6431E5j02M2nN7j15L1O6p7K8M5K7p9%J9l5M5j6j9lK7J8k1K2n8O4j5kk2j3K0K6
6462A0M5pp8K4m3LJ14p7rK7j9M0k0Jj3J7m4J4M8j03R0o0O9m3l2NJj6K8Oo5P9P2
$$ plain form
6230 -5 -29 -18 65 45 7 10 10 5 49 34 1 -8 -21 -16 53 -18 -8 -10 -11 -41 -68 -43 -47 3 5 -8 3 -33 28 -31 -51 -5 28 32 -33 -8
6266 -8 37 4 -37 -99 -57 -10 -66 -35 19 -3 -52 19 0 18 0 -18 -8 -24 19 -13 20 27 12 58 -7 9 39 -17 -13 -15 23 -20
6298 -20 -29 -38 -12 -19 -30 -39 -24 -72 20 -9 -35 -41 -2 7 -36 23 13 41 39 25 21 55 22 -38 8 12 51 -8 79 -15 -5 -52 -32 -19 56
6333 56 12 -56 -19 -12 5 27 -11 -9 44 -44 22 -3 -7 -13 13 -25 -43 -46 10 -1 55 -72 -57 -48 21 18 -14 -62 12 -56 -31 -15 -3
6366 -3 8 -10 49 -4 46 7 24 -22 -44 -43 -26 -31 -40 -43 0 -50 55 -38 -13 5 26 12 43 38 -13 -16 8 -35 -29 9 37 -7 -29 50
6400 50 -20 46 -6 -49 -14 -62 -36 -5 -65 23 -20 31 21 -40 3 6 -67 -9 29 20 -4 30 47 13 47 -21 12 -19 -62 -19 55
6431 55 -47 -5 -10 47 -68 -37 29 -48 -20 25 52 -27 -27 -8 -43 2 -14 -33 -36 -9 9 -12 10 -48 16 1 -1 -23 -36 -16 10
6462 10 55 48 -30 -6 -49 -46 68 -9 -18 9 -10 30 10 11 -2 15 -29 -15 33 -70 20 -40 29 -14 -46 -41 -40 -56 -28 -22 -87 -8 64
6495F4m9k8QM3l6J8j0k4j5M1N2p3qM1l3j1L8J1Ql8K1j8K5n8J0L9n0J6k2L2Pm4
6527d3L2k1%N9m9K3kjJmj7J2l6j3Q1p3O0nm1O2nk9J3K4m3J2j5K1KK4jk9ql3J03
6562F1q5k1nL8K5J0j1ok5J8j2J0Pl6O2m1K1nKj7JpJL9k6k4J6k3L1KJ2j3K3l2o8
6597g8R8n5K7K2Kl5pQ2J2p8l2J0L3N2q3j0N4l3K8l7K1rkk8L7K2kp1M5jMj4K5J8
6631A7j8J5l7l6O1Kn4O4op0L2L8n4Q6r5L9k5J6L3l1K8n4J10o9Ml2RP1m6j6L0m7
6663c5N1l3K3m3NR4p7N4n0j1j3K6O0p1n3L3O6l7Pm5L3p3J12l9K2J5lK2k6K6qo2
6695c0M9nn9M3K1j3l4O5o5L1j8O7m7K4o8j2L1K5J3l2M2j4m0K4J2J9rj0J3om3m
6727c0K5Nm8K7M2l6j1L3ok3n2J21m9JK1l6K9K8Qp8L9o2P8l0k4j5K5L5l7L7r4M1
$$ plain form
6495 64 15 -13 -5 38 2 20 10 -14 -29 12 64 -9 -17 24 -9 -20 18 29 37 -1 20 2 27 -31 -21 18 -32 -16 -38 -6 1 -43
6527 -43 -11 -32 -32 27 -22 1 -1 -2 -1 -5 -22 -10 -46 -59 22 -51 9 4 -37 25 20 -9 4 28 -15 -3 -18 3 5 29 28 -1 -9 -42 61
6562 61 -24 -45 -50 -12 13 23 12 6 -19 -1 -13 -3 4 -32 30 -11 10 5 7 -10 -9 -16 -15 24 -2 -26 -10 -33 -2 0 12 -1 22 -10 -78
6597 -78 20 -35 -8 14 16 -19 -26 56 68 -10 -42 -32 1 53 -30 -40 14 -19 9 -28 -7 -16 -18 -46 -9 13 11 -60 -15 -16 -12 -26 -1 17
6631 17 -1 14 -23 -59 2 4 -50 14 8 -62 -30 8 -46 40 -55 -16 -41 -25 8 -23 5 -49 61 -8 -4 -36 -27 44 -2 -18 12 -35
6663 -35 16 -17 6 -37 -32 62 -15 39 -11 -22 -35 -9 51 -20 -73 -40 26 -11 -4 -49 -16 -89 23 -16 6 21 18 40 14 40 32 -30
6695 -30 19 14 -45 -2 19 6 -28 37 -28 3 -15 52 5 29 -39 -51 -20 5 18 -14 28 14 -26 -2 10 29 20 10 23 17 -26 -30
6727 -30 -5 0 -48 -21 21 -15 -26 7 1 -22 -74 47 -2 -1 20 -16 13 41 49 -29 10 -52 26 -4 -28 -43 -18 17 -20 17 -77 -36
6759c6J4N3n5j2R0o5k2J5O8o5KqK0OrJ0k6K7n0J27r8L3o3J1j8L2N1m2l7J7L8j
6791Gl8P4k1L3k6j9j8L5j8J4Pk8qJ8J4m9oQk8L9N8j2l1l0L5n5J2K8oP5r4QJ5J0
6825Cj2K5K7m1jk1J3m0N1lkL8pL0r1O6j4P2m5K0n1l2N0j3m2j6N0Lo2N2j6pl3K3
6859b6J6lJ0k5oJ2M2J1n8K5j2j7M2J5l2n0K9j3M9Mo3J2PL4m4R1m7pK9J2j2j05
6891h0J20Jjp2LQ8lk0p9nkpJ26q8M7K1o4jj3P0l7m1o4J29q5L1l3R8n2p2O3P5n5
6924bJ3K2qk3LK2qk9k7P2q7kJ8J7k7N3jl1jL1k9K6lpPmL0J4k7m5lJ2nl1Q0LJ6
6961C9m0l5Qk5P7n0Kj2PO5p1O3l3L4Pl3on1Q1l1L5kkn7N7k7J2m1K0Jl2J0QN7r
6996B6j1m1RPK5Kk0N5q3L2K5j6OL5m6m2L5p9R0m5K4Nk9K1LM0k2l7j2k4O4k8Q3
$$ plain form
6759 -36 -22 31 -24 -36 54 -11 -33 -18 50 -15 -13 -21 -1 5 -4 6 -20 7 -43 84 -14 19 -44 -33 -51 -19 32 -10 -47 -30 8 7
6791 7 -31 43 22 55 29 10 -8 27 9 23 30 2 -6 12 26 -23 -29 -21 -49 -10 48 36 5 -25 10 -45 -33 -5 -11 64 -30 -22 -7 3
6825 3 -9 16 43 2 1 -20 -7 -47 4 1 -1 37 30 60 -31 35 21 93 48 68 17 -15 35 22 -20 -36 14 17 -45 7 -9 -16 -49 -26
6859 -26 -10 -13 -3 -28 -34 -22 20 31 -27 -2 -14 -31 11 26 -6 -56 -27 -40 9 13 -50 -38 -31 3 -41 50 3 -4 25 37 25 -80
6891 -80 40 41 40 -32 -29 59 56 36 -43 -48 -50 -57 69 -19 28 49 -15 -16 -29 41 4 -37 -101 28 -57 -26 -59 39 -13 -85 -22 53 -2
6924 -2 11 33 25 2 5 27 19 -10 -37 35 -52 -54 -36 -19 -46 7 6 -25 -26 5 -24 2 -1 -8 -1 -5 25 39 12 -33 -36 -24 -29 -60 20 23 39
6961 39 -1 -36 -28 -53 24 -26 -24 -36 -29 36 -35 28 -5 29 36 3 -3 -54 27 -4 31 29 27 -30 27 0 12 -29 -9 -8 -40 -30 -22 35 26
6996 26 15 -26 -17 -10 15 17 -3 52 -31 1 26 10 16 51 5 -37 -2 -81 9 -36 -12 -7 -36 -15 -12 28 6 -31 -43 -67 -3 -31 52
7029E2o4kL1p8J23o0l1J3K7rLP1n6K0qk9k1MK7k6Rm0M6m4M5n5O7pjJ5m1j7P0j9
7063A5l9j9L1j1K6m6Mj8O4nll6K5J3QL4k5p8M3m5N3kK5J1k8jk1K5J9n9K4O1l3
7096A2n5Q8l1j5j6N2o6%N8j8l2K1j2o5P8l1Lm6N1L1j3J1j2M2%l2l3j6oN5J8j4
7128GL4k0pqJN4j05N5Qj1K2l1kmm4L4pK7J8l8M6J0np8M9l1k8J15j03Q2m2l8K3
7161a7J5M7k4l5J8KJ1j8LK2k7l3O6m5j0k8M7Roqk0K2j5Rj5L8o1K5JJ4n1J20q5
7194b9M8n0K0N2m2J0m8O5l2j9O8kp6J4J0oM4J5o8K6M0j11L9J5Q0k2k7Jj5O3n2
7225A1k3N1K0l8j0L2p4K2j7rqL8j0kQk6M8mK0n5L6m7J9J6l5P0l3KM2p4M7J1L7
7258F5o2J1J8n6L4j9M4l3o2P5l8K0j0K7l4N3k8JPo0RK5L1J1j1m2L3m8k1N1j5O
$$ plain form
7029 52 -12 -14 17 -61 62 2 -29 -16 11 2 5 76 20 40 32 3 -18 -14 13 -13 -4 -44 2 -42 3 -52 15 8 7 22 -19 -36 34 15
7063 15 -24 -43 -12 -23 3 -43 -39 -57 7 2 -1 -37 -12 1 9 43 18 -60 -17 -62 -9 -11 14 25 -3 -4 -25 0 19 -40 -16 45 12
7096 12 -43 45 14 -1 -17 35 -31 -31 27 9 -23 -2 -14 -79 -1 -32 -29 -75 -24 7 -6 5 -7 35 35 3 -30 -46 -52 3 21 7
7128 7 41 21 14 6 7 61 -44 11 19 8 30 -1 -3 -7 -51 -17 -24 3 21 -17 29 39 34 -44 5 -26 -54 61 -42 40 -2 -40 -17
7161 -17 -2 45 21 -14 4 6 17 -1 2 24 -3 -36 30 -15 -25 -53 -6 3 -3 -11 -31 -9 -24 -15 -30 8 -53 -28 -27 -13 -64 56 -29
7194 -29 19 -31 -11 41 -1 9 -39 26 -6 -25 43 41 -35 -21 -11 -17 27 42 -26 0 40 -71 -32 -17 63 41 14 15 0 63 11
7225 11 -12 39 59 21 11 43 -31 -9 -26 -35 -43 -5 -15 -17 -9 -35 13 9 29 -26 10 -37 -18 -2 -37 33 0 2 44 -30 17 28 65
7258 65 3 14 32 -24 10 -9 35 2 -60 15 -23 -3 -13 14 -20 33 5 6 13 -47 -38 -13 18 29 18 -24 9 -39 -60 -9 -24 -18
7290a8K7K3p0j6N6O9j03K5k2N8k2J4L4r4Q0k9rj4K9k6J9l6K6pO7m7kK1n7L4kL9
7322D7n9l1PL8k6O8n2l5P0n3N4p3L9K3J2k9J8K7q7j2Q8l8k7KJ5Okj8OL3M5l3l2
7355iJM1k3j4kJ3L9j9m4l9J33r4jM8l2nl2Q2p0k5N7m4P8q1K8J3J4l1j0J09l7o3
7387a9L2kj7N5p4k9K7M8l3J1j4PN7p9M8nl8L1K5l9J5j3j0M9k8J1k3m8Q4m5M2l6
7419a0qJ4l4K5j3K2%olM0k2jl4M3K0r8M8M6P6j36N9n9L7k3l8O5Nn5RM7m2m3O1
7452hj5OM1o0Q7l4m4J1PQ4n6l7J4k1L5k3k4NjM9j0k7M1k5j8nJ07q0j5K7m3NmJ3
7486a8RO9o0j9j1K4K4j0KN6j8k8l8M2j3l7K8j0j1O9r3Q0k3LKpRL8q9M3m7k7M1
7519b0M2m0k0pJ0K4ok4M9k8Ml4l2N2K9kL4m5J0L0K2j1k0l0JK2Rm9N6p3O4l9N0
$$ plain form
7290 -18 9 32 -38 -54 2 71 -32 -7 -29 29 7 21 55 -39 41 12 3 -11 18 -8 11 -25 1 -6 61 14 12 33 -24 10 8 47
7322 47 -12 -43 -36 2 -24 44 -8 -43 27 -26 28 -45 -6 17 29 0 18 45 -42 -54 34 -4 -31 -29 -14 -8 -10 -28 -22 11 56 23 -9
7355 -9 -8 33 10 -4 -6 7 46 27 -17 -56 77 -17 -18 30 -2 -7 -39 43 -27 -52 5 -39 39 -42 -14 -1 13 -18 -28 81 44 -19
7387 -19 13 11 -6 49 -25 -54 -27 21 -12 -1 -15 -8 49 -30 18 13 -25 6 31 -8 7 -6 -16 33 5 16 -7 -55 29 -16 26 -10
7419 -10 -18 -4 -38 -13 -26 -4 -4 -10 -13 27 5 4 -30 13 33 -65 -17 29 105 -31 28 -31 6 -17 -55 10 15 -40 -31 16 -26 -69 -8
7452 -8 -23 -17 24 -36 51 17 -27 -16 -9 75 19 -18 -4 -25 10 -13 -37 -32 -33 16 6 -21 20 -5 -23 -28 79 -1 -16 11 -32 -27 -31 -18
7486 -18 -9 60 0 -19 -30 -6 18 8 10 66 48 20 -18 24 11 -26 2 -8 -19 50 -43 37 14 17 19 12 21 59 -30 13 -34 -61 -20
7519 -20 22 -18 -38 -45 -35 -11 -17 -41 8 -20 -16 -50 -82 -30 -1 -3 31 -14 -4 26 48 37 17 -13 -12 10 19 -30 26 -47 17 -22 28
7552B8m6L1P8q6k4J8p2M4oM4j2J4n4J3K1j6k2P6Kk0L8K6n9o1N0j5n0QJ02q1J9
7583a2M5n4O9l7J1N0n3mo8Q9l7o2Q4l2JJJ1Pm6M3k5P1j14L4oJ6k7O7n3K2J5l3
7615b7P3l4m6N4o1J6K9m1K8j5N1J5m1K1n1J2mN2p2Q4Qp7L1K0m0j6J5O0l3L0l1
7646A0K7J6p4J4Q0mo1kk1L6on3JML1k0J6j9J0lL8K3p5qK7K7lmL7ln8j6K0%j5%
7682b8M7jm3Q6l1m5P2n0j4J5kJ1l1J3m8M7Rj9P1n0M5n4Mn1K2M4l9M3l1lL0l5l1
7715d7L2M3l0J4ol8Q8o2%NJ8m2L9l3Q1n3m3N1J3j9K5l7nrK0J3j6K1l5L6l1QK9
7748C0j10R0o0OM6j2L2p1O2o4N9r1Q4J6jQL8j04P2J3m7J8m9N6l5mJ3K7K0l3K4
7779C3j0Pl6plj2J8K6K1m5KrJ2J5Pll0rK7K5oq0P5k7n3j7J9R7q2K4Q5j33R3l1
$$ plain form
7552 28 -18 13 91 5 -19 -1 -73 -29 -35 9 -3 11 -43 -30 -9 -25 -47 29 31 11 49 75 16 -45 5 -10 -60 -52 50 -31 -12
7583 -12 33 -21 48 11 22 72 19 15 -53 36 -1 -63 21 -11 -10 -9 2 9 -37 6 -19 52 -62 -28 -34 -18 -45 22 -31 -9 6 -27
7615 -27 46 12 -34 20 -41 -25 4 -37 -9 -24 27 42 1 22 -29 -17 -21 31 -41 43 51 -26 5 25 -15 -31 -16 44 11 41 10
7646 10 37 53 -21 -7 73 69 8 6 -15 21 15 -38 -37 -33 -2 -22 -6 -25 -15 -18 20 43 -32 -40 -13 14 11 7 44 41 -17 -33 -13 -13 -28 -28
7682 -28 19 18 -25 61 30 -15 57 7 -7 8 6 17 -14 -1 -49 -2 7 -12 59 9 54 0 4 -47 -25 19 -20 23 -8 -11 19 -16 -47
7715 -47 -15 28 -2 12 6 -32 56 -6 -6 -1 17 -25 14 -19 62 9 -34 17 30 11 36 -1 -6 -15 5 18 2 23 -12 24 -7 1 30
7748 30 -80 10 -50 -44 2 -10 22 -49 13 -51 8 -83 1 17 16 24 62 -42 30 43 -4 14 -35 21 -14 -18 -5 22 42 9 33
7779 33 23 30 -6 -13 -16 -28 -10 16 37 -8 -6 -15 -3 12 19 16 -14 -23 4 29 23 -57 18 -9 -62 -79 -60 37 -45 -21 64 -69 24 -7
7813gj3lN6l6mk0O7p0RQ3j19R5n0M8r3Q9p1N8k2J3Kj6K9o5l5O1L9kJ5p6N0K5k8
7846IkJ4q8M1L4n4M6m4K8J8QJ%p1O7k3K5km1O0k8l5K1M6l6j6M4o0M4J4o0J7L0
7879Gk6K9kj9M0rj6l8J6J2M1k1k6j3kM8k5PJ5j1J2l3RL7k2J0l5N4j7q6M6M4j2
7912A4o2J9j1K3L2j3J7n1J0K7K1l8k7O6n5O7m2L7p7M6J0m1K4L9jm6N3n5j4L7L0
7943C9l7oroL1On5L0O7q6MM5m4M5m4j1KPM6m5K1l0L9O9m7k9m0M7oM5l1J9Jl3k4
7978b0J6l5N2o1L5K5K5m2JM1o4K6j7N9n8L2Rn1Kjm4J00j1j04M3J04o9j2M0k8K6
8009A9o7N1K8J5q9O8m8J4nj3L6J5Mn3M2J5m0j9L3l6j2j4Q0l5PrJ7l2M8p1M1L1
8041B1L0l2jQm4N2j6m9OP2n7o5Q1K9k9j4L6k6J6L2lm5Jj1M0l1M2o1J9JRJ2oJk4
$$ plain form
7813 -7 -20 -23 33 -3 -7 -27 40 -30 -21 62 -57 38 -12 36 -57 32 -39 19 -3 10 12 -4 25 -40 -75 -14 25 23 38 -38 12 37 9
7846 9 7 21 -67 -26 8 -46 0 -44 -16 2 10 11 11 -60 7 -16 9 7 -34 26 -2 -37 -16 30 -6 -22 22 -38 6 20 -40 -23 7
7879 7 -19 10 8 -11 29 20 4 -34 -18 -6 35 14 -12 -25 -27 21 -4 3 18 7 19 -14 -5 32 10 20 -15 39 22 -64 -18 26 14
7912 14 -48 -29 -40 -17 15 2 19 -32 -22 5 26 -12 -39 27 -28 39 -3 34 -43 3 13 -28 -4 35 34 -12 41 -14 -28 9 39
7943 39 2 -4 -13 -19 12 18 -37 -7 60 -26 -22 23 -21 24 -20 -31 -29 -22 24 -21 0 -30 9 78 31 2 -38 9 3 48 17 36 37 4 -20
7978 -20 -4 -39 13 -48 -13 12 37 -5 -4 37 -27 -1 -18 41 -17 15 24 -27 -25 -26 -70 30 19 -85 -42 62 -7 -19 21 -7 19
8009 19 -48 3 31 46 -43 25 -23 -9 -14 -27 9 24 28 -25 17 32 -8 -27 6 -30 -42 -56 24 -11 -4 -13 4 -28 20 -51 -10 21
8041 21 51 19 18 26 -18 34 18 -31 -25 47 -10 -75 6 35 6 -8 28 2 18 50 47 2 3 -8 32 1 43 -18 1 2 11 23 17 18 -6
8076fJ5o9L6M1j7m3O5K1Pj33K3P8m1J0J1l4O3j00O7J5m7M1pl9j6O3l0M8RK2Kp7
8108b2m3Q1k7k3L4O4K0m1l2l3M4k8jK6Mo4K8Lj2M6k8J9k2L4k4j2N2l1l0k8P1m3
8140a8KM5mj5Pn0O5Kn7L6L4L2m8J4Qo2Oj1l1M4L5%j0k6QjLoK0j2m1L5m0k1J05
8175D8k7MnOk2n2R3j22J09n1J8J8j8q%J2
$$ plain form
8076 -6 9 -60 -24 17 0 -43 22 43 50 -83 -60 18 -23 -13 -2 -36 27 -73 -6 9 -38 3 -4 -43 -59 4 -26 22 31 53 55 -22
8108 -22 -65 16 -11 -34 0 64 84 43 11 -22 22 -6 -7 19 23 -41 -13 -10 -22 24 -4 15 -7 27 3 -9 43 12 -18 -46 25 -18
8140 -18 -16 29 25 10 17 -33 32 34 -23 13 47 79 31 45 53 -9 -3 -14 -45 -1 34 34 24 -2 6 5 8 2 22 10 -31 4 -36 -57 48
8175 48 21 25 20 26 4 -48 45 -77 32 -19 -1 17 -1 -9 -9 3
8191C
$$ Imaginary data points
##PAGE= N=2
##DATA TABLE= (X++(I..I)), XYDATA
0@%%%%%%%%%%%%%%%%%MqJ1j5J6j6J6j6K0k5K8l2L7m1M3n0N7o3O9p7Q5r4J05j13
41e9J23j35J49j63J79j99K17k37K63k91L21l54L92m36M88n50O24p15Q31r78J168
62F38j431J808k375L293m942Q412j8124Q7267K41621m28220l9541L95728k28758
75A5376k11214K95893k9795j94766J80099q854j84479J47202L2689j73513J41077
86I715R2832j77717P4728R6818j72700P7045J52477j98480K6847K37866k15640
97C791j31573L15113o3958k62463K55423J15730k95153Q7661K08088k00681j4861
108A7117K14180j15647p6703J66640q1138j07330J54588k5678j20949J25292J504
119A51876j37083R6312K7290j33459J01757O3282j70278O7140J20175j94711p901
$$ plain form
0 0 0 0 0 0 0 0 0 0 0 0 0 0 0 0 0 0 0 4 -4 7 -8 8 -8 8 -8 12 -13 15 -17 20 -21 22 -28 29 -34 35 -42 43 -51 54 -59
41 -59 64 -71 78 -85 94 -105 112 -125 138 -153 168 -186 206 -230 258 -292 332 -383 448 -530 638
62 638 -793 1015 -1360 1933 -3009 5403 -12721 74546 316167 -112053 -151594 244134 15376
75 15376 -195838 100055 70260 -124506 55593 46739 -137740 9462 42151 -131362 9715
86 9715 102547 -75170 -442 96376 -76324 721 153198 -45282 -18435 219431 3791
97 3791 -127782 187331 123373 -139090 116333 232063 -63090 24571 232659 31978 17117
108 17117 231297 115650 38947 205587 124449 17119 171707 146029 25080 150372 151876
119 151876 14793 111105 138395 4936 106693 169975 -303 66837 187012 -7699 -15600
130a5600J98391j41884j09540K03248n9604j86144J56827M1538j89018R2104J06113
141I6431j64849J7134J25573j19698k4287J27909p8011m7712J11782o7860o9567
152i3155J19703m0929r2729J29952m120j34069J14603N1254j60270Q1305J22966
163I4511j63411N672J72330j27330q4616J84069l9989j39807J36952L4193j46511
174g3937P0601P0921j13559L7812Q0600r7343J5670Q5970r5601p229J07597q4010
186b508m2840J23646o3055r0768J30309j4640j31878J16075N2730j60558N8200
197b5287J17430j42440j8407J49006q2243q0585J26880k0750j01021Q6182J7776
208B6541r0162N7978K9984q3974M4627M2688q5160L4109O5485q9037Q165R0468
$$ plain form
130 -15600 182791 40907 -68633 134615 75011 -111133 45694 87232 -101786 -9682 96431
141 96431 -68418 -51284 74289 -45409 -69696 58213 -19798 -67510 44272 -23588 -93155
152 -93155 26548 -14381 -107110 22842 18722 -115347 -744 50510 -109760 -28455 94511
163 94511 -68900 -63228 109102 -18228 -102844 81225 41236 -98571 38381 72574 -73937
174 -73937 -3336 67585 -45974 -8162 72438 -24905 -9235 76735 -18866 -26095 81502 -2508
186 -2508 -45348 78298 15243 -75525 54784 40144 -91734 24341 77071 -83487 -25287
197 -25287 92143 -50297 -68704 80302 -1941 -82526 44354 23604 -77417 8765 26541
208 26541 -63621 -5643 24341 -59633 -15006 27682 -57478 -23369 42116 -46921 -38756 51712
220E1712q2637l0255J12131n5258p5386J15304p664j13830Q8140N0934j20558
231f7367L6157R0762r3764j6200R5655n3059m3603P9094k3545m9103O2693j1751
243E969n0641N8658l510o0706N9013J4104p7271N0543M2950q9810K5522P6920
255E1741q5796j5706J00617n7884n9461J00485j3110q7575P4655K9840q8929L7541
267a3582N3291p1827Q608N7371n3830n660N5506m4446j3615N9559m0256k7234
279c6115O9687k9842n0858P5975m809p7405O6330L2345r3751L5429O9268q7154
291c0900p045R0323n8113m5817Q7931k0037o7496O7616J2589o9316M2663K9710
303C2108o2248K4558L5717n6923J6184M3824n8965M953O0989n9144j9723Q1446
$$ plain form
220 51712 -30925 -61180 50951 -4307 -79693 35611 27947 -85883 2257 53191 -67367
231 -67367 -31210 59552 -34212 -50412 45243 -7816 -51419 27675 4130 -44973 17720 5969
243 5969 -44672 13986 10476 -50230 8783 22887 -54384 -3841 39109 -50701 -25179 51741
255 51741 -34055 -49761 50856 -7028 -66489 33996 20886 -66689 7966 37806 -51123 -13582
267 -13582 39709 -32118 -23510 33861 -19969 -25629 29877 -14569 -28184 31375 -8881 -36115
279 -36115 33572 3730 -47128 28847 24038 -53367 12963 45308 -48443 -13014 56254 -30900
291 -30900 -37945 52378 -5735 -51552 36379 16342 -51154 16462 29051 -40265 2398 32108
303 32108 -30140 -5582 30135 -26788 -10604 33220 -25745 -20792 40197 -18947 -38670 42776
315D2776m1008n4123Q6365n279q3689O7075L6552r1530L1066O7578p7880r110
327c1207P8244m9624l7399P2813j8677m9435N6458Q12n0794M3514J1469n0373
339b4199L7615K0120n8698K9102L7176o6144J1668O2619o0625k0139P7755l7780
351H470n2554P6050j038p0651N5062L0348p3274K4101M9320n9592j187N5875m1935
364a005j9817N0982k6571k7127M8333j5135l1358M7879r102m3826M8838O488n9328
377c0749M2485L2522p1139J6860N7994o3500j5062P3092l7601m2752O7238r442
389A9946n7780N1555J6414n8414L2381L1674n5199J2033L9300m6414o90M4242
401B9048l8458j1731M7860l3339k4350N7334j9963m3027N9909K016o4893M5637
$$ plain form
315 42776 1768 -52355 34010 28731 -54958 12117 48669 -42861 -11795 55783 -22097 -31207
327 -31207 47037 -2587 -39986 32827 14150 -35285 21173 21985 -28809 14705 26174 -24199
339 -24199 13416 33536 -25162 3940 41116 -25028 -13360 49259 -11366 -31505 46250 8470
351 8470 -44084 31966 30928 -39723 15339 45687 -27587 -3486 45834 -13758 -14945 40930 -1005
364 -1005 -20822 30160 3589 -23538 24795 9660 -21698 26181 17079 -26747 22091 28579 -30749
377 -30749 11736 44258 -26881 -10021 47973 -15527 -30589 42503 4902 -37850 29388 19946
389 19946 -37834 13721 30135 -28279 4102 35776 -19423 -7390 31910 -14504 -15194 29048
401 29048 -9410 -21141 26719 -6620 -30970 26364 6401 -36626 23283 25299 -39594 6043
413F043L2493p0799J9023N7282n9891j3515O4804l7335l6008O1944j0663m7774
425c4396M8630Q783n2277L3128K3887m8590K0145L2231m7051O941L8991m5175
437a4753n045N1711l8083k4753O0390k2147m8303N9173P103o3435M1247L4644
449C7749o5510J1655N1489n0595j3072N5912l0254l0518M9074j2567l7955M1346
461F754K989l9944L2707J2875m2786K3813K3029m4030J5187L5212m5603j326M8048
474B6925l8574k2671N7333j7924m3333N1117P542n3659L2628K9257m8922J1684
486h597L8520l9045n459L9798k7769j5358L9617j7577k3704L7413q334l0684L5126
499A3947K803l6868L0862J4664m4647K0605L0747m6809K845M5992l8176k0364
$$ plain form
413 6043 38536 -32263 -13240 44042 -15849 -29364 35440 -1895 -37903 24041 13378 -34396
425 -34396 14234 23017 -29260 3868 27755 -20835 -690 31541 -15510 -8569 30422 -14753
437 -14753 -19798 31913 -6170 -30923 29467 7320 -40983 18190 25293 -38142 3105 37749
449 37749 -27761 -16106 35383 -15212 -28284 27628 -2626 -33144 15930 3363 -34592 6754
461 6754 9743 -30201 2506 15381 -27405 -3592 19437 -24593 -9406 25806 -19797 -21123 26925
474 26925 -11649 -34320 23013 5089 -38244 12873 20415 -33244 -616 28641 -20281 -8597
486 -8597 29923 -9122 -14581 25217 -2552 -17910 21707 4130 -19574 17839 9505 -21179 13947
499 13947 16750 -20118 10744 25408 -19239 1366 32113 -14696 -11851 34141 -4035 -24399
511b4399N0540j8839l7230M3689K988m2680K9662J7280m1390J6038K6206l6785
523a4920M521L1814l1365o979L4783k3870j6221L6972j5116k5469L7321m467l5854
536b8850L4313J1567m4200K3022K9556m4884L221M2072l4097j6498M4311j7004
548B529k9373L7545j308l4176K8468J0634l4787J9224J9213l3879R346K6023l0757
561a1298l55L1191k6272j0479L5685j9545k2330L8770p103l5206L4571J0806m2871
574b4436K0702K7704l9484K247L5945k8149j2882L5144j5245k0952L0308m925
586E977k4655K5051L098k6598J9946J0284k8128J4307J7438k9014O466K5215k7322
599g935m440L2504k0606j8062L5064p495k9758K9304Q590l3940J6415K0368k9384
$$ plain form
511 -24399 26141 7302 -29928 13761 16749 -25931 3731 21011 -20379 -4341 21865 -14920
523 -14920 -10399 21415 -9950 -16929 17854 -6016 -22237 14735 -381 -25850 11471 7004 -28850
536 -28850 5463 17030 -27170 -4148 25408 -19476 -16255 25817 -8280 -24778 19533 2529
548 2529 -26844 10701 9393 -24783 3685 14319 -20468 -1244 17969 -15910 -6564 19459 -11298
561 -11298 -11653 19538 -6734 -17213 18472 -1073 -23403 15367 8264 -26942 7629 18435 -24436
574 -24436 -3734 23970 -15514 -13267 22678 -5471 -18353 16791 1546 -19406 10902 5977
586 5977 -18678 6373 9471 -17127 2819 13103 -15025 -718 16720 -12294 -5828 19387 -7935
599 -7935 -12375 20129 -477 -18539 16525 9030 -20728 8576 17166 -16774 -359 20009 -9375
612i375L260K4436k1508m982K3957j5476j0001K3801j0852j5206K4005m775k0805
625a3521K2315K977k5681J8315J1865k9041J0945K2042k8969r47L0503k1843j4729
638a5769L2217r107k4465K6411L629k7104J7015J1900k5193R204J6314k2517L070
651d395J9780j9960l234K3094j6181j0313K5420j0322j7975K5344j727k5272K1605
664E864R199k9802J3065K0332k8762N38K7678k0976j1594K8213j0052j9169K3662
677H196l75k1987J7556O421k2432J2116J1463k2075O834J6197k1066P88K1179
690A2815j8417p032K5041j2470j5943K5596l086k3708K1328P968k7225J2295J7586
703A4748k4997J428K2923j8121p847K2943r558j3355J9761l216j5418J6507J104
$$ plain form
612 -9375 -6115 18321 -3187 -8169 15788 312 -9689 14112 3260 -11946 12059 7284 -13521
625 -13521 8794 11771 -13910 4405 16270 -12771 -1826 20216 -8753 -9700 20803 -1040 -15769
638 -15769 16448 7341 -17124 9287 12916 -14188 2827 14727 -10466 -1262 15052 -7465 -4395
651 -4395 15385 -4575 -7809 15285 -896 -11209 14211 3889 -14086 11258 9531 -15741 5864
664 5864 15063 -14739 -1674 18658 -10104 -9566 18112 -2864 -14458 13755 3703 -15466 8196
677 8196 7821 -14166 3390 9811 -12621 -505 10958 -11117 -4283 11914 -9152 -8364 12815
690 12815 -5602 -12634 12407 -63 -16006 9590 6504 -17204 4124 12092 -15133 -2838 14748
703 14748 -10249 -8821 14102 -4019 -11866 11077 1519 -11836 7925 4709 -10709 5798 6902
716F902j7313J4239N613j9941J0875J1895k1469M413J8829j9502m333K3223j3365
729F6j3196K3581m499j9974J9381M911k2749J1817J2402k1071L779J6278j6773
742f047k370J7452j2427o414J7745q955j0202J8380m907j5377J8034J439k0438
755a4087J4560R693k2874P383J7459k0832j754K2102j4850j0316K2857o694j6681
768a4034J9531J680j9574J3505Q264j9240P328J2321j7310K410J5064j5193k393
781g641J8088j2366q255K0107p136j4767J9294M77k0017J4835Q917k1853P559
794b758J5629j9523q35J9612j4261q288K0289p071j3929J7707N3j6678J3103N667
808H717j6966Q317R363j6374M260J2617j5343k34J6385j3196o457J9231q078j3260
$$ plain form
716 6902 -10411 3828 9441 -10500 375 12270 -9199 -4786 14043 -5459 -9792 13431 66
729 66 -13130 10451 5952 -14022 5359 10270 -12479 -662 11740 -9331 -5552 10726 -6047
742 -6047 -8417 9035 -3392 -9806 7939 -1016 -11218 7162 2255 -13122 4912 6351 -14087
755 -14087 473 10166 -12708 -5325 12134 -8698 -10452 11650 -3200 -13516 9341 2647 -14034
768 -14034 5497 7177 -12397 1108 9372 -9868 -2540 9781 -7529 -5119 9945 -5248 -7641
781 -7641 10447 -1919 -10174 9933 2797 -11970 7324 7801 -12216 2619 11536 -10317 -2758
794 -2758 12871 -6652 -7487 12125 -2136 -10424 9865 2794 -11135 6572 6625 -10053 3050 8717
808 8717 -8249 68 9431 -6943 -2683 9934 -5409 -5643 10742 -2454 -8911 10320 2242 -11018
822a1018J8819m66j8480J4548P404j9915P609J3455j7731J20J6714j2958o313
835h212J7028p074j0355J5024k013j2403J2427J662j3680J0140N142j5124P138
848c00R910j6158K096J4957j3818m923J7776q284j1338J6817j321j5136J2789
861C067N020j6052P469R594j4765K042J2366j1890k596J3416q440o053J3315n053
875A440q920J3178j823j2011J2176K771j5116Q989Q649j6183L356J3696j3820
888c618l486J6107q619r087J5322k825j2382J2427K361j3783Q522O642j3694M331
902a782R729j2242J46J1679r942l518J2948p205p359J3568l292j1409J2476K238
916F035j4509Q843P910j4861L149J2016j2263k486J3711q211o946J3320l521j0035
$$ plain form
822 -11018 7801 7335 -11145 3403 10807 -9108 -1499 11956 -5775 -5655 11059 -1899 -8212
835 -8212 8816 1742 -8613 6411 4398 -8005 4422 6084 -7596 2544 7686 -7438 -300
848 -300 9610 -6548 -4452 10505 -3313 -8236 9540 1256 -10082 6735 5414 -9722 3067
861 3067 8087 -7965 -496 9098 -5667 -3625 8741 -3149 -5745 7671 -769 -6822 6493 1440
875 1440 -7480 5698 3875 -8136 4040 6811 -8305 684 9333 -6850 -3494 10202 -3618
888 -3618 -7104 9003 384 -8703 6619 3794 -8588 3839 6200 -7583 939 7581 -6113 -1782
902 -1782 7947 -4295 -4149 7530 -2412 -5930 7018 -187 -7546 6022 2730 -8679 3797 6035
916 6035 -8474 369 8279 -6582 -3433 8583 -3680 -6166 7545 -666 -7612 5708 2187 -7848
930g848J1461R75j1832Q479M838j2049M918P631j1037J520R597r785j563J1287
944F592p804n457J2610m205r740J1944R36j2570Q447O029j2696L736R313j0806
958c671p98J0871p748m452J0920m348p032R810j063q546Q124J631r286O273M132
973D817r993M145P001j0203P18J0042q639l696J1594m915p810J0840m31j0067
987f597Q071L490j0357M658O280r456J491P936p855j410Q953o075l823R209l823
1002F92o165R066j176q442Q260K116j0325N857O193j0880J953R433r016k600J0651
1017E617n470o193J0001j766q136Q066J453q970N951M026r138L509O275q702Q25
1032b652Q116p374k279R399n161n293R473k093p941Q431J553r726O043N133r928
$$ plain form
930 -7848 3613 4588 -7244 1235 6073 -5976 -1058 6573 -4464 -2944 6653 -3132 -4695 6592
944 6592 -1212 -6669 5941 1736 -8004 3940 4876 -7694 753 6782 -5914 -2178 7135 -3671
958 -3671 -4469 6402 -1346 -5798 5122 774 -6258 3552 2489 -6057 2067 3698 -5588 685 4817
973 4817 -5176 -1031 5970 -4233 -3515 6527 -2112 -5808 5786 871 -6939 3901 3470 -6597
987 -6597 1474 4964 -5393 -735 5545 -3911 -2420 5516 -2339 -3749 5204 -871 -4694 4515 692
1002 692 -5473 3593 2417 -6025 2235 4351 -5974 -117 6076 -4804 -2851 6582 -2434 -5034 5617
1017 5617 147 -6046 3955 2189 -5947 2119 3572 -5398 553 4579 -4559 -1050 5225 -3477 -2652
1032 -2652 5464 -1910 -4189 5210 49 -5244 4229 2136 -5805 2626 4179 -5547 496 5629 -4299
1047d299K523P856q316j281R093n719m261Q801k803o298P846j83p595O245K433
1062D042q168M163M693q137J952O585p271p48Q095n827l745Q972l246o643Q396
1077C113K03q592O249L583q860L180O104p731K58P185n932k184P502l878m128
1092c928P360k047n685O652J43o938N581K628p881L696N143p865R11P372o585
1107a443k333Q624m277n375Q227j007p289O497K025p884M118M227p423J877N633
1122D197o317k55O619n379k427P439l750m499P645j625o788O968J350q272M992
1137a02M668q610J932P127p382j493Q326m799m285Q058k126o145O722N61p035
1152d583N230K652p198L248M567p169J296O380o387j215P616m625m086P820k118
$$ plain form
1047 -4299 -1776 6080 -2236 -3517 5576 -143 -4404 4397 1594 -4704 3142 2959 -4636 1609 4042
1062 4042 -4126 37 4730 -3407 -1455 5130 -2141 -2889 5206 -621 -4366 4606 1360 -5283 3113
1077 3113 3316 -5276 973 4556 -4304 -1124 4980 -2751 -2493 4692 -1240 -3424 4078 200 -3928
1092 -3928 3432 1385 -4300 2352 2495 -4443 1138 3766 -4115 -419 4724 -3141 -2230 5142 -1443
1107 -1443 -3776 4848 571 -4804 3423 2416 -4873 1624 3649 -4235 -117 4110 -3313 -1436 4197
1122 4197 -2120 -2375 4244 -1135 -3562 3877 127 -4372 3273 1648 -5140 1828 3178 -5094 -102
1137 -102 4566 -4044 -2112 5015 -2367 -3860 4466 -333 -4618 3440 1314 -4831 1891 2452 -4583
1152 -4583 647 3299 -3899 -651 3916 -3253 -1957 4423 -1964 -3179 4437 -188 -4274 3546 1428
1167A428o191P040R86p737M867L677p734K439N915o843l83P042n040k979P185
1182C672k750m730O546m83n974N100J533o487L844L482o619J944N079o199k43
1197b285O507m852k784P131k800n035O600k88o416N279K298p007L052M393o476
1212b683O66N832n076j538O175l483l215N958j876m411N624q9n768M744J861o451
1228c730L296M119o471R99N817n590j590O861l688l918O796j350n614N577J095
1243B609o330L769L332o120J798M472n490J17N377m469j569N987l368l510O352
1258B957j470n389N744J020o539L932L513o659J530N444n573q59O134l962k909
1273c086O033j808m501N369J45n409M053J963n658K619L603n474Q87M820m853
$$ plain form
1167 1428 -4763 2277 3263 -4474 393 4070 -3664 -1225 4690 -2153 -2536 4506 -534 -3513 3672
1182 3672 922 -3808 2738 2255 -3719 1381 2914 -3573 271 3753 -2866 -922 4157 -2042 -2285
1197 -2285 4222 -630 -3414 3717 917 -4118 2482 2194 -4222 1057 3355 -3652 -600 3793 -2683
1212 -2683 -2017 3815 -1261 -2799 3376 -107 -3322 2636 760 -3651 1973 1884 -3884 860 2721 -3730
1228 -3730 -434 3685 -2786 -1787 4030 -1560 -3150 3711 23 -3895 2901 1551 -4063 1514 2609
1243 2609 -3721 48 3380 -2740 -942 3530 -1960 -1843 3534 -935 -2504 3483 115 -3395 2957
1258 2957 1487 -3902 1842 2862 -3677 255 3768 -2891 -1361 4083 -1490 -2349 3785 -177 -3086
1273 -3086 2947 1139 -3362 2007 2152 -3257 796 2759 -2899 -280 3323 -2151 -1264 3556 -1297
1288a297j068N763l389l115N836j423m787M984P95n541L560K676n584J631M239
1303C280m941k75M959l617k042N278k081l585M794m18m351L937J132m842K828
1318E6K462m923J524L758m489k73M778l524k104N225k054l543M821k69m510L773
1334G08J508m998K487K987m756P60M159m001q42M503k746k130M416j457l245M221
1350A574k90m074L578J291m666K412K870m718P99M186m025j029M801k707k615
1365b613M752j124l719L933O03m394K863J997m367J503L121m068L21L759l391
1380h24j063M342k405k554M514j029l795L985P91m687K794K434m614J168L589
1395B646l917m20M099k808j765M217j598k861L776k13l653L206J014m007K146
$$ plain form
1288 -1297 -2365 3398 9 -3106 2730 1307 -3480 1504 2299 -3242 318 2994 -2590 -959 3280
1303 3280 -1661 -1936 3023 -594 -2636 2642 561 -3024 1770 1352 -2999 938 2070 -2772 56
1318 56 2518 -2405 -881 2877 -1612 -1885 2893 -631 -2735 2490 436 -3107 1714 1445 -3065 708
1334 708 2216 -2782 -295 2692 -2064 -1304 2855 -1146 -1988 2515 -231 -2361 2055 598 -2647 1574
1350 1574 1284 -2790 788 2079 -2587 -175 2695 -2023 -1224 2962 -1063 -2092 2709 2 -2613
1365 -2613 2139 1015 -2704 1229 1832 -2562 301 2298 -2069 -566 2555 -1513 -1192 2567 -824
1380 -824 -1887 2455 50 -2504 2010 981 -2814 1171 1962 -2725 69 2503 -2111 -943 2646
1395 2646 -1271 -1691 2408 -400 -2165 2052 454 -2407 1369 1156 -2497 709 1723 -2284 -138
1410a38K279m014J006L296l687m38M073k709j941M204j180l315L708L47l858K754
1426C87J637l968J534K602l478K21L340k919r47L655j988k016L578q13k930L218
1442A113K90l513K599J449l680J466K541l511K37L348k910j044L721j979k171
1457b044L620o19l094L043N96l443K096J737l502R97K672l052j65L214k474j245
1473a663L393j623k091L358o38k914L047N62l549K232J868l730R55L022l323m65
1489a559L612k369j659L630j187k693L208J12l113K426J161l354J543K054l270
1504a458O74K844k966m34L365k273j672L619j068k835L292L25l572K427J721l660
1520a671J155K729l279q3L207k441j199L296j449k046L041l69k822K693N95l091
$$ plain form
1410 -138 2141 -1873 -867 2429 -1258 -1696 2377 -332 -2273 1931 751 -2564 1144 1491 -2367 387
1426 387 2024 -1944 -410 2192 -1286 -1065 2275 -644 -1591 2064 76 -1940 1638 825 -2105 1113
1442 1113 1403 -2110 489 1938 -1742 -276 2265 -1246 -1009 2339 -571 -1615 2106 127 -2044
1457 -2044 1576 957 -2137 906 1502 -1941 155 1892 -1610 -613 2059 -993 -1158 2056 -418 -1663
1473 -1663 1730 107 -1984 1374 736 -2178 869 1431 -2118 114 1982 -1748 -793 2229 -1094 -1559
1489 -1559 2053 -316 -1975 1655 468 -2225 983 1095 -2018 408 1569 -1785 -242 1812 -1458
1504 -1458 -784 2060 -906 -1340 2025 -248 -1920 1699 631 -2204 1088 1413 -2159 268 1989 -1671
1520 -1671 -516 2213 -1066 -1149 2058 -383 -1582 1714 265 -1781 1260 891 -1931 762 1357 -1734
1536a734J948J568l256J006K522l069j70L121k215j418L350j189k439L024N3k971
1552a869K413R94l095J374J953k925M92K596k476o15K880j731j547K963r35k139
1568a667K695J51k824K152J005k990J363K012k893L20K612k490o56K989j699j581
1584a501K947p07k476K580M10k914J913J420l015R60K089k632jK537k016r52K825
1601A467j421j719K766m60k491K517M62k888J825J517l054Q22K449k711l81L028
1617A728j995j445K997q90k244K676J25k687K007R81k697J211J732k716N17K336
1633A636k349m61K798j825j379K864p97k295K621K62k840K002J241k882R63K051
1649A610k547r6K610j978q63K542j201j531K388m22k084K139L06k382J634J125
$$ plain form
1536 -1734 214 1782 -1474 -468 2054 -1015 -1185 1936 -279 -1697 1653 464 -1975 1049 1102 -1869
1552 -1869 544 1538 -1557 -183 1770 -1155 -663 1933 -543 -1158 1722 -9 -1556 1407 472 -1667
1568 -1667 1028 1179 -1645 507 1512 -1478 -115 1897 -996 -676 1936 -554 -1210 1779 80 -1501
1584 -1501 1446 739 -1737 843 1253 -1661 252 1672 -1343 -383 1706 -926 -927 1610 -406 -1358 1467
1601 1467 46 -1673 1093 633 -1858 659 1121 -1767 58 1575 -1479 -657 1792 -919 -1300 1728
1617 1728 -267 -1712 1285 395 -1849 827 952 -1735 272 1253 -1444 -233 1499 -1217 -700 1636
1633 1636 -713 -1174 1624 -201 -1580 1284 487 -1808 813 1075 -1765 237 1478 -1404 -441 1610
1649 1610 -937 -1033 1577 -401 -1264 1278 77 -1454 934 512 -1572 567 873 -1509 125 1250
1665A250k554Q39J948k394JK425j867j056K664j051j739K347j38k137J837O86
1681A061k351J231J292k277N32J932k054l35K326j495j054K407r44j624K206j04
1697G49k142J846P02k354J138J468k255L57J941j959m00K319j474j151K387p23
1713D49j782K136N6k195J616R35k347R15J622k215K10K003j818n78K266j248j258
1730a233K265n55j852K049K15k251J505J024k344Q28J730k178j0K218j709q46
1746a144K303r69j567K183k11j952J786N39k168J218J167k158N90J656j856k12
1762g95K047j502q96K229q37j566K063l2k014J615P27k113R55J350k046K67J751
1779A203j631l65J889j121r98J935n71j463J751P4j831J432O82j966Q93J292j856
$$ plain form
1665 1250 -1304 -465 1483 -911 -910 1515 -352 -1408 1256 205 -1534 813 675 -1462 375 1061
1681 1061 -1290 -59 1233 -1044 -512 1420 -634 -969 1357 -138 -1192 1215 271 -1353 853 749
1697 749 -1393 453 1155 -1199 -61 1407 -848 -491 1450 -509 -909 1410 -64 -1215 1172 449
1713 449 -1333 803 859 -1336 280 1215 -1132 -217 1405 -810 -600 1403 -415 -993 1273 25 -1233
1730 -1233 1032 477 -1375 674 889 -1362 143 1167 -1177 -349 1381 -797 -807 1411 -298 -1144
1746 -1144 1159 190 -1377 806 595 -1357 429 968 -1200 18 1185 -973 -383 1273 -583 -795
1762 -795 1252 -250 -1146 1083 246 -1320 743 711 -1303 312 1039 -1074 -119 1231 -815 -548 1203
1779 1203 -428 -793 1096 -25 -1023 912 341 -1122 629 703 -1128 304 986 -980 -87 1205 -651
1796f51J11J765j570n55K012j000j111J883l66j524J562K05j757J193P83j795
1812h15O63J263j702M7J697j394n88J887r67j153J847k75j632J601L26j812J092
1829H5R23j892N56J412j673j04J791j376p03J925q65j208J792j58j647J444M92
1846G94j834R74J065j831L93J519j646k24J875j296p85J881o47j400J719K4j727
1863a146J401O12j870Q23J270j839J84J651j424n93J865q91j145J814l10j454
1879a052J460K24j628J095P81j731O25J292j687Q8J597j319n64J748p93j191J748
1896F93j47j576J385M39j695Q48J058j637K42J347j259l48J588j079o47J561n82
1913A91j120J484j04j446J262M50j572P75J021j629K47J367j296l97J595r08p55
$$ plain form
1796 -651 -540 1225 -345 -900 1112 112 -999 884 518 -1006 556 761 -996 197 980 -815
1812 -815 -152 1111 -591 -544 1153 -241 -829 1058 91 -1062 785 510 -1122 479 805 -1007 85
1829 85 1008 -884 -328 1084 -589 -693 1098 -278 -981 944 79 -1129 663 505 -1142 302 794
1846 794 -1040 -66 999 -832 -439 1080 -566 -790 1085 -211 -996 885 238 -1162 557 581 -1146
1863 -1146 255 867 -1003 -180 1090 -749 -565 1086 -338 -931 934 43 -1102 712 402 -1052
1879 -1052 408 632 -996 99 880 -851 -226 1066 -621 -533 1064 -255 -819 929 136 -1055 693
1896 693 546 -1030 355 794 -901 -53 1005 -632 -390 957 -302 -650 938 -141 -788 773 191
1913 191 -929 555 451 -995 267 717 -855 -80 941 -688 -441 926 -370 -767 828 -80 -835
1930h35J558m97j172J352Q2j529J116O17j515N73J068j435J75J311j257k73J518
1947H57r55q23J499l05j299J389K31j547J042O43j531O19J132j476N4J424j166
1964b12m69J556q20r37J577k86j328J274L72j499Q42P91j514M34J233j435p9J518
1982A018j133n88J509o18r95J340l3j393J156M39j543Q17Q98j491K22J411j248
1999b32m26J532q39q77J480k61j218J170J95j306Q74O00j375M85J009j325O8J298
2017H52j153m09J524p68q29J339k46j184J193L40j427P65P76j407L81J077j154
2034c30j47J240r24m38J288o34p26J155j54j102J096K06j311Q30P12j311L08J056
2052H14j098j80J261q92n10J245m84q37J095J2j167R65L70j237O23P44j273K43
$$ plain form
1930 -835 723 226 -946 406 488 -1041 75 692 -823 -250 818 -617 -442 869 -388 -661 857
1947 857 -98 -921 578 273 -1026 363 594 -953 89 732 -799 -180 952 -524 -470 954 -212
1964 -212 -681 875 55 -882 695 409 -919 355 727 -772 70 861 -653 -219 1014 -421 -500 1018
1982 1018 -115 -703 806 188 -807 533 500 -893 263 702 -841 -24 874 -617 -395 1016 -232
1999 -232 -658 874 35 -842 638 377 -841 329 524 -782 92 692 -683 -198 811 -514 -446 852
2017 852 -301 -710 814 46 -783 556 310 -874 319 659 -768 -3 773 -634 -253 824 -330
2034 -330 -477 763 -161 -599 689 55 -671 484 330 -772 324 530 -781 49 761 -550 -242 814
2052 814 -284 -464 797 -95 -605 640 156 -681 414 426 -741 224 594 -643 -20 724 -549 -306
2070c06J064j063j47J225q22n68J259m79q89J158O1j189P74N76j289N42Q78j225
2088d40J56J033j060k37J263p26p04J258k83j071J116J84j269P78P34j334L83
2105b19R30j164m0J233r83m16J174m65q30J253j31j121J011K88j239O45P23j194
2123e45K59R43r75j59J134p43o22J234l19q77R99j2r53Q07L56j139N73O66j141
2142e14K49R40r26j78J065o79n69J124k78q58R52Or45O42M48j028M77O90j034
2161d16J11R00r19j69J052n81n64J052l48q14R98M4r70P30L97j088M50Q27j024
2180c32N6R03q07l28J014m90o28J033j99p90P38K75j019O92M24j028L43P37q97
2199c03p5J007p06m32J035m50p44J071o9r81Q29K74j001N26N70j047L04Q21r46
$$ plain form
2070 -306 758 -305 -452 773 -49 -617 642 163 -726 432 493 -696 78 654 -635 -93 785 -440
2088 -440 -284 749 -311 -548 715 -11 -715 543 260 -811 305 489 -780 -2 732 -602 -219
2105 -219 711 -453 -493 740 -243 -659 515 50 -780 473 342 -779 232 520 -719 -74 649 -545
2123 -545 -286 657 -318 -477 657 -86 -708 526 207 -670 329 317 -636 171 527 -612 -39 627 -514
2142 -514 -265 675 -251 -429 636 -43 -612 512 234 -624 328 334 -611 31 479 -549 -72 618 -416
2161 -416 -305 595 -324 -493 559 -22 -586 466 118 -696 302 346 -624 106 503 -585 -135 692 -332
2180 -332 -276 627 -180 -508 506 16 -612 421 222 -568 170 445 -574 118 542 -486 -143 594 -303
2199 -303 -378 629 -77 -509 526 76 -668 403 334 -647 182 456 -545 -19 551 -496 -192 629 -317
2218c17r3J046p47m50J023l09p32R52j9r90P92L69j049M48P13j003N6R05p25l06
2238d36J017n44n06R41k67p87Q64J28r61O34M32r66L27P43q96J5R04p12l56R50
2258E24m62n90R75j92p51P87J64r58N54M63r75L91O25q45j0Q55o53l78R99m34
2278H9o13Q00rq33O78L15q73M10M56q37K11O83p95j3Q36o03l89R38l82o39Q99
2299C29j04p94O78K96r29M26N97q41O9Q79p80k46R34m85n46R36j85p61P72K6p86
2320e15O65K90r70M45O77r52Q7Q70p03l72R67m55n74R29j34p79P15J97r28N57
2340A7M41q85L25O85q74n0Q77o25l82R10l63n70Q01jq89P28K88r59M82N32q79
2361c91J64P41o61j95P72m27m57Q39k67o08P67k1p85N80M22q90K75O68q04kP36
$$ plain form
2218 -317 -410 636 -111 -561 462 153 -579 373 354 -636 156 525 -524 -76 637 -366 -310 595 -130 -436
2238 -436 581 37 -469 472 205 -582 282 410 -551 83 515 -451 -124 619 -277 -262 642 -70 -426 524
2258 524 62 -528 447 255 -496 291 455 -503 51 514 -461 -70 555 -290 -300 555 -98 -476 523 89
2278 89 -524 276 267 -566 112 427 -446 -36 420 -417 -206 477 -318 -331 505 -98 -487 451 69 -570 329
2299 329 225 -569 109 405 -524 -98 499 -342 -273 606 -174 -420 514 29 -517 419 234 -527 245 271 -515
2320 -515 150 440 -530 -85 592 -360 -273 597 -106 -478 489 34 -540 389 255 -524 191 388 -540 17
2340 17 458 -427 -102 583 -291 -341 536 -89 -471 439 76 -494 307 306 -583 145 433 -526 -44 488 -391
2361 -391 -227 514 -147 -342 430 3 -454 385 118 -490 277 256 -529 51 473 -417 -142 526 -278 -280 456
2382D56o22k07Q33m38n15Q32j66o72O50J57p86N06L50p27J94N88o71rP29n81l35
2403d34Q25l38n21P82j29o39O19J99q27M64M54q33K78N81p31L2O98n41l33Q38
2423D44l74n25P81n8p38O95J37q24M79M16p96J68O61o79j29P89n02l19P60k69
2443A17n83P33j4o82N42K90p99L43N29p70J33O99o81j76P72m24m71P45j43o14
2463d54O32R8p15N00L49p87L15N36o97p9Q16o16k83P66l01n83P28M2p79O85J42
2484C15p23L22M77o70P7O17n51j66O46l58l60O56k30l74N26N2o73M49L58p22L11
2505b1M55o64K1N68m64k06P09l23m00O32j59m59N22O6o52M30K79o26K39N08o45
2526a90M1N96n71j67O50l08m01O22p2n39M98J31o46L62L29o39K11M64n49o1O08
$$ plain form
2382 456 -166 -373 460 22 -493 339 173 -499 151 308 -478 28 378 -349 -155 433 -238 -247 482 -99 -434
2403 -434 391 53 -468 314 185 -454 165 364 -463 1 455 -378 -100 481 -250 -218 480 -61 -394 444
2423 444 70 -455 326 268 -470 225 362 -462 17 433 -363 -195 466 -213 -342 447 -55 -374 386 117
2443 117 -466 267 253 -429 113 403 -396 -53 476 -294 -161 538 -143 -319 453 29 -442 303 160 -454
2463 -454 178 276 -439 61 410 -377 -62 474 -223 -302 514 -102 -385 381 80 -503 225 267 -512 173 315
2484 315 -408 -86 391 -279 -202 415 -136 -302 344 -14 -374 282 52 -322 204 256 -417 32 390 -332 -21
2505 -21 434 -230 -209 359 -105 -311 398 75 -325 307 148 -311 211 277 -375 55 334 -292 -53 455 -190
2526 -190 -149 447 -124 -291 359 51 -350 272 200 -339 159 290 -356 6 335 -304 -93 371 -178 -239 369
2547C69l93k93O75l72l92O76j31o16O05J80p07L66L46o41J51N51n92rN91m25k97
2568c58O86l11l55N54j4o09M96K50p46L55M15o23N2O56n75k07P08l62m05O27j14
2589A20n07N55J03n66L19L02o02K22M35n59M1N42n37j98O20k28m37O52r1n99N06
2610I3J89o06L19K87n62J73M66n17m2N70m05k96N96k06m74N67k7m44M13J66o47
2631c87L37L96o04R7N01m74j22N22k66l22N99j87m35N69k3m63L60J53n65L10L42
2652C38n81M1N39m78j15N83l40l24N46j29m45M97O6m88L66K09n64J70L87m47k6
2673a95N01m09j32O03l54l80O39p3n77N18Q7n56L13L18n18O4M66m32j28N92m02
2694e5k47N39j60m34N47o7m66M86J22n55K35M22n84O7N06m60j18N28k47m22O41
$$ plain form
2547 369 -24 -317 358 -14 -406 270 139 -477 128 308 -399 -33 313 -328 -177 374 -218 -227 364 -61 -358
2568 -358 328 17 -338 216 202 -407 89 339 -407 -52 363 -260 -208 448 -127 -334 374 12 -393 234 120
2589 120 -387 168 271 -295 24 326 -276 -54 381 -178 -137 405 -132 -330 290 62 -375 277 186 -413 93
2610 93 282 -324 -5 282 -280 -107 359 -158 -200 370 -35 -331 265 59 -415 152 125 -319 94 260 -387
2631 -387 -50 346 -258 -161 340 -134 -256 266 0 -322 277 90 -345 224 201 -262 98 251 -314 -4 338
2652 338 -243 -202 337 -141 -256 327 -13 -337 209 80 -365 132 198 -290 76 285 -279 -109 278 -169 -195
2673 -195 306 -103 -235 368 14 -366 273 200 -377 141 228 -328 -15 303 -215 -151 315 -117 -245 347 -55
2694 -55 -302 237 77 -357 190 123 -343 143 265 -290 -55 367 -217 -150 356 -104 -222 306 59 -363 278
2715B78j89m00M33J01n58M07K26n94K30M23n72O3M58m55j29N92l14k97N27k6n24
2736c20M69J38n83K94K70m37N6L77m14KM80m20j63M81j87l72M87%l91K69K19n35
2758b80K56L24m86O3M20l96j08N41l35k30M36j33l53L82j4l40L81P7m73K23L23
2779B78n06J29L84m24n8M76l39k26N07j10m16L88J49n07L60J11l93K52K80n03
2799a68M3M38l56j39M11j83l23M68q4m14M21J43o11L15L45n35J45L73m15j16M88
2820B46k56k50M72k08l66N70j19m03L68J68m65K04L13n04J07M55m32q9M88j97
2840A02l76M85j20l46L88O3m68K83K84m96Q0L54l81JL84m14m6M35j74k62L64m3
2862I7m08L83J35m18J95K35l56K9L29k31j34L33k66j64M06j13k81L77k7l81L67
$$ plain form
2715 278 89 -311 122 223 -335 72 298 -296 -66 357 -215 -152 306 -149 -278 314 0 -297 230 204 -320
2736 -320 149 287 -296 -2 268 -169 -113 264 -150 -148 332 -88 -251 230 43 -329 158 158 -233 36 255 -280
2758 -280 -24 300 -186 -123 297 -99 -207 334 -1 -231 205 72 -281 101 87 -253 128 205 -268 -45 278
2779 278 -228 -99 285 -139 -197 279 -60 -286 221 111 -305 83 232 -275 85 196 -197 55 335 -168
2799 -168 -125 313 -43 -182 229 46 -277 191 107 -307 114 257 -354 -39 306 -229 -84 289 -126 -242 246
2820 246 -10 -260 212 4 -362 208 89 -314 54 222 -243 -39 274 -230 -123 332 -100 -189 299 102
2840 102 -274 211 91 -255 133 196 -272 11 295 -201 -121 233 -148 -147 237 -177 -223 212 38 -224 140 97
2862 97 -311 72 207 -211 -16 219 -137 -108 221 -10 -144 189 -77 -241 165 52 -229 148 121 -260 107
2883A07J18m50J85K91l71L7L58l23j26M52l03k47M85j37l37M27o0l40K66J91m37
2904b14J51K95m06L7L61l36j29M40k06k42L87m3l57L39Q9m12K73K48n11J88L06
2925B58m32O3L91l45j43M03j17l80M96n2m26L33J63m28K10K26l96K5M54m44o7
2946b08M26k41j86M13r8l05L41j8l95L41J34m73K14L20m05L6M09l39j97M50j77
2967D2k53M01l0l51K91M6l46J82J59l05J44K36k98MK96k61n9L46j90k58M05j30
2989G1k86K43J34l43K12J54l34O5L16k95m0L03k27j47K99j56j93L80j01k86K95
3010F4J38m26K20J87l44N1L28k99n7L21k13j68L58j03l16L28L3l33K73J10l30
3031a78J39K28l67P8L19l01j6K95k27j87L92j01l34L73M9m08K99J72l26Q5K19
$$ plain form
2883 107 225 -225 -40 251 -120 -83 275 -48 -174 278 -25 -272 213 76 -261 166 106 -234 32 223 -214
2904 -214 -63 232 -174 -137 224 -112 -241 199 -7 -249 138 95 -262 77 166 -246 27 275 -236 -48 258
2925 258 -174 -111 280 -65 -208 195 78 -302 194 142 -284 49 212 -216 -6 220 -176 -151 303 -141 -208
2946 -208 218 -23 -209 204 106 -199 142 124 -271 70 204 -269 -55 265 -140 -104 305 -34 -231 219 42
2967 42 -211 190 160 -191 100 146 -200 -18 141 -164 -20 216 -82 -78 218 -43 -102 244 54 -204 201 71
2989 71 -215 28 162 -181 31 185 -149 -84 232 -63 -103 200 -27 -174 125 -31 -224 156 55 -231 64
3010 64 202 -224 -4 183 -161 -110 218 -81 -138 183 -30 -198 160 57 -259 69 102 -231 42 152 -178
3031 -178 -39 189 -178 -100 219 -82 -98 197 -30 -217 175 74 -260 113 162 -246 53 225 -101 -16 203
3052B03k87o7L62l08q2L35j04k77M11p1l75K77Q3l23K25J90l24M3L16l09q6L68
3074B00k20j38L07o7l00K93N7l62K59J64l83J33K84l51qL72k79j48M09j60k36
3095a74K96o3k08K20P5l76K61J38l10J33K09l52J9L36k82j29L79j11k97L52k4
3116I2k76K26J02k75J49J57l42Q4K35k35o6L59k43j22L37j50k07L03o9k11K31
3137G9O2l11J97J73l28J16K43k65j13L10r0k35L20j20k51L41L4l44K71L9k74J24
3159b2K23l36Q6K71l09k6K90j55k72M69j41k47K70M0l54K13J92k94J4K68k69j9
3181a08K63j77j32L73k15k06L09j7k79K07J76l72R9K46l23K8L15k43m8K36j13
3202A9k02L09r0j80K67n3k31J84J04k73J25K56l68LK68k02j06L36j31k51L22n1
$$ plain form
3052 203 -84 -151 211 -97 -179 156 52 -225 186 115 -260 17 100 -223 2 192 -132 -89 227 -82 -168 200
3074 200 -20 -158 149 82 -218 75 132 -230 29 193 -190 -57 227 -124 -132 240 -39 -187 222 62 -174
3095 -174 122 59 -149 71 146 -230 31 169 -141 -8 201 -151 -132 204 -78 -207 172 61 -236 116 92
3116 92 -184 42 144 -131 18 175 -167 -83 152 -83 -149 210 -33 -155 182 32 -175 128 59 -152 79
3137 79 141 -170 27 200 -128 -12 231 -34 -147 163 73 -162 158 38 -213 128 162 -182 89 128 -146 -22
3159 -22 201 -135 -49 222 -87 -113 177 22 -250 219 78 -169 101 141 -213 0 192 -102 -88 180 -89 -108
3181 -108 155 -22 -154 219 4 -202 107 90 -189 18 194 -178 -79 167 -156 -128 187 -56 -104 132 19
3202 19 -183 126 36 -144 123 70 -161 23 127 -146 -21 235 -133 -130 138 -64 -170 166 35 -216 106 55
3224E5j94J90O7k55J33J77l19J21J82k61J0L21l01p0K79j43j85K98Lk83J92J27
3246A44l04J71J32j70KJ85j63j11L07k20q6K48j50j17K71l5k55J70J11k74J67
3267B3J40l42P7K74k32k1K61k03k24L30n0k11K61J2l40K82Q3k72J21J94k91J2
3289a16K44j97j41L07j26j62K98p9k75L32K2l11K03J80k91J28J58k55l0L00j85
3310Dj47L29j79j74L18r0k86K93O0k77J35K26l01J0K70k67j1K35j44j46K87j42
3332Cj68K86J8k88J46J32k83J91J42k86K6K48k15l2K07j17j10K16p9j04J50l5
$$ plain form
3224 55 -139 51 118 -137 -4 173 -146 -25 157 -104 -94 227 -74 -144 135 -8 -193 105 108 -175 17 144
3246 144 -160 11 143 -27 -25 160 -3 -114 193 -27 -113 135 -15 -132 139 104 -151 19 130 -144 23
3267 23 163 -179 -102 172 -60 -81 180 -23 -247 83 33 -178 83 95 -245 37 120 -152 -31 163 -128 -116
3289 -116 128 -69 -210 97 -29 -191 107 28 -247 85 107 -204 -1 179 -112 16 174 -81 -111 189 4
3310 4 -143 186 7 -167 151 61 -225 68 128 -149 -14 212 -89 -79 191 -76 -87 148 4 -142 145 3
3332 3 -165 121 139 -149 -3 129 -154 37 179 -107 -81 167 -48 -80 127 10 -100 116 37 -67 83 48
$$ [...]
8191E6
##END NTUPLES=NMR FID
##END=
