##TITLE=1H_MTBDP-3-2907
 CDCl3, 8 sc, 
 30.07.2021
##JCAMPDX= 6.0         $$ Bruker NMR JCAMP-DX V2.0
##DATA TYPE= NMR FID
##DATA CLASS= NTUPLES
##ORIGIN= UXNMR, Bruker Analytische Messtechnik GmbH
##OWNER= root
$$ XWIN-NMR		Version 3.5
$$ Fri Jul 30 08:38:14 2021 Russian Standard Time (UT+4h)  she@DPX200
##.OBSERVE FREQUENCY= 200.131506
##.OBSERVE NUCLEUS= ^1H
##.DELAY= (6, 6)
##.ACQUISITION MODE= SIMULTANEOUS
##.ACQUISITION SCHEME= undefined
##.AVERAGES= 8
##.DIGITISER RES= 18
##SPECTROMETER/DATA SYSTEM= spect
##.PULSE SEQUENCE= zg30
##.SOLVENT NAME= CDCl3
##.SHIFT REFERENCE= (INTERNAL, CDCl3, 0, 15.7039)
##AUDIT TRAIL= $$ (NUMBER, WHEN, WHO, WHERE, WHAT)
$$ ##TITLE= Audit trail, XWIN-NMR		Version 3.5
$$ ##JCAMPDX= 5.01
$$ ##ORIGIN= Bruker BioSpin GmbH
$$ ##OWNER= she
$$ F:/spectra/data/she/nmr/H-F/1/audita.txt
$$ ##AUDIT TRAIL=  $$ (NUMBER, WHEN, WHO, WHERE, WHAT)
(   1,<2021-07-30 08:36:43.67 +0400>,<she>,<DPX200>,
      <created by zg, POWCHK disabled, PULCHK disabled
       configuration hash MD5:
       00 E9 B6 7A A2 85 ED C7 34 08 36 98 17 FE 4E 26
       data hash MD5: 16K
       B8 BF 75 39 76 F4 D9 71 E8 00 65 95 AD 9F 7E 91>)
$$ ##END=
$$ 
$$ hash MD5
$$ C2 F0 40 B7 24 FC 79 2E 91 7B 2D FC 3A 7B 50 5B
##$RELAX= 
##$RELAX= 
##$RELAX= 
##$RELAX= 
##$RELAX= 
##$RELAX= 
$$ Bruker specific parameters
$$ --------------------------
##$DU= <F:/spectra>
##$EXPNO= 1
##$NAME= <H-F>
##$PROCNO= 1
##$TYPE= <nmr>
##$USER= <she>
##$AMP= (0..31)
100 100 100 100 100 100 100 100 100 100 100 100 100 100 100 100 100 100 
100 100 100 100 100 100 100 100 100 100 100 100 100 100 
##$AQSEQ= 0
##$AQ_mod= 1
##$AUNM= <au_zg>
##$AUTOPOS= <>
##$BF1= 200.13
##$BF2= 200.13
##$BF3= 200.13
##$BF4= 200.13
##$BF5= 200.13
##$BF6= 200.13
##$BF7= 200.13
##$BF8= 200.13
##$BYTORDA= 1
##$CFDGTYP= 0
##$CFRGTYP= 5
##$CHEMSTR= <none>
##$CNST= (0..31)
1 1 145 1 1 1 1 1 1 1 1 1 1 1 1 1 1 1 1 1 1 1 1 1 1 1 1 1 1 1 1 1 
##$CPDPRG= <>
##$CPDPRG1= <>
##$CPDPRG2= <>
##$CPDPRG3= <>
##$CPDPRG4= <mlev>
##$CPDPRG5= <mlev>
##$CPDPRG6= <mlev>
##$CPDPRG7= <mlev>
##$CPDPRG8= <mlev>
##$CPDPRGB= <>
##$CPDPRGT= <>
##$D= (0..31)
0 1.2 0 0 0 0 0 0 0 0.06 0 0.03 0 0 0 0 0.0002 0 0 0 0 0 0 0 0 0 0 0 0 
0 0 0 
##$DATE= 1627619803
##$DBL= (0..7)
120 120 120 120 120 120 120 120 
##$DBP= (0..7)
150 150 150 150 150 150 150 150 
##$DBP07= 0
##$DBPNAM0= <>
##$DBPNAM1= <>
##$DBPNAM2= <>
##$DBPNAM3= <>
##$DBPNAM4= <>
##$DBPNAM5= <>
##$DBPNAM6= <>
##$DBPNAM7= <>
##$DBPOAL= (0..7)
0.5 0.5 0.5 0.5 0.5 0.5 0.5 0.5 
##$DBPOFFS= (0..7)
0 0 0 0 0 0 0 0 
##$DE= 6
##$DECBNUC= <off>
##$DECIM= 32
##$DECNUC= <off>
##$DECSTAT= 4
##$DIGMOD= 1
##$DIGTYP= 9
##$DL= (0..7)
0 120 120 120 120 120 120 120 
##$DP= (0..7)
150 150 150 150 150 150 150 150 
##$DP07= 0
##$DPNAME0= <>
##$DPNAME1= <>
##$DPNAME2= <>
##$DPNAME3= <>
##$DPNAME4= <>
##$DPNAME5= <>
##$DPNAME6= <>
##$DPNAME7= <>
##$DPOAL= (0..7)
0.5 0.5 0.5 0.5 0.5 0.5 0.5 0.5 
##$DPOFFS= (0..7)
0 0 0 0 0 0 0 0 
##$DQDMODE= 0
##$DR= 18
##$DS= 0
##$DSLIST= <SSSSSSSSSSSSSSS>
$$ [...]
##$SUBNAM2= <"">
##$SUBNAM3= <"">
##$SUBNAM4= <"">
##$SUBNAM5= <"">
##$SUBNAM6= <"">
##$SUBNAM7= <"">
##$SUBNAM8= <"">
##$SUBNAM9= <"">
##$SW= 20.0188882624521
##$SWIBOX= (0..15)
0 0 2 0 0 0 0 0 0 0 0 0 0 0 0 0 
##$SW_h= 4006.41025641026
##$TD= 16384
##$TD0= 1
##$TE= 0
##$TE2= 300
##$TE3= 300
##$TEG= 300
##$TL= (0..7)
0 120 120 120 120 120 120 120 
##$TP= (0..7)
150 150 150 150 150 150 150 150 
##$TP07= 0
##$TPNAME0= <>
##$TPNAME1= <>
##$TPNAME2= <>
##$TPNAME3= <>
##$TPNAME4= <>
##$TPNAME5= <>
##$TPNAME6= <>
##$TPNAME7= <>
##$TPOAL= (0..7)
0.5 0.5 0.5 0.5 0.5 0.5 0.5 0.5 
##$TPOFFS= (0..7)
0 0 0 0 0 0 0 0 
##$TUNHIN= 0
##$TUNHOUT= 0
##$TUNXOUT= 0
##$USERA1= <user>
##$USERA2= <user>
##$USERA3= <user>
##$USERA4= <user>
##$USERA5= <user>
##$V9= 5
##$VALIST= <valist>
##$VCLIST= <CCCCCCCCCCCCCCC>
##$VD= 0
##$VDLIST= <DDDDDDDDDDDDDDD>
##$VPLIST= <PPPPPPPPPPPPPPP>
##$VTLIST= <TTTTTTTTTTTTTTT>
##$WBST= 1024
##$WBSW= 4
##$XGAIN= (0..3)
0 0 0 0 
##$XL= 0
##$YL= 0
##$YMAX_a= 266710
##$YMIN_a= -318932
##$ZGOPTNS= <>
##$ZL1= 120
##$ZL2= 120
##$ZL3= 120
##$ZL4= 120
##$ABSF1= 10
##$ABSF2= 0
##$ABSG= 5
##$ABSL= 3
##$ALPHA= 0
##$AQORDER= 0
##$ASSFAC= 0
##$ASSFACI= 0
##$ASSFACX= 0
##$ASSWID= 0
##$AUNMP= <proc_1d>
##$AZFE= 0.1
##$AZFW= 0.1
##$BCFW= 1
##$BC_mod= 2
##$BYTORDP= 1
##$COROFFS= 0
##$CY= 11.3945322036743
##$DATMOD= 1
##$DC= 2
##$DFILT= <>
##$DTYPP= 0
##$F1P= 2.36226072786647
##$F2P= -0.459571619588291
##$FCOR= 0.5
##$FTSIZE= 0
##$FT_mod= 4
##$GAMMA= 1
##$GB= 0.15
##$INTBC= 1
##$INTSCL= 1
##$ISEN= 128
##$LB= 0.24
##$LEV0= 0
##$LPBIN= 0
##$MAXI= 10000
##$MC2= 0
##$MEAN= 0
##$ME_mod= 0
##$MI= 1.114404
##$NCOEF= 0
##$NC_proc= 0
##$NLEV= 6
##$NOISF1= 3.799351
##$NOISF2= 2.8
##$NSP= 1
##$NTH_PI= 0
##$NZP= 0
##$OFFSET= 15.70392
##$PC= 1
##$PHC0= -13006.67
##$PHC1= 28.40099
##$PH_mod= 1
##$PKNL= yes
##$PPARMOD= 0
##$PSCAL= 0
##$PSIGN= 0
##$REVERSE= no
##$SF= 200.130013532006
##$SI= 16384
##$SIGF1= 3
##$SIGF2= 2
##$SINO= 400
##$SIOLD= 16384
##$SREGLST= <1H.CDCl3>
##$SSB= 0
##$STSI= 0
##$STSR= 0
##$SW_p= 3612.71676300578
##$SYMM= 0
##$S_DEV= 0
##$TDeff= 0
##$TDoff= 0
##$TI= <>
##$TILT= no
##$TM1= 0
##$TM2= 0
##$TOPLEV= 0
##$USERP1= <user>
##$USERP2= <user>
##$USERP3= <user>
##$USERP4= <user>
##$USERP5= <user>
##$WDW= 1
##$XDIM= 8192
##$YMAX_p= 0
##$YMIN_p= 0
$$ End of Bruker specific parameters
$$ ---------------------------------
##NTUPLES= NMR FID
##VAR_NAME=  TIME,          FID/REAL,        FID/IMAG
##SYMBOL=    X,             R,               I
##VAR_TYPE=  INDEPENDENT,   DEPENDENT,       DEPENDENT
##VAR_FORM=  AFFN,          ASDF,            ASDF
##VAR_DIM=   8192,          8192,            8192
##UNITS=     SECONDS,       ARBITRARY UNITS, ARBITRARY UNITS
##FACTOR=    0.0002496,     1,               1
##FIRST=     0,             0,               0
##LAST=      2.0444736,     0,               0
##MIN=       0,             -318932,         0
##MAX=       2.0444736,     266710,          0
$$ Real data points
##PAGE= N=1
##DATA TABLE= (X++(R..R)), XYDATA
0@%%%%%%%%%%%Qj6J6k4L2l3M1n6P2q1R5j18J36j60J90k21K55k95L41l89M40n01
$$ 0 0 0 0 0 0 0 0 0 0 0 0 8 -8 8 -16 16 -17 24 -32 40 -41 54 -64 72 -88 102 -119 136 -159 182 -207 233 -268
33b68N73o48P28q18R20j031J152j285J429j586J758j948K153k376K623k893L186
$$ -268 305 -343 385 -433 487 -544 608 -677 752 -834 924 -1024 1129 -1247 1376 -1517 1669
50A669l509L868m261M698n189N736o353P058p872Q822r945J1303j2983J5120j7948
$$ 1669 -1840 2028 -2233 2465 -2724 3012 -3341 3717 -4155 4667 -5278 6025 -6958 8162 -9786
65i786K1882k7770L7646n8267J73276k58173j15997N03899k76333k46035L90208
$$ -9786 12096 -15674 21972 -36295 136981 -121192 -237189 266710 -9623 -255658 134550
76A34550M4873l76194K14157J56845l16584O0982K83947k67137q7600L18766j29511
$$ 134550 179423 -196771 17386 174231 -142353 -81371 202576 -64561 -152161 166605 37094
87C7094k44560L11063N4244l38096J50642K31556l19932k8915L45169j79080k28495
$$ 37094 -207466 103597 157841 -180255 -29613 201943 -117989 -146904 198265 19185 -209310
98b09310L31831J5846l47125J93673K26329l32839k5351L37409j71430k15575
$$ -209310 122521 138367 -208758 -15085 211244 -121595 -146946 190463 19033 -196542
108a96542K99254K8588k93900J46851J65294k52394J4967K38101j64898j08128
$$ -196542 102712 131300 -162600 -15749 149545 -102849 -87882 150219 -14679 -122807
118a22807K40337o8679k09599K14479P7982k75703J03815K27723k55828q7216
$$ -122807 117530 48851 -160748 53731 131713 -143990 -40175 187548 -68280 -155496
128a55496L13387r1960k53395K40974J05646k98054P0711K35763k13553q3003
$$ -155496 157891 65931 -187464 53510 159156 -138898 -68187 167576 -45977 -128980
138a28980K65443q9909j99549K15614M8585k46634J11611J70342k15000k0446
$$ -128980 136463 46554 -152995 62619 111204 -135430 -23819 146523 -68477 -88923
148h8923K25310j33132j35950K23708j9863k17618J70940J14813k50607M3787
$$ -88923 136387 3255 -132695 91013 71150 -146468 24472 139285 -111322 -67535
158f7535K31982j90291j23782K63531l4792k37523J78277J24056k45313L2623
$$ -67535 164447 -25844 -149626 113905 79113 -158410 19867 143923 -101390 -68767
168f8767K09795j65138r1277K16882n8255j71147J72847N1234k06649R0553J45856
$$ -68767 141028 -24110 -115387 101495 43240 -127907 44940 96174 -110475 -19922 125934
179A25934j90075j8138K02452j20157j24983K07014p629k06723J40316J21430
$$ 125934 -64141 -82279 120173 16 -124967 82047 74418 -132305 8011 129441
189A29441k19533J1368K12804j39255j23415K10186q678j95736J28515J04864
$$ 129441 -90092 -78724 134080 -5175 -128590 81596 72918 -122818 5697 110561
199A10561j88442K0237J67910j27043p9305J73453l8078j42053J32835M8225j63376
$$ 110561 -77881 -57644 110266 -16777 -96082 77371 39293 -102760 30075 78300 -85076
210h5076O6457J18382j50425k0236J69041q9858j16957J67898J7732j81310R0592
$$ -85076 -18619 99763 -50662 -70898 98143 8285 -108672 59226 76958 -104352 -13760
221a3760J24960j64107k3717J72375q0711j13936J48069J6527j53389Q0981R6191
$$ -13760 111200 -52907 -76624 95751 15040 -98896 49173 65700 -87689 -6708 89483
232H9483j41682j460J40897q9952p8660J40624j6285j27760J00784N7911j40288
$$ 89483 -52199 -53659 87238 -2714 -81374 59250 42965 -84795 15989 73900 -66388
243f6388L8727J18238j20764m1669J54737n9113j24605J40008M0744j66078O1075
$$ -66388 -27661 90577 -30187 -71856 82881 23768 -100837 39171 79915 -86163 -25088
254b5088J28092j37574m2171J58791n7799j17724J29867L1518j44761O3074R7663
$$ -25088 103004 -34570 -76741 82050 24251 -93473 36394 67912 -76849 -13775 83888
265H3888j24993j1408J27449p5958p2240J26641j5795j19203R9345N5500j42428
$$ 83888 -41105 -52513 74936 -1022 -73262 53379 37584 -81619 17726 73226 -69202
276f9202L5851J24570j15830n3560J49786l9293j23304J13676M8643j40919M1927
$$ -69202 -33351 91219 -24611 -78171 71615 32322 -90982 22694 71337 -69582 -27655
287b7655J10934j11940l5865J33204n1743r7844J13314K2954j24140N7449Q3607
$$ -27655 83279 -28661 -64526 68678 16935 -80909 32405 55359 -68781 -11332 72275
298G2275j08951r360J10779o6272o3621J11282j3484j04318Q7024M9854j24135
$$ 72275 -36676 -46036 64743 -1529 -65150 46132 32648 -71670 15354 65208 -58927
309e8927K8046J10312r7183n2107J29398k5195j11854R2770N1422j22232K6182
$$ -58927 -30881 79431 -17752 -69859 59539 34344 -77510 15260 66682 -55550 -29368
320b9368J01526q8653m0722J11580l1282q7428Q6231K7152j01883M2117P2644
$$ -29368 72158 -16495 -57217 54363 23081 -64347 21884 49036 -52847 -10730 61914
331F1914r2172q995J00537n9309o4850J03697o81j05662O7662O5769j08785J118
$$ 61914 -30258 -39253 61284 1975 -62875 40822 40141 -65521 2141 67910 -40875 -39757
343c9757J07559o8853o4316J08303m462j03601P0131N7848j05723Q744R7651p0442
$$ -39757 67802 -1051 -65367 42936 38474 -65127 5004 62852 -42871 -34127 63524 -6918
355f918n1095J01187j4914q7415P1961L6119r5761L0180P4226q2918j8035R9064
$$ -6918 -58013 43174 28260 -59155 12806 48925 -46836 -16656 57570 -25348 -43383 55681
367E5681m8106p1896R6633J2110j08236N5881P4526j02539r828J08619n8723p0153
$$ 55681 7575 -64321 32312 44422 -63814 -7933 66593 -35946 -45774 62845 4122 -66031
379f6031J01366N419j03194N9347O4139r7243n53R3997o0392n0644R0603j2476
$$ -66031 35335 40754 -62440 -3093 61046 -36197 -36750 57247 -3145 -53789 36814 24338
391B4338p8667O7643L1836r0095K9324P2671p9523k2770R7102l8597p3557Q5727
$$ 24338 -54329 13314 45150 -44945 -15621 57050 -22473 -45243 51859 13262 -60295 25432
403B5432K0044r7921M0879P0614q4130j6631R3443m1420o5724Q1969J3416q9297
$$ 25432 45476 -52445 -11566 59048 -25082 -41713 51730 10310 -55414 26555 39971 -49326
415d9326M2306N9931p7577q398P9685m2576m8163P1955k177o9305M9701L5681
$$ -49326 -7020 52911 -24666 -33064 46621 4045 -44118 27837 25660 -43645 6056 41737
427D1737p5540J5634O8301o2180l0882Q3511k1621p1417O6820L1241q6521K1949
$$ 41737 -33803 -18169 50132 -12048 -42930 40581 18960 -52457 14363 45604 -40917 -18968
439a8968P3153o7662l2116Q6062k0482p1082O3148K9292p7673K0558N9574n9162
$$ -18968 54185 -13477 -45593 40469 19987 -51095 12053 41345 -36328 -15770 43804 -15358
451a5358j7699P0480l1541m9140O6730N206p3243M2771M6975p3658j51P4156m6463
$$ -15358 -33057 37423 5882 -43258 23472 28678 -44565 -1794 45181 -28477 -28628 45528 -935
464i35m4410P4480m260p1985N1023L9670p7041J0099P1540n5231l7098P7069j0654
$$ -935 -45345 29135 24875 -47110 3913 43583 -33458 -23359 48181 -7050 -44148 32921 22267
477B2267o8638N2084L4421p0261J1896N8507n0085k2011O3423k3828m5780N7446
$$ 22267 -46371 5713 40134 -30127 -18231 40276 -9809 -31820 31603 7775 -38005 19441
489A9441P124o4539L6477M3152o6722k354P0409m1784m4832P0649J382p1141M1295
$$ 19441 26565 -37974 -1497 41655 -25067 -27421 42988 1204 -43628 27021 28403 -42738 -1443
502a443M4294o6808k397O5113l6460l8103N8017k018n3957L8419K5825n5924J3183
$$ -1443 42851 -23957 -26354 38759 2299 -35804 22213 20195 -33762 4657 30482 -25442 -12259
515a2259M8028m5075j9037N7371j8048m6218M7396J5866n6743K1499M2584m9967
$$ -12259 35769 -9306 -28343 29028 10980 -35238 12158 28024 -28719 -7220 35364 -14603
527a4603j0050N7367k7884m0994N4249R086o0282K6676M4071n2381j3234N7541
$$ -14603 -24653 32714 4830 -36164 18085 27171 -33111 -6435 37636 -14745 -27979 29562
539B9562k0914m0517M3354J0265m5471K0197K7196l9175K467L8645l1044j9478
$$ 29562 8648 -31869 11485 21750 -23721 -3524 23672 -15503 -13036 25609 -5435 -24913
551b4913M7962j1774m4089M0431K0344n4553J2732M7746m1504k2570N5221j1564
$$ -24913 23049 11275 -32814 7617 27961 -26592 -13860 33886 -7618 -30188 25033 13469
563A3469m8179M0537K2492n2843J1511M3789l8369j7229M6773j4124l5390L7386
$$ 13469 -34710 5827 28319 -24524 -13013 30776 -7593 -24822 21951 7827 -27563 9823
575I823R867m3157J9340K9821l9018l188M0361k5220k2545M2317n914l9931L3488
$$ 9823 19690 -23467 -4127 25694 -13324 -16512 23849 -1371 -23916 18401 12487 -27444 6044
588F044K0137m8297Q929M4897l5995k4415N0578m978m5733L0686K4380m2104K901
$$ 6044 26181 -22116 -13187 31710 -4285 -28700 21878 16900 -28833 1853 26233 -15871 -12970
601a2970L6324k5058j6204L3991q671k6646K7663O421l2871J6756K2632l1936
$$ -12970 23354 -1704 -17908 16083 7412 -19234 8429 14850 -18021 -1265 21367 -10569
613a0569k025L3129k0178k0554L3896j128l4445K3849K1159l8729J226L8704k3574
$$ -10569 -12594 20535 357 -20197 13699 12571 -21874 1975 23134 -15595 -14369 24335 761
626G61k5487L7054M363l6792J5683K4142k7957m591K6997j4112j4211K4182m686
$$ 761 -24726 12328 16691 -20101 -4418 19724 -8233 -12824 14173 61 -14150 10032 5346
639E346k0799K0153O503k6565J1575K1298k6329o133L2118j3223k5257K8218Q582
$$ 5346 -15453 4700 11203 -15362 -3787 17511 -8818 -14951 17167 3944 -21313 6905 15487
652A5487l3347J1798K5710k6352r042L0790r872k4280K5206P841k9357J0801K2213
$$ 15487 -17860 -6062 19648 -6704 -15746 15044 5172 -19108 6098 13939 -15418 -4617 17596
665A7596k3810o036K5448j0708j6179K0510Q53j9761J4559Q845k2517Q099J8845
$$ 17596 -6214 -12250 13198 2490 -13689 6821 7674 -12087 2472 11317 -11200 -3101 15744
678A5744k3506m689K9866j2848k4836K7668J0689l3566O483K8420k0494j4855
$$ 15744 -7762 -12451 17415 4567 -20269 7399 18088 -15478 -8995 19425 -1069 -15924
690a5924K6502k011k0832J4305P234j7739P667J1467j7411J098J8330j3974j0462
$$ -15924 10578 8567 -12265 2040 9274 -8465 -798 10669 -6742 -5644 12686 -1288 -11750
703a1750K1320l031k0115J6306R570k2433M941J8819j6741q465K1960n045j9355
$$ -11750 9570 6539 -13576 2730 12300 -10133 -5192 13627 -3114 -11579 10381 5336 -14019
716a4019J7107R545k2951L625J9876j4467j0922J9013k82j6375R153Q601j2994
$$ -14019 3088 12633 -10318 -6693 13183 -1284 -12206 6807 6525 -9850 -697 7904 -5090
729e090J043J0110q925j658J0885p793o041J4167l450j4515J2963R027j9709J445
$$ -5090 -4047 6063 -2862 -4520 6365 -1428 -7469 6698 3248 -11267 1696 10723 -8986 -7541
743g541K0130j1834j4366J9079L913k0174O895J4585j3330n233J4670m609r781
$$ -7541 12589 755 -13611 5468 9381 -10793 -3898 10687 -2643 -7876 6794 2185 -7596
756g596J0394J701j0956O953O110j1732K443J0197j0181l535J3789n657j0660
$$ -7596 2798 4499 -6457 496 6606 -5126 -2683 7514 -2667 -6202 7587 1930 -8730
769h730J3142L164j6350P000J3015j5649l582J7930o563j3997J4305N254j6467
$$ -8730 4412 7576 -8774 -1774 11241 -4408 -7990 9940 3377 -10620 3685 8939 -7528
782g528M057J3076j1010n479J3233l240r640Q830K326r211M541M970q495K029
$$ -7528 -3471 9605 -1405 -6884 6349 3109 -6531 2299 4625 -4586 -45 4925 -3570 -1541
796a541P578q575k154J1456n915r790J3138L258j5717N298J3036j1836p237J4615
$$ -1541 6037 -2538 -4692 6764 849 -8941 4197 7455 -8262 -2964 10072 -1764 -9001 5614
810E614n79j2737O844P442r793o99P946m530l419O198j387m393N145M66o093L775
$$ 5614 5035 -7702 -858 6584 -3209 -3908 4038 -492 -3911 2287 900 -3493 1652 2118 -3975 -200
826b00L748o965Q22P366n582m604Q887o44q887N430O406q954j560J0159m031q054
$$ -200 3548 -3417 -2595 4771 -811 -5415 3472 2828 -6059 -629 5777 -3177 -4737 5422 1391 -6663
842f663Q343L246r780K088Q155n774m124P287l16o422L620L470m889P13L694l747
$$ -6663 1680 4926 -4854 -2766 5389 -385 -4509 2778 2462 -3960 -340 3130 -1759 -1046 2648 -1099
858a099J61L933m205j321O531k496o564P116L757j0231J160J0170o460p077J0291
$$ -1099 -938 2995 -1210 -2531 4000 1504 -5060 2056 5813 -4418 -3258 6912 452 -6625 3666
873C666J562j0047L478P431p175k917P708j872n638N471J205n206K470K469m386
$$ 3666 5228 -4819 -1341 6090 -1085 -4002 3706 1834 -3804 1667 2872 -2334 136 2605 -1781
888a781J220L269l904q74N612l178m587O359J146p605L073O026o394k258P379
$$ -1781 -561 2708 -1196 -2070 3542 364 -4223 2136 3282 -4323 -1250 4776 -1618 -3876 3503
903C503j936o469N220L922p467J35P336m135m863O021J496n993J491M407l039
$$ 3503 1567 -4902 318 4240 -3227 -3092 4244 109 -4754 1267 2763 -3230 -1739 2668 -371
918c71k256L664l54k186J882k30k062K933R6m376L044L991n885k044P842j405
$$ -371 -2627 1037 683 -1503 379 149 -1913 1020 1116 -3260 -216 3775 -2110 -4154 3688 2283
934B283p801N952M985q767q5Q555m643n967Q106J400q338L227O344p046j591P381
$$ 2283 -5518 434 5419 -3348 -3433 5122 479 -5488 2618 4018 -4320 -1093 5251 -1795 -3386 3995
950C995l336m360O245k55n703M415K557o652K177N790o247j968Q206l608o569
$$ 3995 659 -3701 2544 2289 -3414 1001 3558 -3094 -917 4873 -1374 -3342 4864 1256 -5313
965e313Q000J934r649L988P673q607k762J0486l445q972Q309M193j0430K243Q244
$$ -5313 2687 4621 -5028 -1040 6633 -1974 -4736 5750 2305 -6667 1642 5835 -4595 -2352 5892
980E892o564l692P283j216n804N395J425o242L503M087p231N53P600o003m285
$$ 5892 -672 -4364 2919 1703 -4101 1294 2719 -3523 -20 4067 -3164 -2611 4989 -1014 -5299
995e299Q991q40q903O544N134j0088K31J0439o309o908J0298J156j0674M856P135
$$ -5299 3692 2852 -6051 493 5627 -4461 -4230 6209 -100 -7008 3290 4446 -6228 -1372 5763
1010E763q629j555Q764l813n862Q036K75q273N651M493r055J491Q435o924l934
$$ 5763 -2866 -4421 4343 530 -5332 2704 2979 -5294 357 4850 -4205 -2714 5721 -1203 -5137
1025e137R656k312q601Q221L677j1308L785R678j0270l717J2941l975j0825J0142
$$ -5137 4519 2207 -6394 1827 5504 -5804 -2019 7659 -2611 -6328 6613 2638 -8187 1955
1039A955N548j3274K265J1410q762n146J1225k518q731Q568J988r587M998O231
$$ 1955 7503 -5771 -3506 7904 -858 -6004 5221 2703 -6028 2540 4528 -5059 -61 6170
1053F170r948K02J0702p604o157J2446j789j2229R677O449j4034J782J3261r316
$$ 6170 -3778 -3576 7126 -478 -6635 5811 4022 -8207 1470 7919 -6115 -4333 8928 -388
1067c88p844J3837q33j2964Q568O906j2505J747J1082r126m770J1617l014r670
$$ -388 -8232 5605 4772 -8192 376 7282 -5223 -3476 7606 -1520 -6290 5327 2313 -7357
1081g357R506L252j1403M244Q546j0128j508J1186o577p172J2041n53j2607Q840
$$ -7357 2149 5401 -6002 -1758 6788 -3340 -4848 6338 -239 -7411 4630 4077 -8530 310
1095C10Q084j4200o10J5333q213j0764J4095K754j4842N984R911j1008k534J1491
$$ 310 8394 -5806 -6416 8917 704 -10060 4035 6789 -8053 -2069 7842 -3166 -5700 5791
1109E791n142o939R942m41r768P942M238j1470L912R862j1082l282J3718m893
$$ 5791 649 -6290 3652 3211 -6557 1385 5623 -5847 -1935 7927 -3155 -6437 7281 2388
1123B388j1846J2627M820j5660M558J2819j2153n192J5165m485j1762J1814L982
$$ 2388 -9458 3169 7989 -7671 -3113 9706 -2447 -7639 7526 3041 -8721 3093 7075
1136G075j4337N440J1077j2526l436J4607n685j0276J1959J521j2060O688P090
$$ 7075 -7262 -1822 9255 -3271 -6707 7900 2215 -8061 3898 5419 -6641 47 7137
1149G137j2051J744J1516j0665n082J5679m961j4092J4136O287j8173L721J6168
$$ 7137 -4914 -3170 8346 -2319 -7401 8278 3317 -10775 3361 9648 -8525 -4804 11364
1162A1364j2677q415J6429j495j4582J0071O893j3602L005J0640j0793k649J2623
$$ 11364 -1313 -9728 6701 5206 -9376 695 7588 -6014 -3009 7631 -3162 -5811 6812
1175F812o326q770J2597O19j3350Q324Q546j4728R19J4576j0125q460J5665j319
$$ 6812 486 -8284 4313 4932 -8418 -94 8452 -6276 -5357 9219 -906 -9366 6299 4980
1189D980j4872J0558Q174j5433J013J4992j0303q271J5136j353j3600R806O910
$$ 4980 -9892 666 8840 -6593 -5580 9412 -891 -9162 5974 4621 -8979 827 7737
1202G737j3330J790J1488r483m398J2561m793r432J2048J341j3886Q453R351j5148
$$ 7737 -5593 -3803 7685 -1798 -6196 6365 1572 -7860 4188 5529 -8357 96 9447 -5701
1216e701n32J6395r342j1456J6176K325j7385Q149J2031j4990k385J5813p859
$$ -5701 -6233 10162 820 -10636 5540 7865 -9520 -1371 10660 -4330 -6715 9098 1239
1229A239r971J3525J029j3533Q044P728j3157J286J2298j0360m977J4374n156
$$ 1239 -8732 4793 5822 -7711 333 8061 -5096 -3810 8488 -1872 -6849 7525 2369
1242B369j1539J3492L363j6855O861J3826j5840m363J8531o908j4290J5370M349
$$ 2369 -9170 4322 7685 -9170 -2309 11517 -4323 -8686 9845 2937 -11353 4017 8366
1255H366j7430O506J2498j4059k998J5907p604j0834J4412J009j4663Q626Q492
$$ 8366 -9064 -2558 9940 -4119 -7117 8790 1186 -9648 4764 5773 -8890 -264 8228
1268H228j4151J455J3045j0818n858J5505m629j3216J3916N081j8257O419J4986
$$ 8228 -5923 -4468 8577 -2241 -8099 7406 2777 -10439 3477 8558 -9699 -3280 11706
1281A1706j5908n666J9240n448j5717J4531O589j7584M282J3810j2490m962J4802
$$ 11706 -4202 -9868 9372 3924 -11793 2738 9327 -8257 -3975 9835 -2655 -7617 7185
1294G185n368j0020J2533P32j3233Q772P716j4537J743J4455j1357q307J7556
$$ 7185 1817 -8203 4330 5062 -8171 601 8317 -6220 -4477 9978 -1379 -9686 7870
1307G870k455j6449J2446R184j7909J885J6317j1528r019J6981k127j5362J2205
$$ 7870 5415 -11034 1412 10596 -7313 -5428 10889 -639 -9658 7323 5196 -10166 2039
1320B039P387j6690L348J4207j2632n878J6005m663j2364J2852L539j5337P353
$$ 2039 9426 -7264 -3916 10291 -2341 -8219 7786 3123 -9241 3611 7150 -8187 -834
1333h34J0383j5058p60J6592j0455j0515J7528n0j8227J1391J1695j8364q96J8644
$$ -834 9549 -5509 -6269 10323 -132 -10647 6881 6831 -11396 -5 11690 -6674 -7570 11074
1347A1074j0379j2019J7465M55j6971J0328R433j5918J454J4256j0978o447J5595
$$ 11074 695 -11324 6141 6596 -10375 -47 9386 -6532 -5078 9178 -1800 -8247 7348
1360G348m758j2948J4461L418j7618Q125J3312j6899l255J9123q020j4505J6991
$$ 7348 2590 -10358 4103 7521 -10097 -1972 11340 -5559 -8814 10309 2289 -12216 4775
1373D775L984j9160Q003J3574j6290k668J7520q718j1474J6160J085j6739R701
$$ 4775 8759 -10401 -2398 11176 -5114 -7782 9738 1020 -10454 5706 6791 -9948 -247
1386b47J0036j6039Q28J5651j1521p655J6589l694j4225J3120O247j7811N512
$$ -247 9789 -6250 -5422 10229 -1292 -8947 7642 3948 -10277 2843 9090 -8721 -3209
1399c209J4879j5228n742J9398o480j5654J6018N908j9408N900J5779j5442n739
$$ -3209 11670 -3558 -9300 10098 3618 -12036 3982 9890 -9518 -3618 12161 -3281 -9020
1412i020J8099n620j3739J3935L969j5898P035J0492j4512j29J5091j0734q722
$$ -9020 9079 3459 -10280 3655 7624 -8274 -1239 9253 -5259 -5388 9703 -1031 -9753
1425i753J7159j775j6969J2845R578j9284J943J8193j3073r867J8676k023j6890
$$ -9753 7406 5631 -11338 1507 11085 -8199 -6256 11937 -1136 -11003 7673 5650 -11240
1438a1240J2776Q550j8139L234J5889j3632o990J8125m986j4785J4540M885j7203
$$ -11240 1536 10086 -8053 -4819 11070 -2562 -9552 8573 3587 -11198 3342 8227 -8976
1451h976O517J2806j5252k555J6876q699j1610J6993O16j8021J1449J0901j8547
$$ -8976 -2459 10347 -4905 -7460 9416 717 -10893 6100 6716 -11305 144 11045 -7502
1464g502P02J8378j2227j1017J8993m50j8642J2016J0662j8205J462J6540j1811
$$ -7502 -6800 11578 -649 -11666 7327 6877 -11765 251 10913 -7292 -5830 10710 -1101
1477a101q273J6782l265j4026J2852N301j6931O496J3173j5514l647J8368q043
$$ -1101 -9374 7408 4143 -9883 2969 8270 -8661 -2165 11008 -4506 -8153 10215 2172
1490B172j3806J6802L352j8555Q278J3293j6335k789J7846r000j1986J6730J247
$$ 2172 -11634 5168 8520 -10035 -1757 11536 -4799 -7588 10258 1258 -10728 6002 7249
1503G249j7294R639J0972j6622j3J6180j0287r444J6444j337j5592J1499P944
$$ 7249 -10045 -406 10566 -6056 -6069 10111 -176 -9620 6824 5487 -10105 1394 9338
1516I338j7037L550J4651j3201o056J7358n223j4278J4444N362j8251O031J4802
$$ 9338 -7699 -4149 10502 -2699 -8755 8603 3380 -10898 3546 8908 -9343 -3312 11490
1529A1490j5630n152J8726o335j4402J4921M793j7447O629J2270j4486k298J5804
$$ 11490 -4140 -9292 9434 3099 -11303 3618 8411 -9036 -2407 9863 -4623 -6921 8883
1542H883q665r809J5503m30j5791J1027R281j7234J367J6432j1789r051J7651
$$ 8883 218 -9591 5912 5482 -10309 718 9999 -7235 -5868 10564 -1225 -10276 7375
1555G375k189j6308J2956P857j7811L488J5300j3164o753J7507m260j4626J3709
$$ 7375 5186 -11122 1834 9691 -8120 -4632 10668 -2496 -9249 8258 3998 -10628 3081
1568C081N571j7100N679J2891j3911l361J5945p080j1242J4597J450j5861R281
$$ 3081 8652 -8448 -2769 10122 -3789 -7150 8795 1715 -9527 5070 6520 -9341 -60
1581f0J0284j6227K35J6094j0810r272J6813j261j6146J1458Q946j7013J638J5888
$$ -60 10224 -6003 -5768 10326 -484 -9756 7057 5796 -10350 1108 10054 -6959 -5321 10567
1595A0567j1507q436J6387k142j4372J1611O299j5600M022J2681j2556m270J5432
$$ 10567 -940 -9376 7011 4869 -9503 2108 8407 -7193 -3171 9510 -3046 -7316 8116
1608H116n986j1616J3576K839j5834P244J1418j4506k058J6182q603j0871J5395
$$ 8116 2130 -9486 4090 6929 -8905 -1661 9757 -4749 -6807 9375 772 -10099 5296
1621E296J450j6573R191J0477j5443o12J5553r465r005J4744n82j4100R678P746
$$ 5296 6746 -9827 -636 9841 -5602 -6214 9339 -126 -9131 5613 5031 -9069 609 8355
1635H355j4930K254J3331j0909o158J5245m108j2420J2322M311j5443N898J2010
$$ 8355 -6575 -4321 9010 -1899 -8057 7188 3080 -9340 2982 7293 -8150 -2252 9758
1648I758j3910l420J6635p176j2243J4855L016j6632P471J1536j4187k523J5283
$$ 9758 -4152 -7572 9063 1887 -10356 4499 7515 -9117 -1646 9890 -4297 -6820 8463
1661H463p254j0093J3888L82j3694Q851P953j4421J657J3361j0295o764J4997
$$ 8463 1209 -8884 5004 5386 -8308 543 8496 -5925 -4268 9093 -1202 -7966 7031
1674G031l091j3208J1507N884j5490M195J2943j2544m979J5735m847j2832J2955
$$ 7031 3940 -9268 2239 8123 -7367 -3172 9771 -2773 -7752 7983 3136 -9696 3259
1687C259M416j5669N656J1680j2784l469J4779o223j0388J2846J642j3678P498
$$ 3259 7675 -7994 -2338 9342 -3442 -6911 7868 1645 -8743 4103 5745 -7933 -435
1700d35Q556j2917J59J2823q810p075J3770k013j3404J0869O708j5572L180J3631
$$ -435 8121 -4796 -4637 8186 -624 -7699 6071 4058 -9346 1523 8231 -7341 -4161 9470
1714I470j1258o962J5541k566j3626J0759O274j4304L056J1945j0755m314J3296
$$ 9470 -1788 -8750 6791 4225 -9401 1358 7632 -6672 -3616 8329 -2426 -6740 6556
1727F556m494j0313J1358K696j3439O533R441j2745j336J4001p993q934J3723
$$ 6556 2062 -8251 3107 5803 -7636 -1103 8338 -4407 -5743 8258 265 -8669 5054
1740E054L65j4165Q567Q898j4208J65J4236r355p872J4101r16j3433R526P305
$$ 5054 5419 -8746 -179 8719 -5489 -5324 8912 -443 -8315 5786 4870 -8563 963 8268
1754H268j4109J832J2469r649n950J3313l011j1025J0270L913j2825N338R310
$$ 8268 -5841 -4009 8460 -1189 -7139 6174 3163 -7862 2408 6321 -6504 -1166 8144
1767H144j2070j580J3927p591r807J3984J485j5069P570J0519j4131j483J4433
$$ 8144 -3926 -5506 8421 830 -8977 5007 6492 -8577 -1007 9512 -4619 -6102 8331
1780H331p321r561J3011P59j2573P527O963j2188R31J1812q942n604J2662k784
$$ 8331 1010 -8551 4460 5219 -7354 173 7136 -5052 -4121 7691 -1251 -6855 5807 3023
1794C023j1013J0233M471j3296M038J0623j0943l786J3637n030j0756J1932L096
$$ 3023 -7990 2243 6714 -6582 -2544 8079 -2864 -6650 6987 1957 -8799 3133 6229
1807F229j3527N283J0250j1633k896J3238n311r879J1482K402j2732N885Q510
$$ 6229 -7298 -2015 8235 -3398 -6294 6944 1633 -8246 3236 5638 -7094 -1209 7301
1820G301j1356o23J1558p255o395J1497j405j0826Q836N676j3175K643J2015j0257
$$ 7301 -4055 -4678 6880 -375 -6770 4727 3322 -7504 1332 7008 -6167 -3524 8491 -1766
1834a766n916J4172k762j2312J0296N756j3628K699J1540r652n153J2865l362
$$ -1766 -7682 6490 3728 -8584 1712 7468 -6160 -3461 8079 -1573 -6726 6139 2777
1847B777j0113R698L424j1900M993Q219j0403j470J1849o643p884J2228K5j2535
$$ 2777 -7336 2362 5786 -6114 -1121 7098 -3305 -4775 7074 431 -7453 4775 4800 -7735
1861g735Q058P560j2675K09J2638q160p469J2842q56j2047Q343O549j2530J501
$$ -7735 323 7883 -4792 -4583 8055 -105 -7574 5268 4412 -7635 708 7257 -5273 -3772
1875c772J1201q584n548J2010k265j0027Q425M319j1170L281Q944r581k288J1236
$$ -3772 7429 -1155 -6703 5307 3042 -6985 1440 5759 -5411 -2130 6814 -2767 -5055 6181
1889F181n504p906J1062J012j2212O594Q393j1834j446J3080o648q788J1595J553
$$ 6181 677 -7229 3833 4845 -7367 -773 7620 -4214 -5660 7420 772 -8016 3579 5132
1903E132j1919N621P847j0270o54J0214o151n806J0097j144r423P727M467j1132
$$ 5132 -6787 -1166 6681 -3589 -4243 5971 -180 -5986 4111 2967 -6456 1271 5738 -5394
1917e394L042R246r075l742J1686l297r667R513L555j1610L709R286r712l071
$$ -5394 -2352 6894 -2181 -5923 5763 2466 -7201 2312 5867 -5743 -2034 7252 -2460 -5531
1931e531J1592m093q871R607K687j1335M557Q266r431k232J0511m664o949R300
$$ -5531 6061 1968 -6903 2704 5391 -5944 -1387 6879 -2552 -4784 5727 1063 -5886 3414
1945C414J91r382O305N179r767J092R656p806m867J1163k149j0191Q624N078j1626
$$ 3414 3605 -5777 528 5707 -4060 -2968 6688 -1118 -5985 5178 3029 -7162 1462 6540 -5086
1960e086J883J0375q371m784J0854j952r183P611L938r957K715P755p980k275
$$ -5086 -3203 7172 -1199 -5983 4871 2919 -6264 1347 5285 -4672 -1957 5798 -2182 -4457
1974d457R427m436o122Q656N83r677N821O222j0041k0J0054o248n947R921k25
$$ -4457 4970 534 -5588 3068 3651 -6026 -205 6017 -4024 -4044 6010 -238 -6185 3736 3511
1989C511r605O318N582r787M99R420o571m993R519j030q685O372M552r317J984
$$ 3511 -6094 224 5806 -3981 -3482 5938 -633 -5626 3893 2863 -5822 550 5102 -4215 -2231
2004b231P566o752k949Q648k944o744P651J704q955M202O514q650j050R353m575
$$ -2231 5335 -1417 -4366 4282 1338 -5406 2245 3949 -5006 -804 5710 -2940 -3990 5363 788
2019G88o806R032J185r513M564O870q921j182R096m433n727P757L51p521M713
$$ 788 -6018 3014 4199 -5314 -750 6120 -2801 -3983 5113 680 -5047 2710 3061 -4460 253
2034B53M140p719J074P282o254k945Q478k383p327P088L029r007K448P481p135
$$ 253 4393 -3326 -2252 5030 -1224 -4169 4309 1926 -5401 1687 4716 -4291 -1843 5638 -1497
2049a497k977Q856k888o961P456K337q852L397O211p254j720Q508l778n674P025
$$ -1497 -4474 4382 1494 -5467 1989 4326 -4526 -1129 5082 -2172 -3892 4616 838 -4836 2189
2064B189R89p741M168M735p375L53P234n285l741P719j201p034N890L535q451
$$ 2189 3178 -4563 -395 4340 -3035 -2682 4552 -733 -4474 3245 2044 -4990 900 4435 -4016
2079d016J800P308o309l483Q610j936p266O361L209q027J833O508n674k592P181
$$ -4016 -2216 5092 -1217 -4700 3910 1974 -5292 1069 4278 -3749 -1916 4592 -1082 -3674 3507
2094C507k484n371O328P87o818L897M470p061n6P209m313m898P607J98p502M492
$$ 3507 1023 -4348 1980 2767 -4051 -154 4316 -2745 -2801 4408 95 -4803 2804 3002 -4500 -8
2110hM631p546K97P161m867l697P002o35o750N091L474p202J244O180n228k669
$$ -8 4623 -2923 -2626 4535 -332 -4029 2973 2338 -4412 679 4153 -3049 -1805 4375 -853 -3522
2126c522O860j689n691N121K099o257K164M994n741j198O367k872m688O321M96
$$ -3522 3338 1649 -4042 1079 3178 -3079 -915 4079 -1662 -2860 3507 635 -4053 2268 2764
2141B764o974L810M928o904o90P239l702m879O372R02o725L384M059n693L8N544
$$ 2764 -4210 -400 4528 -2376 -3066 4173 471 -4408 1964 2866 -3859 -475 3584 -2109 -2071 3473
2157C473m056k769O070j169n492M886K461o583J656N702n405k114O415j941n309
$$ 3473 -583 -3352 2718 1549 -3943 943 3404 -3179 -1523 4179 -1226 -3340 3075 1134 -4175
2172d175N449J740o494K471M966n669j362O702k924m584N445J183o199K862M095
$$ -4175 1274 3014 -3480 -1009 3957 -1712 -3074 3628 704 -3880 1565 2748 -3451 -589 3506
2187C506n372m42N578l189l502N481l52n055L877K651n618Q46N188m352k489O197
$$ 3506 -1866 -2308 3270 81 -3421 2060 1708 -3347 530 3181 -2437 -1591 3597 -755 -3244 2953
2203B953j114n697M811K530o263J307N150m315k522N907j158n115M489J858n334
$$ 2953 1839 -3858 953 3483 -2780 -1473 3677 -638 -3160 2747 1589 -3526 963 2821 -2513
2218b513J761M106m602q96N186k649l588N092L20n361L006L428n104k58N304l232
$$ -2513 -752 3354 -1248 -2144 3042 393 -3195 1897 2217 -3144 -138 3290 -1814 -2072 3232 0
2234@l386N590k04n441L643K993n383K16N227l615k951N542n86m963L639K467
$$ 0 -3386 2204 2000 -3441 202 3195 -2188 -1972 3255 -360 -3311 2231 1645 -3318 321 2788
2250B788n132Q97M396l861j624M782j513l810M133J006m939K273L710m702p67
$$ 2788 -2344 -1447 2949 -912 -2536 2246 733 -3077 1056 2062 -2877 -604 3106 -1596 -2363
2265b363N348k689l705M905P44n543K758L821m845o69M971k428l155M196L32m473
$$ -2363 2985 296 -3409 1496 2240 -3303 -545 3276 -1569 -2238 2733 305 -2850 1346 1678 -2795
2281b795K822K675m634N34M122l321j999M731q89l942L521J652m734J232M023
$$ -2795 27 2702 -1932 -1398 2724 -597 -2596 2135 1246 -2696 825 2477 -2257 -1025 2998
2296B998l804j626N128j656m105M192J382n058J785L698l989j135M520j372l719
$$ 2998 -806 -2432 2696 1040 -3065 1127 2509 -2549 -764 2934 -1055 -2190 2330 958 -2761
2311b761L914R15m279J747L187l964l12L811k221k209L939m82l811K861K214m558
$$ -2761 1153 2068 -2211 -464 2723 -1241 -1553 2258 37 -2172 1767 1285 -2526 335 2549 -2009
2327b009O10M436l483k398M817m76m248L038K306m320K54L960k859j880L766n80
$$ -2009 -1399 3037 -446 -2844 1973 1497 -2751 287 2593 -1727 -1473 2487 -372 -2252 1514 934
2343I34l390L069J245l882J241L018l237p98L808j505l109L792N65m225K119K805
$$ 934 -2456 613 1858 -2024 -783 2235 -1002 -1800 2008 503 -2606 1186 1751 -2474 -355 2450
2359B450m039j92M318k515k651L927L39m136K238K972m046l61M207k256k714L830
$$ 2450 -1589 -1781 2537 22 -2629 1298 1637 -2499 -261 2711 -1335 -1696 2511 255 -2459 1371
2375A371k6l306J915K011l112N58K531k677j017L762j476k918L408R95m263J920
$$ 1371 1345 -1961 -46 1965 -1147 -589 1942 -735 -1752 2010 534 -2384 1024 2019 -2244 -324
2391c24L185l569j484M329j110l304K983J271l665J054K955l042q31L337j242
$$ -324 2861 -708 -2192 2137 1027 -2277 706 1977 -1688 -634 2321 -721 -1552 1785 543
2406E43k553K983K25l016J645K092l050O0L004j981j904L235j53l064K173J731
$$ 543 -2010 973 1198 -1818 -173 1919 -1131 -1071 1933 -48 -1952 1283 1130 -1934 239 1970
2422A970l386J68L675k586k040L759n59l296K274K152l427J36L024k038j768L106
$$ 1970 -1416 -1248 2427 -159 -2199 1560 1001 -2295 -21 2131 -1296 -1160 1864 -174 -1942 1164
2438A164l68k561K181R37k908J068J941k369m48L240j763k143L103N08l768J791
$$ 1164 796 -1765 416 1353 -1555 -487 1454 -915 -1363 1877 114 -2029 1074 1582 -2186 -395
2454c95K717l293o78L796j514k911K990R04l235J397K077k589m90K646j552j392
$$ -395 2322 -971 -1649 2147 633 -2278 712 1616 -1619 -222 1855 -734 -1224 1422 -130 -1522
2470a522K501k03k196J924J095k862O49K307k156j101L172j047k593K585J113
$$ -1522 979 776 -1420 504 1599 -1263 -614 1693 -463 -1564 1608 561 -2032 553 1666
2485A666k962P71K687k560j036L081p65k760K353J403l346O68K644j946j157K384
$$ 1666 -1296 -525 2162 -398 -1434 1647 882 -1878 475 1878 -1468 -800 1844 -102 -1259 1125
2501A125o20j853J899L25k132J407J341k674N13K397k010j306K956m20l032K140
$$ 1125 505 -1348 551 876 -1256 151 1492 -1182 -669 1728 -282 -1588 1368 948 -2084 56
2517E6J655k741k21L035j722j735K428K29k517J320J632k452K95K073j697q95
$$ 56 1711 -1030 -1251 1784 62 -1673 755 984 -1533 -213 1419 -1033 -738 1335 -362 -1257
2533a257K428p80j936K030O21k355P01K204k290o90K580q42k273K569N51k911
$$ -1257 1171 391 -1545 485 1106 -1249 -548 1656 -634 -1324 1256 414 -1859 710 1261 -1650
2549a650J402K129k756l74K926j249k154K478O60k861R62J923j831n06K071j006
$$ -1650 -248 1881 -875 -1249 1677 428 -1726 752 1412 -1449 -487 1436 -395 -901 1170 164
2565A64j297J931j92j821J704O84k257M35K485k203j213L172p51k506K139J345
$$ 164 -1133 798 606 -1215 489 1173 -1084 -649 1836 -367 -1580 1592 841 -1665 474 1819
2581A819k905M09K281j671j202K270k39k024J543P35j960P67J350j654l11J972
$$ 1819 -1086 -677 1604 -67 -1269 1001 762 -1262 281 1016 -944 -177 1173 -481 -792 1180
2597A180r45j521K098J31k338J323J673k457o5K351j378j686K500J53k740J601
$$ 1180 235 -1286 812 943 -1395 -72 1601 -856 -921 1430 52 -1634 866 1019 -1721 -120
2613a20J594k360m8K583j574j778K331L24k251J127J312j710N2J547j225q17K010
$$ -120 1474 -886 -934 1649 75 -1703 628 952 -1299 -172 1140 -570 -518 1029 -196 -1013 997
2630I97q95j454K073K30k139P85J923k199o47K691q46k357K430Q08k656Q05J909
$$ 997 102 -1352 721 951 -1188 -403 1520 -679 -1326 1365 519 -1838 592 1400 -1256 -451 1458
2647A458j685o95K048o97j532J702L05j923R15J364k021J02K101j413j176J980
$$ 1458 -227 -922 1126 429 -1103 599 904 -1019 -104 1260 -761 -659 1442 29 -1147 833
2663H33j30k082J512J456k581L55K143j670j119K320j33k427J948R59k503M83
$$ 833 703 -1379 133 1589 -992 -637 1506 -164 -1283 1037 904 -1523 425 1384 -1119 -636
2679f36K106j575j169K150l8j948J454P60k079N73J589j670l72J897r26j275J921
$$ -636 1470 -105 -1274 876 838 -1110 344 1104 -975 -402 1187 -483 -855 1042 116 -1159 762
2696G62O9k162J231J610k360k50K502j339j558K147L00k447J334J483k099l23
$$ 762 831 -1331 -100 1510 -850 -1100 1402 63 -1495 652 952 -1495 -161 1322 -777 -1100
2712a100K227j056j303K009l24j661J332R57k087O43J718j535j029K397p20j921
$$ -1100 1127 71 -1232 777 453 -1208 124 1081 -1006 -363 1355 -180 -1209 1188 468 -1453
2728a453J757P98k143O32J737j911n58K358q89j567J776N61k353R23K064k203
$$ -1453 304 1102 -1041 -409 1328 -583 -1141 1217 328 -1239 537 1098 -1255 -332 1732 -471
2744d71n96K344p37j828J882M26k113J031J365j961L0J928j432j150K319l28k200
$$ -471 -1067 1277 540 -1288 594 1020 -1093 -62 1303 -658 -628 1300 -132 -1282 1037 709 -1491
2761a491J852J133k387J20K480j889j268K486k68k236J762J012k325N94J580j521
$$ -1491 361 1494 -893 -773 1707 -182 -1450 1036 768 -1468 294 1306 -1019 -425 1155 -366
2777c66q07K420r38j737J790N44k143R17J532j912k56K123q96j715K158J31k327
$$ -366 -1173 1247 309 -1428 362 906 -1237 -320 1212 -700 -956 1167 271 -1444 714 845 -1482
2794a482J515J562k565J14K261j512j534K482j3k312J548J444k330o3K289j608
$$ -1482 33 1595 -970 -856 1405 -107 -1641 841 828 -1484 64 1508 -822 -885 1404 -204
2810b04j266K171j95j752J379R19k067O85J583j668q31K481r62j890K207M97k459
$$ -204 -1470 701 506 -1246 133 1052 -1015 -330 1253 -415 -1246 1235 273 -1617 590 1087 -1372
2827a372R96K133k271o47K542r51j920K057N11k260J166J307k067j8K225j152
$$ -1372 -376 1757 -514 -1161 1381 430 -1490 567 1078 -1182 -16 1291 -776 -794 1431 279
2843B79j551K084p9k006J400J335k280K64K081j730r32K136m94j979J824R46k342
$$ 279 -1272 812 733 -1273 127 1462 -818 -554 1527 -203 -1135 1001 507 -1472 352 1298 -1044
2860a044M31K270j879j046K388n88k099J836J022k463P05J896j833q41K256q87
$$ -1044 -613 1657 -222 -1268 1120 532 -1567 269 1291 -1172 -467 1429 -404 -1245 1011 124
2876A24j549J890K60j889J061J554k166k5K199j479j552K501k9k469J390J589
$$ 124 -1425 465 725 -1164 -103 1451 -715 -740 1459 -20 -1572 929 900 -1569 -179 1410
2892A410k388O5K305j465j428K482k04k301J574J199k239K07K284j722j285K632
$$ 1410 -978 -913 1392 -73 -1501 981 777 -1524 50 1249 -990 -783 1501 -221 -1506 1126
2908A126n89j825J719O67k193O52J800k069k44K346j118j755K181L65k286R87
$$ 1126 537 -1288 431 1098 -1095 -443 1357 -712 -956 1390 272 -1483 698 1063 -1223 -236
2924b36J820k382j59K533j299j832K329L46k361J027J621j926j55J956j360j149
$$ -236 1584 -798 -957 1576 277 -1555 774 1120 -1241 -214 1407 -519 -674 1282 -78 -1227
2940a227K202l62j967J708Q59k293N85J997j901q35K458p31k023J972O90k389
$$ -1227 975 613 -1354 354 1213 -1080 -495 1502 -399 -1234 1224 493 -1530 442 1132 -1257
2956a257Q06K054j964j023K747j022j803K207L22k317Q80J874k139m02K233j108
$$ -1257 -451 1603 -361 -1384 1363 341 -1462 745 1067 -1250 -370 1504 -635 -1037 1196 88
2972H8j565K219K22k266J251J287k258L30J989j667j092K515m55k178J747J278
$$ 88 -1477 742 964 -1302 -51 1236 -1022 -692 1297 -370 -1462 1053 598 -1580 167 1445
2988A445k682M21K443j915j102K325k29k191J591J157k087L98J762j765n76K252
$$ 1445 -1237 -816 1627 -288 -1390 935 706 -1485 106 1263 -824 -426 1336 -429 -1005 1247
3004A247j078j504K058K20k339J201J581k117l29K559j301j720K439J9k275J341
$$ 1247 169 -1335 723 943 -1396 -195 1386 -731 -1060 1499 198 -1522 917 936 -1339 2
3020BJ408k213m6K335j544j420K428j36k023J404J141k265L75J980j650p70K031
$$ 2 1410 -803 -849 1486 -58 -1478 950 814 -1209 195 1336 -929 -554 1426 -224 -994 1037
3037A037n46j765J909M45k314R93J710k100k36K355j251j751K233N52k715J070
$$ 1037 491 -1274 635 1080 -1234 -241 1469 -631 -867 1488 237 -1514 719 1271 -1444 -374
3053c74J852k139m98K397r84j495J832J63k074J254J247k088K81J940j754q18
$$ -374 1478 -661 -1159 1238 254 -1241 591 754 -1320 -66 1181 -907 -626 1314 -440 -1258
3069a258K361n42k252K077Q59k292M25J990j624j045K483o04k128J926P75k462
$$ -1258 1103 561 -1691 386 1245 -1047 -622 1368 -256 -1301 1182 578 -1550 376 1151 -1311
3085a311R86J605j788n58K124p32j555J888J34j989Q53J574k033J5K062j258j057
$$ -1311 -325 1280 -508 -1066 1058 326 -1229 659 793 -1196 -343 1231 -802 -787 1275 17 -1040
3102a040J994j76k147J580J174k452L46K466j879j210K485l32k179J527J175k265
$$ -1040 954 778 -1369 211 1385 -1067 -721 1745 -134 -1344 1141 809 -1370 157 1332 -933
3118i33K67J949j505r00K234p66j624J746M86k084R58J438j939l37K462j453j645
$$ -933 -666 1283 -222 -1122 1112 346 -1278 468 954 -1130 -172 1266 -673 -1010 1452 -1 -1646
3135a646K289N09k477J338J404k280k05K295j218j407J974K07k089J330J168k021
$$ -1646 643 1152 -1325 13 1417 -863 -1068 1227 9 -1398 576 783 -1306 24 1192 -829
3151h29N1J951j464r97K261n82j681J549P71k147P24J647j735n16K332j074j702
$$ -829 -778 1173 -291 -1288 973 391 -1290 259 1030 -1117 -393 1254 -481 -997 1335 261 -1441
3168a441K021N13k523J180J676k179m63K434r02j807J989N03j784P84J163j672
$$ -1441 580 1093 -1430 -250 1426 -753 -1216 1218 316 -1491 498 1001 -783 1 1164 -508
3184e08r1J709j199j125J992l29j574J554P70k110O02J764j804q63K237m47j923
$$ -508 -599 1110 -89 -1214 778 449 -1125 429 1199 -911 -309 1455 -349 -1212 1025 578 -1345
3201a345J705Q32k060M71J855j780q68K300p81j592J707M26j861Q38J481j943
$$ -1345 360 1192 -868 -397 1458 -322 -1190 1110 329 -1263 444 870 -991 -153 1328 -615
3217f15k33K027j042j434K048L24k315J271J142k087L78J876j602j032K224k41
$$ -615 -848 1179 137 -1297 751 1075 -1240 31 1173 -914 -536 1340 -262 -1294 930 689
3233F89k205J736J099k219J21K027j471r24J877k92j515J197P07j950Q42J569
$$ 689 -1516 220 1319 -900 -779 1248 -223 -1147 730 438 -1077 120 827 -1123 -281 1288
3249A288j881m07K158j033j449J910M07k256J149J537k228nK096j288j167J942
$$ 1288 -593 -1000 1158 125 -1324 586 993 -1263 -114 1423 -805 -810 1286 -2 -1169 773
3265G73q1j754J346P72j896K9J981j479p97J902k67j794J596N75j906P94J430
$$ 773 692 -1062 284 1056 -840 -811 1170 -309 -1106 796 529 -1265 331 906 -1000 -206 1224
3282A224j538o47J893n51j533J511N48k018R11J553j979m58K359j081j508K035
$$ 1224 -314 -961 932 381 -1152 359 907 -1111 -200 1353 -626 -1084 1275 194 -1314 721
3298G21L16k190Q77J380j835J98J730j106j140J647k3j606J172J271k433L70J826
$$ 721 1037 -1153 -276 1104 -731 -533 1197 91 -1049 598 575 -1031 141 1412 -1021 -651 1175
3315A175j523o07J989m59j868J650P84k090M11J798j654o07J966o48j527J618
$$ 1175 -348 -955 1034 575 -1293 357 1141 -949 -538 1260 -394 -1001 965 317 -1210 408
3331D08N41k056R34J269j682k31J690p96j274J676K20j917J155J255j923J46J682
$$ 408 949 -1107 -173 1096 -586 -817 873 77 -1197 479 699 -1218 -63 1192 -731 -585 1097
3348A097j333q65J861k42j736J521Q53k133N46J795j500j058K084m29j645J535
$$ 1097 -236 -1101 760 518 -1218 303 1156 -977 -431 1364 -136 -1194 890 461 -1184 351
3364C51P00j936N50J341j246n49J704p01j358J651L45j885Q79J472j972j91K003
$$ 351 1051 -885 -335 1006 -240 -789 915 214 -1144 507 852 -1033 -154 1318 -654 -845 1158
3381A158j128j128J714J11j874J143J154j694NJ506j065r13J836l59j634J544
$$ 1158 30 -1098 616 727 -1147 -4 1150 -544 -539 967 -98 -1011 825 466 -1168 376
3397C76N76j810J92J878j371q00J805l85j640J575L46j757P46J432j567m31J930
$$ 376 952 -858 -666 1212 -159 -959 846 461 -1179 396 742 -1015 -269 1163 -404 -835 1095
3414A095p85j786K088L50k065Q74J507j758l92K036j076j313J851Q8j835R18J240
$$ 1095 310 -1476 612 962 -1103 -229 1278 -480 -872 1164 88 -1225 626 714 -1121 -203 1037
3431A037j754O3J749j290r21J858m43j478J489N36j768N78J452j343p42J808m20
$$ 1037 -717 -654 1095 -195 -1116 742 299 -1179 310 846 -922 -344 1108 -235 -977 831 411
3448D11j619J710K61j552N09J430j491m71J886p85j374J642K95j680P54J147j494
$$ 411 -1208 502 763 -789 -280 1150 -341 -812 1074 289 -1085 557 852 -828 -74 1073 -421
3465d21l30J693p41j117J479J67j708J026J072j734R8J562j123q93J724k64j569
$$ -421 -751 942 201 -916 563 730 -978 48 1120 -614 -516 1046 -77 -970 754 490 -1079
3482a079J257P15j732N57J283j387l33J469m08j373J414N38j711O09J055j261
$$ -1079 178 893 -839 -282 1001 -386 -719 750 342 -1031 383 921 -790 -181 874 -387
3498c87j99J470r62j013J640J21j627Q98J143j758O6J597j020j054J736j36j614
$$ -387 -586 884 -78 -1091 549 670 -957 -59 1084 -674 -608 989 -31 -1085 651 515 -1099
3515a099J220P66j498RJ548j094q93J624j38j441J253N27j521L36J136r93l95
$$ -1099 121 887 -611 -602 946 -148 -1041 583 445 -996 257 784 -737 -401 735 -258 -653
3532f53J483o45j056J155M70j649O08J328j483k18J573p72j141J623O1j478O52
$$ -653 830 185 -871 284 754 -895 -287 1041 -442 -660 913 141 -1000 623 684 -794 -142
3549a42J202j473l01J534p36j124J610j32j346J112P50j769N18J334j141q32J679
$$ -142 1060 -413 -714 820 84 -1040 570 438 -908 204 954 -815 -297 1037 -104 -936 743
3566G43k84j440J218P22j774N27J371j502k15J373m44j242J502K14j682Q44J005
$$ 743 459 -981 237 959 -815 -288 1083 -419 -634 739 295 -947 555 769 -913 -69 936
3583I36j393j61J451o15j230J576m2j448Q95R29j589K11J348r90o81J547l70j407
$$ 936 -457 -618 833 218 -1012 564 522 -926 -31 898 -691 -480 868 -122 -803 744 374 -1033
3601a033J162N58j383L35J311j160p91J749k72j402J169O26j631L59J126j127
$$ -1033 129 687 -696 -361 950 -210 -1001 748 476 -926 243 869 -762 -403 723 -404
3617d04k50J320n75j102J590p0j503R89R63j581K16J229n57j192J433J47j527
$$ -404 -654 666 91 -1011 579 509 -994 -5 958 -623 -407 822 265 -927 506 653 -874
3634h74Q17J006j512QJ334r34o75J460j29j386Q48Q78j308j14J525j068n53J513
$$ -874 -57 949 -563 -555 779 -155 -830 630 501 -885 -37 841 -467 -581 944 -124 -677 836
3652H36m56j007R90K65j186K24J283j348o4J228m95j056J288J84j352O60Q17j128
$$ 836 380 -627 363 628 -558 -334 949 -399 -463 765 270 -786 502 686 -666 -6 811 -317
3670c17l38J457n94r77J186K13j297O38Q15j247J46J190j110l81J262m35j055
$$ -317 -655 802 208 -769 417 630 -667 -29 786 -461 -315 875 -235 -616 646 211 -844
3687h44J159L14j467K66J444j126n71J323m00r23J198J98j170N13R16j174m81
$$ -844 315 629 -838 -572 872 -254 -825 498 98 -825 373 571 -599 -86 830 -344 -825
3704h25J541n07r40R47M90j273M10R25j013l04J300q23m82J005o3j029P05O48
$$ -825 716 209 -731 216 706 -567 -157 768 -245 -549 751 -72 -554 451 388 -641 64 712
3722G12j197K3J336r77p41J353k58j077R41N79j250P4J179q31m40J055j83j157
$$ 712 -485 -462 874 -103 -844 509 251 -826 115 694 -556 -482 697 -134 -574 481 298 -859
3740h59J102J72r52O99M30j058O5J156n90r68J226K8j085N92R07j288M0J304p75
$$ -859 243 415 -537 162 592 -466 -401 755 165 -803 423 451 -634 -42 865 -423 -383 921 146
3759A46q50J180j39r41O97M16j111L01J219r24m95Q32j03q84Q27L86j121K47R94
$$ 146 -704 476 337 -604 93 509 -602 -301 918 -6 -501 331 228 -656 171 557 -564 -317 677
3778F77j008j68J020n44p22J111J29j180N27J120j266k86J256n53q15R32L21j196
$$ 677 -331 -499 521 -23 -745 366 495 -685 -158 962 -304 -590 666 113 -702 230 551 -645
3796f45O05Q72j235O3Q14o05l74R79j40r34P38M88j065K50J062r78o56J272j24
$$ -645 -40 832 -403 -340 474 -131 -505 474 334 -600 138 626 -439 -189 873 -105 -761 511 387
3815C87j043R02K14j030L65P91q05k37J053l52r02P07M99j091M08R43j080k50
$$ 387 -656 246 460 -570 -205 586 -219 -456 597 245 -657 50 549 -542 -134 809 -271 -521
3833e21J105m27q22J055M0r47N07P16j143R6Q97n91n34R59Mj117Q70P18j276o6
$$ -521 584 157 -665 390 430 -517 -10 706 -437 -341 556 -35 -569 390 394 -723 147 865 -411 -477
3853d77J024o99m91R44m7r75R33M72j008P3P84o99k47R86m82o72Q32L16j152L99
$$ -477 547 -152 -643 301 254 -721 212 684 -324 -251 533 -166 -413 573 91 -581 251 567 -585 -186
3873a86Q38j002qR09m99o39Q66K20j074N62M42q04P9P39n57p05J269k44r14Q77
$$ -186 652 -350 -358 551 52 -587 279 499 -575 -13 429 -375 -296 443 -114 -819 450 206 -708 169
3893A69M43r83q9J007p66k43R03j86p10M88M19r23L84O47r59mQ53k44q58R07K30
$$ 169 612 -371 -460 547 -219 -462 441 255 -455 33 452 -471 -87 560 -399 -403 450 206 -652 255 485
3914D85r61J56R53q67j31R35n41n14O16J78r69P91M54r25J23Q22p02m66J002j55
$$ 485 -476 -320 633 -234 -365 570 29 -485 131 309 -660 131 585 -340 -217 605 -97 -563 439 284
3934B84p86N50M92j025R8R58q01k93P57P6o87M96M37r79J40P85p47n6O89j87p62
$$ 284 -502 48 540 -485 -387 571 -230 -523 234 310 -377 119 556 -423 -283 502 -245 -301 388 201 -561
3955e61O94M04j023K86O33n98j40O68m58o42J173k1q46L55M90o52p9P49m30l69
$$ -561 133 537 -486 -200 433 -165 -305 363 -95 -737 436 415 -431 -76 414 -238 -317 432 2 -367
3975c67N62O3p66M36N80q41J46O83n41k96O20qp33N64M07j050L46O00n58k34P66
$$ -367 195 258 -508 -72 508 -333 -187 496 -45 -341 279 271 -462 102 509 -541 -195 405 -153 -387 379
3996C79j74o80P85m9n09K57M47p58q7Q15k54o59O91J31j017P81M58j005M6R52
$$ 379 205 -475 310 261 -248 9 456 -302 -389 426 172 -487 204 335 -682 99 557 -448 -402 550
4016E50n77l38Q47m16o36N03O08p13J7N25m44m83P59J29p45O63K08r28K32P39
$$ 550 -27 -365 482 66 -570 -67 541 -172 -155 370 -74 -557 202 331 -414 249 457 -471 -239 500
4036E00p22j62P19j97o10N88L85p67J03O83p11j65O90j96n41N21O7o38N27K41
$$ 500 -222 -384 335 138 -472 116 501 -266 -163 520 -191 -356 334 138 -403 118 185 -453 74 315
4056C15p08J43P28m38n77P95r6n31M10J56n83K85N20m13l42O07j65n11L40M14
$$ 315 -393 -250 478 40 -537 258 162 -369 41 197 -386 -101 419 6 -336 271 106 -405 -65 349
4076C49o47J85N85m99k76N23op57N73M44q90L41N09o21j89P45k74l91O33np99
$$ 349 -298 -113 472 -27 -303 220 214 -543 30 474 -416 -75 434 -187 -376 369 95 -296 337 332 -467
4097d67M62M91n43j78P66m78m05N89j15m19L50K64m88J36M18k73n46O45L5n42
$$ -467 -5 486 -57 -235 531 53 -352 237 122 -297 53 317 -171 -35 383 110 -436 209 244 -298
4117b98L67L77p48K40L90m78k26O58n6m71M03K28n64J64M12n35k91Q77l50o27
$$ -298 69 446 -302 -62 328 -150 -376 282 226 -245 158 386 -178 -14 398 -137 -428 449 99 -528
4137e28P43P2p81N13L00o23O4N57l60l39O93k30n03N17J59m58M9M90m25m15P31
$$ -528 215 287 -494 19 319 -304 -240 317 -43 -382 311 81 -422 95 254 -204 -155 335 -90 -505 226
4158B26q6o25M59M41q91K38N07m62j18O54k35m44L89L59o85K08N38n36j28N49
$$ 226 140 -485 -26 415 -476 -238 269 -193 -311 343 108 -336 53 412 -273 -65 473 -63 -191 358
4178C58k63l39N54j89l11J78L76p46J49M42m00j84O32Kp09N68J48m71q2P61m59
$$ 358 95 -244 310 121 -190 -12 364 -382 -233 209 -191 -375 257 259 -450 118 266 -205 -287 474 15
4199A5l41N67K6n32K36M04o79K36M84l98l14P10j70n27M05K17n48N7P18p16m5
$$ 15 -326 241 267 -265 -29 375 -304 -68 416 18 -296 414 244 -283 122 339 -209 -152 566 -150 -195
4220a95N92l50k88K77O6m45M12K58m11r1L94k21l67N54N0n37L77J89m59R5K84
$$ -195 397 47 -241 36 102 -343 69 327 -84 -175 219 -2 -369 185 235 -302 75 264 -195 -100 184
4241A84j39m83Q32k19n14M87%l19J9O29o05k71P03k85m38O95N8q21M54K44n27
$$ 184 45 -438 394 175 -339 148 148 -171 -152 477 -128 -399 304 19 -419 276 334 -487 -33 211 -316
4262c16J58M15k60k23K58L08n65J17M46m83k95P82m96k3L50K5o22M18M40p11j9
$$ -316 -158 257 -3 -226 32 340 -225 -108 338 -145 -440 342 -154 -177 173 198 -424 -6 434 -277 -296
4283b96P37n20l77O70N5n63L46K38m80J27L40m07k36O93k52m50N56J36n68K98
$$ -296 441 -79 -456 214 269 -294 52 290 -190 -63 277 -130 -366 327 75 -375 181 317 -251 47
4303D7L90m40k62O87l31l88L92M5m39J97K99l15qM56l82l60N72P3o76L79M40n82
$$ 47 437 -3 -265 422 91 -297 95 140 -299 -102 197 -118 -126 330 -52 -412 160 233 -443 -64 376 -206
4325b06m6M98l52j41K61l5l53M87J35l82oM46m38k13O97l64m50M48L48o57O4O30
$$ -206 -252 246 -106 -247 14 -21 -374 113 248 -134 -140 306 -132 -345 352 -12 -462 -14 334 -323 -259 371
4347C71m76k41N72r2o43O42J23n91J08O18o09%M28k68j97L43J39o50M04K39m26
$$ 371 -105 -346 226 134 -509 133 256 -335 -227 391 -218 -218 210 -58 -255 88 227 -423 -19 220 -206
4368b06j72P17k92j88L05p6k93K12K74n68J21O96n88m11Q44k14l82M22K41p63
$$ -206 -378 339 47 -141 164 88 -205 7 281 -287 -166 530 -58 -469 375 161 -221 201 442 -321
4388c21J96M10k38k47L93j83k32J78K16m16J60N48o03kK87n4n12M94J94o71K53
$$ -321 -125 285 47 -200 193 10 -222 -44 172 -244 -84 464 -139 -141 146 92 -420 74 268 -403 -150
4409a50O14o21L9M11k60q3J35R1n31K35M22m70O0M33l62j21L14j3m02K17J78n10
$$ -150 464 -157 -118 293 33 -50 85 176 -355 -120 302 -168 -108 325 -37 -158 156 143 -259 -42 136 -374
4431c74Q9O81n02k07P19l04m04N06R7p02M27K99n34P7N98l93n00N51Q1n87M20
$$ -374 -285 396 -106 -313 406 102 -302 204 301 -401 26 325 -209 -132 466 73 -427 124 205 -382 38
4452C8L79o60k8N21r2k44L28j7n58M54J69n74J50M54l94k75M99l6m51K77K94m01
$$ 38 417 -243 -271 250 158 -86 242 225 -333 121 290 -284 -134 320 -74 -349 150 114 -337 -60 234 -167
4474a67J06M51n16j72N33j80l97M93J07n32K44M21o10j69O88m32j49N84J19p70
$$ -167 -61 390 -126 -298 235 55 -342 151 258 -274 -30 391 -219 -388 300 -132 -281 303 422 -348
4494c48K86M58n23j48O27l53k55M20l2n15L94K26n12j36P44l84k01M67qn13K82
$$ -348 -62 396 -127 -275 352 -1 -256 164 132 -383 11 237 -275 -411 333 -51 -252 215 207 -306 -24
4515b4K39o02K75M39m02j41N10l77k35M59N2m47K49L86l40m48O97j69o50O51R8
$$ -24 215 -387 -112 327 -75 -216 294 -83 -318 141 193 -254 -5 381 41 -407 290 121 -529 122 220
4536B20n10K44M15m94k5L54q4m63N95r3l81L58J55n18L4M97k81l36N27P6m72M14
$$ 220 -290 -46 369 -125 -150 204 120 -343 252 159 -222 136 291 -227 -193 304 23 -313 214 290 -182 232
4558B32q2l67J62L70m22k5L97j79l67L60K59n83K56M80o26j39O72l44l15M44R5
$$ 232 150 -217 -55 315 -107 -132 265 86 -281 79 338 -245 11 491 -135 -274 398 54 -261 183 278
4579B78o24K84L45k85m5M37m43k20O20k93l68L77J19m57K11L74k83l38N58o8l80
$$ 278 -346 -62 283 -2 -47 390 -53 -273 347 54 -314 63 182 -275 -64 310 27 -311 247 179 -201
4600b01K95J90n79L27K54m84j2M46r5n46N91O7n20L38K94l62j87M30r8l87L31
$$ -201 94 284 -295 32 286 -198 -210 236 141 -405 186 253 -267 71 365 3 -184 246 148 -239 92
4621I2p5k27J74K53k91k01N32l58%L82r3n45K65N96o18L0M02k79k54L97K2o39
$$ 92 17 -210 -36 217 -74 -275 257 -101 -101 281 188 -357 -92 504 -114 -84 318 39 -215 182 204 -435
4643d35P41J32p27J40N08l35k61O51l85l15M67J17l93j66M69k28k90N73j60m31
$$ -435 306 438 -289 -149 359 24 -237 414 29 -286 181 298 -95 -261 208 -20 -310 263 103 -328
4663c28M00L25o94K36L84l16n3K02n9l94M72O1n47L00K95n51J5M75m49j22P08
$$ -328 72 397 -297 -61 323 7 -46 156 97 -297 175 236 -311 -11 284 -267 -252 223 -226 -348 360
4684C60k70n27M82L03o47N2N08k48l35M91n7n02P41k12m12K76L98m61k20N22j19
$$ 360 90 -437 45 348 -299 -247 261 13 -322 169 112 -390 351 139 -273 3 401 -60 -280 242 123
4705A23l19K57J18l04J13K25l31j06M19j46m63O83o0l58J05K15m25J5M40j93k01
$$ 123 -196 61 179 -125 -12 213 -118 -224 195 49 -414 269 209 -149 -44 171 -254 -239 201 8 -193
4726a93K88%m97N08J55l48j75M03j70o6M01j99j05J73J39n48J40M20k73j85L59
$$ -193 95 95 -402 106 261 -87 -262 141 -29 -95 306 107 2 175 314 -234 -94 326 53 -132 227
4747B27Rl25L12N0m61L9N91n84j9M95k38m55M91J83n40R2L78m15O2M10k71k04
$$ 227 236 -89 223 273 -188 -149 442 -142 -161 334 96 -359 132 315 -225 -133 245 -170 -108 302 31 -173
4769a73K76j1m70N13J28m22o8N39m24q5L81j09m20O42j02m43N7N15l99k40M19
$$ -173 103 92 -378 135 263 -159 -227 312 -112 -197 184 75 -345 297 195 -248 -191 324 -75 -315 104
4790A04r5j12J58L50m96j5M00m08j04M42j77k93M41J58o88J58L68n80K00M80k23
$$ 104 9 -103 55 405 -91 -106 294 -114 -218 224 47 -246 195 353 -335 -177 191 -389 -189 291 68
4811F8l92N60L8o47L66L32n40L6M68k92j52L07q4m84N82J45n13K0K44j41r6L51
$$ 68 -324 236 274 -373 -7 325 -215 -179 289 -3 -155 152 68 -416 166 311 -202 -182 62 -79 -175 176
4833A76j37k98M00J26l12L1J08k06MM16k74l70L88n8j37J81K66l47k16M04om86
$$ 176 39 -259 141 267 -45 -14 94 -112 -108 308 34 -336 52 -6 -143 38 304 -43 -259 145 139 -347
4855c47O34N0o82L82K29m46R5L74k07m07L94j41l45M34L02n94K80K78n38mM38
$$ -347 287 337 -345 37 266 -180 -85 289 82 -325 69 -72 -417 17 319 -275 5 283 -255 -259 179
4876A79j1o50O40k9m04L88K72m72j12L42n7l39M84j55j54O5J55l98L8L94j14m65
$$ 179 168 -482 158 129 -275 113 385 -87 -199 143 86 -253 231 76 -78 -13 142 -256 -218 176 62 -403
4898d03M83J55m54J61K68k32q5L38l60r4M75J4n73K98L03m92J61L46m57j69N77
$$ -403 80 235 -219 -58 210 -22 -107 231 -129 -223 252 266 -307 -9 294 -198 -37 309 -148 -317 260
4919B60k18k68K91K27n31K19L53l14k01M45r9m91M10J00m39J20M50m48P4L25k19
$$ 260 42 -226 65 292 -239 -20 333 19 -182 263 164 -327 83 183 -256 -136 314 -134 -60 265 46
4940D6l51M48J11n26M5M01l03p1N86l43k77M34N8n95N10R2o20K32L03k74j72O49
$$ 46 -305 143 254 -272 -227 174 -129 -200 386 43 -234 200 258 -337 173 265 -355 -123 180 -94 -266 383
4962C83j64n53M11J01k53J24L94n78M7K04p9j30L42r0n38M26O4k72JM06k79j34
$$ 383 219 -334 77 178 -75 49 443 -135 -88 116 37 -93 249 159 -379 47 111 -161 -160 246 -33 -167
4984a67L70P2n07J51K89m49K11K22l04%L80Kn80M92K00m00q3L11l59j18O04j44
$$ -167 203 275 -232 -81 208 -241 -30 192 -112 -112 268 270 -310 182 382 -18 -101 210 -149 -267 337 193
5006A93m27M84J7l55J28J97m60J62K59j30k98L16J76n84J81M89m32j70L89j02
$$ 193 -234 250 267 -88 40 237 -223 -61 198 68 -230 86 262 -322 -141 348 -84 -254 135 33
5026C3l62N64j4n09K15J62k91K05K65m51j3L35k4l27K60K46n65J80L29k96j67
$$ 33 -329 235 221 -288 -73 89 -202 3 268 -183 -196 139 115 -212 48 294 -271 -91 238 -58 -225
5047b25L83j95k60L18K01n50K18K05k34R8K65j60j70K77P2m17lN14m11m9K20m8
$$ -225 158 -37 -297 21 222 -328 -110 95 -139 -41 224 64 -106 171 243 -174 -177 337 -74 -123 97 49
5069D9l53M71j21k09J24K66m29J75K62k84j50M93k32l64M72M4l24k1L33j83p7
$$ 49 -304 167 46 -163 -39 227 -202 -27 235 -49 -199 294 62 -302 170 214 -110 -131 202 19 -58
5090e8K57j51l01L00J01j65j11K69l18j03M92k30k08L63j5k26Q9K23j97k36L91
$$ -58 199 48 -253 47 148 -17 -128 141 -177 -280 212 -18 -226 137 122 -104 -15 208 11 -225 166
5111A66q0n05P35o6n44L35J59k52r5M45l74j21M82j47m45M51O9m25J67K90m31
$$ 166 86 -419 316 250 -294 41 200 -52 -147 298 -76 -197 285 138 -307 144 213 -212 -45 245 -186
5132a86j21N16j90l30N50k8m60J68L73m27j55N02k84k23M56p4l37K65K37l51k38
$$ -186 -307 209 19 -311 239 211 -249 -81 292 -135 -290 212 -72 -295 161 87 -250 15 252 -99 -337
5153c37N68k76k30L82L9m07K55J80m68O8N68m26j66M16Q1m39K55J25m84K87L14
$$ -337 231 -45 -275 107 146 -261 -6 174 -294 -226 342 -84 -250 166 247 -192 63 188 -296 -9 305
5174C05l41j49M03j12l61L87P6l09L4K46q1l72N44k35l41L65J05m43L15L33m04
$$ 305 -36 -185 218 106 -255 132 208 -101 -67 179 98 -274 270 35 -306 59 164 -279 36 369 -35
5195c5j33L55j48j65J75P6n06L47L02m64M9M57k76l34M90J9m79K01L05l97J44
$$ -35 -168 187 39 -126 49 125 -381 -34 268 -196 -147 310 34 -300 190 209 -270 -69 236 -161 -17
5216a7J81k11k30N59j62m18K90J03l43J58J36k13R8K31J1m96N48m6l92J06L84
$$ -17 164 -47 -277 282 120 -298 -8 95 -248 -90 46 -167 -69 162 173 -323 225 179 -213 -107 277
5237B77m87L0M21l83k55N42Pm60M19J59m83o4M47j12k54L22m4l07K36M23n43J54
$$ 277 -210 -180 241 -142 -397 145 152 -308 111 270 -213 -277 170 58 -196 126 82 -225 11 434 -109 45
5259D5J71k58j03K39j36k62N07j60l48K46M25m44j24M27k6m21Q5K41l89L55K26
$$ 45 216 -42 -145 94 -42 -304 203 43 -305 -59 366 -78 -202 225 199 -222 -137 104 -285 70 296
5280B96j78l10M89m10k05N57j01m41L31K57m00o9O06m06k30M52k44k97L05K44
$$ 296 118 -192 297 -113 -318 239 138 -303 28 285 -115 -184 422 16 -214 238 -6 -303 2 246
5300B46m47J77K18k70j73L42m8l11M43K4l92L5N04n09j55N55k41k85M40J55n88
$$ 246 -201 -24 194 -76 -249 93 45 -266 177 201 -191 -156 348 -161 -316 239 -2 -287 153 308 -280
5321b80J85K54k84p4N33m27k26M12j13k76L02J71k14n1L05k12j47L31N2n26L26
$$ -280 -95 159 -125 -199 334 -93 -319 93 -20 -296 6 177 -37 -88 217 5 -142 189 241 -285 41
5342D1K89n88J74L49k03k76N38j64m81K11M53o54K87K88k55k19M28j78k22J86
$$ 41 330 -258 -84 265 62 -214 324 160 -321 -110 343 -311 -24 264 9 -210 218 40 -182 4
5362DJ56l64J64L57n50j4L78j32k37L97l8k69J77J65l20m5L51l04PJ74L7l23K59
$$ 4 160 -204 -40 317 -233 -247 131 -1 -238 159 121 -148 29 194 -126 -171 180 -124 -117 57 94 -229 30
5385C0K21l95P8L77k94k13M89j63k48J78P8n20K50L36j98l02M57j5m03N11j49
$$ 30 251 -144 -66 311 17 -196 293 130 -118 60 138 -382 -132 204 6 -296 161 146 -257 254 105
5406A05k67J77J29l07j61P01l62k42K03J07k62K27N7k44L1M19m39j85N17j90j6
$$ 105 -162 15 144 -163 -324 377 15 -227 -24 83 -179 48 105 -139 -108 311 -128 -313 204 14 -2
5427bj8K08m33K91J17j00k81M13k1l77K06J67l31M5L20o9j49J4J38l76K37J32
$$ -2 -20 188 -245 46 163 63 -218 195 174 -203 3 170 -161 -116 204 135 -14 0 138 -238 -1 131
5449A31l02J99P1j94j22L22j07k83M62r7m09L07J72k90J28J76j97k9K24j71m2
$$ 131 -171 28 99 -95 -217 105 -2 -285 177 80 -329 -22 150 -140 -12 164 -33 -62 162 -9 -51
5470e1k6L55m63J57M23l73j61J34L0l00M54J7l68MP6P8j29K96j50l36N37J23m94
$$ -51 -77 278 -185 -28 395 22 -139 -5 25 -275 179 196 -172 -168 -92 -14 -143 153 3 -333 204 327 -167
5493a67J17K07k91j30N92l38j51L95K5o03K45J19r7m3L07k90n9J93J54l68L10
$$ -167 -50 157 -134 -264 328 -10 -161 234 259 -344 -99 20 -77 -120 187 -103 -162 31 185 -183 127
5514A27K03l55J6K55l73M7J58l3r0jR3j35PK67k32l17N82k15k15L30M8k87K01
$$ 127 330 -25 -9 246 -127 -80 78 45 -45 -46 47 -88 -81 186 -46 -363 219 4 -211 119 167 -120 81
5537H1Q9k19j14L48j48k90L36J51m47K15L54n00k5L13k63k67P65k09l07K15J35
$$ 81 170 -49 -163 185 37 -253 83 234 -213 2 356 -144 -169 144 -119 -386 379 170 -137 78 213
5558B13m10O1M31l23j23L21j69k82L51L5k98O5M03m05rK84j43k44M82q4m95K48
$$ 213 -197 -136 295 -28 -151 170 1 -281 70 105 -193 -128 275 -130 -139 145 2 -242 240 156 -339 -91
5580i1L65l46j14M78j10l69L36Q4m98L92R9k77n6R1J74l51L70j31j79J43K06l42
$$ -91 274 -72 -186 292 182 -187 149 233 -265 127 226 -51 -107 -16 158 -193 177 46 -133 10 216 -126
5602a26J18K85l24k07K41Q7l84M41J6j74n3L34l32j38M91l01k69L10O9l95M77
$$ -126 -8 277 -47 -254 -13 74 -310 131 147 -27 -80 254 -78 -216 275 -26 -295 15 84 -311 166
5623A66K84n75Q4L34j07l25K50K12n89J72K02k00O6J49k79j23M79j41k69J3M04
$$ 166 450 -125 -41 293 186 -139 111 323 -266 -94 108 -92 -26 123 -156 -279 200 59 -210 -197 207
5644B07l39J30K05l27j72L80k7l01K89L47n03r5M37k79L8K95m28j11L35M8l18
$$ 207 -132 -2 203 -124 -296 84 57 -244 45 392 -111 -206 231 -48 -10 285 -143 -254 81 129 -189
5665a89J35K86m42J23K37J0l64L64j70k40J1N10l87K3L29l21m6K73j63k35K77
$$ -189 -54 232 -210 -87 150 160 -204 160 -10 -250 -239 271 -116 -93 236 -85 -131 142 -21 -256 21
5686B1J56l63O2N6j4M8R2N3l80K70J7k21J78L55k87k44M58k56k76L75k6m14J94
$$ 21 177 -186 -124 -68 -82 -34 58 111 -269 1 18 -203 -25 330 43 -201 257 1 -275 100 74 -340 -146
5709a46L90l98P1L91k25l54L86O8l55K31K54m71L4K92J6m90M41j8k87K56J65k76
$$ -146 244 -154 -83 308 83 -271 115 183 -172 59 313 -158 -124 168 184 -306 135 117 -170 86 251 -25
5731b5q5M22l39j64M83j51m23N04J05m69J6M92l32k24K06J00l98L82L0k42J05
$$ -25 -110 312 -27 -191 292 141 -282 222 327 -142 -126 366 34 -190 16 116 -282 100 130 -112 -7
5752gJ41k90P3K38k24MJ49j16l27K72K52l79l6N24p8l02K25N4l57K31Q8k69l0
$$ -7 134 -156 -83 155 -69 -65 84 -32 -359 -87 165 -214 -250 274 196 -106 119 173 -184 47 135 -134 -164
5775a64N45l94J8J43j91l04J70M77n38J61K68l63L4M37k00m20K18L42m23K40N3
$$ -164 381 -13 5 148 -43 -347 -177 300 -238 -77 191 -172 -138 299 99 -321 -103 239 -184 56 109
5796A09k79j26L74Nk91K09J04j41k5J83j71l1M25l52k19N07o8l49L37n6k25p4
$$ 109 -170 -296 78 83 -208 1 105 -36 -61 122 -49 -80 345 -7 -226 281 213 -136 201 145 -80 -154
5818a54L31k19j39K99l9l50M21k9k71J8K29l5j88K71k22p3L51J5o11K42M54l96
$$ -154 177 -42 -181 118 79 -271 150 121 -150 -132 97 62 -126 145 -77 -150 201 216 -395 -153 301 -95
5840i5j28L62n5k12K62J19m23Q0M02m25R2K54k08j51K25j2m31L55J93k24N5K83
$$ -95 -223 139 84 -128 134 253 -170 -90 312 -113 -21 233 25 -126 99 87 -344 11 204 -20 35 318
5862C18m45j94L91j47k98L29K80l70O1L27l07j81L38j89j79L38J15l14Q1M05l55
$$ 318 -127 -321 70 -77 -375 -46 234 -136 -75 252 -55 -236 102 -87 -266 72 187 -127 -46 359 4
5883Dj94L89j44k14J64L11n07L02J48m32K75p8Q0j70J23L0k64K29J49k91L5L05
$$ 4 -190 199 55 -159 5 316 -191 111 259 -173 102 24 104 -66 57 87 -177 52 201 -90 -55 250
5905B50k55j42M26o8k89J55l2k9j59L69k52j21L22J0m01K87L12n23NL18j82k24
$$ 250 -5 -147 279 211 -78 77 45 16 -143 226 -26 -147 175 185 -216 71 383 -140 -135 183 1 -223
5927b23L71k3m32J19L90l96J67K58k44p7K57j22j87K18r8j24J33M38o43J43K92
$$ -223 148 125 -307 -188 202 -194 -27 231 -13 -90 167 45 -142 76 -22 -146 -13 425 -218 -75 217
5948B17q8k89K91j3m72L52L01k56j70L46m23Q8L72k51k48K17J50l33J83L46k40
$$ 217 129 -160 131 118 -354 -2 299 43 -127 219 -204 -116 256 5 -243 -26 124 -209 -26 320 80
5969H0k47J78M5j71K20K96o23J70J80m50L18J99k12n1J64o5j42J71K25m32J66
$$ 80 -167 11 56 -115 105 401 -222 -52 128 -322 -4 195 -17 -68 96 31 -111 60 285 -147 19
5990A9K61k49k18K92J45m92L52K86n13m9M14l01n6P4K0l13L64n6j77K13R9J7k56
$$ 19 280 31 -187 105 250 -242 110 396 -117 -166 248 -53 -109 -35 -15 -328 36 -20 -197 16 115 132 -124
6013a24K53n3m95M74J80l35N6K63l58O8J10N3l37L13R5n31K21M20l68j33N56l53
$$ -124 129 76 -419 55 235 -100 -44 219 -139 -71 39 92 -245 68 163 -368 -147 273 -95 -228 328 -25
6035b5p6K10l7k84J55K64j66k69L92p5k67M57k98l12L64J69m79K93K10k11j59
$$ -25 -101 109 72 -212 -57 207 41 -228 164 89 -178 279 -19 -331 33 202 -277 16 226 15 -144
6056a44K57J4k90K14J05j17n7J84l27k1K66J4k26K97k7k65J04L15l81o1L41M0
$$ -144 113 127 -163 51 156 39 -18 166 -161 -182 84 98 -128 169 142 -123 -19 296 -85 -146 195 235
6078B35l45L74r5l35K89J00l40J30J54p2k51L68j66k14K17K26l46J7K02j9k92
$$ 235 -110 264 169 -166 123 223 -117 13 167 95 -156 212 46 -168 49 275 -71 -54 148 129 -163
6099a63L89l9m04L02m2j73J89K02l95j33M82j03k23K46J92m05r5K94j03o9J9K0
$$ -163 226 187 -217 85 43 -130 59 261 -134 -267 215 112 -111 135 327 -78 -173 121 18 -51 -32 -12
6121a2l59L93k4j91J01K54k60o5K80k08r8L38j67n5j36N23l02r9J35j96R3J91
$$ -12 -371 22 -2 -193 -92 162 -98 -163 117 -91 -189 149 -18 -73 -209 314 12 -87 48 -148 -55 136
6143A36j6l31L16O2k71K68J40l58j11K05J4k94K35K37n05K35K69m38L6L63j57
$$ 136 120 -211 105 167 -104 164 304 -54 -165 40 54 -240 -5 232 -273 -38 231 -207 -171 192 35
6164C5j66L98k27j38J94K71m83j7L52p6m13L22N6m49L13J73j69j12L74l47K0J25
$$ 35 -131 267 40 -98 96 367 -116 -133 219 143 -270 52 108 -341 -28 145 -24 -136 238 -109 -89 36
6186C6Q4k47J84K95l27pL25k94j73M20k60j76K50J47l92K8K99J04n10L40j42k40
$$ 36 120 -127 57 352 25 18 343 49 -124 296 36 -140 110 257 -135 -107 192 296 -214 126 -16 -256
6208b56L14j20k12K49K81m10o8N05j70l53L53j97k1J33J86l00n8K22j76j3J34
$$ -256 58 -62 -274 -25 256 -154 -222 283 113 -240 113 -84 -105 28 214 -86 -144 78 -98 -111 23
6229B3J17l93L07K04k38j23L76l15j07M19j05k58K37J5l10R9L42l52j59M71k16
$$ 23 140 -253 54 258 20 -103 273 -42 -149 270 165 -93 144 159 -151 -52 290 -62 -221 250 34
6250C4r8J09J91n47K58K92l82J47R2J08l29L97j21m68L39J9j96r8M98k14j46L03
$$ 34 -64 45 236 -311 -53 239 -143 4 96 204 -125 272 151 -317 22 41 -155 -253 245 31 -115 188
6272A88j72j11J98K0k86qL18k08J0J58j15j33J12K51k76p7L24k23j4L16l82j19
$$ 188 16 -95 103 123 -163 -171 147 -61 -51 107 -8 -141 -29 222 -54 -131 193 -30 -44 272 -110 -229
6294b29M05L7m59L83nk72j30M43q6l91K46J87m98M62K77o93K33J04J2q2L48l79
$$ -229 176 213 -246 137 132 -140 -270 173 87 -304 -58 129 -369 93 370 -323 -90 14 26 -56 292 -87
6316h7j84K79K73l62N0L02l39n8K84p9l00J88K70l80K00J03l37m7M27K8m49L15
$$ -87 -271 8 281 -81 -31 271 -68 -126 158 79 -221 -33 237 -143 57 160 -177 -224 203 231 -218 97
6338I7j1j63l4K86j58k79L93O3m24M48k00j76J98L11m58l2M84l41l05M79o9k62
$$ 97 86 -77 -111 175 17 -262 131 194 -230 218 18 -158 40 351 -107 -139 345 4 -301 178 109 -153
6360a53J46K32k66j73L66k37l8K27o1m17L67R4k26J98J72n02K67L82k86j86R0
$$ -153 -7 225 -41 -214 152 -85 -123 104 43 -374 -7 87 -139 59 231 -271 -4 378 92 -94 -4
6381dK11l88P4K64l69O2L29j59l33O25k36k37J99J79l09M3J95k87OJ60K5j96J65
$$ -4 207 -181 -107 157 -212 -150 179 20 -313 312 76 -161 38 217 -92 -49 146 -141 -135 25 50 -146 19
6404A9J65k49r0M15l75q6J85J1l27K18K14m19L81K69l07L3J86om99L43J82m03
$$ 19 184 -65 -155 260 -115 -201 -16 -5 -332 -114 100 -319 62 331 24 57 243 237 -262 81 263 -140
6426a40K52J31j72k01M84k92j92K39P7l20J04K23k91q7L43k60j13J57K06l02Q4
$$ -140 112 243 71 -130 354 62 -130 109 186 -134 -30 193 -98 -185 158 -102 -215 -58 148 -154 -70
6447g0K98l49R2L61k57l29L63o6l25L29J79k76K6K99n18J89K71k35r7J85L08n75
$$ -70 228 -121 -29 332 75 -254 109 43 -282 47 226 -50 -24 275 -243 -54 217 -18 -115 70 378 -197
6469a97K23K05l82q7M88j71k80L37k16k61L85K23n00R6L83k80k11M49j10l38L51
$$ -197 26 231 -151 -238 250 79 -201 136 -80 -341 44 267 -233 -137 246 -34 -245 204 94 -244 107
6490A07O1j94j10J66j08k18K88J42l97J76K89m12L50K4k30l7K44r8j55J55J9j12
$$ 107 168 -26 -136 30 -78 -296 -8 134 -263 -87 202 -210 140 164 -66 -103 141 43 -112 43 62 -50
6512e0K1L37l99l2K51r7j62K55p9k21J33K21j58k26L54j36j39J64J3r6Q0J38j84
$$ -50 -29 308 -91 -123 128 31 -131 124 45 -176 -43 178 20 -206 148 12 -127 37 50 -46 34 172 -12
6535a2j13L69k89j44L26o4l19L66p3j44L1K55l21o4K46J50l70K39K39l07p9K75
$$ -12 -125 244 -45 -189 137 73 -246 120 47 -97 -66 189 -132 -196 50 200 -170 69 308 1 -78 197
6557A97p2k08K17k01j96L75L8m49L51J14l21M5K84k85j82M43j33j04K1P9l00K24
$$ 197 125 -83 134 -67 -263 112 150 -299 52 166 -155 -110 174 -111 -293 150 17 -87 -66 13 -287 -63
6579f3J87l13O2J72J32m22L48L04m35p4M40m71j51M07kl76K50K01l71J79J81j78
$$ -63 124 -189 -127 45 177 -245 103 407 -28 -102 338 -133 -284 123 121 -255 -5 196 -175 4 185 7
6601Gk47L97n9l29L13k3l45K89K71k42j94N15l42l16M31l4k98K67K17l52k14O46
$$ 7 -240 157 98 -231 82 59 -286 3 274 32 -162 353 11 -305 126 92 -206 61 278 -74 -288 358
6623C58m42n9K61n8k80K67L01k61j90L43j55m95N38P4l85K07l3k09O5L74m60P8
$$ 358 -84 -143 118 60 -220 47 348 87 -103 240 85 -410 128 202 -183 24 -9 -218 -153 221 -239 -161
6645a61M88j16l63K82J4k07k0K09l55J27K69k11k59L36Q0m52L56K29l33q8M38
$$ -161 327 211 -152 130 144 -63 -83 126 -229 -102 167 -44 -303 33 113 -339 17 246 -87 -175 263
6666B63k85j19J37M3k22J11K72k14q6L63l23j69M52j29k93K05K36o04K88L13m97
$$ 263 -22 -141 -4 39 -183 -72 200 -14 -100 263 -60 -229 223 94 -199 6 242 -362 -74 239 -258
6687b58K13J76jk53J87N3k60K07R6k03l1J60m3k44M87j65k43K15K07m23l2N19
$$ -258 -45 131 130 -123 64 117 -143 64 160 -43 -74 86 43 -201 286 121 -122 93 300 -123 -155 364
6709C64m68r2M93p0l86L5L94l24l5K62j80l12N04j51j51K47L4k47n5L75k61k00
$$ 364 -104 -196 297 227 -159 -124 270 -54 -89 173 -7 -319 185 34 -117 130 164 -83 -138 237 -24 -224
6731b24M73j34m85M67R9l71O5L60k71n4K08q3l16M33j5l00O4K54l73O2L07q5l54
$$ -224 249 115 -370 97 196 -175 -110 250 -21 -75 133 50 -266 167 152 -148 -84 170 -203 -141 166 81 -273
6754b73K43J85k36J70Q5l49J84K25m55pL18N8l63J41L40l48j40M76l51j79L80
$$ -273 -30 155 -81 89 174 -175 9 234 -221 -228 90 148 -215 -74 266 -82 -222 254 -97 -276 104
6775A04j39m8J42K08m53K6K67m37Q8N18k12l10M02J6m42K86K14k93pJ88P7k77
$$ 104 -35 -83 59 267 -186 -160 107 -330 -242 276 64 -246 156 172 -270 16 230 -63 -70 118 195 -82
6797h2L63l21l97L57L29m61P9M00k10j98M04k14k02L08Q6l34P9K20k60j86M77
$$ -82 281 -40 -437 -80 249 -212 -133 267 57 -141 263 49 -153 155 241 -93 -14 206 -54 -240 237
6818B37j14l86L57p7j86J86J24k24j42M01k53l04M31J20k45J4L18l53j9L17q6
$$ 237 123 -263 94 17 -169 17 141 -83 -225 176 -77 -381 50 170 -75 -61 257 -96 -115 202 116
6839A16m84M62J36o91M82K09m62J84K19k49j45L27J14n83M64J38m10J7L95j50
$$ 116 -368 94 230 -461 21 230 -232 -48 171 -78 -223 104 218 -365 99 237 -173 -156 239 89
6859H9k86L06k65r3J51L20o15K99K99j89j66K6L57n80K71P3r5O7J51j76j51K74
$$ 89 -197 109 -156 -249 -98 222 -393 -94 205 16 -150 -124 233 -347 -76 -3 -98 -31 120 -56 -207 67
6881F7j28j87L49M7m22K92K57l03p6M01n28k42N74j6k74K12J76l64J30J52l32
$$ 67 -61 -248 101 148 -274 18 275 -28 -104 297 -231 -473 101 85 -189 23 199 -165 -35 117 -215
6902b15K8M05J2l78J79j1n1q6K83j02p5K92k50n09N21n6l37M28J70k08j43J81
$$ -215 -187 218 230 -148 31 20 -31 -117 166 64 -11 281 31 -478 43 -13 -350 78 248 40 -103 78
6924G8j1l59L03Q8k44L1K90k72j36N03m41k8L64r7l36M02K01o34K50J81j87q3
$$ 78 67 -292 11 99 -145 -114 176 -96 -232 271 -170 -198 166 69 -267 135 336 -298 -48 133 -54 -137
6946a37O1J57l05K98P4l31P1M71m22k30N91k36k88J61K57m02J34O5k07J51M95
$$ -137 -76 81 -224 74 148 -183 -112 359 -63 -293 298 62 -226 -65 192 -210 -76 -11 -218 -67 428
6967D28l27m52N04M0m53M46K75n84p8N26k71l69N09n4k10J99J09n28K57L08l78
$$ 428 101 -351 153 193 -260 186 461 -123 -201 325 54 -315 194 140 -70 129 238 -290 -33 275 -103
6988a03j1L60k03k29L93N6m97J18K57j07k08M23j17k18J01J62k33p3K43j69j64
$$ -103 -114 246 43 -186 207 263 -234 -116 141 34 -174 249 132 -86 15 177 -56 -129 114 -55 -219
7009b19M89l33j61M79j67l58K85J92k97k6K89j09l32M45O1l73J04K96l68J59Q5
$$ -219 270 -63 -224 255 88 -270 15 207 -90 -116 173 64 -268 177 238 -135 -31 265 -103 56 141
7030A41j00k61M02j27l08L35P3k77KK93j85k67L90j13j88K67L5k28J37K43l96
$$ 141 41 -220 182 55 -253 82 155 -122 -120 173 -12 -279 111 -2 -190 77 112 -116 21 264 -132
7051a32m4L43k10j13L40L8n40J04N16l98j97M06j4l89M04L7m01K89O1l79K79K88
$$ -132 -176 167 -43 -156 184 222 -318 -214 302 -96 -293 113 99 -290 114 151 -250 39 100 -279 0 288
7073B88l82l4K79m8n40O72K9m30J03J56k49l0M10j62j65J49o0j83K02K01m34Q9
$$ 288 -94 -128 151 103 -437 235 264 -166 -63 93 -156 -186 224 62 -103 46 -14 -197 5 206 -228 -139
7095a39K65K7l36L10o2k81O9N97m05k86L19p6j29K45n1m17L90K46n06Q5L36m74
$$ -139 126 153 -183 127 65 -216 -147 450 45 -241 78 2 -127 118 67 -350 40 286 -220 -135 201 -273
7117b73pM94j2m20M60m1m40P4L25j34k08L90j22m09L79J27k80o5M57l75pK50j26
$$ -273 -280 214 202 -218 242 201 -239 -165 160 26 -182 208 86 -323 56 183 -97 -162 295 -80 -87 163 37
7140C7k44L90K5l32K40J97o05M4M80j66k35K60o5l91M03Ok57R7L11k03j89L71
$$ 37 -207 183 208 -124 116 313 -292 -248 232 66 -169 91 26 -365 38 44 -213 -116 195 -8 -197 174
7162A74R1l94L26L0m05J07L27l09j04L70j49l35J46L03k46L4K87l02j10K56L2
$$ 174 265 -129 197 227 -178 -71 256 -53 -157 213 64 -271 -125 178 -68 -34 253 -49 -159 97 129
7183A29l62L39J66n35K24K24l16J40J62o3l24M52j35l67K37L85n10J59K77l73
$$ 129 -233 106 272 -263 -39 185 -131 9 171 108 -216 236 101 -266 -29 356 -154 5 282 -91
7203i1p7L88k40l10K77K75m56J66K12k37j13M05j94q6J08J98m45J84J87j76l67
$$ -91 -168 220 -20 -330 -53 222 -234 -68 144 -93 -206 199 5 -81 27 225 -220 -36 151 -25 -392
7224c92O27j66l89M52jk06N6P3j38m2L89m42QL15p7l19K63K16m74M5M93k92k30
$$ -392 235 69 -320 132 131 -75 -19 54 -84 -126 263 -179 -171 144 67 -252 11 227 -247 -202 291 -1 -231
7247b31L43n9j70J53J46k63j14M24l15j35L98l00q2K76K59l75R0K77m11L3K84
$$ -231 112 53 -117 36 182 -81 -195 229 -86 -221 177 -123 -205 71 330 -45 45 322 -89 -56 228
7268B28j68k63M62j16k45j6L01m48J93L20m71m7L42L3k99K37K66l94J0J71j48
$$ 228 60 -203 259 143 -102 -118 183 -265 -72 248 -223 -270 72 105 -194 43 309 -85 -75 96 -52
7289e2n4K45j61k49M06J1j74j7L80m28j83L63L6k92K01J14k67J0K56k79k62N19
$$ -52 -106 139 -22 -271 135 146 -28 -45 335 -93 -276 87 123 -169 32 146 -121 -111 145 -134 -396 123
7311A23O8j90J35nl25J75J11j12k64N94k78o0J44P5m07K35K11l60K00J26j66l78
$$ 123 191 1 136 131 -194 -19 92 -20 -284 310 32 -28 116 191 -216 19 230 -130 70 196 30 -348
7333c48L75J78n29M03Q5k66J9J76o0k31N07k50l66J72L04k94K3K98k02k01L59
$$ -348 27 205 -324 79 164 -102 -83 93 33 -198 309 59 -307 -135 169 -125 -102 196 -6 -207 152
7354A52j70j33K35N7k32kL3J5p8M62m12o5L42r5l29K31J83l26N4J34K7l67M09
$$ 152 -18 -151 84 141 -91 -93 -60 -45 -123 339 -73 -138 204 109 -220 11 194 -132 -78 56 83 -284 125
7377A25O0m91K61K16k40L0K95n00LK93K8k21K40R1j61k06M03k27k79M32l6l81
$$ 125 185 -306 -45 171 -69 -39 256 -244 -241 52 80 -141 99 190 29 -177 226 -1 -280 152 116 -265
7399b65M68J79n12Q0M14m57j89N81m27rL60Nl86J23J70k50r2L91l50J06MN1k09
$$ -265 203 382 -130 -50 364 -93 -282 299 -128 -137 223 228 -158 -35 135 -115 -207 184 -166 -60 -56 -5 -214
7422b14K68K28m32R2K04j50j52L76m1j38O5K59n36k3L84j64j12M24m22K2N9K52
$$ -214 54 282 -150 -58 146 -4 -156 220 179 41 106 365 -171 -194 190 26 -86 338 -84 -62 -3 249
7444B49l64Q1J27q3j60L88j61m07L94J36l27L7K83k38p8K83j82j61L22N5k68M1
$$ 249 -115 -34 93 10 -150 238 77 -330 64 200 -127 -90 193 -45 -123 160 -22 -183 139 194 -74 -33
7466c3P5j36J09J06j18l49N32j83k43L09Q9k20q6N08l70j59K09J28k64L05j08
$$ -33 42 -94 15 121 3 -346 186 3 -240 69 158 -62 -148 360 -10 -169 40 168 -96 209 101
7487A01k36K49J52l96J16K07j47j03J49n6k97L56J27k58n6M29m53K4K34Ml37K18
$$ 101 -135 114 266 -130 -14 193 46 -57 92 36 -261 95 222 -36 -92 337 -116 -92 142 146 -191 27
7509B7J45l38J8M33l31j37L30o0m16M12m7l06R8M55m15j15L90j02k47L87p7m92
$$ 27 172 -166 -148 285 -46 -183 147 87 -329 83 36 -270 -172 283 -132 -247 143 41 -206 181 104 -388
7531c88M00K53l39l9K19k02J5K00K9m71K00L44l94N2K45j28j72M13j86j34J39
$$ -388 12 265 -74 -113 106 -96 -81 119 148 -323 -123 221 -173 -121 124 -4 -176 237 51 -83 56
7552E6J03k93J04K90k62j70K45jk37N1J88k15m9K22r2j02L97j63l80L55P6l92
$$ 56 159 -134 -30 260 -2 -172 73 72 -165 -114 74 -141 -190 32 -60 -162 235 72 -308 47 123 -269
7574b69J58K76m34J5M71m9j61LJ26m07K11M04k98j68K94l15k7K10N3l55K71J97
$$ -269 -111 165 -269 -254 217 168 7 10 136 -271 -60 344 46 -122 172 -143 -170 40 93 -262 9 206
7596B06l37n4M02m44J1K91K3k97J66J35k09q5P9r1n0M58j75l94N61nl65l8M25
$$ 206 -131 -185 217 -227 -216 75 98 -199 -33 102 -107 -192 -113 -204 -254 204 29 -365 196 191 -174 -212 213
7619B13k66k87N41k20o7J42J90n24K29K67l74M1K27j41k8K39j95j47J3K46l06
$$ 213 -53 -340 201 -19 -86 56 246 -278 -49 218 -156 -115 112 -29 -57 182 -13 -160 -147 99 -207
7640b07K41J94j34k19J32M2k54L54O5k37qK91k92P8J54j62l24M48J78l68j13L30
$$ -207 34 228 94 -125 7 49 -205 149 214 -23 -31 260 -32 46 200 38 -286 162 340 -28 -141 189
7662A89k60j58M73j69l42K38J09k48K28J40l60l2M26k52k66L78N9l85M5M98k89
$$ 189 -71 -229 244 75 -267 -29 80 -168 60 200 -160 -192 234 -18 -284 94 153 -232 -187 311 22
7683B2p0P9k3k62M14om58L16Q6j62J55Q2j11j32K69l37o1J52R0k20Q8K11k81J42
$$ 22 -48 31 8 -254 160 154 -304 12 98 -64 91 173 62 -70 199 -138 -199 -47 43 -177 -89 122 -159 -17
7707a7oL2k37M16Qm60J40L13k05k01K86N5l63L57K8l97J67K30r5j65L64l37r5
$$ -17 -23 9 -228 188 196 -264 -124 189 -16 -217 69 124 -239 118 146 -251 -84 146 51 -114 250 -87 -182
7730a82K20K96n38K89J95m40J33L40n83J13K88J1l89K55j03j06J42L46l58M4L38
$$ -182 38 334 -204 85 280 -160 -27 313 -270 -157 131 142 -247 8 -95 -201 -59 287 -71 -27 311
7751C11j43k78L5J82l30L23j51N2n3K98k81j45K6J20j40J09L65m10K28K11l90
$$ 311 168 -110 -75 107 -223 100 -51 1 -52 246 -35 -180 -154 -34 -174 -65 300 -110 118 329 -61
7772f1K2K32L1l38R0K33m58K77M5j72q1P5O8n6J63J85m61J83M00l42j17K44l8
$$ -61 -39 193 224 -114 -24 209 -249 28 73 -99 -180 -105 -37 -93 70 255 -206 -23 377 35 -82 162 124
7795A24m54L42O9k65J77J32k01O7J84j45l97N67L3l88K76J03l07R4J53k48L1L60
$$ 124 -330 12 81 -184 -7 125 -76 -9 175 30 -367 200 233 -155 121 224 -83 11 164 -84 -53 307
7817C07l46k18J70L21k70p8K08Ql70L39M7l78L69K07l68n4K89k34r4L05Ol90L87
$$ 307 -39 -257 -87 234 -36 -114 94 102 -268 71 118 -260 109 316 -52 -106 183 -51 -145 160 166 -224 163
7840A63j22k81K56pk62J85K45j19k38J80K02m13J70K73l55qK73j58j69L37p3k54
$$ 163 41 -240 16 9 -253 -68 177 58 -180 0 202 -211 -41 232 -123 -131 142 -16 -185 152 79 -175
7862a75K92n3j04J15n9j1k21L46j03l11L12l6j87J01K90l60RJ47n3k22K17J87
$$ -175 117 64 -40 75 16 5 -216 130 27 -284 28 -8 -195 -94 196 -164 -155 -8 -61 -283 -66 121
7884A21k52j3L28k94l7K62m6j94K80o5k12J58K5j75l0L15k23o2J85J5l37L61M9
$$ 121 -131 -144 184 -110 -147 115 69 -125 155 90 -122 36 61 -114 -144 171 -52 -114 71 86 -251 110 159
7907A59m04K48J38q7l02L61nl13K52N1l26R5N09n21j3K48l6j58M2J52j00o3K51
$$ 159 -245 3 141 54 -248 113 108 -205 47 98 -228 -133 376 -145 -158 90 54 -104 -62 90 -10 -73 178
7930A78l12j8L48k00k4QK01l55K58O6j52j8K25j98j67K02R2l20K70J71l95J0K36
$$ 178 -134 -152 196 -4 -28 -20 181 -174 84 150 -2 -20 205 7 -160 42 134 -186 84 255 -140 -130 106
7953A06r0j54J69R3j30pK50m09R7K06N1n12L57J45l80K87j76L8o0K34m0l02M78
$$ 106 16 -138 31 124 -6 -13 237 -172 -75 131 182 -330 27 172 -208 79 -97 -59 -119 115 75 -227 251
7976B51j48l30M67j70l53K37K47j19k26L30q8k42K37o7k11J46P8k50L6L80r1k85
$$ 251 103 -227 240 70 -283 -46 201 82 -144 186 98 -144 93 26 -185 -39 39 -211 -175 205 114 -171
7998a71L08J3m93M96M5m59K30K37j78j64L09N3l36K46M0l38J11K87j62l19L46
$$ -171 137 150 -343 153 198 -261 -31 206 28 -136 173 226 -110 136 176 -162 -51 236 74 -245 101
8019A01rk01J64N3l10K21J94k24o1K52ol90L67m4l51K64J20j80j38M74l73j35
$$ 101 92 -109 55 108 -202 19 213 -11 -72 180 174 -216 151 107 -244 20 140 -40 -178 296 -77 -212
8041b12L82j12k30K70K09l98o2J91mk9j7J52m17L16J24l56K8O11m71j94L26j47
$$ -212 170 58 -172 98 307 -91 -153 38 34 5 -12 140 -277 39 163 -193 -165 446 -25 -219 107 -40
8063d0j50L05J88m15K21J72l71O8K28j63k27J35K79n58L83J00j34l97O08l30j03
$$ -40 -190 115 303 -112 109 281 -90 -22 206 43 -184 -49 230 -328 55 155 21 -376 232 -98 -201
8084b01N24j76m37K41K52l44R9Q7O1l38N07j48m04K86K25n09J94L04k42p1M10
$$ -201 323 147 -290 -49 203 -141 -42 45 106 -232 275 127 -277 9 234 -275 -81 223 -19 -90 320
8105C20m14jK17J4k89J44K26k70pR9n0r7L55k13j72P2J02o4J58K19m10k85M41
$$ 320 -94 -95 122 136 -153 -9 217 -53 -60 39 -11 -108 247 34 -138 -66 36 -28 130 349 -61 -346 95
8128I5N6k86O5M02n23Q1M21l00j46J70J53m40L97K6l13j37M37k10j62M37k51k17
$$ 95 151 -135 -70 332 -191 -110 311 11 -135 35 188 -252 145 171 -142 -279 158 -52 -214 223 -28 -245
8150b45M03k26j34n1M86k03j88L82k87j1K67r9k21P2L80m10m8L77k74k11M98j09
$$ -245 158 -68 -202 -253 233 30 -158 224 -63 -74 193 94 -127 -55 325 -85 -133 244 -30 -241 257 148
8172A48l88J25J02p7k00M21q3k22K49m4k61K54L13k03j97L45j41k54K37
$$ 148 -240 -115 -13 -90 -290 131 48 -174 75 31 -230 24 337 134 -63 282 141 -113 124
8191A24
$$ Imaginary data points
##PAGE= N=2
##DATA TABLE= (X++(I..I)), XYDATA
0@%%%%%%%%%%%oJ4j6J6j6J6k4L2l2M0m8N6o8P6q8J04j20J37j58J81k06K35k66
$$ 0 0 0 0 0 0 0 0 0 0 0 0 -6 8 -8 8 -8 8 -16 16 -16 24 -24 32 -36 40 -48 56 -64 73 -85 96 -110 125 -141
34a41K98l34L75m19M68n22N81o44P15p93Q73r63J065j174J291j421J565j725J905
$$ -141 157 -177 198 -221 247 -275 306 -338 377 -416 457 -506 559 -615 676 -745 820 -905 1000
53A000k103K324k576K864l197L588m053M614n310O200p376R008j1426J5352k2732
$$ 1000 -1103 1221 -1355 1509 -1688 1900 -2153 2461 -2849 3351 -4025 4983 -6443 8909 -13823
68a3823M0931j59020j87020N30108j12146l67621L45802J56668m16066R8225K73712
$$ -13823 27108 -131912 -318932 211176 99030 -268591 77211 233879 -182187 -83962 189750
79A89750k78851n0393L25374j79199j95559L08264j9239k99975K36188J56982
$$ 189750 -89101 -139494 185880 6681 -188878 119386 100147 -199828 36360 193342
89A93342l42227M7090L00561k49633j36270L51319p6371l02914K70029J27867
$$ 193342 -148885 -101795 198766 -50867 -187137 164182 87811 -215103 54926 182793
99A82793l58026R1929L01157k78028j29902L53690p6134k88575K49360J24297
$$ 182793 -175233 -83304 217853 -60175 -190077 163613 87479 -201096 48264 172561
109A72561l15419O3244K41481k11856p4776K62590r5953j84419K13810J9337k39892
$$ 172561 -142858 -79614 161867 -49989 -124765 137825 41872 -142547 71263 90600 -149292
120a49292J49595J54709k57063J2723K65563j88427j66942K98115k521k97201
$$ -149292 303 155012 -102051 -89328 176235 -12192 -179134 118981 116460 -180741
130a80741J75161J88276k83351j6793K81214j51233j67755K53260n565k45929
$$ -180741 -5580 182696 -100655 -117448 163766 12533 -155222 98038 92473 -153456
140a53456J63234J30900k44650L4328K19892j74388j01421K33211n9705j91392
$$ -153456 9778 140678 -103972 -69644 150248 -24140 -125561 107650 47945 -143447
150a43447J89462O2048k34209J00071J75736k22395l8524K54583j22215j86763
$$ -143447 46015 108063 -126146 -26075 149661 -72734 -111258 143325 21110 -165653
160a65653K38398M6136k64022J12353J89520k23569m5828K40575j05793j58370
$$ -165653 72745 118881 -145141 -32788 156732 -66837 -112665 127910 22117 -136253
170a36253K02187J5430k06016J23549J18451k00838K1805J87378j49129q8206
$$ -136253 65934 81364 -124652 -1103 117348 -83490 -61685 125693 -23436 -111642
180a11642K07425n4110j73190J73758O3328k17928P7535J72416j89882n8321K27298
$$ -111642 95783 41673 -131517 42241 105569 -112359 -34824 137592 -52290 -110611 116687
191A16687p9023j75917J85362N9707k14189P2961J57119j68245m3405J88437p8307
$$ 116687 37664 -138253 47109 106816 -107373 -34412 122707 -45538 -88943 99494 21187
202B1187j29690J59796K0856j67768R0845J00282j57305J0152J50374j14647p3362
$$ 21187 -108503 51293 72149 -95619 -4774 95508 -61797 -51645 98729 -15918 -89280
213h9280J68630l6849j51439J35249P1636j83329L8655J61214j34310p8007J76511
$$ -89280 79350 42501 -108938 26311 97947 -85382 -46727 114487 -19823 -97830 78681
224G8681l1158j50189J21578O8211j58735L5127J31206j18368n1826J49216m7378
$$ 78681 47523 -102666 18912 87123 -71612 -36485 94721 -23647 -75473 73743 26365
235B6365j15758J22986L3037j42158O2053R8067j28489j1149J37635q3831q4844
$$ 26365 -89393 33593 66630 -75528 -13475 84592 -43897 -55046 82589 -1242 -86086
246h6086J46133q627j47947J04127Q6715j61645J1064J55290j04097q9181J56003
$$ -86086 60047 51420 -96527 7600 94315 -67330 -56266 99024 -5073 -94254 61749
257F1749r164j46092R8784P8660j45184J7690J28756j00198n7394J33903l5484
$$ 61749 52585 -93507 5277 83937 -61247 -43557 85199 -14999 -72393 61510 26026
268B6026j06559J07957L0817j30250O0913R3114j28037j1310J40917q0112r4046
$$ 26026 -80533 27424 58241 -72009 -11096 82018 -46019 -57329 83588 3476 -90570
279i0570J40533P663j43281Q1061R0044j34907l484J32798q1407p6704J30123
$$ -90570 49963 57626 -85655 -4594 85450 -49457 -52941 79857 -1550 -78254 51869
290E1869q524j21907Q7358O2806j26008J8949J09958q7657m8550J17015l0696
$$ 51869 43345 -78562 8796 71602 -54406 -35457 74501 -13156 -61706 55309 24613
301B4613r3191R3943K6777j14410N3134Q2675j11218j1819J23539o6239q5969
$$ 24613 -68578 25365 52142 -62268 -9134 73541 -37677 -49496 74043 7804 -78165
312g8165J19003J4152j26634O3145Q6138j13792j3121J17550o1666p4953J06379
$$ -78165 40838 54990 -71644 -8499 77639 -36153 -49274 68276 6610 -68343 38036
323C8036M501j04331O2747O0000j00272P535R2584p1570m3463J02827k5932q7726
$$ 38036 42537 -61794 953 60953 -39319 -31784 60800 -10770 -54233 48594 22662 -65064
335f5064Q5890L3527j10867L5489R0338r2286l3771J14054l6817r1086R3015L1259
$$ -65064 20826 54353 -56514 -21025 69313 -22973 -56744 57310 20493 -70593 22422 53681
347E3681j12323L9858Q5453r2531k5404J07211m2128p8808R0325J8887r9652M6708
$$ 53681 -58642 -18784 66669 -25862 -51266 55945 13817 -64991 25334 44221 -55431 -8723
359h723O5898q9108l228R0392o0575m9657R6541j5143r0173P6431M4895j08031
$$ -8723 57175 -31933 -35161 55231 -5344 -55001 41540 26397 -63776 12655 57550 -50481
371e0481K2617R6240q4008m4112J11593k5546r3721Q4449L9548j08260K8535Q8049
$$ -50481 -27864 68376 -15632 -59744 51849 26303 -67418 17031 56579 -51681 -23146 64903
383F4903q2880l3175J01581l2041p6059Q0048J9460r0434M3073N8849q3474q67
$$ 64903 -17977 -51152 50429 18388 -57671 22377 41837 -48597 -5524 53325 -30149 -31016
395c1016Q6332n7500n1211R3095q532r0245O6072M9523r6432J1324Q8349o6559
$$ -31016 55316 -2184 -53395 39700 31168 -59077 6995 56518 -39914 -28590 59759 -6800
407f800m5870R3109j3129q3405O5118M1625q9987J5467P7948o4078l5599Q3299
$$ -6800 -52670 40439 27310 -56095 9023 50648 -39339 -23872 54076 -10002 -45601 37698
419C7698j8552o7032O1011K4259p5325K7158N5528o6679j0852P6755m0423n2614
$$ 37698 19146 -47886 13125 37384 -37941 -10783 44745 -21934 -32786 43969 3546 -49068
431d9068P6740M854q2262M6443N3961q0219m642Q4026m6729n5751Q0688N574q2937
$$ -49068 27672 32526 -49736 -3293 50668 -29551 -34193 49833 3104 -52647 28041 33615 -49322
444d9322M4760N2818p4426l627P2350m3010m0474O8426p643o3321N2428K9203
$$ -49322 -4562 48256 -26170 -29797 42553 -457 -40931 27495 19852 -43469 8959 38162
456C8162p4014J9883O3374o1729k5401P8177k4290o2232O4004K1650p7451K8592
$$ 38162 -35852 -15969 47405 -14324 -39725 38452 14162 -48070 15934 37584 -39867 -11275
468a1275N9077o7932j5630P8864l4458n6646O9905J3569p7142L3114N4021o4842
$$ -11275 47802 -20130 -35760 43104 8646 -48000 21905 35474 -41668 -8554 45467 -19375
480a9375j1208O8775l3172m2422O0157j296n8434M2846K8609o4314J5581N7131
$$ -19375 -30583 38192 5020 -37402 22755 21459 -36975 5871 34480 -29834 -14253 42878
492D2878n4022k4601P1601k0720o0787N9274K4739p4568K1495O0413n7221k4438
$$ 42878 -11144 -35745 35856 15136 -45651 13623 38362 -36206 -14711 45702 -11519 -35957
504c5957O9032j8426n3867N0306J8953n9236K1497M1922n0482o801N5106l0634
$$ -35957 33075 14649 -39218 11088 30041 -29195 -7698 34224 -16258 -23059 32047 1413
516A413l5269N4404Q03n5108L4127L2500n4936L006N2735l7757k7541N6675r651
$$ 1413 -33856 20548 21351 -33757 370 32870 -22066 -19060 33675 -4082 -31623 25052 15401
529A5401n2230M2961K6521o0032R242N5115m1315l0086N7271m491n1712L4235
$$ 15401 -36829 6132 32653 -27379 -18137 36978 -4337 -34423 22848 18357 -33355 880
541H80K6718m6927N930L8703l1935j3454M1283j7732l0985M2001M742m8440K7169
$$ 880 27598 -19329 -13399 25304 -6631 -20085 21198 3466 -27519 14482 19224 -29216 -2047
554b047L3867m9864m333N3663k8471l6481N1195N851n4192K7118L6710m9322n442
$$ -2047 31820 -18044 -22377 31286 2815 -33666 17529 23380 -30812 -3694 33016 -16306 -21748
567b1748N1121k6259l1804M5492R65m3753K7614K3738m2946N299L9014l0803j7165
$$ -21748 29373 3114 -28690 16802 17767 -25986 1628 25366 -17580 -12281 26733 -4070 -21235
580b1235M2035j2270l3721L5724Q975m3164K0725L1911m2932o335M8928k3673
$$ -21235 20800 8530 -25191 10533 19508 -23656 -2931 28980 -13952 -20287 28641 4968
592D968l6570M5634J0111n0529J9292L6494l9033j0968M1291j5277k7356L1624
$$ 4968 -31602 14032 24143 -26386 -7094 29400 -9633 -20601 20690 5413 -21943 9681
604I681M084l2283J9232J7552l2654N192K9629k5849j2617L4424r443k8429K8151
$$ 9681 13765 -18518 714 18266 -14388 -9196 20433 -5416 -18033 16391 6948 -21481 6670
617F670J0129l6157J3137K9439l2616j0308M0518j3188l3824L1750J5248l8356
$$ 6670 16799 -19358 -6221 23218 -9398 -19706 20812 7624 -26200 5550 20798 -17558
629a7558O332L1956k3152j4665K8963n824k1874K0638N195k3922J3385J4731k4799
$$ -17558 -11226 20730 -2422 -17087 11876 6052 -15822 4816 10011 -13911 -526 14205 -10594
642a0594K145K5493j9813j4622L0821l372l0076K1919J7523l2460J773L0851k0021
$$ -10594 -8449 17044 -2769 -17391 13430 10058 -20018 1901 19424 -13036 -11263 19588 -433
655d33j8056L0549m54k8976J8498J6568k8944J463K7735j8372j4372K6066k650
$$ -433 -18489 12060 11606 -17370 1128 17696 -11248 -9785 17950 -422 -14794 11272 8622
668H622k2291J6689Q686k1518P543J5503j9533p53K1990j6665j2917K7925m133
$$ 8622 -13669 3020 11706 -9812 -2269 13234 -6299 -7052 14938 -1727 -14644 13281 9148
681I148k8621K1374J8613l1997k086L2025j4304k2829K4887O378k4829R484J4558
$$ 9148 -19473 1901 20514 -11483 -13569 18456 4152 -18677 6210 12588 -12241 -2757 11801
694A1801j7725L55J5218j3219n538J9230q049j5246J8803L841k2208J0151J5597
$$ 11801 -5924 -5569 9649 -3570 -9108 10122 2073 -13173 5630 9471 -12737 -2586 13011
707A3011k0218k548K1882j1281j4389K0258J647k1730J1702J5086k0877k775K2510
$$ 13011 -7207 -9755 12127 846 -13543 6715 8362 -13368 -1666 13420 -7457 -10232 12278
720A2278r670j6089J7487N137j8269N483J3004j1789l655J2225n720o336J0786
$$ 12278 2608 -13481 4006 9143 -9126 -3643 9361 -2428 -6083 6142 422 -5914 4872
733D872l262r202J2045J810j5595Q408J2285j6745m253K0849o745j8089J6645
$$ 4872 1610 -7592 4453 6263 -9332 -924 11361 -5384 -9637 11212 4467 -13622 3023
746C023R327k0732J618J7962j0592j0095J4709N13j2789P766O154j1694K876R009
$$ 3023 12350 -8382 -6764 11198 606 -9489 5220 5733 -7056 710 6864 -4830 -1954 7055
760G055r774j590J1709o861p441J2267q69j2835R659P640j5486K048J5193j1785
$$ 7055 -2719 -4309 7400 539 -6902 5365 4496 -8339 1320 8960 -6526 -4478 10715 -1070
774a070r089J7601j613j6433J1112R669j5795n23J5201q262r663J3013J015j2045
$$ -1070 -10159 7442 5829 -10604 508 10177 -5618 -6141 9060 798 -8865 4148 5163 -6882
788f882O495O395r975J334P394p131j336Q513n449n158J0385j604j1539R671O958
$$ -6882 -387 6008 -3967 -2633 4761 -2370 -3706 4807 -642 -5800 4585 2981 -8558 1113 8071
803H071j5112J204J5387q883j0714J3646L436j4369L910J0478q691l903R522k307
$$ 8071 -7041 -5837 9550 667 -10047 3599 7035 -7334 -3424 7054 -1637 -5540 3982 1675
817A675o361O148O87n509L512K863n741J495N511n847j909P422l073o096P689
$$ 1675 -4686 1462 2149 -3360 152 3015 -2726 -1231 4280 -1567 -3476 3946 873 -5223 2466
832B466K154r230K925P788p360m233R992r58r452O456N777r472n67R090m129o210
$$ 2466 4620 -4610 -1685 6103 -1257 -5490 4502 3544 -5908 548 6325 -3147 -3714 5376 1247 -4963
848d963P106J971p154K030N035m925j278M852k441j716M047k014l257N491l51
$$ -4963 2143 4114 -3040 -1010 4025 -900 -2178 2674 233 -1483 2564 550 -2707 2784 2433
863B433p082M826N799r020j514J0931m378r162Q660M344j0360J295Q835n480n225
$$ 2433 -4649 177 5976 -3044 -4558 6373 1995 -7167 1493 5837 -4523 -3228 5607 127 -5098
878e098P764J09p104L824L700n551Q80M240m026o67M245l048k416N350r70n480
$$ -5098 2666 2775 -4329 -505 3195 -2356 -1476 2764 -1262 -1929 2316 -732 -3148 2202 1232 -4248
894d248M819L070p127P82P005m931m095P213L43p374L796N229o701j937P742k072
$$ -4248 571 3641 -3486 -2704 4301 -630 -4725 2488 2831 -4543 -747 4482 -2219 -4156 3586 1514
910A514o249N353L042o280J30N602k554l476L809J142l646J642J089k244J776
$$ 1514 -4735 618 3660 -2620 -2490 3112 558 -2918 891 2033 -1613 29 1118 -1126 650
925F50J223l865J428M472m478l056O763M26q054L625O934p812k536R069k399p705
$$ 650 1873 -1992 -564 3908 -570 -3626 3137 3563 -4491 -866 6068 -1744 -4280 4789 2390 -5315
941e315O520L809q424J121P508n109m006P091r74o194N087K144o364K515M392
$$ -5315 1205 5014 -3410 -2289 5219 110 -3896 3195 2221 -3973 1114 3258 -3106 -591 3801
956C801n627o45O550m289m162P718p69p893O170M403r638J281R002o729n360J0157
$$ 3801 -1826 -2471 4079 -210 -4372 3346 2577 -5316 854 5257 -4381 -3100 5902 -827 -6187 3970
972C970j34j0421O265O718j0019j027R832m432o025P408Q29p109L680L691o166
$$ 3970 3836 -6585 -320 6398 -3621 -4648 5184 752 -5273 2135 2964 -4145 -465 3226 -2940
987b940J255N652n742j855P731l341o511P882J908r287L800P642q513k904J0536
$$ -2940 -1685 3967 -1775 -3630 4101 760 -5751 2131 4039 -5248 -1448 6194 -2319 -5223 5313
1002E313l368r226R046M081j0777K098R310p089m797R412j326p735O414L206q636
$$ 5313 1945 -7281 1765 5846 -4931 -2833 6477 -612 -5409 4003 2677 -5058 1356 4562 -4074
1017d074K985O855p872j764R297m593o298Q791R06r634N425O389j0120o8J1226
$$ -4074 -1089 5766 -2106 -3870 5427 834 -5464 3327 4233 -5401 24 6413 -3707 -3775 7451
1032G451p341p008J2198k57j2621P287Q633j2396j254J2743n782q804J0706J095
$$ 7451 110 -6898 5300 5043 -7578 -291 8342 -4054 -5308 7435 1653 -7151 3555 4650
1046D650j0762N981N728r511J698Q505q166l261J0705m020r114J0719K525j3026
$$ 4650 -6112 -131 5597 -3914 -2216 6289 -1877 -5138 5567 1547 -7567 3152 5677 -7349
1060g349N914R927j2561k517J4357n946j1062J2225L557j3948M859J0481j1384
$$ -7349 -1435 8492 -4069 -6586 7771 1825 -9237 2988 6545 -7403 -2544 7937 -3447
1073c447k548J2442n653q241J1162P70j1434O405P043j0856K41J0862p685n217
$$ -3447 -5995 6447 794 -7447 3715 4485 -6949 -544 6499 -4357 -4116 6746 -939 -6156
1087f156J1288k641j0024R692L766j2780M767J0942j1797m685J5399m061j3426
$$ -6156 5132 2491 -7533 2159 5925 -6855 -2088 8854 -2943 -7628 7771 3710 -9716
1100i716J1522O902j4871J868J2707q707o377J1537j503r741Q430L175j0633M603
$$ -9716 1806 8708 -6163 -4295 8412 -295 -6672 4865 3362 -6379 2051 5226 -5407 -804
1114h04P642j0393l12J1397p795p167J3065n53j3574R111Q623j4676n3J4938q877
$$ -804 6838 -3555 -3867 7530 -265 -7432 5633 5080 -8494 617 9240 -5436 -5489 9449 572
1129E72r452J4381K57j4007Q198Q526j3649M07J3564r369p737J4380j377j3174
$$ 572 -8880 5501 5758 -8249 -51 8475 -5174 -4767 8797 -572 -8309 6071 4694 -8480
1143h480R281O187j2595K729J0241j0017k943J2338o613q674J3859J65j5494R939
$$ -8480 801 6988 -5607 -2878 7363 -2654 -5597 6741 128 -8546 5313 5478 -10016 -77
1157g7J0607j6908j385J7891q589j2802J5287L615j6461O475J1051j2815j773
$$ -77 10530 -6378 -7763 10128 1539 -11263 4024 7639 -8822 -2347 8704 -4111 -5884
1170e884J3097p569o904J2437j921j1387J0108M862j3818M125J1722j2064l979
$$ -5884 7213 -356 -7260 5177 3256 -8131 1977 6839 -6979 -2854 8868 -3196 -7175
1183g175J5354n984j1993J3572L771j6159O382J2195j3764l726J6278o330j2107
$$ -7175 8179 2195 -9798 3774 7545 -8614 -2232 9963 -3801 -7527 8751 2421 -9686
1196i686J3605L664j5481O089J0899j2316k729J3342n880q780J1500K76j1596
$$ -9686 3919 7583 -7898 -1809 9090 -3226 -5955 7387 1507 -7273 4227 4503 -7093
1209g093Q599N804j3782L663J2280j2272n303J6594m487j4775J3438P203j7937
$$ -7093 1506 7310 -6472 -2809 9471 -2801 -8104 8490 4003 -10772 2666 9869 -8068
1222h068L217J5612j2226p608J6232k893j3386J0853N840j4319L867J1181j1194
$$ -8068 -4851 10761 -1465 -9073 7159 4266 -9120 1733 7573 -6746 -2879 8302 -2892
1235b892l367J3504o387r121J3122k81j3653R911Q063j5837J525J5956j1837r516
$$ -2892 -6259 7245 858 -8263 4859 4578 -9075 836 8899 -6938 -5413 10543 -1294 -10810
1249a0810J7860j018j7265J1565J0096j7595J092J5916j1034p998J5882k254j4335
$$ -10810 7050 6032 -11233 332 10428 -7167 -6075 9841 -1193 -9191 6691 4437 -9898
1262i898J1778O294j5772M351J2160j2042l552J4317o538r924J3872O09j5145
$$ -9898 1880 8174 -7598 -3247 8913 -3129 -6681 7636 1098 -8826 5046 5655 -9490
1275i490R914R667j6945O90J7447j1734j0695J8261Q4j8102J0366J1713j6864
$$ -9490 424 10091 -6854 -6164 11283 -451 -11146 7115 7199 -10903 -537 11176 -5688
1288e688j058J6519q911r899J4598l42j3271R721N662j3663M007J1189j2178l315
$$ -5688 -6746 9773 862 -9037 5561 5219 -8052 1669 7331 -6332 -2325 8864 -3314 -6629
1302f629J5451o886j1997J5283K998j8081P648J3655j5867l904J7987o947j3309
$$ -6629 8822 1936 -10061 5222 8220 -9861 -2213 11442 -4425 -8329 9658 2711 -10598
1315a0598J4788L479j7124P657J2039j5150k133J6586q610j0797J4913Q56j5026
$$ -10598 4190 7669 -9455 -1798 10241 -4909 -7042 9544 934 -9863 5050 5906 -9120
1328i120R122Q255j4481J859J3799j1859o197J6735n065j4257J4829N399j8798
$$ -9120 2 8257 -6224 -4365 9434 -2425 -8622 8113 3048 -11209 3620 9019 -9779
1341i779N860J5848j5653o634J9585n198j6102J4851O525j8062M997J4090j3935
$$ -9779 -3919 11929 -3724 -10358 9227 4029 -12073 2778 9303 -8759 -3762 10328 -3607
1354c607m047J5950o652j0953J4192R78j5158R839Q846j6715K080J6405j2809
$$ -3607 -7654 8296 1644 -9309 4883 5861 -9297 542 9388 -7327 -5247 11158 -1651
1367a651q829J8868k390j8108J3424R819j8900J809J7478j2757q744J8026l102
$$ -1651 -10480 8388 5998 -12110 1314 11133 -7767 -5958 11520 -1237 -9981 8045 4943
1380D943j5629J3127O899j7303M478J4124j3664m826J6688o454j2335J4870K089
$$ 4943 -10686 2441 9340 -7963 -3485 10639 -3025 -7851 8837 2383 -9952 4918 7007
1393G007j6328Q871J0732j6363m54J7315j0835j0796J8138k02j8561J1631J1524
$$ 7007 -9321 -450 10282 -6081 -6535 10780 -55 -10851 7287 7085 -11476 155 11679
1406A1679j8788P9J8306j0992j1180J7412K6j6779J0377R311j5762J546J4059
$$ 11679 -7109 -7030 11276 284 -10896 6516 6542 -10237 140 9451 -6311 -4765 9294
1419I294j1424n824J5714n492j2593J4592L685j8055P771J3958j6682m229J9723
$$ 9294 -2130 -7954 7760 2268 -10325 4267 7952 -10103 -2332 11626 -5056 -9285 10438
1432A0438p957j4615J6797L986j8823P942J3260j6194k824J7968q820j2263J6834
$$ 10438 2481 -12134 4663 8649 -10174 -2232 11028 -5166 -7990 9978 1158 -11105 5729
1445E729J153j7374J0407J0223j6814Q77J6165j1656q157J6967l023j5396J3741
$$ 5729 6882 -10492 -85 10138 -6676 -5799 10366 -1290 -9447 7520 4497 -10899 2842
1458B842O749j8668N353J5537j5583n725J9719o876j5330J6389N385j9779O655
$$ 2842 9591 -9077 -3724 11813 -3770 -9495 10224 3348 -11982 4407 9792 -9987 -3332
1471c332J5389j5865m929J8382o810j3206J4921K771j6094Q328J0140j5712N77
$$ -3332 12057 -3808 -8737 9645 2835 -10371 4550 7321 -8773 -445 9695 -6017 -5440
1484e440J5836j1498q990J8054k275j7056J3000R061j8514K377J6755j3067q298
$$ -5440 10396 -1102 -10092 7962 5687 -11369 1631 10692 -7822 -5445 11310 -1757 -10055
1497a0055J8200l464j5741J3652O891j8072M654J4856j3903n764J7266n518j3775
$$ -10055 8145 4681 -11060 2592 9483 -8589 -3935 10921 -2982 -8746 8520 3002 -10773
1510a0773J4449M175j7063P133J2192j5158k173J6559q787j0898J6056O12j6723
$$ -10773 3676 7851 -9212 -2079 10113 -5045 -7218 9341 554 -10344 5712 6324 -10399
1523a0399J0301J0460j7416L27J7684j1565j0310J8002p46j7614J1622R746j6894
$$ -10399 -98 10362 -7054 -6727 10957 -608 -10918 7084 6338 -11276 346 10092 -6802
1536f802J030J5783j1172p929J6139l118j3900J3000N022j6670O119J3246j4858
$$ -6802 -5772 10011 -1161 -9090 7049 3931 -9969 3031 8053 -8617 -2498 10748 -4110
1549d110m062J7802p064j3521J5542L625j7840P971J2572j6008k138J7447r215
$$ -4110 -8172 9630 2566 -10955 4587 8212 -9628 -1657 10915 -5093 -7231 10216 1001
1562A001j1466J6305J130j6903R877J0526j6230m4J5975j0542q808J6214k273
$$ 1001 -10465 5840 6970 -9933 -56 10470 -5760 -5804 10171 -371 -9179 7035 4762
$$ [...]
8191A32
##END NTUPLES=NMR FID
##END=
