##TITLE=1H_MTBDE2506-4
 CDCl3, 8 sc, 
 28.06.2021
##JCAMPDX= 6.0         $$ Bruker NMR JCAMP-DX V2.0
##DATA TYPE= NMR FID
##DATA CLASS= NTUPLES
##ORIGIN= UXNMR, Bruker Analytische Messtechnik GmbH
##OWNER= root
$$ XWIN-NMR		Version 3.5
$$ Mon Jun 28 10:28:19 2021 Russian Standard Time (UT+4h)  she@DPX200
##.OBSERVE FREQUENCY= 200.131506
##.OBSERVE NUCLEUS= ^1H
##.DELAY= (6, 6)
##.ACQUISITION MODE= SIMULTANEOUS
##.ACQUISITION SCHEME= undefined
##.AVERAGES= 8
##.DIGITISER RES= 18
##SPECTROMETER/DATA SYSTEM= spect
##.PULSE SEQUENCE= zg30
##.SOLVENT NAME= CDCl3
##.SHIFT REFERENCE= (INTERNAL, CDCl3, 0, 15.7039)
##AUDIT TRAIL= $$ (NUMBER, WHEN, WHO, WHERE, WHAT)
$$ ##TITLE= Audit trail, XWIN-NMR		Version 3.5
$$ ##JCAMPDX= 5.01
$$ ##ORIGIN= Bruker BioSpin GmbH
$$ ##OWNER= she
$$ F:/spectra/data/she/nmr/H-F/1/audita.txt
$$ ##AUDIT TRAIL=  $$ (NUMBER, WHEN, WHO, WHERE, WHAT)
(   1,<2021-06-28 10:26:30.70 +0400>,<she>,<DPX200>,
      <created by zg, POWCHK disabled, PULCHK disabled
       configuration hash MD5:
       00 E9 B6 7A A2 85 ED C7 34 08 36 98 17 FE 4E 26
       data hash MD5: 16K
       67 F6 BD 72 A2 6C CA 22 83 D9 97 C5 45 2F 52 C2>)
$$ ##END=
$$ 
$$ hash MD5
$$ 3A C1 15 41 DD 37 51 67 C9 16 80 F0 53 2A F7 8B
##$RELAX= 
##$RELAX= 
##$RELAX= 
##$RELAX= 
##$RELAX= 
##$RELAX= 
$$ Bruker specific parameters
$$ --------------------------
##$DU= <F:/spectra>
##$EXPNO= 1
##$NAME= <H-F>
##$PROCNO= 1
##$TYPE= <nmr>
##$USER= <she>
##$AMP= (0..31)
100 100 100 100 100 100 100 100 100 100 100 100 100 100 100 100 100 100 
100 100 100 100 100 100 100 100 100 100 100 100 100 100 
##$AQSEQ= 0
##$AQ_mod= 1
##$AUNM= <au_zg>
##$AUTOPOS= <>
##$BF1= 200.13
##$BF2= 200.13
##$BF3= 200.13
##$BF4= 200.13
##$BF5= 200.13
##$BF6= 200.13
##$BF7= 200.13
##$BF8= 200.13
##$BYTORDA= 1
##$CFDGTYP= 0
##$CFRGTYP= 5
##$CHEMSTR= <none>
##$CNST= (0..31)
1 1 145 1 1 1 1 1 1 1 1 1 1 1 1 1 1 1 1 1 1 1 1 1 1 1 1 1 1 1 1 1 
##$CPDPRG= <>
##$CPDPRG1= <>
##$CPDPRG2= <>
##$CPDPRG3= <>
##$CPDPRG4= <mlev>
##$CPDPRG5= <mlev>
##$CPDPRG6= <mlev>
##$CPDPRG7= <mlev>
##$CPDPRG8= <mlev>
##$CPDPRGB= <>
##$CPDPRGT= <>
##$D= (0..31)
0 1.2 0 0 0 0 0 0 0 0.06 0 0.03 0 0 0 0 0.0002 0 0 0 0 0 0 0 0 0 0 0 0 
0 0 0 
##$DATE= 1624861590
##$DBL= (0..7)
120 120 120 120 120 120 120 120 
##$DBP= (0..7)
150 150 150 150 150 150 150 150 
##$DBP07= 0
##$DBPNAM0= <>
##$DBPNAM1= <>
##$DBPNAM2= <>
##$DBPNAM3= <>
##$DBPNAM4= <>
##$DBPNAM5= <>
##$DBPNAM6= <>
##$DBPNAM7= <>
##$DBPOAL= (0..7)
0.5 0.5 0.5 0.5 0.5 0.5 0.5 0.5 
##$DBPOFFS= (0..7)
0 0 0 0 0 0 0 0 
##$DE= 6
##$DECBNUC= <off>
##$DECIM= 32
##$DECNUC= <off>
##$DECSTAT= 4
##$DIGMOD= 1
##$DIGTYP= 9
##$DL= (0..7)
0 120 120 120 120 120 120 120 
##$DP= (0..7)
150 150 150 150 150 150 150 150 
##$DP07= 0
##$DPNAME0= <>
##$DPNAME1= <>
##$DPNAME2= <>
##$DPNAME3= <>
##$DPNAME4= <>
##$DPNAME5= <>
##$DPNAME6= <>
##$DPNAME7= <>
##$DPOAL= (0..7)
0.5 0.5 0.5 0.5 0.5 0.5 0.5 0.5 
##$DPOFFS= (0..7)
0 0 0 0 0 0 0 0 
##$DQDMODE= 0
##$DR= 18
##$DS= 0
##$DSLIST= <SSSSSSSSSSSSSSS>
$$ [...]
##$SUBNAM2= <"">
##$SUBNAM3= <"">
##$SUBNAM4= <"">
##$SUBNAM5= <"">
##$SUBNAM6= <"">
##$SUBNAM7= <"">
##$SUBNAM8= <"">
##$SUBNAM9= <"">
##$SW= 20.0188882624521
##$SWIBOX= (0..15)
0 0 2 0 0 0 0 0 0 0 0 0 0 0 0 0 
##$SW_h= 4006.41025641026
##$TD= 16384
##$TD0= 1
##$TE= 0
##$TE2= 300
##$TE3= 300
##$TEG= 300
##$TL= (0..7)
0 120 120 120 120 120 120 120 
##$TP= (0..7)
150 150 150 150 150 150 150 150 
##$TP07= 0
##$TPNAME0= <>
##$TPNAME1= <>
##$TPNAME2= <>
##$TPNAME3= <>
##$TPNAME4= <>
##$TPNAME5= <>
##$TPNAME6= <>
##$TPNAME7= <>
##$TPOAL= (0..7)
0.5 0.5 0.5 0.5 0.5 0.5 0.5 0.5 
##$TPOFFS= (0..7)
0 0 0 0 0 0 0 0 
##$TUNHIN= 0
##$TUNHOUT= 0
##$TUNXOUT= 0
##$USERA1= <user>
##$USERA2= <user>
##$USERA3= <user>
##$USERA4= <user>
##$USERA5= <user>
##$V9= 5
##$VALIST= <valist>
##$VCLIST= <CCCCCCCCCCCCCCC>
##$VD= 0
##$VDLIST= <DDDDDDDDDDDDDDD>
##$VPLIST= <PPPPPPPPPPPPPPP>
##$VTLIST= <TTTTTTTTTTTTTTT>
##$WBST= 1024
##$WBSW= 4
##$XGAIN= (0..3)
0 0 0 0 
##$XL= 0
##$YL= 0
##$YMAX_a= 312398
##$YMIN_a= -355096
##$ZGOPTNS= <>
##$ZL1= 120
##$ZL2= 120
##$ZL3= 120
##$ZL4= 120
##$ABSF1= 10
##$ABSF2= 0
##$ABSG= 5
##$ABSL= 3
##$ALPHA= 0
##$AQORDER= 0
##$ASSFAC= 0
##$ASSFACI= 0
##$ASSFACX= 0
##$ASSWID= 0
##$AUNMP= <proc_1d>
##$AZFE= 0.1
##$AZFW= 0.1
##$BCFW= 1
##$BC_mod= 2
##$BYTORDP= 1
##$COROFFS= 0
##$CY= 11.3945322036743
##$DATMOD= 1
##$DC= 2
##$DFILT= <>
##$DTYPP= 0
##$F1P= 15.9154993809931
##$F2P= -4.1035820241983
##$FCOR= 0.5
##$FTSIZE= 0
##$FT_mod= 4
##$GAMMA= 1
##$GB= 0.15
##$INTBC= 1
##$INTSCL= 1
##$ISEN= 128
##$LB= 0.24
##$LEV0= 0
##$LPBIN= 0
##$MAXI= 10000
##$MC2= 0
##$MEAN= 0
##$ME_mod= 0
##$MI= 1.114404
##$NCOEF= 0
##$NC_proc= 0
##$NLEV= 6
##$NOISF1= 3.799351
##$NOISF2= 2.8
##$NSP= 1
##$NTH_PI= 0
##$NZP= 0
##$OFFSET= 15.70392
##$PC= 1
##$PHC0= -11568.65
##$PHC1= 8.20101
##$PH_mod= 1
##$PKNL= yes
##$PPARMOD= 0
##$PSCAL= 0
##$PSIGN= 0
##$REVERSE= no
##$SF= 200.130013532006
##$SI= 16384
##$SIGF1= 3
##$SIGF2= 2
##$SINO= 400
##$SIOLD= 16384
##$SREGLST= <1H.CDCl3>
##$SSB= 0
##$STSI= 0
##$STSR= 0
##$SW_p= 3612.71676300578
##$SYMM= 0
##$S_DEV= 0
##$TDeff= 0
##$TDoff= 0
##$TI= <>
##$TILT= no
##$TM1= 0
##$TM2= 0
##$TOPLEV= 0
##$USERP1= <user>
##$USERP2= <user>
##$USERP3= <user>
##$USERP4= <user>
##$USERP5= <user>
##$WDW= 1
##$XDIM= 8192
##$YMAX_p= 0
##$YMIN_p= 0
$$ End of Bruker specific parameters
$$ ---------------------------------
##NTUPLES= NMR FID
##VAR_NAME=  TIME,          FID/REAL,        FID/IMAG
##SYMBOL=    X,             R,               I
##VAR_TYPE=  INDEPENDENT,   DEPENDENT,       DEPENDENT
##VAR_FORM=  AFFN,          ASDF,            ASDF
##VAR_DIM=   8192,          8192,            8192
##UNITS=     SECONDS,       ARBITRARY UNITS, ARBITRARY UNITS
##FACTOR=    0.0002496,     1,               1
##FIRST=     0,             0,               0
##LAST=      2.0444736,     0,               0
##MIN=       0,             -355096,         0
##MAX=       2.0444736,     312398,          0
$$ Real data points
##PAGE= N=1
##DATA TABLE= (X++(R..R)), XYDATA
$$ [...]
1764a011k82L940k381k974M617K23n025K563M165m949j943N894j302m895M123
1779G63K357n170M78L624j747j652J941k11j188R70k94l51J597j650j700L482
1795A249J57l979K054L334m357j263M985p99m387K676K893m060l35L761j532k503
1811b106J927J112j424k09O80J96m06m54M19J115q15j479J749J409k766k22L171
1828A897j308k743K497J992l014j144L252j68k975J380K399j901j461J698J120
1843A521j925o14J839L45k119M56J976j135j390J075J237j206r16J410M60j576
1859e62l57J813J01j952L12K195j282j883K129J091k614l70K987o86k830J904
1875dJ764k627p61K709m46j849P99J136p58m63J81P09k87q55J04J629n89k064
$$ plain form
1764 -1011 -1293 2647 266 -2708 1909 2132 -2893 -330 3835 -1114 -3057 2837 1535 -3360 763
1779 763 3120 -2050 -1572 2052 305 -1347 594 383 -805 165 -129 -480 1117 -533 -2233 1249
1795 1249 1406 -2573 -519 2815 -1542 -2805 2180 1381 -3006 -330 2563 -1497 -1832 1929 397 -2106
1811 -2106 -179 933 -491 -700 -20 176 -230 -684 -265 850 35 -1444 305 1714 -1052 -1274 1897
1828 1897 589 -2154 343 2335 -679 -1823 1429 1261 -1714 -334 2065 164 -1297 401 1521
1843 1521 -404 -1018 821 1166 -953 -497 1479 344 -1046 29 1266 60 -856 554 1014 -562
1859 -562 -919 894 995 -957 -645 1550 268 -1615 514 1605 -1009 -1379 1608 922 -1908 -4
1875 -4 1760 -867 -1628 1081 635 -1214 -415 721 -37 -500 -319 390 103 -752 -648 981 392 -1672
1893a672J515J849k816o71L353q91l128K274K035k975m74L172j188k266K205Q05
1909A127j977L13J034o14j83L68j13L05j44r05R10J130j721p41K756o43k811K373
1927D64J744l302k35L213q64k939K266J445k581p3K164p74j166O43N29k31j45
1944A58l52L44M76p31m01J403j41j815J022J562k193m74K563p78k279J661J331
1961A356k051n91K411o45j912J462Q88j244l50Q91l6m20j54L48J43o4p87N24J075
1980H44j364o94K049k82j861R17J598j827o11J961J47k013O82J651j531o58J495
1997E03K0j111M42M65k86m72L66M43k61j10n23P68O31j564K91J574j096j018J632
2016F94L93k101M35J993j274j327J979M33j858K22J543j001n98P45L23p89r8N93
$$ plain form
1893 -1672 -157 1692 -1124 -1795 1558 667 -2461 -187 1848 -1127 -1601 1571 383 -1883 322 1127
1909 1127 -850 -537 497 -117 -300 68 -45 260 116 -789 121 1251 -470 -1211 1545 902 -1909 464
1927 464 2208 -1094 -1329 1884 1020 -1919 347 1792 -789 -862 1302 528 -638 5 534 303 158
1944 158 -194 150 626 -105 -506 897 756 -1059 -37 1525 -668 -1142 1421 643 -1636 25 1356
1961 1356 -695 -1286 1125 480 -1432 30 918 -326 -676 215 179 -241 -395 -47 96 32 -755 -231 844
1980 844 -520 -1214 835 553 -1308 -391 1207 -620 -1231 730 877 -1136 -454 1197 -334 -992 503
1997 503 523 -588 -146 319 33 -439 -73 370 109 -1 -524 244 875 -689 -398 1176 80 -938 694
2016 694 1087 -1014 -579 1414 140 -1187 792 1225 -633 -411 1132 131 -467 278 601 -188 -286 307
2034C07q5n6l87L4R77o44r19J195N18j609J06J527o59j667J426J280j988k57J999
2053A098p44j532J182R57j527j23J257l25n33j81N45J3l62j67L89M14q94l10J460
2072F17l38j583J128J223j774n39K074j87k036J093J655j902n03J710l72j140
2088h74N15R13p62m40Q65M7k54j71l0P20j65j054P63Q51j354m01J832m23j744
2107a166J052J646j857q05K091J8k129J126J236j104q18J144K95j087J40P95l16
2124B61m74Q6M49L03r59j70J555n77j497J100J256j791o63K098j17k312J308J555
2142A411j791r51J966J48j784M39J306o90r64Q31N98q02l90O01L00k75q02P96
2160e3P57j523j62J853m54j759R77J501j540j018K053J53j820N06J680j124j187
$$ plain form
2034 307 222 166 -221 -187 790 146 -773 422 940 -669 -563 964 305 -1362 64 1344 -644 -901 1098
2053 1098 354 -1178 4 961 -566 -689 568 243 -290 -471 74 87 -275 -442 -53 361 -533 -843 617
2072 617 279 -1304 -176 1047 -727 -1266 808 621 -1415 -322 1333 -569 -1072 638 266 -874
2088 -874 -359 554 -208 -648 217 264 10 -161 -191 529 364 -690 73 924 -430 -831 1001 578 -1166
2107 -1166 -114 1532 -325 -1130 961 979 -1150 -24 1212 108 -710 434 729 -358 -218 577 261
2124 261 -213 -127 322 625 -334 -504 1051 474 -1023 77 1333 -458 -1121 977 860 -1452 -144 1411
2142 1411 -380 -1331 635 783 -1001 -562 744 54 -910 -79 519 -283 -673 -72 228 -47 -849 -53
2160 -53 704 -819 -981 872 418 -1341 -364 1137 -403 -1421 632 785 -1035 -529 1151 27 -1160
2177a160J211R26j445k93J471m10j057M25J010m96p45M21P84p07p05J072M20q46
2195a24o06J327O43j959J26J867j138j508J898Q15j852m02K078n25j631J275J055
2212A339j707l35J203J85r60j0O70k63l58J04N21J00j028j70J555m64j491J437
2230C28Q17k097MK258p68k009J343J287j856j60J985p89j517J066P32p71l03N54
2248A04j25r5n7R7M60k62j244Q92J164j607k75J840p21j550J413J264j897m88
2266a087K218r19j442J828M03j748J34J316m19n45K93R5K8k22J33J81L13p98o04
2285h42J845m36j432J249O75j642P4J729o47j680J157R54j585K85J297q29o91
2302e19N84L60l16r7o3K58j58j46K28L44l90q59R29N98j182l3J159n83r97J090
$$ plain form
2177 -1160 51 977 -468 -761 710 300 -757 -332 678 182 -563 -142 642 -65 -770 302 722 -124
2195 -124 -730 597 1240 -719 -593 1274 136 -1372 526 1341 -511 -913 1165 640 -991 284 1339
2212 1339 -368 -703 500 685 -275 -285 385 122 -236 -132 389 489 -539 -709 846 382 -1109 328
2230 328 1145 -952 -948 1310 542 -1467 -124 1163 -693 -853 1132 343 -1174 -108 624 -147 -450 104
2248 104 -21 -116 -173 -76 384 122 -1122 -230 934 -673 -948 892 171 -1379 34 1298 -599 -1087
2266 -1087 1131 212 -1230 598 1001 -747 -613 703 284 -261 32 127 155 -67 66 247 560 -238 -842
2285 -842 1003 567 -865 384 1059 -583 -509 1220 573 -1107 50 1004 -581 -296 1001 172 -519
2302 -519 65 425 109 12 -51 207 49 -97 131 475 85 -774 155 753 -429 -462 697 114 -883 207
2322B07N24p97o29O88J28o93L79N70o34k65L57K71j24m30M65O2m50Q4O60k38n17
2343c82LQ66k99o10O35R7o41l48J011J27r12m4R03k26q34Q60M37j150j99J194
2363D88l4r42M11N61m24l90N04O9m77m4L83L27k53m91N02K49m44m38R10l6j147
2384g16P19Q27j003m42J302m64j048R57O94r36l94R83r6o56N04j93Q5j82k11J17
2404a53O53o08l79P42P6j053N74J050j253n81J426K58j877J162O88j199l12J407
2422F21m75p91N57M51o32Q9K39k46K25j60l04N12P0r35P17R66j199o64J474r0
2442D25j490J124R71j471j36J197l27r04M95O87n98l21M67K95m88j3J46K84k01
2461A42m98N34M55r75j68J059j60j059P31R14j311m99J612k05j408P44P39p24
$$ plain form
2322 207 731 -66 -695 -7 121 -572 -193 377 -257 -522 -165 106 -18 -448 17 79 -371 -287 373 135 -382
2343 -382 -379 487 188 -422 213 310 -331 -679 332 459 -453 -497 406 180 -654 206 643 -507 -706 488
2363 488 454 -488 -77 484 60 -330 174 243 -234 -278 105 432 179 -312 190 439 -5 -443 467 431 -716
2384 -716 3 830 -173 -615 687 223 -825 132 826 -110 -504 479 383 -273 231 38 123 -59 -270 -153
2404 -153 500 -108 -487 255 331 -722 -148 902 -351 -932 494 752 -1125 37 725 -474 -786 621
2422 621 146 -645 -88 363 -269 -180 59 -187 38 -122 -426 86 156 -779 -62 904 -295 -959 515 425
2442 425 -1065 59 1030 -441 -577 620 293 -611 -116 571 -27 -348 119 414 -74 -87 59 343 142
2461 142 -356 178 633 -342 -510 549 389 -670 61 975 -336 -835 777 572 -836 -92 647 -77
2479g7m73Q75K25r00R2O34j97m58L24K80j99m44J09P63o49n97R42N04r32m31J103
2500D94L5j299N58J124j077o72J148J68j058Q6J068o52q76R41N36q23n9N51p8
2519A15m95K5N91q2p57L17O70k38p03L01Q12o08o99J243L50j571L03J145m83r25
2539f89J012M56j350R3J047k67j031P17N59m91l67M45L72n74q0L46K68m61m26
2558d21P06L74j100KJ292p07r58J100M21j102J9J206n08r76Q40N49j060j09R64
2577E32l10o36L67L77k09m54K26L20j15l62L2Q16o55n41Q29M65j263J21J157n70
2597A27j026Q55P11j282L7J056l03r75P62O43p78o8L53K03n61RL38J05l34q6R4
2618a20M97q81K27O94l43p49Q08M06r92j51J189j64j229Q12P70j100k9P75j35
$$ plain form
2479 -77 -550 325 550 -350 -258 376 179 -279 45 325 126 -318 -209 554 -95 -692 250 754 -178 -609 494
2500 494 529 -770 -212 912 -165 -837 311 479 -579 -493 575 -77 -953 -12 524 -299 -358 193 115
2519 115 -380 -355 236 154 -603 -286 384 146 -557 -256 556 -52 -751 492 842 -729 -426 719 236 -689
2539 -689 323 779 -571 -478 569 302 -729 -12 547 56 -311 134 506 -68 -148 198 466 5 -421
2558 -421 285 659 -441 -439 853 146 -812 288 709 -393 -374 832 324 -652 188 737 -323 -432 532
2577 532 222 -414 -47 330 121 -333 -107 213 98 -264 -232 584 -71 -612 217 682 -581 -460 697 127
2597 127 -899 -44 667 -615 -578 478 175 -800 -38 605 -173 -241 112 315 -246 -237 101 206 -128 -214 -120
2618 -120 377 -504 -277 417 74 -675 133 539 -453 -604 585 421 -808 4 774 -326 -355 420 285
2637B85n58K20N27m79l43N19R5k72n9nN71l64n16O13L21q04jQ93l41q10O05N85
2659F82p93k22Q18j43r38O12O74p22k82N15o3l70J17L33n5j04l06K59L54n59j99
2680c92N46ko01L33M65o16k34P58K19q82K23Q11p47n46P86K15p74J83M94m19l1
2701b11L18N9k12j99M6J98K11l90m3M37k95k83N24J80p98O4Q31l20q23Q75M28
2722E97j057K90P75l30n87K80M23l44k07L55k15j7j4o6L61q2l51L31R9l65j0P17
2744E83l07q22N81O57j074q8J092m87o72P71J82n27k42O27j87l37L85N1l35J19
2764c0j96K60M07o08j92O41k88m53L70N95q61m03J188k74q11N22P22r90j03Q47
2784C43j46p15L56L12l79j58N34j60j71q0M0O00k26n51L48K75p17J31R43l26r84
$$ plain form
2637 285 -273 -53 474 -5 -348 171 266 -6 -65 -70 501 137 -379 234 555 -249 -250 643 302 -508 97 682
2659 682 -111 -333 485 342 -596 16 690 -32 -314 201 138 -232 -115 218 163 59 -247 12 366 -193 -392
2680 -392 154 152 -449 -116 349 -267 -501 257 476 -406 -183 628 -119 -665 121 336 -438 -255 239 -180 -211
2701 -211 107 166 -46 -245 -199 -1 210 -180 -223 214 -81 -364 160 340 -458 -394 437 117 -706 169 597
2722 597 -460 -170 605 275 -312 -32 391 47 -160 195 -20 -37 -51 -117 244 162 -189 142 241 -124 -134 583
2744 583 276 -546 35 692 -382 -470 622 135 -537 234 416 -111 -353 274 87 -250 135 186 -149 -30
2764 -30 -226 34 441 -167 -359 282 -6 -459 -89 506 -355 -758 430 156 -655 -133 589 -401 -504 343
2784 343 197 -518 -162 150 -229 -387 147 -13 -184 -264 -224 376 150 -401 -53 222 -495 -364 579 253 -731
2805g31N45Q09q25k41R14k95q04N81M60l88l80L56K66l28J20K90j97l92J19L93
2825B72K00o51L0N62l01m35L79N29o84l74Q29N9j011N45O25q48j62Q32J01q43
2845c46j29Q26k55n51N48K50l74l40L10M52m99l31N22J42m21j33P15j61p77K71
2865b81P07m94o00P66R4p03J74P74k06j003Q48M01p62j78P15j70n16L00L18J77
2885C61o91J81M42l27l88K84M36l85n42Q07L88j093j2J114m35q12Q01N86j121
2904d06j29J192l67q21P63K34p60R2L95K9l07N5J54J06l35j29M83j3m74P5Q23
2925F60o12n50O32L50j039K45R23k76j194R82O13j079n7R18k57o99M67L94n42
2944a21q1J07J50m2j85J09L60l25o15N46N10r34M7R86n16n91P18L69j086M0R73
$$ plain form
2805 -731 -186 623 -202 -443 471 176 -628 -47 413 25 -355 1 267 -61 59 349 152 -240 -121 272
2825 272 472 -179 -149 413 112 -323 56 585 -99 -473 356 415 -596 -51 574 -274 -436 396 497 -346
2845 -346 -475 351 96 -455 93 343 -31 -371 -61 391 -108 -439 83 225 -196 -329 386 225 -552 -281
2865 -281 426 -68 -668 98 192 -511 -337 437 231 -772 76 477 -285 -463 252 82 -434 -134 184 361
2885 361 -330 -149 293 -34 -422 -138 298 -87 -629 178 566 -527 -539 575 140 -672 129 715 -406
2904 -406 -535 657 290 -531 232 466 -294 -202 193 222 -85 -30 124 230 -105 -234 249 236 -238 -163 660
2925 660 48 -502 130 480 -559 -314 609 333 -861 121 734 -345 -402 516 259 -440 27 421 -121
2944 -121 -202 -95 55 13 -172 -63 297 -28 -643 -97 413 -521 -474 512 -4 -595 123 492 -594 -554 419
2965D19k65p63N44M13p46J51L16J45l45r0L27Lj89q2K36M5m38O3P54m44n47O51
2987A58K26n44k7N46k56o76N44N99o78k76P46j86l77K08M43k90m05K87K73l18
3007cn8P1Q2N0l14L45Q4m81Q5N28j96l34J05L77l14m52P13J43q43K38N88m71l29
3030c86O39M6o48J23M06j05k47J37R7O4k32r8M54k44m21K71L44k69l08L17L25
3051B65n16q7Q11m86n08N30L54o50l8O23l26l16K67K41l26l1J78kJ27j68K3K50
3073B15j51l66L32M04n36o5N50l04o29O61L12o41J62K98j49l98M97J34l49o8M22
3094C31q6k87J98k0rR6l39K27M4l60qN23j71m62J17N53m36l29Q38n2p66L56M62
3117D20n09k96P21r1m58M6M66j91j44N3J85j46p8j79L87p5m83K66L20l97k22N97
$$ plain form
2965 419 154 -609 -65 348 -398 -247 69 214 -131 -221 106 109 -80 -162 74 119 -319 -256 498 54 -493 158
2987 158 384 -160 -187 359 103 -573 -29 570 -108 -384 362 176 -201 7 450 160 -245 42 315 -3
3007 -3 -61 10 92 142 -172 173 257 -224 -139 389 193 -141 -36 341 27 -425 288 431 -412 -174 414 -57 -386
3030 -386 253 299 -349 -226 180 75 -172 -35 62 126 -106 -204 250 6 -415 -144 200 -69 -377 -60 265
3051 265 -251 -338 473 -13 -521 9 363 -287 -325 298 -28 -344 -77 164 -162 -193 -15 -17 110 -58 -35 215
3073 215 64 -302 30 434 -102 -167 383 79 -550 111 423 -218 -56 242 93 -305 192 326 -23 -91 331
3094 331 245 -42 156 136 127 223 -116 111 155 -205 -213 310 139 -323 -206 347 -89 -418 420 368 -398 -42 420
3117 420 -89 -385 336 245 -213 -167 299 108 -36 17 202 56 -22 -201 186 111 -372 -106 214 -183 -405 192
3139A92N9n71J15O52m48n91N93L80n76j23N82q4l78J64J82l45J36j24L65j70j32
3160a22J82R4j50k46L65J31l44k0N31k65n00O94N5o64j01P37j81n90M34L85m99
3181g4r5M82j40k79PK67j3k26M0K12j99j47lM89l09m43N06L31p45O7P84m47m64
3204c99L54M15m87k64P34j83n81L71N29o00j61J78J74j64j33L27J53n72J06M38
3224B35k26l64M9Q13m90m79N27K13p06rQ16m4r62N66M15m28m32R30k01o05K71
3245a11M88m63j55K13J28k48p5K63K37l70j01M01J96o63k1R02n34m20M46L54o34
3266a67k72P78J9q61N22N54o41j88L84Q9l17n9K83m3k79K56K12k9m26KO05m26
3288dm11L73N10o25j79O10j94n27L08N99o54j89N38J44p13K34M65l71l26M65M4
$$ plain form
3139 192 251 -320 -205 447 -1 -592 1 381 -195 -318 264 180 -198 -34 148 -197 -61 -185 180 10 -122
3160 -122 60 154 4 -242 123 254 -90 -110 421 156 -344 350 405 -259 -360 377 196 -394 40 425 -74
3181 -74 -169 313 173 -106 -99 168 155 -71 -31 181 -18 -165 -168 321 12 -431 75 406 -339 -272 512 65 -399
3204 -399 -45 370 -117 -381 353 170 -411 -40 489 -111 -272 -94 80 -84 -217 110 263 -309 -203 235
3224 235 9 -355 -306 507 17 -462 65 278 -428 -437 379 335 -627 -61 354 -74 -506 424 223 -382 -111
3245 -111 377 -86 -241 -28 100 -148 -223 40 277 -93 -194 207 403 -260 -281 621 87 -333 113 467 -167
3266 -167 -439 339 358 -503 19 573 -68 -256 128 217 -100 -159 124 81 -198 58 270 241 -185 -183 422 -4
3288 -4 -415 -42 468 -157 -336 274 80 -447 -139 460 -194 -383 155 299 -414 -180 285 -86 -412 53 97
3309I7j85PK45j73j60j2K13K58n61J22L59k78l33M58K85o04j00L59K54q60N57
3330e2M18l90m59N72J51l20j42M48j15l31J88P0l0j78J45K93k63j60K61N6k52
3351i0j01M72j32m10M8N03j66n17O99Q8n72j51O80j51o06M37L47n57N8M39j40
3372A78j46K8OQ9j14q5Q1Pj74j4K49O8m85J57L19l59p7N83k09m69L79K17m05j41
3396c17M77j66l74M63m9o6k3M6m6J29j21j13J88r0p7j92N88j96m89O38K6o60N34
3419A10L16n94j52N88j60l16Q7L69l51l0K86l17J19J5J39l2N5k49J25L05l37k60
3441b84M91P1n55K43M30n40q5M55m0l12J73K37j52l56K61J67l44J10J31Kj12j44
3463a53L11O7j87j56L15Rj82L1N1j73l24N47P3l12r3K57R9k35J99N7l19j77M42
$$ plain form
3309 97 -88 -81 164 -9 -169 -181 32 290 -271 -149 210 -68 -401 57 342 -262 -362 -3 251 -609 -52
3330 -52 366 -24 -483 89 240 -80 -222 226 111 -220 -32 38 8 -170 -25 268 5 -155 106 162 -90
3351 -90 -191 281 149 -261 -213 290 124 -393 306 394 -178 -329 351 200 -406 31 378 -179 -121 318 178
3372 178 32 60 66 155 41 -44 37 44 -130 -144 105 173 -312 -155 164 -195 -272 311 102 -367 12 229 -176 -317
3396 -317 160 -6 -380 83 34 -32 -55 -9 -55 74 -47 -160 28 -62 -139 -331 257 61 -428 210 236 -424 110
3419 110 426 -168 -320 268 108 -208 -121 248 -103 -133 153 -164 -45 -30 109 77 132 -117 8 313 -24 -284
3441 -284 207 278 -277 -34 396 -144 -229 226 186 -126 47 284 132 -224 37 204 -140 -30 101 103 -9 -153
3463 -153 158 225 38 -118 197 206 24 55 106 -67 -391 156 229 -83 -176 81 180 -55 144 201 -118 -295 147
3486A47j3l92J11K64j07o2R6J40m26K10N5mj39J67j11K7k42J33K08K9m92K52L06
3509A57j74j22K54J52o29J42O49m73j28L40j17j76o1L96j19l25J84K32jj39n6
3530a4K43k03l33L07K99l55j37K47R2k93n6O39k48o45P23K81o69P6L94k59m01
3551c12N30N3m71n5L86j41k5O4q2K76l99J4L24J10n31m9N28k19l09L74K84p35
3573c85K35M57l46k69M26J5l05M4M55k72l65J72K77j69p8m5J15J5j78J61L04m17
3595a53j37L86K29n72J39M52l64l75O33J52p72J80N00l47k81L94J95n08j37M81
3615I5K7j51k2J88nj70j66M34P1n28J00M54k41m26O07P9o98K24O45l25n09L86
3637F9K33m23P3L44r6n15K77L41k77j59K33M1k20P1Q7N4k93p7L24l3k09RM32k14
$$ plain form
3486 147 134 -258 -147 117 10 -52 44 184 -242 -32 23 19 -120 47 -64 -37 -279 -146 62 91 -401 -149 157
3509 157 -17 -139 115 267 -362 -220 429 -44 -172 168 51 -125 -186 210 91 -234 -50 182 181 42 -14
3530 -14 229 26 -307 0 299 -56 -193 54 146 -147 -203 436 188 -457 266 547 -122 -46 348 89 -312
3551 -312 218 271 -200 -255 131 -10 -35 29 -53 223 -176 -162 162 272 -259 -308 220 1 -308 66 350 -385
3573 -385 -150 307 -39 -308 118 133 -172 -128 327 55 -310 -138 139 -30 -108 -153 -38 -23 -201 -40 264 -153
3595 -153 -290 96 325 -247 -108 344 -20 -395 238 390 -382 -202 298 -49 -330 64 259 -249 -386 95
3615 95 122 -29 -51 137 132 -38 -204 230 301 -227 -127 327 86 -340 267 346 -352 -128 517 192 -317 69
3637 69 302 -121 -48 296 200 -315 -38 303 26 -133 100 141 -79 -8 79 133 -160 -237 87 54 -155 -146 286 72
3661G2k70K58K21m45j93O06o7l50K31K84m93k45N20k42j18L0K48N2l45K77J25
3682A56k50o7J09R0p7k67K97J49l52j07O09k36l17K12L27m11k12N31M1o43M39
3703B1K94k38j96K94Q7m31J43J28J91m50j1J85J56j14k63L93R7m36K27J00k04
3724b7l3L36j64l03qK51lk05L59K4l71K12J65l07J35j10j5J82j14K04j63Q3k15
3747h7o7L41l51M6J88M1l07M0K49j64k21L08J13l16n5M01k50j53L01l7k12J37
3769e5J17p7j10R6k3o0Q7j40J15J11q2o7L01j42k85M2L60k44l06N17l7j98J41
3792F1M6j57J5M8O2r5P2J19k54J52j3q7J20k7j26J65J06k85J48K95l66k49L17
3815F7K29o90M26J49k98j24M49j37j69J82k1nj17NJ33o2j9o5RQ2l48L21N5r8j04
$$ plain form
3661 72 -198 60 281 -164 -357 249 182 -168 63 347 -146 -391 129 -113 -231 -201 47 99 -246 31 156
3682 156 -94 -161 -52 38 -39 -306 -9 140 -212 -319 290 54 -263 -51 276 -135 -347 184 225 -418 21
3703 21 315 77 -119 175 262 -169 -26 102 293 -157 -168 17 173 59 -204 189 286 -150 77 177 -27
3724 -27 -60 276 112 -191 -199 52 49 -156 203 227 -144 68 233 -74 61 -49 -64 118 4 208 45 128 -87
3747 -87 -154 187 -164 -118 70 111 -196 -156 93 -71 -292 16 129 -187 -242 159 -91 -244 57 20 -192 -55
3769 -55 62 -15 -125 -29 -52 -112 -25 -165 -50 61 -21 -88 213 71 -214 -172 188 -56 -362 155 118 -80 61
3792 61 107 -50 -35 13 75 -20 52 171 -83 69 56 -31 89 62 -64 101 207 -78 70 365 -1 -250 67
3815 67 296 -394 32 181 -117 -241 208 71 -98 84 63 58 -59 -54 79 17 -2 -67 -58 24 -324 -3 52 -46 -150
3840a50K19J14l69j3K88p4l52N95j7m42RL53k0l88K11L71l18j65K03m1M6j2j79
3863a31R0Qq2J23K38m15m8K50J12l77K37L34o19J21L55j47l07J91K01q6k08K68
3885A08Q6n33M06K12k40k04M9J79j64M6Q6%j06j60L30L08o20j7N25k57k58M38
3907B14K57m88j61O47l63m43M41R9k10k73M20J5m30K08J03o0Jm1J46M7k16j00
3929a87M38j04l77L35Q1k69j34M40j18n14L72J88k82j10M25r2l52J14J34l1n3
3950i6K5J1J2o9K73q7k91J74L7J35j61r8L19j52k03J89L30n59j43M75m2m76K79
3973a18L92k69j94L46r8j80k2K53L5k51K00P5j35j06O3J97k61K7Q8J40l78P7M65
3996C46j83m51J26L72j99j70L59r1l81R1K71o5k42N05j10k89m0L37R2k96M9qO3
$$ plain form
3840 -150 69 183 -186 -199 89 15 -337 258 241 -201 -192 161 141 -247 -36 335 17 -148 55 14 60 48 -131
3863 -131 -41 -33 -115 8 246 -169 -217 33 145 -232 5 339 -280 -159 196 49 -258 -67 134 48 -160 108
3885 108 194 -339 67 279 39 -165 -116 63 -101 -55 31 31 -75 -235 95 403 -217 -234 291 34 -224 214
3907 214 471 -17 -178 469 106 -337 104 203 -7 -280 140 155 -275 -67 36 -24 -23 -64 82 129 -87 -187
3929 -187 251 147 -230 105 186 -83 -217 223 105 -409 -37 151 -131 -241 184 92 -260 -146 -12 -43 -96
3950 -96 -71 -60 -48 -117 156 69 -222 -48 -11 124 -37 -135 184 32 -171 18 348 -211 -354 121 79 -397 -118
3973 -118 274 5 -189 157 59 -121 -143 110 145 -106 94 169 34 -72 -9 188 -73 -46 42 182 -196 -119 346
3996 346 163 -288 -162 210 11 -159 200 109 -272 -181 90 25 -217 288 178 -111 -151 186 278 -18 31 23 86
4019H6k35J25J33p3j86P9L07m09K6J86L3j68j29O29m14k36K42J59j84j04K10j41
4041f4j34j2L87j95r6K49p1j37Q2m9J44kk41K15J0j51j22K47j53j92L69J17k73
4064g2k07L56m9k90M38L6k19j25L83j30j39Q0M4l7q0P7Q4j05k07J80J00jj46N7
4088B8J6j99O9K48n3m61K82J94j85P6K11k57k12K62K00k54QJ53j69lJ20j01O3
4111C6j38L1J42o0o1j82K81m6j57J80Pr8j11K67n9r2lR3r3o7N8J62j98l8N3oR
4138i0Q9J21Jj69j78L02j28N5k3P0N8k13J72J17k83j8L86o5m10K84J56k15j96
4161a77K99p5k06J73mL7nR2q3J8l8k0J2ll5r6L11j48r2J71k40o3p4N01l04k4K71
4188A98m9l17R3J75j31k16J51K70k61K6Q2K17k63l2J73n4q4p1J1J03k09J21L8
$$ plain form
4019 86 -149 -24 109 36 -150 -71 236 -173 -147 39 72 -96 -225 404 -10 -246 -4 155 -29 -133 77 -64
4041 -64 -198 -210 177 -18 -114 135 64 -73 9 -40 104 102 -139 76 86 -65 -187 60 -93 -285 84 201 -72
4064 -72 -279 77 28 -262 176 212 -7 -132 251 121 -18 62 106 69 -11 66 150 45 -162 18 118 117 -29 28
4088 28 44 -155 -86 162 109 -352 -70 124 -61 15 226 -31 -243 19 219 -35 -27 126 -43 -46 74 -27 36
4111 36 -102 -71 71 11 -50 -232 49 3 -154 26 33 -65 -176 91 32 -60 -63 30 -63 -130 -72 90 -108 -146 -93 -99 -90
4138 -90 -1 120 121 -48 -226 76 -52 3 -20 50 108 -105 67 184 -99 -117 269 204 -206 78 234 19 -177
4161 -177 122 47 -159 14 10 47 42 134 51 69 31 11 23 20 -15 -111 200 52 -40 131 -109 -172 -246 255 -49 -73 198
4188 198 149 -168 -75 100 -31 -247 -96 174 -87 -61 21 238 -25 -57 116 62 -22 -93 -82 21 -188 -67 -29
4211b9l4j48J64J73l65K27J92k05k75L80M5k94q8L72j68n3R2o6K19j70L1M6M4
4234I0j00L4J3r8r7J72L11m92R3J99j07k10K64R8l17R4K22o1j37M0J79k38J08
4257F0j39K20j03o7K9L2k9k0J30L2j67J13Q5j05j52L34Kl26j35M69r5k72J95K24
4281C15m42n2L48l1k69O6K36j39j33N5J35r5P6l11L08k08J30Q0M8l77K83K52m24
4304a49o5K77J12l21N9K13l10NR7J82r5p4O0M5k21j23L87q7j21q1L68j31k27J79
4328b1J84n2j67J41P2k53J07J10nm09L19K27k93j2J77Q3k65Q2K95k52k55L20k2
4351A11j05r0J96r4j06l1L03j13j60K34Nk77P3K0R1l09J37K14K6l02J05K45j48
4374B5k89J69J80r4p1K03j65j24J57P2ro1N7m4l7q9K73j90lj57J91K29l76j9K73
$$ plain form
4211 -29 -63 -211 -47 126 -239 -12 180 -25 -300 80 125 -169 -257 115 -53 -106 -14 -80 139 -31 0 46 90
4234 90 -10 24 37 -61 -158 14 325 -167 -74 125 18 -192 72 170 -147 -53 169 108 -29 11 190 -48 60
4257 60 -79 141 38 -29 0 32 3 -17 113 145 -22 91 176 71 -81 253 255 -71 -206 263 168 -104 91 315
4281 315 -127 -179 169 138 -131 -65 171 32 -101 -46 89 -6 70 -241 67 -141 -11 69 117 -260 23 275 -149
4304 -149 -214 63 175 -146 -87 126 -184 -179 -82 100 5 -69 -9 36 -185 -308 79 -8 -129 -210 158 27 -200 -21
4328 -21 163 111 -56 85 157 -96 11 121 116 -293 26 253 -40 -52 125 208 -57 25 320 68 -187 133 111
4351 111 6 -84 112 18 -88 -119 184 71 -89 145 150 -127 -54 -34 57 -252 -115 99 125 -177 -72 173 25
4374 25 -264 -95 85 -9 -80 123 -42 -166 -9 63 54 -7 50 6 -31 -120 153 -37 -40 -197 -6 223 -153 -172 101
4399A01j67m1J33J07k15LK78j48k02R7K26l09J52L4Q9j39L1j1J50k46Q1J9j3J10
4423A20j75L23k83q4L39j69p5l0J00K2j27R9J63k36o6K29j25j40R7j8j2j9P9o1
4447d9J41j52J35J91j28l58L27p8k7n5O8j04K36r6P7k02L5RL8j68J32K6j06Jo
4472a13K64l23NJ90k6P4k05K32k21K0JO9j03j0J88q7j21M9J40p7%n0K81Pl46J08
4498e4J73k64J60Pq5M4K0J34j80OJ13K2m6n1L8Q0j07p8K69n0k36Q1P2o9nr4K0
4525h0J16j26J88Q6k38J65n4J20j36O8j29J07j39J20Q1j60o6N5J04j91j63M81
4547B09k47N1r7K64q2r1PJ17l32J73K40l20PO8J49q6k62L84r5j21j66NK91j21
4571e5O6J12k05j57K17Q7j43jJ24r4j91J69K49j32J7j39K26k43k2J1J33j79J29
$$ plain form
4399 101 -66 -107 26 133 -82 -79 199 51 -151 -54 172 -137 15 49 138 -1 30 19 169 -77 4 23 10 120
4423 120 -55 268 -15 -99 240 71 -4 -34 66 88 -39 60 223 -13 -79 150 25 -115 -18 -36 -48 -67 12 -49
4447 -49 92 -60 75 266 138 -220 107 29 2 -53 15 -89 147 51 128 -74 -39 -30 8 -160 -28 -2 -108 -107 -113
4472 -113 151 -172 -167 23 -3 71 -134 98 -123 -103 -102 -33 -136 -146 42 -45 -166 -117 23 -54 -54 -104 177 184 -162 -54
4498 -54 119 -145 15 22 -63 -19 1 135 -45 -39 74 96 50 -1 37 117 10 -68 201 151 -85 -4 68 -1 -6 -100 -80
4525 -80 36 -90 98 184 -54 111 57 177 41 109 -20 87 -52 68 149 -11 -77 -22 82 -109 -272 209
4547 209 -38 13 -84 180 98 7 14 131 -201 -28 212 -108 -101 -33 116 30 -232 152 57 -64 -230 -225 66 -55
4571 -55 11 123 -82 -239 -22 65 -78 -79 45 -49 -240 -71 178 46 63 -76 150 -93 -115 -104 29 -150 -21
4594b1J87k1j22N8q5LJ54k01L7Q9j18R6K6n4j5J00k9k61L15J94l94K02M9j72k28
4619b11K17J14j37k7O2J83j95rn8J14k18R5J54o9k08J47J20j08q1Q5K04k83J64
4642E5Q7p8k39J75J01j25J3J4J1k22J44J5k2L9p7J53r2k4J44J07k81J9P8J0k26
4667b21L26p1n6k43K27J50l22K2L26j46j30P6P5P5k37K52j04k3K2k4J7m0j77L17
4691I1%o6R7l3j38LP6J9l4j08K81k26n2O8J91j01r0J01J2j39M9J75j16l9O3J17
4717B01j74n0K36k45j36J40J30k4q5j48L05j51j86K11O7j7j47P1J9P5l5J55j69
4740D3j42R9J47j81r9J61N1l12K32r4%r5J37lL5j38J99p4k1L7J68k07j9Q0kp5
4766g3R1q1Kk7p0K78K8k45O0M4Q0j36J40j60q0R0P7O2j61J25R7o7j08K30j07j67
$$ plain form
4594 -21 166 145 23 81 -4 -1 153 -48 -11 78 -40 56 82 28 13 113 84 -177 138 332 -62 140 189 17 -211
4619 -211 6 120 -17 -44 18 201 6 -3 -61 53 -165 -70 84 15 -193 -46 74 -34 -115 -30 174 -109 55
4642 55 142 64 -175 0 101 -24 -11 3 14 -208 -64 -49 -71 -32 -109 44 -48 -72 72 179 -102 -83 -5 5 -221
4667 -221 105 34 -22 -265 -38 112 -210 -188 138 -8 -138 -62 13 88 -149 103 -1 -24 -2 -26 -9 -49 -226 91
4691 91 91 25 122 89 -49 -46 30 49 15 -93 188 -38 -90 -22 169 68 -22 79 91 -48 1 176 60 21 84 201
4717 201 27 -23 213 -32 -168 -28 102 78 -7 -155 150 -1 -187 24 91 74 -73 -2 17 92 57 212 43
4740 43 -99 0 147 -34 -133 28 79 -233 -1 -95 -95 -190 -53 -56 -21 -159 40 -34 -55 -18 150 -57 -76 4 2 -73
4766 -73 18 -63 -61 -88 -158 120 148 -97 -37 7 87 -49 91 -69 -149 -59 18 80 -81 44 141 74 -34 196 89 -78
4792g8O0K65k04j27O9J51j02k71L21P6j1j59K65j46j26j2J27k64K67k6k4Kj22
4815f9J53M7o6o2J05j04n2R1L1q9l7r0K23j58M8J7K43m14J64j25J80p6j13K01
4839D8j17J07j08J0mP5q9M0J0J11k31J78k07J82P4j05j39R4J24j19j05L92k07
4862A4r6L4K2J13k85K20n1j77P8R8jK1P5m9qo7J08n1Kk3K9q6j8J55J48j84j14
4889i3L14j55j1j26J06J5k3j9K17j47J8K3j76K8N5m7M3k6k65L08j0k08Q0p4K39
4914F6j94qP6p0l4K11r5m4m6K76p3k41K67n8k09n3Q5P8j66K90m8J1j25L5J57J3
4940A01r3m8K9M0p1J05n1j54K50p6j73J73m8J58j09p3K50j84j16N9J18o4J4n4
4964a7P7k1j54J74K1j46J7O8N4j92L7K01j78L9N6m3m5l0J75o4j04Q9Q4m9j34J35
$$ plain form
4792 -78 -18 247 43 -84 -15 136 34 -237 84 160 149 -10 255 109 -17 -29 98 -166 101 75 51 53 -69
4815 -69 84 131 65 3 108 4 -48 43 74 -15 -52 -142 81 -77 -29 -12 231 -183 -19 -144 36 -40 -153 48
4839 48 -69 38 -70 -60 -64 11 -78 -38 -28 83 -148 30 -177 5 79 -26 -165 -71 53 -66 -171 221 14
4862 14 -82 -48 -26 87 -198 22 -29 -206 -128 -30 -31 -10 65 16 8 -59 49 -2 0 -23 6 -80 -98 57 205 21 -93
4889 -93 221 66 55 -71 35 50 27 8 225 78 96 119 -57 -29 26 -21 22 -4 -269 39 29 -179 -99 -173 66
4914 66 -128 -136 -60 -130 -164 47 -48 -92 -138 138 65 -176 91 33 -176 -229 -144 -66 -232 58 10 21 -104 -69 88 101
4940 101 8 -40 -11 29 -42 63 12 -142 108 32 -141 32 -16 142 33 -40 210 26 -90 -31 87 23 37 -17
4964 -17 60 39 -115 59 80 -66 -49 19 73 -119 -82 119 -59 -20 36 -7 -52 -82 93 29 -75 14 98 49 -85 50
4990E0k07J37M4j9J35j35o2J21j29J56nO0p4k33J90o9k00L42j61k3J0J21n0j49
5014a50J4K11o3o2q0L37l08k04J83J5N2J5p5J65k11P2J39o7J27k03L3j23Q9J90
5038I6o0j7OJ06q9j19P6L4l2r5J60O0r3k37J80j3K6J53J3k16%m7J58J0o9L8M7
5065G6j08K02lr2l3r5J67j54l7K98j26j52O9Q5j23j8K7J45k18m9J20l7k1J14o3
5090b6Kj26Q3L9O1m1K1j04J14j4p5J8j53K48P8o3n6J3j52o9P4J65O1j22p4R5n2
5117e5rJ14N6k27J99lp6j73J33J65k11J31q8J29j92j3J20K2j45NK93k95K8RN0
5142c3r5R1L6J22j56M7m6R5kP3L3j69j53J36K19j08J06k12l1j17K05O8p6l9l2
5167c8J94j97J2Q4O1l35J22J98j33l8O4Mk6k3k3J16n3o3Q6k3M8r9M6K9j93J83
$$ plain form
4990 50 -157 -20 24 5 140 5 -57 64 -65 91 86 146 72 -161 29 -40 -240 102 -59 -82 -72 49 -1 -150
5014 -150 -136 75 12 -50 -130 207 -101 -305 -122 -107 -55 -40 -115 50 -161 -89 50 -17 110 -93 -60 -183 -94 96
5038 96 36 19 25 131 42 -77 -1 33 1 -94 66 126 33 -204 -24 -37 -11 142 155 -61 -61 -108 50 60 -9 29 76
5065 76 -32 170 167 75 42 -53 114 -40 -77 221 95 -57 12 97 -26 -44 -17 128 -90 -139 -19 -56 -77 37 -26
5090 -26 -24 -150 -67 -28 33 -8 13 -91 23 9 -66 -48 -201 47 125 62 6 19 -133 -202 -128 37 98 -24 -98 -3 -55
5117 -55 -64 50 106 -121 78 75 -1 -174 -41 124 -87 44 -44 85 -107 -120 0 22 -123 -118 175 -120 -92 -83 -33
5142 -33 -128 -37 -1 121 -35 12 -34 61 59 132 165 -4 -157 -21 198 90 196 -16 -47 -164 41 109 33 -6 -38
5167 -38 156 -41 -29 55 116 -219 -97 101 -32 -70 -6 -2 -28 -51 -74 42 -11 -74 12 -11 37 -62 -16 13 -180 3
5193Cnj33R7P9j06j80J58J88o6o2k2P7j07J3O8P8k61K66l7mm6M0N4%j29P3j08
5220g2RM5J96k18Q3J14j82J42k18Q7K57k17r0M2J77j20ok9J21j87J90l8Q0l48
5244a82J69J20Mq6K6j03R7r7PK56m13K14L4J1k00J94r0m4J84N0j87j47K17n1m8
5269f5j6J3K3O2J58p0j29j08R3q6K12j45J46j04j12K9M5N5p7J54L1j61qL7N7l3
5295AR9m5r1o1K0J24j71J54Jm6n7Q1j4K8p3l8M0r7J07O0oP5l06K94n6kn3K61j20
5324A09m5j30J17j21k6J18O9J7o1J12J2o2j34J95l57K08Q5R2j97K4J97l2j31j33
5348g4J30k5k38L45L3j10k23K91p8Q2j39J85j23o4M9%j50L1P4Rm4r4J19l3o4P8
5374c3o3l9J03j6k9J27r5r0J47k40K61m2j64O3J26J47k51K9Q8P5j59j0J19j13
$$ plain form
5193 3 -2 -135 -38 41 -65 -245 -87 101 35 -27 -49 28 -79 -66 2 80 -181 85 48 44 -2 38 92 92 -37 36 -72
5220 -72 -63 -18 178 -40 43 157 -25 117 -101 -14 243 26 -64 -22 155 35 29 0 121 -66 124 86 166 -182
5244 -182 -13 107 111 25 51 -52 45 -52 -45 211 -202 12 46 57 -143 51 -39 -83 101 151 -36 -183 34 -17 -65
5269 -65 -81 -68 -45 17 175 105 -24 -132 -39 -125 87 -58 88 -16 -128 -99 -54 1 -76 78 109 -52 -60 -23 34 1
5295 1 100 55 -36 -97 -77 47 -124 30 31 -15 -72 9 -5 23 -50 -88 -48 -145 -38 22 16 91 -215 79 23 21 -32 229 109
5324 109 64 -66 51 -70 -96 22 91 108 47 159 171 109 -25 170 -187 21 106 198 1 25 222 190 59 -74
5348 -74 56 31 -207 138 171 61 -162 129 51 133 -6 179 56 -8 41 41 -109 -78 -4 5 -39 -133 -14 -47 -111 -33
5374 -33 -96 -135 -32 -48 -77 50 -45 -135 12 -228 33 -9 -173 -110 16 163 -88 -59 29 104 -55 -65 54 -59
5398e9J93j14q8P4k2N1L4o1m8J70j34p4J96P0k93j0L51j46j16J6J79k38o7J61
5422B5Nj3n7K4J00j92L29n0j51o6m8p5Q8K2J24N2j18j8O0j17O6O9j6M4l06J79
5448d0k7J14j74J24J6j23J41P3r1o2J48P3k72J37j60M0Kr7K24j69l5J65n4M4N1
5473D8o0N8Rj12N7m2O6M6j2K06k60KJ20j80J10O1L8k10Q8j6r8m6K08O9k81o9K88
5500H8q7P5j22R7l3j21J06M1p7R4O1J9j17N3jj4n5O6K2j08l3K23k65j3J36Q7r7
5527B5j0k9J57j74L2j05K18q6o2M6o2pJ43q3k0N6j60J33q7K9Q8j42m9K34m9p8
5553d2N1J2n6j27Q7J71J8Oj98K27q0lj21P4k43J27K0J10j3l7p7M6k5P2J25l06
5579a82K65j25m3K5J64j9l9p8l6J91j16L0l3O5J2j59J49P3k30R1Q0Q1k15j27K52
$$ plain form
5398 -59 134 20 -68 6 -16 35 69 8 -40 130 -4 -78 118 188 -105 -115 236 90 -26 -10 169 -69 -136 25
5422 25 30 17 -40 -16 84 -108 221 171 20 -46 -94 -169 -81 -59 65 117 -1 -19 41 -76 -10 59 43 87 -219 -40
5448 -40 -67 47 -127 -3 13 -110 31 104 13 -49 99 172 -100 37 -123 -83 -81 -178 46 -123 -158 7 -47 -3 48
5473 48 -12 46 55 -57 0 -42 24 70 58 264 4 6 126 -54 56 117 155 -55 33 17 -81 -127 81 150 -131 -200 88
5500 88 1 76 -46 51 18 -103 3 44 -33 61 122 141 24 77 76 62 7 73 95 -13 -46 177 -88 -101 35 122 25
5527 25 15 -14 143 -31 1 -104 114 28 -34 12 -50 -57 86 3 -17 39 -121 12 -75 -46 42 -100 -149 85 36 -42
5553 -42 9 21 -35 -162 -75 96 114 120 -78 149 69 66 -55 19 -224 -97 -77 33 20 -17 -94 -48 -73 -1 124 -182
5579 -182 83 -42 -85 -60 104 85 46 -32 -68 123 7 37 4 69 81 -78 71 144 -86 5 85 166 -49 -176 76
5604G6M3j64K88j54j45K3j8R3j98N3L08j40q7O9M8j24mj19J86nl7O9p2Rn4Q3p3
5631d6j03K41J2l36K68M9p9K8R5q2lj02Q9N6j13l6l2K61k50P3J8j06l6J69j29
5656i4P6j04K01P4j76J2J36j79J0K02k89R7j63K30j1j25R4J59k04O8L1r0J64j98
5680g9P5K02k15j1J60o4j33jO8Q%O8J02k9j46M4J9q9K0Q3q7k6Q8l0L1L0r6KL3
5709B7k0k1j6j3L6J84j20j80RK24K0k06K07j72p0J36J99j52j38J31q5k5J95j03
5733D7J8k08K76k31m4J73j3q9J75j18P5j08j30J95q1L7j45J66J07j14j02L04j00
5756I0k41J28J05k20R0N8P9p5j63K54M4j96PJ67k62L4k4J29J27n3j42J57M0j21
5780A2J50N1j93P0rj35J59j5jj18pJ34l7j60J16O1j75J48nl6j06l8J84j19l5J33
$$ plain form
5604 76 119 -45 243 89 -56 -33 -51 42 -156 -103 205 65 -22 47 95 -29 -33 -152 34 29 -8 61 -11 -2 -56 27 -46
5631 -46 -149 92 104 -232 36 85 6 34 129 47 44 -58 31 87 -26 -62 -94 167 -83 -10 8 -98 -134 35 -94
5656 -94 -18 -122 79 153 -23 -11 125 -54 -44 158 -131 -34 -197 33 22 -103 -9 150 -54 14 45 -45 119 -79
5680 -79 -4 198 -17 -28 132 68 -65 -66 2 10 10 78 180 151 5 49 68 -21 -1 82 -5 -31 57 27 58 88 -8 -6 27
5709 27 7 -14 -30 -43 -7 177 57 -123 -114 110 130 -76 131 -41 -111 25 224 72 -66 65 -20 -45 150 47
5733 47 65 -143 133 -98 -142 31 18 -71 104 -14 61 -47 -177 18 -63 -26 -171 -5 102 -12 -114 190 90
5756 90 -151 -23 82 -138 -48 10 89 14 -149 105 149 -47 -40 127 -135 -101 -125 4 131 78 -64 93 133 12
5780 12 162 213 20 90 81 -54 105 90 89 -29 -36 98 61 -99 17 78 -97 51 46 10 -96 -134 50 -69 -104 29
5806B9j2Mj35J26J28l65J24Q0l7l3Q8J28p8j43l1J75o4j56J52J3j68K43k67J78
5830b1O3l07L29j71OJ18k4pl4N8J9m7J0M1k63K10m2R3OJ9p6P4l1nq5P4j44pK39
5859I5j63J8J39j00J89k17L3Q3j49J98j16J04k0l7j6N1o5P5j35N5j09L4R0L5J56
5884B28k19j7LK05j68o6j33O7L5L5N1l9N7q3R7j73N4j8J67J7l02J43J50j12nJ3
5910a3J89j87Q4r5q6j3L4J14l8n7J22j38J43l5N7j8j49N4qj7j1J9M0k2P0Jr5j30
5938a85K40Q6o8j31P1rJ10Pq3j1J05j06j17MR1r1J01J0J7J34j9j08Kl1P5L8p5
5965E7jj34l8P0R0l9l6mQ1k6nN5j8o0j2O0Q9j40rQM4q3Jl7m6J3L16l5j59n6K42
5996A88l33Q7O7j08j6J19kq3L1q6J45M8j68J83j3k35K02l2Q8n5o8R3n8lR8q8N8
$$ plain form
5806 29 17 21 -114 12 140 -225 -101 -21 -58 -91 -3 125 47 -96 -127 48 -16 -172 -20 -7 -175 68 -199 -21
5830 -21 42 -265 64 -107 -101 17 -7 -14 -48 10 29 -18 -8 33 -230 -20 -62 31 37 56 -20 54 23 18 -67 7 -137 -144 95
5859 95 -68 -50 89 -11 178 -39 -6 77 -72 126 10 114 94 57 41 92 27 102 -33 22 -87 -53 37 72 228
5884 228 9 -8 -5 200 32 -34 -167 -100 -65 -30 21 -18 39 -44 53 -120 -66 -84 83 100 -202 -59 91 -21 -26 -13
5910 -13 176 -11 73 -22 -108 -121 -87 27 -11 -68 54 -84 59 24 81 63 -86 -32 -40 -57 -68 -49 -9 -31 39 40 -55 -185
5938 -185 55 141 73 -58 13 4 114 121 38 27 132 26 -91 -87 4 -87 14 24 41 175 156 48 50 19 94 132 57
5965 57 56 -78 -116 -46 44 5 -31 -35 46 20 15 70 52 -8 -20 40 129 -11 -20 -12 32 -51 -50 -87 -133 -120 196 161 2 -54 188
5996 188 -145 -58 9 -99 -115 4 2 -81 -50 -136 9 57 -111 72 59 -176 26 -6 82 27 -41 52 -6 -9 89 1 59
6023E9k0r5K4r1l5R0J21jj10L7J11j48J64j12k2Q5N3j40j8J22P9j22l9J59j16
6048C5M0Km6R4j35rJ07M5j45J32j65J02r6J21L3j84N8P8m6kN0N7q9l5jJ35k70
6075a34n6J64q4J43j23R6n1m8J74J1j0k35J49N4j31P3L8O1j86Q3J45j66r4P8j02
6100a51K11Q5p2m6R4j14r6L6K50k47j18R0J6K56j17j67J67O3k26L1RJ07j11N2
6124Bj2J94k47j1Q6o0o0J84j98M5J05rJ31k62J95n8K0J45Qj92j51J16K38j85K0
6149D4m0n3O7jM5r3m4J39P5j24r1M5r1N0Rr3L07k23j03K72p8j21J52lj51O0k1
6176f5K7o8Q1l3N8l5n3K8K5l9l8L5j5l7J59P9j31J40q4j26M0n6Q5J57j62J3J06
6203I1k21KK61j77q2N1J40m0j38j6J28M1m7jl3Q4J04Qj43LK04j45J4m2J38k36
$$ plain form
6023 59 39 -56 -32 -123 -158 -68 53 52 -58 -21 90 -58 106 -6 -28 57 110 -30 -48 74 153 31 -8 151 35
6048 35 75 77 31 125 -10 -19 88 133 -12 120 -45 57 -39 82 115 -69 -11 67 21 19 69 126 37 2 1 136 -134
6075 -134 -190 -26 -110 33 -90 6 -45 -93 81 92 82 -153 -4 50 -81 -8 30 91 -95 -12 133 -33 -127 -49 -151
6100 -151 60 145 73 27 121 7 -89 -53 197 -50 -168 -78 -62 194 77 -90 77 140 -86 -55 -46 61 -50 2
6124 2 -10 184 -63 -74 12 -48 -108 76 -122 -77 28 19 150 -112 83 25 45 190 198 6 -145 -29 209 24 44
6149 44 4 -49 18 17 62 -31 -75 64 139 15 -76 -31 -122 -72 -63 -156 151 -72 -175 97 19 -102 50 47 -104 -44 -65
6176 -65 -38 -106 -25 -58 0 -35 -88 -60 -35 -74 -112 -77 -92 -129 30 109 -22 118 34 -92 -52 -108 -23 134 -28 -15 91
6203 91 -130 -128 133 -44 -126 -75 65 25 -113 -129 -1 40 -7 -8 -41 43 147 155 12 15 219 74 88 46 184 -52
6229e2l0P2O9j32RQ5N5p5M2J02n1r9p0K23Lo5J9j73J40j18J46j43K4L3P7k29l3
6256a71K26r0K2K5n5j0n5Q3J98k33p4J1J76r0KM7L1k26oJ91j02J09J7r7j5n2J11
6283b7Q2k12Q2O1m0J21j29K8J2l4J00j71J58l1j1N4j09J05R9j75m2j48K83N6p0
6308D2p4L2K1j4M1K4J11O2j08j80J36o0jrJ25j32L1Q0j51J55q3p7J04R6j34j%
6335C6j12n8J52J7qO2j03J78k7l80K51j2jo1k1P4m9J96j63j05J0JJ41p0L2m7N4
6362a3KJ0rj77J55m5P9J34j96JJ50j20o2Q7K9o0J66j54Q6o3N6q2j7j06K6J68N3
6389I8j77q2N7J53K5Qm8M0j40J95K9j91J63j52j17J56R6j4m5n9J97j90J1J25K8
6414A66j56m1J74j41K25J7k27q5J42P5q0p3K24j43o6q2K49j22j34l6J62l5p9R8
$$ plain form
6229 -52 -82 -10 59 -73 -64 21 76 1 43 145 94 -5 -75 148 151 86 105 -68 72 -46 100 -43 -19 14 91 -138 -171
6256 -171 55 -35 -13 12 -43 -53 -108 -25 173 -60 -134 -123 53 -37 -35 12 43 -183 -189 2 -100 9 26 -71 -86 -138 -27
6283 -27 55 -157 -75 -14 -54 67 -62 -34 -22 -56 44 -127 31 0 -11 43 -66 39 138 -37 -79 -227 56 112 42
6308 42 -32 0 21 7 48 72 183 245 137 -43 93 33 32 23 148 16 47 127 -24 131 48 -29 75 171 37 36 36
6335 36 -76 -134 18 35 27 89 -14 164 137 -243 8 -4 -5 -66 -87 -13 -62 134 -29 -134 -124 -123 18 -52 -20 -67 -13
6362 -13 -11 -1 -10 -187 -32 -77 2 136 -60 -59 91 -29 -91 -4 25 -35 131 -23 63 0 56 -26 -43 -149 -123 45 98
6389 98 -79 -161 -104 49 74 82 34 74 -66 129 158 -33 130 -22 -139 17 113 99 54 -5 192 2 13 138 166
6414 166 10 -31 143 2 227 244 17 -68 74 149 69 -4 220 77 11 -71 178 56 -78 -114 48 13 -66 32
6438C2o4R6J3lp2q6P8J3N0l8M6Q3k58J03P5oN2j57l5Q9k1o6K24p6p0j5L9N6%J6
6468I8N9j99L9N6j29pM6P0R4j65m5J10j8r4O4j1j10J87l4p6n0J49j8k5j20J60
6494C1K2O5j23N2m6o7J16k9Q0r4R0Q3k77J21Q1j50J23j4m8p6O6J25J57k71n0J82
6520A49j28pj4r7J32j49J42j54J54J6J53k97R1j5o1Mk0J05j58J20r9m0J19M1R1
6545G8N8k40J46jl2rl1j10J17N7j68J19J92l56J81K7k06P6K55r5l2Qq9N3j06J48
6571D0j42O4J34j75P1m1J79j46L9p3K0K01k78L7J94J04j49j03j38J91M9m8j8J6
6595B8j07O1L6P1r5O7j62Q5j8M5L7r2M7P0n3k94L72mj38j9J70n3j95J28J80k23
6621e6n7Q4n4J77L1j37N9k6l4l3Q7k69J36K6J10p2P8j68P2MP5m4j12J27j86K73
$$ plain form
6438 32 -32 64 77 74 2 -84 -6 7 57 19 65 148 -110 -7 68 62 114 -43 -78 11 -10 -76 148 72 2 -13 26 82 82 98
6468 98 157 -42 -3 53 -76 -83 -37 33 127 -38 -83 27 9 -85 -21 -32 -142 45 11 -65 -115 34 16 -9 -129 31
6494 31 53 118 -5 47 1 -66 50 21 101 7 97 180 -97 24 105 -45 78 64 16 -60 6 131 288 17 -33 149
6520 149 21 14 0 -97 35 -114 28 -126 28 44 197 -100 -9 -24 -85 -81 -101 4 -154 -34 -133 -173 -54 -13 78
6545 78 136 -104 42 41 9 0 -31 -141 -24 33 -135 -16 176 -180 1 28 -178 -102 153 58 26 34 -55 -2 -108 40
6571 40 -102 -38 96 -79 -8 -49 130 -16 23 -50 -30 171 -107 -70 124 228 79 -24 -162 29 78 30 12 28
6595 28 -79 -18 18 89 -6 61 -101 -16 -34 11 48 -44 3 73 20 -274 98 94 -44 -63 107 54 -141 -13 167 -56
6621 -56 -113 -29 -83 94 125 -12 47 21 -13 -46 41 -228 -92 -66 44 -28 50 -118 -46 -42 33 -11 -123 4 -182 91
6647I1j9p2j36P5J32m6q6L3%M1J5j6o0n0J72k8L5j64O5J69k25J93k13M1J44j77
6673h6J31m3m8J22%Jm1j91J67L5J48j75J25j85J9J73j40m0k6J52p2P8j03N2oK0
6699F7j50J65n7q7K2n4m1Q3J46j57L9p9L70l38M7m4J17n0j4Oj02O1O0Mn7N9j7
6726ak3K2l2j52J78rJ34K1j37j01N6k7O3K6OJ58j96m3K4J11q2Q9l2M8O0q7j50
6753g6L0P2N9m3J28l02K25p3l3r2K15k36J68j2l6Jl9L73j43j63O6J8j76OJ35j03
6779c1J26r3P2L6j34J33j10P0k38J86q5J34j02k0J9j6j19J86j11J07J13j16N0
6802E7j98K57j49j07l3L49k31o4O5J7K26j01j1l45K22qj00R2m2J48K5j45J49p8
6826ekr8m7K27o1l5J30k14K07p6P8m4m5M0n9O6j8Q3j90K20k65l0N0J20MJ41j44
$$ plain form
6647 91 72 0 -136 -61 71 25 -61 -28 -28 13 28 12 -48 -98 74 46 81 -83 -18 151 -74 119 -94 -53 91 -86
6673 -86 45 2 -46 76 76 77 36 -155 12 47 195 20 145 -40 -21 152 12 -28 -54 98 26 104 1 53 47 67
6699 67 -83 82 25 -62 -40 -94 -135 -52 94 -63 -24 -103 267 -71 -24 -68 49 -1 -15 -9 -111 -50 10 14 -43 16 -1
6726 -1 -24 -2 -34 -186 -8 -17 117 138 1 -100 -44 -71 -8 18 24 182 -14 -57 -33 78 -4 85 53 101 161 74 -76
6753 -76 -46 26 85 42 170 -132 93 20 -13 -105 110 -126 42 30 -6 -5 -44 329 186 23 89 107 -69 -63 72 -31
6779 -31 95 2 74 110 -24 109 -1 69 -169 17 -68 66 -36 -56 -37 -53 -172 14 -97 10 123 7 57
6802 57 -141 116 -33 -140 -173 176 -55 -119 -54 -37 189 88 77 -268 -46 -54 -154 -62 -104 44 69 -76 73 -5
6826 -5 -7 -105 -152 75 14 -21 109 -105 102 26 104 60 15 55 -4 62 44 127 -63 157 -108 -138 -88 32 36 177 33
6853C3O8o8L9o3m0J58o1j71n9K78j20k5Q0o6MJ10r8Ln0J58k14K29k64K12L9l4
6879G8j35m5K54r1m2K0j6n6K1R9l6j18O6J14j21k1J0J04n4k1J1k3m0N3m2k1J60
6906A08j08p1j8J47j41J02j14N6J19j15J33n5M2N5n6r9l8R1k1l4j4N3R3j20r8
6931a03M3lJ9J55j35j4L3J04l7K9M7k4j68m7M7J12k1L5k5p1O8j83K54q4%R6o2
6958F5j19j0j0K4K11J6j91O7J2K7pl5p4n6K08j53K1j04M9J1Q3Lj62K06L9k44R7
6985b6j23R2J42j24q3J08N6q3M3p9J8O1j63Q6j0J18j56R3Q4K9k5k03K99j20L1
7010F5o4o5Q4M8r8J06L0r5R0r9J43r6J04m6nj4O2n8k1l3J1Q7j6j51O5n5J40p7
7038D2j57M9J02J13r9L5r8Q6j86J75j47K29q1j26K03k11O6R2j65J78j03M6l8o9
$$ plain form
6853 33 101 33 72 9 -31 127 66 -105 -164 114 -6 -31 49 -17 -13 97 -1 2 -48 110 -104 125 -139 73 112 78
6879 78 -57 -102 152 61 19 39 23 -33 -12 87 51 -67 -1 113 -8 -29 -19 85 31 10 21 -2 -42 11 -31 -52 108
6906 108 0 -71 -89 58 -83 19 -95 -39 80 -35 98 43 85 140 84 -15 -53 38 17 -17 -31 22 115 -5 -103
6931 -103 -60 -63 -44 111 -24 -38 -5 99 62 91 138 114 -54 -101 -54 58 37 72 47 -24 44 -139 115 31 31 127 65
6958 65 -54 -64 -74 -50 161 177 -14 53 65 92 85 50 -24 -80 128 -25 -4 -108 -59 -48 35 38 -124 82 121 -123 -26
6985 -26 -149 -57 85 -39 -122 -14 42 -41 2 -77 -59 2 -161 -75 -85 33 -123 -30 54 83 58 -145 154 34 65
7010 65 1 -64 20 68 -30 76 106 11 101 2 145 49 153 107 102 88 150 92 71 38 49 136 120 -31 34 -21 119 42
7038 42 -115 -66 36 149 50 85 -13 73 -113 62 -85 144 63 -63 140 -71 -5 87 -78 100 -3 43 5 -64
7062f4M9J64j26o0K0N4K7k32J12R2J1lj11J88j80m3N6q0J02J39j37N0o0J91j14
7087D5k1J68k94O7K1N4m1J7r7J45m7J44k66m7K16j90K33o6j21l1J40j07K6%R3
7112D1o1m8J74j31P0J9j31K00k38P1o5J40K1m6Q7l4Q3j87Q0j04j4J7P3k4r0K17
7138A20l0j23n5R1j72K55l2L0j75J21j42J40o1l1J14j4k0p7J41q2J84j56k03J42
7162c5P4j83L7K03j05J8%n1K1Q0RJ4j64M6P0l5j06L3Q7j12J05M9j5j27MJ36r2
7189c9P9j21J17n5o5J73k3k3k35K33j02K1q7O6J58k4j19J00r2J51L3j83R8J40
7213B01j20j59L4oJ47r8p8J48M1j6j35N7QJ8K9j39K3j3R7J25j2j52ON6j04M2J99
7240A99k04j47J98l3p9K23j04n5p7P1j0l6O9j8j5O5n1J8Qj10k7J87m9j17J74K
$$ plain form
7062 -64 -15 149 23 -37 -17 37 64 -168 -56 36 47 44 -67 121 -59 -102 -46 -126 -24 115 -22 28 -32 159 45
7087 45 24 192 -102 -35 -14 40 -1 16 -81 64 17 161 -105 -152 64 -126 107 41 -80 -111 29 -78 -52 -52 41
7112 41 -20 -68 106 -25 45 64 -67 133 -105 -34 -99 41 62 16 103 69 152 -35 45 -59 -73 -56 17 -7 -97 120
7138 120 90 -33 -88 3 -169 86 54 84 -91 30 -112 28 -33 -64 50 36 16 -61 80 -2 182 26 -177 -35
7162 -35 39 -144 -107 96 -9 9 9 -42 -21 59 68 82 -82 -36 34 -1 -107 -74 13 -99 6 55 40 -87 -83 53 -39
7189 -39 40 -81 36 -19 -84 89 66 43 -192 41 -61 -40 -127 -61 97 73 -46 54 -38 113 146 -37 61 201
7213 201 81 -78 -44 -50 97 -1 -79 69 110 94 -41 16 24 42 71 -68 -45 -58 39 164 152 0 6 62 -42 0 199
7240 199 -5 -152 46 13 -66 157 53 -2 -79 -8 -18 -54 15 -3 -18 47 -4 14 22 -88 -115 72 23 -94 80 82
7266H2k41J11m3J42J57j22j56J34J0nL0k64K41p8N6L5j8j77J03p4J08J7k4M3j3
7291E4r5J04k7J39j42l4K15k67J29k44J61J36j81K13q9j5l2q5J4J60P7j99r8J25
7315A9N9j14q7J84j92N4N6j47R7N2L4l3L7r9JL8J44l41J84M1J51m1j39J17m1o4
7341c0j7O1k4m1R1j47J46j44Q8J36m8j11J8J58j73J38j00%J00o2j73J93pq7K7
7366hj60J85J41k10L2n4R5j36M5J36j54Q7J1j67J53J14kj67J4J07M2k6Q1j73n0
7391f4P1J71j96m7P4q3J73k00J48nj29J43Jq1O5J5j38O7O6r4L6P3K02j97j06o
7417d1n5M8KK9O3j04O0p3m9K45k67J78N2j03P3j61J60j49J36J1k23K04j34J37
7441C9oj28J24m8j61J99P7m2k14RQ3J19j16M8R7j74N5J50j01O7k3K0j8O3k6L2
$$ plain form
7266 82 -159 -48 -91 51 208 86 -70 64 74 69 99 -165 76 -2 54 89 71 -106 -3 -77 31 48 24 67 54
7291 54 -41 63 36 175 33 -1 214 -53 76 -168 -7 129 -52 161 72 57 25 -60 -46 114 191 -8 -106 19
7315 19 78 -36 -123 61 -131 -77 -21 -168 -71 -19 15 -18 19 -80 -79 -41 103 -238 -54 -13 138 97 -42 75 34 -30
7341 -30 -47 14 -10 -51 40 -107 39 -105 -17 119 71 -40 -22 136 -37 101 1 1 101 39 -134 59 52 -35 -8
7366 -8 -168 17 158 -52 -20 -74 21 -115 -70 66 -88 -1 10 -157 -4 110 108 -59 -45 62 104 78 159 -14 -64
7391 -64 7 178 -18 -65 9 -74 99 -101 47 42 -87 56 57 -24 41 56 -82 -15 51 -43 -7 66 268 71 -35 -41
7417 -41 -96 -48 -46 -17 46 -58 2 -71 -120 125 -142 36 88 -15 58 -103 57 -92 44 55 -168 36 -98 39
7441 39 33 -95 29 -19 -180 19 96 54 -160 -151 -68 51 -65 -17 80 -94 -39 111 10 77 54 74 56 119 93 125
7467A25r0K1l9J1j0J39j60j06J13N1m0J06j6k35K61k18N1Q7m7l7K16k08j88K63
7491E0n4J12j83N9J01q2M2p1J3j20j2M4J56o3N4N0j04j4J8n5q9J67K2p3K8l0J
7518c3J37j01j24O9L3K0kL4p4m8J45N8j52N6j5o1J3J84j90k2J08J8k35J68j5R5
7544F6l0M0p7Q3j3k9k3j14J66j41j3J78p1Jj6j36J15P5k55J15rO0J61r5J44o4
7570A18j88P2O0j23J25J3j82R3r3K17p3m0Q7k17J56N3N1q6%J6j67K9N8L5j50N9
7596g7R7j4rL9J4q8k0nJ49k1r1j54RJ30O1m0j1J42j88PJ2M3K6k9j60J50Q2j47
7624i3M8R0PJ2Jj50R7L7j24K7J5J85k16J48n6p3P6j24M5M6oj6L6p5J9O1n8lK10
7653A66j30Mm8L0Q4Q8k19L6j04j0R3J6L0P0L8j95l5j8J53pk55N1Q2J52K5O1j50
$$ plain form
7467 125 35 56 17 28 18 157 -3 -109 4 55 15 121 105 -130 131 -87 -36 51 4 -33 183 -25 -213 50
7491 50 -4 108 -75 -16 85 3 45 -26 -13 -133 -145 -101 55 -8 46 96 -8 -22 -4 -59 -148 19 41 -32 -4 -34 -33
7518 -33 104 3 -121 -52 -19 1 -1 33 -41 -89 56 114 -38 18 3 -58 -45 139 -51 -73 35 53 -182 -14 -29 66
7544 66 36 76 -1 82 69 40 17 -97 69 -72 -85 93 22 23 7 -129 -14 61 -194 -79 -88 -28 133 38 182 118
7570 118 -70 2 62 -61 64 77 -105 -12 -105 112 39 -1 86 -131 25 78 129 43 43 59 -108 -79 -21 14 -136 -77
7596 -77 20 6 -3 36 50 -38 -58 -63 86 65 -26 -180 -171 -41 20 -20 -31 111 -77 -70 -58 -15 11 -18 -178 -28 54 -93
7624 -93 -45 45 52 64 65 -85 12 49 -75 -48 -33 152 -64 84 28 -45 31 -93 -48 -2 -8 -24 12 -63 -44 17 -41 -44 166
7653 166 36 40 -8 22 106 194 -25 11 -93 -103 -10 6 36 106 144 -51 -86 -104 49 42 -213 -162 -80 72 97 158 8
7680Hj9l3j0O3J46j59n5Q2pl1n4L2J21j44J20j78J32q8J51j59K3O0o5Q3k2kN0
7707D5n0nK2mK3J7R4l56K13n1J39n1L3k2j49J58N2j09k4K8lM4L7j54R7N6j19K2
7735a7n8kJ92nl7l00K03J43J9j34p8K21j23J32k41L8J78j71M3j63L0J77j69K25
7759A03j24L1m2l9K49j10k2m0j25K6Q4P1q8K7o7L0K68j27k30P7N7rR5j71J88j28
7785a6j27P9m9Q9j10J08k5K0Q9j08j41K36on4R0k21R0j61J36%P0R2j96K24r4j84
7811a69K68j05O5o7o4j6M5q0J59J04k19J8J39mo4K7j02R0J7l3j22P9K1L4o7L6
7837a0PL5j42J32k8kK5j78K38j89J35J92k29J4Q6ok4R9j55p2K03q8o0r9J10M0
7863C4O2q5K35l16np5J5J1K27o9q4R8Q6j20M9Q2j10N6L9r8Jj73M5J02q4J63r3
$$ plain form
7680 8 -11 -44 -54 9 155 -4 -59 23 16 -15 -69 -37 84 -60 60 -118 14 -74 77 -82 -59 1 -64 19 -3 -5 45
7707 45 -5 -10 12 8 31 48 142 -214 -1 -52 87 36 69 47 -102 56 108 -1 -25 3 0 44 81 -73 24 80 -39 -17
7735 -17 -75 -77 115 110 73 -227 -24 119 138 4 -74 147 24 156 -85 -47 131 -40 3 -160 -130 47 -122 103
7759 103 -21 10 -32 -71 178 68 46 6 -119 -93 -9 62 -26 1 -66 -36 232 105 -125 -48 9 0 95 -76 112 -16
7785 -16 -143 -64 -113 -24 -134 -26 -51 -31 58 -50 -191 45 39 -15 75 -146 -56 -217 -81 -81 -11 81 -115 109 15 -169
7811 -169 99 -6 59 -8 -72 -88 -43 -123 36 140 -79 -61 78 74 10 37 -65 25 42 9 -113 -34 -13 21 -46 -10
7837 -10 -3 32 -110 22 -6 -8 17 -161 77 -112 23 215 -14 0 86 80 56 155 0 -72 131 43 -17 -116 -6 34
7863 34 96 11 246 -70 -75 -150 -135 -124 103 34 -50 48 134 14 63 145 35 91 130 32 33 -140 -95 7 -77 86 -7
7890gK6p1J8j5Q4j35J35j03J17p9m0J50j01J95j53J55k46k6R5R1p8K2M2n7q9J35
7916F5j16J22J6j61J49j84P7K4qp8J9J84j18j08J66Jo8O4L4q2P9j51P9k1J49r4
7942C9j2J51l73J78M9k4nN0N0r0j9nR1r4o5J05Mq1R6q7O3j8l7pj3j01R3J2O6o8
7972e2j91K28N9r7l7O8J63j27j14J72l2q8O8N9r7j17J28Mj42J69l9j7rO2N9j28
7998d8m0J20p8N8O0j18J41p4k05L0J28k8J27j34k0J47Rr0J25q8L2o1o2l2M1O3
8024Cj07K51j3n9k30J27j02jK9K11k02R7j46P7k2O0N3m2pM0l7%j9l2L8M2o6J39
8052H2j37k9Q0j3m5Oj4p6J84op9R7r2j2L2J36j03r5P0QJ01n2j7N5j44P4l2j9R
8081c1K3M1j33J20r7J3M9L5J4j64K55k7l7J1m8J54j82K4m3N8J08k0j59J4l2J03
$$ plain form
7890 -7 19 -52 -34 -49 35 -100 35 -68 49 -30 -70 80 -21 174 21 176 -70 -96 -1 90 12 34 76 19 -70 65
7916 65 -51 71 87 -74 75 -109 -32 -8 -16 -94 -75 109 -9 -117 49 50 -18 46 80 -2 77 -74 5 -16 133 39
7942 39 27 178 -195 -17 32 8 3 53 103 13 -6 -11 80 -14 -79 26 30 -51 45 -42 21 3 -34 -41 -54 -155 -62 -50 16 -52
7972 -52 -243 -15 44 -53 -90 -22 141 14 -100 72 40 -48 20 79 -18 -135 -7 -3 -145 24 -15 -32 -41 21 80 -48
7998 -48 -88 32 -46 12 72 -46 95 21 -184 -154 -26 -54 73 -61 -81 66 75 -15 110 22 54 -7 -69 -101 -60 3
8024 3 -104 147 134 75 -155 -28 -130 -131 -102 109 -93 4 -142 -65 -87 -27 26 -16 -23 17 -20 -20 -39 -71 -33 9 -57 82
8052 82 -55 -84 -4 -17 -62 -56 -70 -146 38 32 -47 50 -42 -54 -22 114 11 -84 -14 -6 95 43 26 81 -63 11 -21 -40 -31
8081 -31 -8 33 -100 20 -77 -64 -15 20 34 -130 125 98 61 72 24 178 -4 20 -23 35 143 123 -36 -22 -54 49
8107D9j09J18kj72R8L8J26k59K35q3j04J00q2P1l1n2K05j38nj25qJ26J51j18k9
8132@L9n3R1j1j87J44rrNm9l2P2m6o5J91j64J70j55j35l9L18p7m6l0K75l0k32
8159f4k1R0n9M4r7R3q0kR6j05M4K38k25jo9j7K89j27q2J26r5r8J11k0J4J3J35
8186A31k19L7J33j57P5
$$ plain form
8107 49 -60 58 56 -116 -18 20 146 -113 122 39 -65 35 -47 24 -7 -59 146 8 3 -122 -130 -4 147 29 0
8132 0 39 -14 77 66 -121 23 14 5 10 -39 -71 1 -45 -110 81 -83 87 -68 -203 -242 76 -1 -47 -77 198 168 -64
8159 -64 -85 5 -54 -10 -107 -14 -94 -96 0 -105 -61 177 -48 -49 -118 -135 154 27 -55 71 -24 -122 -11 -31 -17 -4 131
8186 131 -88 -51 82 -75 0
8191@
$$ Imaginary data points
##PAGE= N=2
##DATA TABLE= (X++(I..I)), XYDATA
0@%%%%%%%%%%Qj6J6j6K2l0L5m3N6o4P2q8J07j31J52j76K08k40K74l14L58m08M64
33B46n25N93o66P49q40R38j046J163j291J433j588J755j938K139k359K599k863
50a501L153l474L829m225M672n172N740o397P161q059R140j0468J2140j4324J7305
65I520k1623K8450m0854P0143k55252j45480O67494k36921k95026L85589k3824
76A42216m49806K62773K65951k78972L801J81079k66432J8831L34138j76627k08309
87a71357K48575o6457j95749L05471Q9089l79879O6274K32283k34380K3928L57104
98B74902k45815l17161L34717J09549l02579J54373J99521l12845p5461L02073
108A21274l8897j50752J08926m4276j10841J76746M1433j68433P5335M1030j90176
$$ plain form
0 0 0 0 0 0 0 0 0 0 0 0 8 -8 8 -8 14 -16 19 -24 32 -32 40 -48 59 -72 80 -96 112 -128 146 -168 190 -218 246
33 246 -279 314 -352 397 -443 495 -551 612 -679 754 -834 921 -1017 1122 -1237 1362 -1501
50 -1501 1652 -1822 2007 -2218 2454 -2718 3022 -3375 3786 -4273 4867 -5601 6539 -7785 9520
65 9520 -12103 16347 -24507 45636 -209616 -355096 312398 75477 -219549 166040 142216
76 142216 -307590 -44817 221134 -57838 -54037 127042 -139390 -120559 213579 36952 -171357
87 -171357 77218 10761 -184988 120483 209572 -170307 -104033 128250 -106130 -82202 274902
98 274902 29087 -288074 46643 156192 -146387 7986 207507 -105338 -180799 121274
108 121274 82377 -68375 40551 -3725 -114566 62180 103613 -64820 10515 51545 -138631
119a38631J03211K35889j77361j66140J82918K968j61490J61280J23779k35822
129f9399n3129J99020m1167j02610J22251R651j60335M2229J44395n2059p9639
140d0792L8919m976k9271N3985K9996l3544k5692l0937J390P7071K4634p9342
152a8559j6832N8818l5363m1237J00167K3924j39706L976J35330m5300r1474R3985
164B7729K2220j36175M7218J42509r1538q8672J01451q387q6103R0071N4607j09483
176c4553n683O6361m8720N283P5942o8721m7433R8350k9040p7640J12089J1551
188E7786j55440P2698J34111j38924m8401J65703o9000j41173J62170O6549j82600
199g6521L8832J26751j27262l0940J52652n7684j01754J07906M649j01340Q7343
$$ plain form
119 -138631 -35420 200469 23108 -143032 39886 42854 -118636 42644 166423 -69399
129 -69399 -122528 76492 35325 -67285 54966 64617 -95718 -53489 90906 38847 -40792
140 -40792 -1873 -6849 -36120 17865 47861 14317 -11375 -42312 -40922 36149 60783 -18559
152 -18559 -35391 23427 -11936 -53173 46994 70918 -68788 -64812 70518 25218 -66256 27729
164 27729 49949 -86226 -39008 103501 11963 -76709 24742 16355 -69748 20323 74930 -34553
176 -34553 -40236 26125 -22595 -17312 58630 -10091 -57524 40826 11786 -65854 46235 57786
188 57786 -97654 -24956 109155 -29769 -78170 87533 18533 -122640 39530 106079 -76521
199 -76521 -37689 89062 -38200 -69140 83512 25828 -75926 31980 36629 -64711 22632
210B2632M0125j27871M9669R5471j22778k879J40919j02449r5643J68441M584
221G0221j66426R7803J02415j70285m502J75662q9483j08763J42194M059j33931
232h1036Q3986P1170j19075J4277R1901q3729j9627J03457o3410o4122J15767
243D9559j8281j10235J02230M8889j46513L7286J30092j13001o2045J49011k7909
254C9083j33446J04094O9341j34742J5109J09948q1353m7197J01621k1768p3117
265e2427O7842J5348p4775M5520M1039q2291K0589P5279p9462k4943J05413m3075
277A4057q6276R8258L3273j19327L3676J01007r0777m9268J17185j6808r9013
288f4013P0097M7955q9294R777P1263m9210k8734O0611j8331m1200N0887k270
$$ plain form
210 22632 62757 -65114 -15445 80026 -42752 -45631 95288 -7161 -102804 65637 70221
221 70221 -96205 1598 104013 -66272 -70774 104888 15405 -93358 48836 52895 -81036
232 -81036 2950 74120 -44955 -30678 61223 -22506 -42133 61324 -2086 -66208 49559
243 49559 31278 -78957 23273 72162 -74351 -37065 93027 -19974 -82019 66992 39083
254 39083 -94363 9731 79072 -55670 -40561 69387 -11966 -59163 42458 20690 -52427
265 -52427 15415 30763 -44012 1508 42547 -39744 -19155 56124 -23338 -48281 57132 14057
277 14057 -72219 26039 59312 -60015 -26339 74668 -16109 -65377 51808 35000 -64013
288 -64013 6084 54039 -35255 -25478 45785 -3425 -32159 28452 10121 -31079 19808 17538
300A7538n3266N0595K1448p5505L0863O3091p8604k1760J00633l2180q7440Q2126
312A7539M3373j10975J6739J01517o9726n5988R4245k971q2366M6472M4233o3749
324b1657K147N2631l8802j6970M8600k8944k6983N7856j6562n1544N8801J4929
336C3502q0588L2119P0450p3647l0398R6806k6470q8815P6005M6791r8144J1103
348c1286Q5823n6731m8135P4187K065o4511L5150L3515m8405Q134L2580l9194
360a6808L326L9544l9460q477N8244l3325n0742O7503J6899q2962L3213P3297
372F0252p8244l4169R7351k0498q2762O6181M3536q3302M236P2629m3687m1141
384c9618O0382Q1m7005L4021J2657m1243K2697J7274m1192K1695L6555n4588q236
$$ plain form
300 17538 -35728 14867 36315 -39190 -8327 54764 -23840 -45600 55033 22853 -64587 17539
312 17539 60912 -50063 -33324 68193 -1533 -57521 36724 33753 -48613 -2141 42092 -21657
324 -21657 -19510 33121 -5681 -22651 25949 -2995 -29978 27878 11316 -40228 18573 33502
336 33502 -47086 -14967 55483 -18164 -48562 48244 21774 -67041 8964 55755 -42389 -31286
348 -31286 54537 -2194 -50329 23858 25923 -38588 -3438 30077 -18328 -10194 22386 -16808
360 -16808 -13482 26062 -13398 -21875 36369 3044 -47698 19805 36704 -46258 -13045 60252
372 60252 -17992 -52161 45190 24692 -58070 8111 51647 -31655 -27419 45210 1523 -39618
384 -39618 20764 20845 -26160 7861 20518 -20725 1972 19246 -21946 -251 36304 -18284 -26520
397b6520O7749l5034n5918P4853J9168r0764L1302P3821p4028l2661Q8768j5641
409B5095p3395N4871L8176p2080L443N8645l6970k3042M6829j4353k7691L2601
421A2129q366k7174L9868J110n0990L5713L6475o8777o11P7926m5067n5740P9858
434B6354J2673q6968L2221O3372o4495k1845P4287j9756n7318M7131J9711n1010
446b5643J7883L2354l5624j269K8117k4266k932L0969k6024j7169M7625j1917
458A2104m8158M5378K4464o7990J2743O8187m4685m4610O1845Q142o2485K5849
470i216M8908m4453k2738M3718n286k8289K2599P886k1712O441Q809r830P879
483D716M122k1401P349K4125k0387j0894L1333j3387l5044L4261K6907m3090p196
$$ plain form
397 -26520 41229 6195 -49723 25130 44298 -46466 -15164 58657 -15371 -48032 40736 25095
409 25095 -48300 6571 44747 -27333 -23890 34755 -2215 -25257 21572 7219 -20472 12129
421 12129 3763 -23411 16457 17567 -33423 2290 38765 -30012 -30623 47303 2236 -53504 26354
434 26354 39027 -47941 -15720 47652 -16843 -38688 35599 15843 -41475 5656 25367 -25643
446 -25643 -7760 24594 -11030 -12299 15818 -8448 -11380 19589 -6435 -23604 24021 12104
458 12104 -36054 9324 33788 -34202 -21459 46728 2043 -42567 19278 27420 -35065 -9216
470 -9216 39692 -4761 -27499 16219 10933 -17356 5243 13129 -8583 -2142 6667 -3163 4716
483 4716 8838 -12563 -5214 18911 -1476 -12370 18963 5576 -29468 4793 31700 -11390 -18586
496a8586M1791j8702l5496M0763K3720n1116n039M4764j5397k7216K9947P703
508A7136l4542N077K7296j0370q918R002j3357j966K3119r579j1830K1822j3974
521a084k8629L7660K2458m8496q9M4229l3841k6217O2631j374o8384K9950M5502
534C4316n0077m586N4759l2801m2844M9602J6083m0235J7949J2929m1609J7603
546h911L6299l5550o58L4487m4227j5562P1283j4446o4798M8106K7041p2262K5414
559a3784P3106o6861m2956P7599p861n5827N5696J7720p5014J8074N5700m0580
571d988p638M4870m1609k7385O2950p670m3835M4319k372o2021M7608M8340o9998
584a9429o257O3498m6804l5479Q4805l335q5040L8506M5247n8075R704N5654m8240
$$ plain form
496 -18586 23205 4503 -30993 9770 33490 -17626 -22665 22099 6702 -20514 9433 17136
508 17136 -17406 -12329 14967 4597 -4321 4681 -8676 -10642 12477 2898 -8932 12890 -1084
521 -1084 -29713 7947 30405 -18091 -18180 26049 -7792 -34009 28622 27248 -41136 -11186 34316
534 34316 -15761 -20347 34412 1611 -41233 8369 24452 -15783 2166 15095 -26514 -8911
546 -8911 27388 -8162 -8820 25667 -18560 -34122 37161 22715 -42083 6023 33064 -39198 -13784
559 -13784 59322 -7539 -50495 27104 19243 -36584 19112 36832 -38182 -20108 35592 -4988
571 -4988 -12626 32244 -9365 -36750 26200 18530 -25305 19014 16642 -45379 2229 50569 -19429
584 -19429 -25686 37812 -8992 -44471 40334 36999 -48041 -9535 35712 -22363 -12659 42995 -5245
597e245l2662N1294k277k5721L5038j0823m7469L8516K7629m6461J5945L2845
609C0609n7281o708P0085j9923m8828M0590O276n0468L3340M4502n2151j9221
621b9178M3880j5254j9344L9966k907m1037J2581J9528j0618R321M621k7893M193
634a2141K4459j5747j93K6151k7858k7757M1881J7604l6321J347K2430k1385j1240
647a8770L3265O581k9856m029J4036J030R23M576l471j0390m387J1947J1684p120
661F019j0036K16P68J353Q866L940j1616j0333N899J0925L414q177n564O124n105
676c307p009K2447P848l4455m023L3761p928k3040K5633P456l9992P211L8939
689B3541j7736k0016K0849n383j6816K0982P164j9156M946K978j5061J7482J5244
$$ plain form
597 -5245 -37907 13387 11110 -14611 20427 9604 -37865 651 28280 -18181 -2236 30609
609 30609 -26672 -33380 36705 16782 -32046 8544 14820 -35648 -2308 42194 -9957 -29178
621 -29178 14702 -552 -19896 20070 17163 -23874 -11293 8235 -2383 6938 11559 -16334 -12141
634 -12141 12318 -3429 -3622 22529 -5329 -33086 8795 26399 -9922 -8575 13855 -7530 -18770
647 -18770 14495 21076 -8780 -12809 1227 2257 3180 7756 4285 -6105 -10492 1455 13139 6019
661 6019 -4017 -3801 -3033 -1680 7186 11126 -490 -10823 -4924 6001 9415 1238 -4326 1798 -3307
676 -3307 -10316 12131 19979 -14476 -18499 15262 7334 -15706 9927 17383 -22609 -15398 23541
689 23541 5805 -14211 6638 1255 -15561 5421 12585 -6571 -1625 1353 -13708 3774 19018
702A9018l1168k33K8726k4908j0371M4487j3866m5568L4103K5176m4357O974M2585
715C0598l6348k7274M9006K186l9002K1856J4586l2683R860K4825k1472l245J7721
728A0614k0092k546L3440j8561k5834L6433n99m1479L2674K9217n2291l689N1103
741B8390k4847l1854M5195M727m8473K0551L2360l3724m487K9985j9068j3110
753a4355K6156o247j5464J8972n130j9883K4377P776l3434J4328K6152l6132n412
766a8296M4797j9055l5823L6919J4045m2829J0207L6019k8512j9432L4379j361
778A1058k6208J5983R758j8485M400J0175j0639K849P519j3588J880J6617j4252
791b933j0153K4268m311k6100J9954J7494k9791j994L0388j3295k4010K4399J2201
$$ plain form
702 19018 -12150 -12383 16343 -8565 -18936 25551 11685 -33883 220 25396 -18961 -11987 30598
715 30598 -5750 -33024 15982 18168 -20834 1022 15608 -17075 -7215 17610 -3862 -7107 10614
728 10614 -9478 -12024 21416 2855 -22979 13454 12855 -28624 4050 33267 -19024 -22713 28390
741 28390 3543 -28311 16884 21611 -26862 -6311 26049 -7675 -12162 17823 -1245 -14355
753 -14355 11801 5554 -9910 9062 3932 -15951 8426 16202 -17232 -2904 23248 -12884 -18296
766 -18296 26501 7446 -28377 8542 22587 -20242 -10035 25984 -2528 -21960 12419 11058
778 11058 -15150 833 10591 -7894 -3494 6681 -3958 -1109 6410 -7178 -5298 11319 -2933
791 -2933 -13086 11182 6871 -19229 725 18219 -11572 -13566 16822 3527 -20483 3916 16117
804A6117k8429J749K4653j3117j4450J7366L611j3923K981P136m226n04J737l535
818b834L756L021r942L415J3374j2526j0120J9905P43k1821J0771J8318k0301
831d241j0059K5933j659k5135J4412J7084k2364m900K2992o402j6405J2021P016
844H293j1913R26Q083n539p89L646o031M044P215j2854j114J7193r364j4891J9034
859E939O835k4797M619K3767j6852j5075K4676J059k4215J1907J5588j8588l985
872i122J7562o130j1040J1455K033j0507O025K591q400P158K636j2420P386J0349
886I576j6617k129K1057r070j8757J9659J0070k5750K986K3637j4905j3730J9917
899E944J803j7229P347R982j1343j039R886o532l095R155n265m586J0282m307
$$ plain form
804 16117 -12312 -10563 14090 973 -13477 3889 7500 -6423 -3442 3694 -532 -1036 701 -2834
818 -2834 922 3943 -5999 -2584 10790 -1736 -11856 8049 8792 -13029 -2258 16060 -4241
831 -4241 -14300 11633 9974 -15161 -749 16335 -6029 -10929 12063 5661 -10744 1277 8293
844 8293 -3620 -2694 5389 -150 -939 2707 -3324 720 7935 -4919 -6033 11160 1796 -13095 5939
859 5939 12774 -12023 -7404 16363 -489 -15564 9112 10171 -14044 -2137 13451 -5137 -9122
872 -9122 8440 2310 -8730 2725 4758 -5749 276 2867 -5533 1625 4261 -8159 -773 9576
886 9576 -7041 -9170 11887 2817 -15940 3719 13789 -11961 -8975 14662 -243 -13973 5944
899 5944 7747 -9482 -2135 7847 -3496 -4535 5351 -1181 -4276 4879 -386 -4972 5310 1003
913A003p928J1741O61j4499Q944J1290j7419k411K1704r251j9103J9976R132k4020
927a0180L214K0413j2157j2347J6006K721j3988N346P140q758J758N771p947K216
941g92P442r786j415J2652o443j0538J3408L159j6941P172J4137j6448n280J9950
955A0277o110j6129J4359P881j7675J017J5030p902q412J0328J71p294N348J05
969I94m726O191r71q203P654N786j2779J84J4483q726j0953J5864L034j8460P249
984c379J3845j4030n430J5913k659j3963R111Q794j1981j637J0171l803m582N072
998A442p72j437K467l411p26P042k385q862P691O917j2839q67J5408p457j2409
1013a0198J3213O184j5163J853J3476q830r315J3635K559j3867M742Q992q931
$$ plain form
913 1003 -6925 4816 5477 -9022 -78 11212 -6207 -8618 13086 3835 -15268 4708 13840 -10180
927 -10180 -6966 13447 1290 -11057 4949 7670 -6318 -972 6168 -2590 -832 4939 -3008 -792
941 -792 6650 -3136 -4551 8101 1658 -8880 4528 7687 -9254 -2082 12055 -4393 -9673 10277
955 10277 4167 -11962 2397 10278 -7397 -6380 8650 748 -7664 2664 2835 -4459 889 994
969 994 -3732 2459 1488 -6715 939 6725 -6054 -5870 8613 -113 -11066 4798 7832 -10628 -3379
984 -3379 10466 -3564 -8994 6919 4260 -9703 -592 8202 -3779 -5416 4755 952 -3630 1442
998 1442 670 -767 1700 -1711 -2437 4605 2220 -6642 1049 7966 -4873 -5740 9668 2211 -10198
1013 -10198 3015 9199 -5964 -4111 9365 535 -8780 4855 7414 -6453 -1711 7281 -1650
1026a650k175Q124k252m544K978J6r54L976l320n309Q906R64j2597P616J1421
1041A1200j5993n509J9625l130j7488J1455J1091j8179j513J9048q010j2734J3114
1054B977J925j2012O950O393j0090L84O901o029K45P974q284l723J2644o200r398
1069i343J6370k19k0618J1151J6609j9366n615K2607p855j9495J8356J0425k1284
1082h277J934J5277j1284m285J3161m564p642P835j486n507J0259j370j2852R737
1096I36O999j5469N265J5298j7070p913K2061l381j8209J4072R201k1037J872
1109g375K0337j0565j1684J3498J22j0556P693M326p704J203J741m362O283L230
1123F187j1201J861J0580r824m455J6581n069j6869J2177J0475j5056m81J3595
$$ plain form
1026 -1650 -3825 4299 2047 -2497 481 497 -457 3519 199 -5110 3796 4760 -7837 -221 11200
1041 11200 -4793 -10302 9323 6193 -11295 160 11251 -6928 -8441 10607 2597 -10137 2977
1054 2977 4902 -7110 -160 6233 -3857 -3473 3428 -2601 -2356 5618 -2666 -6389 6255 55 -9343
1069 -9343 7027 6808 -13810 -2659 13950 -5416 -11031 11576 3721 -15774 2582 13007 -8277
1082 -8277 -6343 8934 -2350 -6635 6526 1962 -5680 2155 669 -4838 5421 4051 -8801 936
1096 936 7935 -7534 -2269 13029 -4041 -11954 10107 6726 -11483 2589 11790 -9247 -7375
1109 -7375 12962 2397 -9287 4211 4333 -6223 1470 5796 -1908 -705 1036 -3326 2957 6187
1123 6187 -5014 -3153 7427 -2397 -6852 9729 4660 -12209 -32 10443 -4613 -5094 8501
1136H501q605r902J3006M480j1490P54O110m320q47M464r23j620j902j150N029
1151A585K392o610q27O231l559m761Q675K632j1370j3R918k217o218M608L178
1166C644o899k027Q353K037q134j460O780q87n030M639M645q283l708R424J289
1181D383o981K060L079m601k49M756L18k809j700k63L931J764n676J173N642p438
1197b611l333J3355j415j4298P251R175j1839j298J3994o296j2068J0801N625
1210G043j0859K934O185q275l76P310l751j081M221o140j711J0541m090q966J0867
1225C852J154j4958Q822J2968j6230m525J6976n984j2269J3820M661j6426M094
1238d045J1552r788k186J0208o728n112R587k637n385Q339k235r324R600M757
$$ plain form
1136 8501 -104 -10006 3000 7480 -4010 -3256 2854 -1466 -2313 2151 1228 -392 -2294 -3444 1585
1151 1585 3977 -2633 -3460 2771 -788 -5549 3126 5758 -5612 -5625 4293 2076 -4142 466 3644
1166 3644 -3255 -5282 3071 5108 -3026 -4486 2294 1407 -3623 1016 5661 -2622 -6330 3094 4383
1181 4383 -2598 -538 2541 -2060 -2309 2447 2765 -44 -1744 -2007 1924 3688 -1988 -815 4827 -2611
1197 -2611 -5944 7411 5996 -8302 -1051 8124 -3715 -5013 8981 2685 -9383 1418 7043
1210 7043 -3816 -882 5303 -2972 -3348 3962 211 -870 3351 -2789 -4500 6041 1951 -7015 3852
1225 3852 5006 -9952 -1130 11838 -4392 -8917 8059 2075 -10194 3626 8287 -8139 -4045
1238 -4045 7507 -2281 -4467 5741 -987 -6099 3488 851 -4534 3805 1570 -7754 1846 6603
1252F603j3194L705J1990j3337m688J7887n279j4388J2626N833j5170L849J2426
1265H863j0072o044J1721k001p694P814J03p286N972J769p412N748L764j0318
1279e073K374J0306q256n832J2295j656j2141R172O885j2418J64J1001o305n875
1293e359Q647Q33q063L359M774n499N3L889l547J20L261l767K0M850m057l217
1309c703O658j53p314L709O085p154k886Q797j508p553M446M337m873k048M781
1324A621J19m332J608K768k219j077J403J21n3p69k3J316l85j706Q67K324j604
1341b1k908L467J819n050M45N838l111m870N248K896o031r93O961k279n719M951
1357F43K943n653J88M029j310k119J434R28j220L61m78j92K640k222k591M961
$$ plain form
1252 6603 -6591 -2886 9104 -4233 -8921 8966 3687 -10701 1925 7758 -7412 -3563 8863
1265 8863 -1209 -7253 4468 2467 -5227 2587 2690 -4596 1376 3145 -4267 1481 5245 -5073
1279 -5073 -2699 7607 -649 -6481 5814 4158 -7983 1189 8074 -4344 -4180 6821 516 -5359
1293 -5359 3288 4121 -3942 -583 4191 -1308 -1255 2634 -913 -793 2468 -1299 -1279 3571 -486 -3703
1309 -3703 2955 2802 -4512 -803 5282 -1872 -4758 4039 2531 -5022 -576 3761 -1112 -3160 1621
1324 1621 1740 -2592 -984 1784 -435 -1512 -109 12 -41 -810 -833 483 98 -1608 -741 1583 -21
1341 -21 -2929 538 2357 -2693 -2248 3590 479 -4391 857 3753 -2278 -3271 3690 1411 -4308 643
1357 643 3586 -2067 -1879 2150 840 -1279 155 1083 -137 224 -254 -446 2194 -28 -2619 2342
1373B342M05o491L337N613o587k874Q510j026q342N067N747p789j353P994k994
1388A559n288M811J600m135Q77K178j879J14J171k258J628J991m734Q06N815m900
1404f44l971P870j08q480M352O641p717l127R282j807p932N579M317o712m42N307
1420B408k056k767K581M87j479R37q12m59K892j756l380M791J511p106K430O616
1436D838n891m186Q227M24q507L579O704o729l109P876j022o178L806L309m025
1451h84r51L128m20j599P73j83Q29N68k785P60L988l297l319N752J084o843J807
1468a592O710n098m637P354J052p667K494O117n029k963N491K9m365J596K530
1483B022k052q75J312p9J83k79j641K228J027m056P36M704l132m249N706K166
$$ plain form
1373 2342 2747 -3744 -407 5206 -1381 -4255 4255 3229 -5113 -46 5701 -2088 -3441 4553 1559
1388 1559 -3729 1082 2682 -1453 -576 1602 -277 -163 1008 -1250 378 2369 -2365 -1559 4256 -644
1404 -644 -4615 3255 3147 -5333 -981 5660 -2057 -5184 4098 2291 -5641 -62 4255 -2457 -2899 2408
1420 2408 352 -2415 166 653 -826 111 -701 -1160 1732 -24 -3404 1387 2898 -4208 -1778 4838
1436 4838 -1053 -5239 2988 3412 -5095 -1516 5188 -1541 -4650 3226 2204 -3974 -168 3141 -884
1451 -884 -1835 1293 873 -726 47 -136 693 1261 -1524 -764 3224 -73 -3392 2360 3444 -3399 -1592
1468 -1592 5118 20 -4617 2737 3789 -3878 -1384 4733 -296 -3259 2232 2261 -2104 -508 2022
1483 2022 -30 -905 407 328 511 232 -1409 819 1846 -2210 -1474 3230 98 -4151 1555 3721
1499C721p327Q86P469m601n418O967J786o829J153N575l298l357L774J402l257
1514a354K37J887q58j71m45M2K025j522k340L198J484m248QN261k629m790N162
1531I47K722o856P11O466l557m413N155K067n477L99M807k370k883L009O17k006
1547f62O23K84J4P60j421o94L025o15l470K204L479m648j713O205j329o050M372
1564C64L819n982q33N694j589m808L896K620m685J11L225j903j119J682l85r6
1580A1N41j323L05J974j738j901L620L11m984K642M369n592j681O536j673n534
1596d117M021L542n530o67N338k149l190L406M64k561J281N79j203J225k86j871
1612a718K129J310l681O55L983l112k747N480j94n740L337L706m995q34N021j534
$$ plain form
1499 3721 -3606 -2720 4749 148 -5270 1697 3483 -3346 -2193 3382 84 -3273 501 1903 -1354
1514 -1354 -1117 770 -88 -259 -704 -662 1363 -159 -2499 699 2183 -2065 -2057 3204 575 -4215 947
1531 947 3669 -3187 -2476 3990 433 -3980 1175 3242 -2235 -1836 2971 601 -2282 727 1344 -662
1547 -662 -39 245 259 1019 -402 -1096 1929 1314 -2156 48 3527 -1121 -2834 3371 2042 -4008 364
1564 364 4183 -1799 -2632 3062 1473 -3335 561 3181 -1504 -1393 1832 -71 -1190 492 107 11
1580 11 552 -771 -466 1508 -230 -2131 1489 1800 -3184 -542 3827 -1765 -3446 3090 1417 -4117
1596 -4117 -96 3446 -2084 -2751 2587 438 -2752 654 1118 -1443 -162 417 -786 439 153 -1718
1612 -1718 411 1721 -1960 -1305 2678 -434 -3181 2299 2105 -3635 -298 3408 -1587 -2421 2600 1066
1628A066l979L397J835l585L20K320j463k62J132j038O64N89j883N25K426k067
1644cj875L284O05m111J696L395l657j578M246m78l398J738K386k679j060K808
1660A319j07k152R81N32n01k67k07P59L76j355j31J855k79k363J120J972j687
1677a35j706K401P90k968N22K451q80k278J510J899k405j046K897l13k564J275
1693e50J813j667j210J966M77k005M27J313m83p31k9M81Q25j026r97K152L29k755
1711a670Q46L258k240k938L807J285m631J292L823l017k227M202l50l283J660
1726a83J866k171m6J942j352j90R15j435Q46J586k529n54L595j754l121M057J361
1743B833n386J143N181l878l264N710k8n568K960L256l802o57L082j238j457J839
$$ plain form
1628 1066 -2913 484 2319 -1266 -946 1374 -89 -351 781 -257 407 996 -887 -362 2064 -3
1644 -3 -1878 1406 2011 -2100 -404 2991 -666 -2244 2002 1524 -1874 -136 2250 -429 -1489 1319
1660 1319 1212 -940 41 573 72 -195 -402 357 733 -622 -753 1102 823 -1540 -420 1552 -135
1677 -135 -1841 560 1350 -1618 -1096 1355 475 -1803 -293 1606 -799 -1845 1052 739 -1825 -550
1693 -550 1263 -404 -1614 352 829 -1176 -749 564 81 -650 -679 -198 627 -399 -1396 756 1085 -1670
1711 -1670 -824 2434 194 -2744 1063 2348 -2283 -991 2832 -185 -2412 1790 1440 -1843 -183
1726 -183 1683 -488 -534 1408 56 -134 781 -654 192 1778 -751 -1305 2290 536 -2585 1472 2833
1743 2833 -2553 -1410 3771 -107 -3371 2339 2311 -3257 -297 2959 -843 -1500 1582 344 -1113 726
1759G26l99j191K085j803j098L643j148l511L323J755n086J050N190m111l199
1774c774N825J68n569K821L754m992n39M415j461k731K253O81j760O41N12q89
1790f45J192m62k123K855J136m068R02L870l113k473M796J22m645J653L800l368
1806e71j760M072n34l180J845J632j645n74Q99K24l60m67O44P73q33j343J308
1823A30J730k342p75K847n82k954K133K278k930j448L031N23l106Q65K377j416
1839C61j955J864J290j573j295J825O55k127L45J810r15j465R60J303r98j226
1855a141J361O21j740j0J569J59j696p4K123p53k190J728J809k978n83L085k15
1872A075k979J205K429k304j430L015j06k377J037J355q71q79O13N61l04o09P8
$$ plain form
1759 726 327 -864 1221 -582 -1680 1963 815 -2696 627 2382 -2704 -1654 3536 -575 -3774
1774 -3774 2051 2219 -3350 -529 3225 -1767 -2306 2109 648 -2083 170 851 -909 -268 244 -645
1790 -645 547 85 -2038 817 1953 -2115 -1213 2657 -456 -2929 1867 1989 -2656 -1003 2797 -571
1806 -571 -2331 1741 1207 -1973 -128 1504 -141 -715 184 408 48 -419 225 998 165 -1178 130
1823 130 1860 -482 -1257 1590 1008 -1946 187 2465 -465 -1913 1118 1641 -1465 -600 1777 361
1839 361 -1594 270 1560 -13 -1308 517 1172 -955 -610 1200 285 -1180 -220 1083 85 -1141
1855 -1141 220 841 -899 -909 660 819 -877 -951 1172 419 -1771 -43 1766 -1212 -1795 1290 1075
1872 1075 -1904 -699 1730 -574 -2004 1011 905 -1472 -435 920 49 -830 -217 344 40 -569 -491
1889d91J296j97k029J059K060k219j163L349l66l230J686K507k738j390L319l34
1905A119k931J651J996k354j46J567n17o56M79J7J4kl93K93J064j216j234K526
1923A277q4k947J764K167k926j003L352l81l137J907J990k641q02K499l98j661
1939a024P03P74m87j82J85P9K97m79o66J202K41j776O25J813j686j172K637m19
1957F65k437J439J792j947j078K391j69k193J202J459j751j78J114On96jL95R9
1975B12k34m86L32Q41o89j175J728K56j910P76J774j493j300K036M68k169M37
1992e96J893j067j348J859K76j613L32J025l96m23R1L18k38m4l24M95N06j118
2010c72j18J620p85j343J618N50j834j62J948m57j956J472J165k093nJ828q48
$$ plain form
1889 -491 805 608 -1421 -362 1698 -521 -1684 1665 1299 -1931 -245 2262 -476 -1866 1453 1119
1905 1119 -1812 -161 1835 -519 -665 902 385 -271 208 225 239 237 -156 137 1201 -15 -1249 1277
1923 1277 1193 -1754 10 2177 -749 -1752 1600 1219 -1918 -11 1979 -662 -1464 1035 637 -1024
1939 -1024 -321 453 -34 -216 -31 48 345 -134 -800 402 643 -1133 -508 1305 -381 -1553 1084 665
1957 665 -1772 -333 1459 -488 -1566 825 656 -1537 -335 1124 -627 -805 309 315 -281 -282 113 212
1975 212 -22 -508 -176 665 -24 -1199 529 785 -1125 -349 1425 -68 -1368 668 1136 -1033 -596
1992 -596 1297 230 -1118 741 1017 -596 -264 761 365 -58 33 351 113 69 -255 240 746 -372
2010 -372 -490 1130 345 -998 620 1170 -664 -826 1122 665 -1291 181 1346 -747 -752 1076 228
2027B28j035Q13M11p08j25N01o7l56K00N2L57j38j046R31P04j475j59J760n27
2046C21j613J210J256j832o94K312m15j773R88J297j467k83J179k43q23K42N79
2063B41p2l63j70M13L56q49l11J384r4j551R36J310j465q08J912K10k319P43K037
2082A540j731r75K005j8j645O03J241q83o81O82M50o97j36L98L03j13q18N49R10
2101I84j167o68J679J21j981O22J855j279j385K214J73k308O75J740j322p97J216
2118C72L00j100k5R07l23n12J28M06K46p99l48J107M8j523P46J562j560r93J949
2137E88N37k270L24K037j319j445J879O88j910J54J350l19j220Q04Q54r20l45
2154e33P38L38m56p46O75O43j038m80J485K8j623M91J719j028j478J697Q54j936
$$ plain form
2027 228 -807 6 417 -291 -416 85 18 -338 -138 -86 271 133 -913 18 722 -753 -912 848 321
2046 321 -1292 -82 1174 -658 -1352 960 545 -1228 -240 1057 -410 -693 486 243 -580 -338 241
2063 241 169 -194 -364 49 405 -444 -755 629 535 -1016 -80 1230 -235 -1043 869 1079 -1240 -497 1540
2082 1540 -191 -1166 839 821 -824 -221 1020 137 -544 138 588 -109 -245 153 456 343 -475 74 984
2101 984 -183 -851 828 949 -1032 -410 1445 166 -1219 995 1168 -1140 -465 1275 -47 -844 372
2118 372 672 -428 -453 454 131 -381 -253 153 399 -400 -748 359 407 -1116 -370 1192 -368 -1361 588
2137 588 1125 -1145 -821 1216 -103 -1548 331 1019 -891 -737 613 294 -926 -122 732 -188 -533
2154 -533 205 543 87 -659 16 659 -379 -859 626 654 -969 -478 1241 213 -1265 432 1286 -650
2172f50N3J670n40j678J095J211j356n32J490j01j234M17R21k87j013M75O98m17
2190B22q18P14O82j071n20J162N90j471k74J954r92j459J370J275j930n87J897
2207G44l6j871Q59J466j453o98J401K22j158J48O44l7p13K99J99K15p79j68J217
2226E01N2j641R63J208j837k99K070k71k192J077J609j801o50J929l35j582R04
2243b95J070r19m74O30J13k50lK70K08j08r06L67J378j142r59J826j42j730J223
2262A57J268j621j072K332m34j765J412R08j693l37J685m34n63J52J07r9K2l4
2280iK90J54p52k95J400K7j737P88J305j665l41J720k53j685P56J231j194l83
2298f43J281m54r73P00M52l69l21L61nj31n3K62K11m38p11R10O03r58n51J309
$$ plain form
2172 -650 -597 1073 533 -1145 -50 1161 -195 -727 763 662 -572 -155 766 479 -534 -59 639 222
2190 222 -596 118 800 -271 -791 371 961 -510 -784 1170 178 -1281 89 1364 -566 -1153 744
2207 744 708 -1163 -304 1162 -291 -989 412 634 -524 -376 268 231 -482 -183 16 231 -548 -716 501
2226 501 553 -1088 -125 1083 -754 -1053 1017 746 -1446 -369 1240 -561 -1211 718 383 -1199 -295
2243 -295 775 -144 -618 12 125 -125 -128 142 350 242 -664 -297 1081 -61 -1020 806 664 -1066 157
2262 157 1425 -196 -1268 1064 630 -1135 277 1185 -508 -845 840 406 -157 -5 102 3 25 -9
2280 -9 281 435 -317 -612 788 815 -922 -134 1171 -494 -835 885 632 -1053 -297 934 -260 -643
2298 -643 638 184 -789 -89 363 -6 -327 34 29 -102 -155 107 318 -120 -831 79 682 -276 -827 482
2318D82k57j176Q93R52j185n06R92J13q49L28P90o71n15O39N47l66n93L86L29
2337C33n73L4N70j53q17M17N62q2n94L19L62n19p0O29J1p48k70J089L5j030P32
2358B37N03q43l69R72L25j295K88P38o36m06Q51M3m84j81K53L38j97m23J97M99
2378D10n47j85P47O5q89M1J126q62o07J240q5j432Q78Q58r97l44Q22n4p70N33
2398e2J83l99J08K21k09L87l59m18O74J97j060J82J303r45q17J578n5j546N95
2417d32J228j046n69J302n0r10K21N93n02m3N36k53P7J9m83L68L30p50J86R85
2437H07q25n43J063J74j376M38J457j226r56J623j7j216N04R92p89m94P20J69
2455E05n77n2J92J12j32l09K42N34n25m10J043p4j245L35J192r78o09J264K85
$$ plain form
2318 482 225 -951 -58 894 -291 -797 195 308 -541 -213 577 -94 -609 30 577 211 -382 4 333
2337 333 -240 -206 364 211 -606 -189 373 291 -303 16 378 -141 -211 418 429 -319 -589 500 535 -495 237
2358 237 740 -103 -472 500 825 -470 -182 556 -80 -486 365 408 -76 -257 -4 334 137 -286 -89 410
2378 410 -137 -322 425 490 -399 -358 768 -94 -701 539 454 -978 -100 758 -239 -583 239 185 -585 -52
2398 -52 131 -268 -160 61 -148 239 -120 -538 136 333 -727 -545 758 -187 -1004 574 519 -1027 -432
2417 -432 796 -250 -819 483 433 -477 -256 337 -165 -208 328 75 152 171 -312 56 386 -364 -178 807
2437 807 -18 -561 502 676 -700 -262 1195 -31 -987 636 619 -597 -93 899 110 -384 336 505
2455 505 -72 -124 68 180 48 -261 -19 515 -10 -420 623 549 -696 -361 831 -147 -756 508 793
2474G93j497K95R91o33o21Q74K89q38j19J032m62n09J99M48j61m10Q4O78n84n43
2494f94O09P19r84l38R08K96j257K19J241q19o76J071L80j163J7R72k88r80P26
2513d1N92p38l01O79j5m38m6O58o0o19N7Q11j67p44L39N96m76o62R80M96j475
2534e74K49J115m76r38Q88M58j107j85J276k46r37M93N42n80j88L67L34o35k59
2553d03O01N6k82k88M03N18j049P1J079n73r71R24Q94j341k34J033j03j249Q62
2572e2Q38j124m48J165n9q39L41M56k71m34K61N39m04m20L55M84l92o81P41N10
2592E66j117K0J316n21j184Q73Q60j223l51J365l60j033P11O08n39k98M66k5k58
2611a24K0K43N3l91o3L86L13o11k67P74R9j049M73Q89r04k92J036o8j146M23J252
$$ plain form
2474 793 -704 -409 582 -51 -672 202 491 -347 -466 566 104 -405 -206 242 81 -329 -245 433 -151 -694
2494 -694 -85 634 -350 -688 220 516 -741 -522 719 -100 -776 295 675 -488 -471 501 213 -767 -41
2513 -41 551 -187 -488 191 176 -262 -308 350 290 -329 -272 539 372 -372 -33 563 87 -575 405 901 -574
2534 -574 -325 790 314 -624 264 722 -385 -570 706 460 -477 16 558 -22 -210 157 491 -144 -403
2553 -403 198 254 -28 -316 87 605 -444 -373 706 133 -838 86 980 -361 -595 438 335 -914 -52
2572 -52 786 -338 -786 379 320 -519 -178 278 7 -427 -166 373 -31 -451 -96 388 -4 -685 56 566
2592 566 -551 -531 785 264 -920 -47 813 -410 -761 604 244 -789 -78 530 -9 -307 159 134 -124
2611 -124 -104 139 192 -199 -262 124 437 -174 -441 333 432 -617 -144 745 -159 -451 585 517 -629 -206 1046
2632A046j254k37O94P0q00M20O04o20k08K07M61m14j41Q9J02J29n66K31P20q38
2652c05j53P77J16j134M55R33q62n80Q15K42p78K52P19n76m79Q37j04n22J55M29
2672B37k45j40j5oL19k65k81N26J16o79J87N43k97n47N78M85j019J99P64k34p18
2693d92O21K94o71O4M45o1m30K50L47m17o7J1K00K04m67j5M73q5l69N81l4n42
2715a60k04Q02m6p95L37O21q38J1Q18l05n35K99K66l46j00L64o4k67P9J33q7L4
2737A7k36J83M25n26l42P03n9o29K76R15r41l14R28k82p22N81N49p74l00Q11j27
2758A36l13J77J90l61K1j2J46K12l28m24O87O2n77L26O00o53n49P44M30j098N43
2779d1O68q80k54Q92k9o33JL92j77j99L93n5k05Q0k6K01P0n74L07O33o44k6N60
$$ plain form
2632 1046 -208 -445 249 319 -481 -61 543 -77 -285 -78 383 -31 -172 -83 19 148 -418 -187 533 -305
2652 -305 -458 319 435 -699 -244 689 -173 -753 62 304 -474 -222 497 -79 -558 279 175 -347 -192 237
2672 237 -8 -148 -163 -169 150 -115 -396 130 246 -433 -246 297 0 -547 31 516 -503 -304 460 226 -492
2693 -492 129 423 -248 -184 261 200 -230 20 367 -50 -117 -106 94 298 -169 -184 289 204 -165 416 382 -160
2715 -160 -364 438 392 -403 -66 555 -283 -272 546 241 -294 5 271 -75 -175 189 125 -142 -63 70 -17 17
2737 17 -219 -36 389 -137 -479 224 165 -464 -188 727 -214 -528 400 118 -604 -23 526 -248 -548 263 136
2758 136 -177 0 190 -171 -150 -162 -16 196 -132 -556 131 193 -384 -58 542 -111 -660 84 514 -584 -41
2779 -41 627 -253 -507 385 356 -277 -276 116 -61 -260 133 78 -127 -47 -73 128 198 -376 -69 564 -80 -106 454
2802D54k87o39M62P62o30p28R61n5p92K43Q27m20n86M58K04l78o1N36j99k14p1
2823a53M66J16n89J0M25M8q46N01N08n78n09Q32K78q86P9P51n41n72Q99K99q28
2844b90k45Q41l23n39M30M29n07l11N55L13m90l26M84J47l74m1N46k3p74K15Q91
2865F08m98o83Q01L46j041L07O39j53q61M53P86p80l75Q58j46o22K60N21k20n29
2885c29K95K89j10m68L49L71m03m09O68L47p28k05R69l09j018Q07O50r65n17J354
2905F38n5j209N48P78q55j47M98J26n23k2K85j4q6m4K80j0l36l12Q46j52r21N69
2927a18Q19j042j26Q30k09j009O62Q88q42m86J022k59o50L92N20l71m08L94Q1
2946H8j35M6j71K39j6l56K65M52p17k37Q89k14o93L78Q31j075j91J068j17r32
$$ plain form
2802 454 167 -472 -10 752 122 -606 355 300 -492 -249 578 158 -428 30 234 -144 -205 331 132 -82 -153
2823 -153 313 429 -160 -150 275 323 -523 -22 486 -92 -601 231 509 -377 -298 453 -88 -660 239 538 -290
2844 -290 -535 306 -17 -556 -126 303 -204 -515 40 353 -137 -463 21 168 -206 -247 299 276 -498 -283 608
2865 608 110 -573 228 574 -467 -160 479 326 -535 -82 704 -76 -451 407 261 -361 -101 420 200 -329
2885 -329 -34 255 145 -323 26 397 -6 -415 253 600 -128 -333 636 327 -691 116 766 -199 -716 638
2905 638 583 -626 -78 700 -155 -302 196 322 -201 -223 62 48 -38 -82 198 188 -148 -460 386 234 -687 -118
2927 -118 701 -341 -467 363 154 -855 -193 695 -147 -633 389 130 -520 -128 392 21 -387 7 88
2946 88 -47 -1 -172 67 51 -305 -40 412 -305 -542 347 133 -560 -182 649 -426 -617 451 334 -598
2966e98P28K42n35r6M82Jm19PL99N5k09L7j9Lk36Q7O68n49n06O33K17m96l00P31
2990C27n3n15K05O84n91n44O13K27o59L46K39k94l74L94K97m09m7J32J98k27q8
3011a39J99K75m95o4L48J31o18J51L09j54l89N31K81p70O5N31j49k67K79K43n89
3032b91O8N68n2o11K47L67m01J9m9J95P0l67N6N38l64k65J38N40n70j41O73k65
3054A03n44L95L94m51j26M78q4m97L42L51m16j21K40R6j31l8J08J84k92j69K61
3075H3L32l97j70L14J94q23M16N65p35k02P60n8m24M0L87m00o6M59j44k62K28
3096I7j49Q7Lk04J08K42m12r4L50R9l64j70N57l25l16P23j9n15O8P34n92l01L91
3119bK27m07P4K09j53j36P8j01L42k37r6L08J9l20J85J77j81k59L43K01o97K02
$$ plain form
2966 -598 130 372 -163 -259 223 224 -195 -188 211 266 57 94 75 78 -158 -71 597 48 -458 175 392 -104 -404 327
2990 327 274 -241 -36 648 57 -487 126 353 -306 40 279 -15 -389 5 302 -107 -154 -22 176 -51 -139
3011 -139 60 335 -160 -224 124 255 -363 -212 97 -57 -446 85 366 -404 -339 192 43 -224 55 298 -291
3032 -291 -223 345 293 -318 -71 296 -105 -86 -135 60 130 -237 -181 357 -7 -272 -134 406 -164 -305 368 103
3054 103 -441 -46 348 -103 -229 249 165 -332 10 361 -55 -176 64 160 29 -9 99 283 -9 -178 83
3075 83 415 18 -152 162 356 -467 -51 514 -221 -423 337 279 -145 -105 282 -118 -184 275 131 -131 97
3096 97 -52 35 38 -166 -58 184 -228 -322 28 127 -237 -407 150 -175 -491 232 213 -302 -234 500 -92 -393 -2
3119 -2 225 -182 -108 101 -52 -188 -110 -211 131 -106 -202 106 125 -195 -10 167 -14 -273 70 271 -426 -224
3141b24O22m31n17Q11L2n44O9L54l8l32J59K68m30l0L84M8l46R2J16K64l66j15
3163a54K78P1m09mN54p2o56P74P9o48j3O32j72o47L79N86n56l84Q80k35n35J76
3185g6J91N3l44J06L31l29p9K7L90l98k78N60K3m28m8O35l64o12O44M59p10l95
3207f42R66j83n64K17N83n14j55L10J29l81k0L97n3k49j2L63j51k21MN03k60l84
3229c17K91M21m65m18R06j3q86K89N50l89l38M07K83n03J30K82j76l54L93J46
3249B39j52j34J55K21j72k93J80J98k95j14N24k67n61M66N73n84k76O42L2p77
3269c95K10N30m84l79O34J76m60n7L19j06k84J96K60j12m06K95J99k8n81L84L98
3290C09m83j87O27j63n82K98O21n31l46P26p5n66l2O93k67m49K27L62l88j29L87
$$ plain form
3141 -224 398 -33 -550 261 293 -251 -182 172 134 -198 -39 229 -201 -231 153 201 -145 -53 63 327 -39 -154
3163 -154 124 195 -214 -218 336 264 -392 382 461 -187 -200 432 260 -387 -8 578 22 -362 518 283 -252 -76
3185 -76 115 168 -176 -70 261 -68 -147 -120 270 -128 -406 154 177 -251 -299 336 -28 -640 4 463 -247 -642
3207 -642 324 141 -423 -206 377 -137 -292 18 147 -234 -254 143 90 -159 -171 192 41 -180 -176 327 67 -317
3229 -317 -26 395 -70 -488 418 405 -481 -192 358 -31 -369 38 321 -182 -52 230 54 -300 93 239
3249 239 87 -47 108 329 157 -136 44 242 -53 -167 357 90 -471 -5 568 -16 -292 350 382 -395
3269 -395 -185 345 -139 -518 116 292 -168 -225 94 -12 -296 -100 160 48 -358 -63 136 108 -473 -89 309
3290 309 -174 -361 266 103 -479 -181 440 -91 -437 289 214 -352 -384 309 42 -407 -180 182 -206 -335 52
3311E2J5j95Q8K09N4m18J02L85r0m83J68N12l62m54O50J80p10J23N91n39k81N99
3333A96Q8j64l71M79J29n65J81L36l55k71M38J10j79j10J02J41k36j22L59l6m34
3354b84J08L98j3o04N19L33o06j97O89k52n21L20K64k31k53N35L9m65J46J79m3
3375F1k33J30j6n4p1Q3R9m0k32L0M55m15k80O75j3o45M73K66l14k23M72Rm88L14
3399D3K46n75RL55j05j2j9J5QJ77k08q7L49k14k25L83K41p00J89L67j00m19M88
3422B06K07p40K72L70m39j11L55J35l19J61q7J27P9k5k10J52j7j84K87N5m64M0
3444a50L19m5l85M09R0l95j7N49k81m47M49J24m37J08K04j66j58L4K57J35l40
3465a43K7J78L8m6l17K87R8l90L23J9k63j92O05j80l57M15J92m39j05K15J26j69
$$ plain form
3311 52 67 -128 -40 169 223 -195 -93 292 202 -281 -113 399 37 -417 233 413 -297 -174 417 -122 -403 196
3333 196 284 120 -251 228 357 -208 -27 309 -46 -317 121 231 52 -58 44 185 -51 -173 186 150 -284
3354 -284 -176 222 209 -395 124 457 -149 -346 343 91 -430 -110 154 -77 -330 205 244 -221 -75 104 61
3375 61 -172 -42 -58 -112 -183 -100 -1 -41 -273 -243 212 -203 -483 192 179 -466 7 273 -41 -264 208 217 -271 43
3399 43 289 -286 -277 78 -27 -39 -58 -43 -35 142 -66 -153 196 -18 -243 140 381 -319 -130 237 137 -282 206
3422 206 413 -327 -55 315 -124 -235 120 255 -64 97 10 137 216 191 -19 133 116 -68 219 274 -190 -150
3444 -150 169 124 -261 148 238 -157 -174 375 94 -353 96 220 -217 -109 95 -71 -229 -195 62 197 -143
3465 -143 -116 62 100 54 -263 24 122 -268 55 74 -189 -381 224 44 -313 102 294 -145 -250 -35 91 -78
3487g8O4m0N6pP0K57m32j01L03p4K6k79L00Pj66L8J92M2n10L32K53j74l36M65
3511B08l5n74K56N48k96k85lM04k89p7K08J77m11K13J91j82l9j69K33O2l21L96
3533B15N7l07l67M04K16l21p0M04j11n26N06K11n13j44O97j86l96J67L53m55j7
3554a83J09J57k35J32j0qp4m2K93P8o21K30L67r3m07K92L08o36j09P89l48l84
3576c95M29K59m84p8O37l23l87L62L32m85R5K1N7n6r9O6L51l64j50M04L21p03
3598a90M9O68o32m36P08L49p53R8M18j36m31J97L72k74k32L33J64l32j6K79N5
3619B58k15k23K43O1k54J08K90k59k06L60L7l33M7M99j73n04J71M00m23j41L91
3640A34Om69K11M39m57j84L48l2N7k95J26M02m19j61L46Q9m04L6L47N7o05M37
$$ plain form
3487 -78 -14 -54 2 -5 65 322 -110 -211 92 18 44 -235 65 72 -94 -56 136 178 -332 0 253 79 -257 208
3511 208 173 -401 -145 403 107 -178 -181 223 -66 -143 65 242 -169 44 235 53 14 -155 78 140 -181 215
3533 215 272 -35 -402 2 218 -103 -173 231 120 -406 100 311 -202 -346 351 165 -231 -64 289 -166 -183
3554 -183 -74 83 -152 -20 -30 -38 -112 -154 139 217 -404 -174 193 100 -307 -15 293 -343 -452 337 -11 -395
3576 -395 34 293 -191 -269 368 45 -342 20 352 -133 -38 -17 40 -16 -115 -49 302 -62 -212 192 513 -190
3598 -190 -141 527 -105 -541 167 516 -237 -139 279 143 -288 -91 281 7 -225 108 272 -60 -76 203 258
3619 258 43 -180 63 124 -130 -22 268 9 -197 163 200 -133 -86 413 240 -264 -93 307 -116 -257 134
3640 134 140 -329 -118 321 -136 -320 28 -4 53 -242 -116 286 -133 -294 52 141 -263 -227 120 177 -428 9
3662IJ48m22j65P10j73m29K38M86m14k86L12J98n82K37J67%k46J95K01j26k01
3683a43J60K02j32k17J77J64l66m9N76j63n30K78L20j71l99M66K47n22Q7L61l88
3704d2m7J97l3j38J82R1j0k32K9Rq5N2L8P7Qk79J37L68m10j39K34J06k43r7M42
3729B15k79k43M41O4n64J92L49m7l73J82K75l72j4K65j07J21k54P4J86p4k65L3
3751a95K91l18j8L29Mm33L72K70l86n3L45p6k13R9M8j07r4K12K2r7Q4k1qN3j85
3776g5j1J42n0l4J31k2l31J68M29k39k26L78j12l61K74L47n03n5L14o3j77J24
3798D8qN1j63k3l1J12J71k71K30J33l36O5J47j33j28K22J2k66m2K96j68j74L95
3821A39j47j60O2K07n8j02P8n5j36K13m4j47K03j86R7M4J10l45L29r0k41R8L97
$$ plain form
3662 9 157 -265 -430 280 107 -322 -84 402 -12 -298 14 212 -370 -133 34 34 -212 -17 184 58 -143
3683 -143 17 219 87 -130 47 211 -155 -204 372 209 -321 -43 277 106 -293 173 420 -102 -15 346 -42
3704 -42 -89 108 75 -63 119 210 200 -32 -3 6 -79 -27 11 88 96 -183 -46 322 -88 -227 7 113 -130 -227 215
3729 215 -64 -307 134 198 -366 -174 175 128 -245 -63 212 -160 -174 91 -16 105 -149 -75 111 37 -228 -195
3751 -195 96 -222 -240 89 93 -340 32 302 -84 -137 208 132 -81 18 66 -41 -135 77 99 2 86 65 57 110 -75
3776 -75 -86 56 6 -28 103 81 -250 -82 347 108 -118 260 148 -213 61 408 -95 -150 164 101 -76 48
3798 48 40 91 -72 -95 -126 -14 157 -114 116 249 -87 -22 125 -8 -136 86 98 -168 -210 86 -82 -256 139
3821 139 -8 -168 -106 101 43 -59 19 -36 -172 41 -3 -150 53 -133 -36 8 118 -227 102 12 -229 -131 266
3844B66j21l83L43K78n83M2L39k44p1K20L1m6j69J93K9k21k7J77J02k40l5J45
3866B5K39k80j27N52j33m40L35J15m34j16O46l08l11L53K57n56K5M04j59l97L11
3887AL68m68m4L55r6m9k15K57k05J48l99L85K23l04j38K89O8l19J18L89m26k89
3909c51M41K3m78M49J97m85m5K89R9l94J17K04j09qj14J41J84m13J5K52J5k80
3931b51K68K30j79l23L58J28n10O7N81m42j61L31L1l18K04J46k6k82J32K26j15
3952I5j70J22J08j56j36L01j3k80Q0J76j34k45L18K03j94l86M00O0j82J03J83
3973B53l00k06M97j17j58j00K32j26j70MM75r6k13j10L20j21k13J52N2k19L1K72
3995A39R4l53J00J81k74K7M5K22n14O2M77j24l49K10J31k26N1J81R0n40K17J76
$$ plain form
3844 266 145 -238 105 383 -200 -158 181 -63 -134 86 117 71 -98 95 124 -97 -124 53 155 -85 -120 25
3866 25 264 -16 -143 409 276 -164 171 286 -148 -264 382 74 -237 116 373 -183 -158 246 87 -310 1
3887 1 369 -99 -143 212 116 67 -148 109 -96 52 -347 38 261 -43 -181 108 176 -143 -25 364 -62 -351
3909 -351 90 113 -365 84 281 -204 -249 40 139 -255 -138 66 -43 -51 -165 -24 160 -253 -238 14 29 -251
3931 -251 17 247 68 -255 103 231 -279 -212 369 -73 -234 97 128 -190 14 160 134 -148 -16 210 95
3952 95 -75 47 155 -1 -137 164 151 -129 -49 127 -7 -252 66 269 75 -311 89 149 -33 70 253
3973 253 -47 -253 244 127 -31 -131 101 -25 -195 -191 284 188 -25 -135 185 64 -149 3 55 -164 -133 139
3995 139 233 -120 -20 161 -113 -86 -41 181 -333 -271 206 82 -267 -57 74 -152 -101 80 170 -370 -153 23
4017B3m2O4j05K58k26j17K7L77k11q8q9J73k37J99L76j96m36K35L08n58K13J18
4039F6P0l75J16L34j92j32L6J22j53L3J3nJ14j35K60J35j80j10k1M9q2Q5K15l81
4063a18k64L91K23l71L18k69o9m1K80O8j68q3Q4J01m7L6k74J87j04J9L20j78n9
4086a8m6K31l18J89K39l44j88K46K43k73j51K37p4j23J83Kq8j59Q0J58o1j3O4
4109A6J6Q3j34P3N2Q2m62K00j29J9O6L44j81k76K92Q9k05j53L03j67L5J36Kl9
4133F2j47P9N1J4j04q9O9R8j44J14Rj40R6N8J33m44J71K62k39r2L98j07j97J39
4157E0R9m7o2J84L2k11M8j87J43j5O0j04o9j35M15o7n8j91P4k6l9q1K51k3l82
4182c41K28K83j78l14L27J0j78J05J24j99J17J67j86j03j3J71J5j09q3J19J02
$$ plain form
4017 23 -19 45 -60 198 -28 -145 -118 259 48 -40 -129 44 -193 6 382 186 -250 -15 293 -265 -52 66
4039 66 136 -239 -123 211 19 -113 -77 45 -108 -75 -62 -67 47 -88 172 307 127 17 -4 45 -37 48 263 -118
4063 -118 -382 9 232 -139 179 -90 -159 -200 80 148 -20 -103 -19 82 35 71 -203 -16 -120 -101 219 41 -18
4086 -18 -64 167 -151 38 277 -67 -255 -9 234 -39 -190 47 -27 -150 33 35 -53 -212 -132 26 -35 -48 16
4109 16 32 115 -19 54 106 188 -274 -74 -203 -184 -118 226 45 -231 61 150 -55 -208 95 -72 -37 99 101 62
4133 62 -85 -6 45 59 -45 -134 -65 33 -111 3 12 -128 -32 26 159 -285 -114 148 -91 -183 215 108 -89 50
4157 50 149 102 40 224 256 45 93 -94 49 34 94 -10 -79 -214 201 134 76 -115 -41 -67 -106 -187 64 41 -341
4182 -341 -113 170 -8 -322 5 15 -163 -58 66 -133 -16 151 -35 -138 -151 20 35 -74 -157 -38 64
4203F4k50K8K93M4m07J43M92l54k09K32J88l38r7L16k3k50K36m9k04K29L9j36
4225a3J16k2k8J98k09j02J88m6k89K57J3q7j04K41K51n76J7L63o5l12K45M7k35
4248a52n0M84j24k52R4K44l14M2J29l4J27l19K64k47mqK33j04k79R2K68r5k03
4271b08L23Rl76J28J89M4j93L1K56k71j31K98o8p4l9J58L3j74M5J30k5k33n4K11
4295Ij90R2j5L12l52j6M26j12k36l6K55q0j59K66P6m49R7L11j90k28K66R6p1j00
4319b8K5Q1j92J1K21q8qk8J92k24q2L55n6k35M5R7J18l23R6L58k37j99QK12l79
4344b60j7L01O0k20K24L8r8j48O5J80j24J9j09J87k06K30P3k24j96Q6J24j22j52
4367b89M10p1j86j4L62k85j25J18P6j11o6L58l0l53L1J01J41k51J28rJ63l16N6
$$ plain form
4203 64 -186 -158 135 179 -228 -85 407 53 -156 76 264 -74 -171 145 122 -128 108 59 -145 84 123 -13
4225 -13 103 81 53 251 42 -60 128 82 -207 50 63 -24 -128 113 364 -212 -195 168 103 -209 36 83 -152
4248 -152 -202 282 158 -94 0 244 -70 -28 101 67 194 -125 139 -108 -112 -120 113 9 -270 -178 90 -5 -208
4271 -208 115 124 -252 -124 65 109 -84 -53 203 -68 -199 99 31 -43 -82 76 109 -65 -20 110 85 -148 -202 9
4295 9 -181 -89 -104 208 -144 -160 266 154 -82 -118 137 57 -102 164 240 -209 -112 199 9 -219 47 143 72 -28
4319 -28 -3 78 -114 -103 118 30 22 -6 186 -38 -120 235 179 -56 -11 86 204 -119 -23 335 98 -101 -93 119 -260
4344 -260 -277 24 84 -136 88 126 28 -120 -55 125 1 20 -89 98 -108 122 195 -29 -225 -139 -15 -137 -289
4367 -289 121 50 -136 -150 212 -73 -198 -80 -4 -115 -181 177 147 -206 -175 -74 67 -184 -56 -65 98 -218 -162
4390a62K87k02J28j07J69j61j05L45j30j25Q2J98j46j50J41j07p9K14N0j65k9
4411e4O4q2k9M3l0J9l9O1rK6J5K8M00m33j33M3R9oJ03j07J17j57J41l8p2K6J6
4438A2Q8j19n4N4j0q6K0J32K7j46P5K3j05k0O2R6p0n5M1k5j40J86P4k82L9J48
4464c5o9r5J66L9R4k96J14l8J89k72K82n0m4l7J69p9m3P0p7J32l29K15p3J12k27
4489a82K13R4k27J10J15K0k09J17p5l4J16j15L6PL0J82k09j86K53O9j31k04K73
4512F3m3J22k76K97k6j25r0K50j82o2K0J84o1j06J04J07j37nR1j26j88M08k07
4535A2k6j83J63n6J46l8j57J56J0r0N8Q2j21P4%l8j15J17q4n7l0R5J26l15L18
4560D7M8j47j01R2J18r0j03%J09k8m8K18Nk92J70R3j09p2L6ON1l4J36n7j64K54
$$ plain form
4390 -162 125 -77 51 -56 113 -48 -153 192 62 -63 19 217 71 -79 62 -45 -124 90 140 -25 -54
4411 -54 10 -72 -101 -58 -88 -69 -108 -47 -56 -30 -15 13 413 -20 -153 -110 -11 -17 86 -21 96 -61 80 42 -30 -4 12
4438 12 100 -19 -73 -19 -29 -115 -95 37 64 -82 -7 16 -89 -109 -47 49 -21 -76 -35 -60 -200 -14 60 -222 -183 -35
4464 -35 -104 -199 -33 6 100 -196 -82 -120 69 -203 79 29 -15 -52 117 38 -5 65 -12 120 -209 6 -67 45 -182
4489 -182 31 125 -102 8 123 143 -66 51 -24 -58 58 -57 -21 -14 16 198 -11 -197 56 125 -6 -210 63
4512 63 20 142 -134 163 137 12 -78 172 -10 -72 -52 132 71 -35 69 176 39 34 125 -1 -189 219 12
4535 12 -14 -197 -34 -90 56 18 -139 17 27 -63 -5 77 -44 30 30 -8 -123 -6 -90 -147 -177 -82 44 -271 47
4560 47 95 -52 -153 -61 57 -33 -136 -136 -27 -55 -103 115 120 -172 -2 91 -18 -90 -54 -48 3 -31 105 48 -116 138
4586A38J05j56j33J44mj24R3J38k77J19J9Rj77J2J52m7j96J51J44p6k05J91O0
4609H0o0M3m8J59k13J1J79O2k81K4J84k55j8J33O4q4M0M0n9m5L8P5k3j82lK29
4635I0j49j0K56J5m52J6L65j53l4j9K97k35q7K54j18j48M6J88j21q2O9P4r5k7
4659f0J08r9p9M4R3o2n2M9J48j19O2J04Mj21j19K38j4j20M6J06j02n5J5K32j50
4684I7r7J70o0q0P2L6L9k27J21M2j6j98K96k74O5J76K9j20j52N3P9j9j55R0M7
4709A4q3J1K10p9q6k7R8l43J95J51j10m0O4J06k33N1nJ98k19N6m2J72J1j93J87
4734F4j4j44j70L06o1j66J34Q8j02j5R7M6k37J67n8R0K5l4K1rL1j74K24k71R4
4759f8J41j47J05m4J39o2J1m2J17k33J5J46j16K4mQ5Lj58J88m9j11J15L4M2j64
$$ plain form
4586 138 243 87 -46 98 94 -30 63 201 -76 43 62 71 -106 -94 58 11 -185 -34 110 34 -171 20 80
4609 80 20 63 15 174 -39 -28 151 213 -68 -44 140 -115 -133 0 64 -20 20 60 1 -44 -6 69 46 -136 -139 90
4635 90 -59 -69 187 202 -250 -234 131 -22 -56 -75 222 -13 -100 154 36 -112 -66 122 1 -81 -12 62 -33 -60
4659 -60 48 -51 -130 -86 7 -55 -107 -58 90 -29 33 137 141 20 -99 139 125 5 51 157 55 0 15 247 97
4684 97 0 170 110 30 102 138 177 -50 71 113 97 -101 195 -79 -14 162 191 71 -81 -28 51 32 -123 -33 14
4709 14 -69 -58 152 73 -13 -40 58 -285 -90 61 -49 -89 -25 81 -152 -101 -106 92 -127 -71 -113 59 70 -123 64
4734 64 50 -94 -264 42 -19 -185 -51 37 -65 -80 17 63 -174 -7 -65 25 50 16 37 28 59 -115 109 -162 -68
4759 -68 73 -74 31 -13 126 64 75 33 150 -83 -68 78 -38 -14 -18 67 70 -88 100 51 -60 55 89 131 -33
4784c3J3J06j01j61K93j88k4J12l9j6N1O7r6n3m3j05L37j56m8J72l1q7OQ0j15
4809e9r0K04Kj96J07J84j96K29k42M9j31J78m2Q6j60N3mq1j6j37L51k17J23j29
4833a34J67j50P4j7J12j18o4J39L7r5k0K8M6j0l5J14q7Q6j24K84k85N6j3l8J48
4858A01r6J26l6k02J97r7J27j84P4P5P4j19j04L0O2J3j39J55j59J85j0j68J61
4881F6p%j87MK06m4r7j3J65k9r4l1J8l0K8m2M9l3N0J08j97NM5r6n3K93j31M3J7
4910A3j08R4j77j8J36J08j59r2K43k2j05kP2J3k57L61j1k09R3J7J4j8J35j75K47
4935A93l18J8K56k12N7J5j31J23O3J21O6k56nJ83j75o8k1J75J2k41J93l2n8r2
4959a34L19k53O0J77o8J5j30J85m9o6p3Q0J3j08J44J0k2k57J63N0p7M6J46m3k40
$$ plain form
4784 -33 -20 86 -15 -176 117 -71 -95 17 -22 -38 13 80 -16 -69 -112 -217 120 -36 -84 88 57 -30 -24 56 -59
4809 -59 -149 55 57 -139 -32 152 -44 185 -57 -8 -139 39 -3 83 -77 -24 -28 -109 -125 -262 89 -128 -5 -134
4833 -134 33 -117 -43 -60 52 -66 -130 9 46 -49 -69 -41 5 -5 -40 74 -13 73 -51 233 -52 4 -9 -47 101
4858 101 5 131 95 -107 90 -7 120 -64 10 85 159 40 -64 -34 28 41 -98 57 -102 83 73 -95 66
4881 66 59 59 -128 -124 82 38 -59 -72 93 64 -30 -61 -43 -73 -45 -87 -38 -71 -21 87 -110 -105 -60 -156 -209 84 -47 -4 13
4910 13 -95 -1 -178 -196 -60 48 -111 -203 40 18 -87 -89 -17 -4 -261 100 89 -120 -27 -10 4 -14 121 -54 193
4935 193 -125 -107 149 -63 -6 9 -122 1 64 185 251 -5 -10 173 -2 -70 -91 84 96 -145 48 16 -42 -134
4959 -134 185 -68 -8 169 101 116 -14 171 122 56 -17 63 76 -32 112 122 100 -157 6 56 -21 25 171 128 -112
4984a12N7J47j32j01K75k57J16j17J46j2j13l9J44j94J49L1m1J09M2q1j14j29
5006b26L04J30l75m7K06P5q7m0L4M1j84K58j9j68P5n2J64j21o4K18j17M2k15J52
5030a6O4p6K2n0P7j26K47j25o0m7J61N3p7K2J17j37p3Q1R5j38j9K88k34O5R9l7
5056A76j64lJ77j18on4j45L21m02J55J01j74K7J71K4k53J76Q3R9k64K2J06m0j14
5080i9J13m7o8K2M5L5j80K16j09J62l36J72J44m3q7J02L6j31j10J76m2l6j45J60
5104e0qMJ13j47J16n2j7J30k18P6K73l07j70K90j36Kj6K10R6k55K20m9pk1j55
5129g8K81k26O7K9N1k33N5K25j34Q7j36J53j51K4M4L1o0M6j2L5j08J5K2K9k26
5154a70J35J15k05K66P0k98J10rJ5p9P6pl6o6J07q4J84k56J12K14k97K15j39m5
$$ plain form
4984 -112 -55 92 -40 -141 134 -123 -7 -124 22 10 -103 -142 2 -192 -43 -12 -53 56 98 17 -97 -226
5006 -226 78 208 -167 -214 -8 67 -20 -60 -26 15 -169 89 70 -98 -23 -75 89 -32 -96 122 5 47 -168 -16
5030 -16 48 -28 -6 -56 21 -105 142 17 -43 -90 71 124 47 69 186 49 -24 57 152 14 -5 283 49 114 213 176
5056 176 12 9 186 68 62 8 -137 184 -218 -63 38 -136 -109 62 86 -167 9 92 191 -73 -51 55 15 -99
5080 -99 14 -33 -101 -79 -34 1 -179 37 -72 90 -246 -74 70 27 -60 42 78 -53 -163 13 -29 -65 -210 -50
5104 -50 -58 -54 59 -88 28 -24 -41 89 -129 -53 220 -87 -257 33 -103 -101 -117 93 189 -66 154 105 98 77 -78
5129 -78 203 -23 44 73 124 -109 -54 171 37 124 -12 141 -10 14 58 89 29 75 63 98 -10 5 27 56 -170
5154 -170 -35 80 -125 141 211 -87 23 14 29 -50 26 19 -17 -83 24 -60 124 -132 -20 194 -103 112 -27 -72
5178g2Q4N3n8j7j4j67J48J07rL6j08qj32K1K51k94J30k1k8R1Q2k7jq4Q6kp9n7
5206h9K09j56P7Rl2K6m5J52j52p4J35n0K9o5J09N0J0q8p5J84j02Kj15K1r7R1L2
5233dJ26j55J95r3jp6j20J67o7J6j20J17k3O3j24K57J5k58R5q7M8k8j02J26J2
5258b1n6N9q2K9J53N6l21J32J11j82O6j7K7mJ17k24K78j52p2J7j2N7QK21k76J37
5284D9M3j24J05n6L1j23r1J98np2J5J07n7q2O3n1J83k20O5K25k07R4j15J05j64
$$ plain form
5178 -72 12 65 7 -10 -24 -191 -43 64 55 91 -17 -25 -157 -136 115 -179 -49 -70 -98 -7 75 48 47 -37 49 47 -32 -89
5206 -89 120 -36 41 50 18 44 -1 151 -1 -75 60 10 39 -26 83 133 143 55 -20 164 62 64 -51 -30 -127 -36 -4
5233 -4 122 -33 162 69 68 -8 -128 39 -28 -12 -132 -15 -38 25 -99 158 173 -85 10 -77 -29 -57 -159 -33 -21
5258 -21 -77 -18 -100 -71 82 138 -183 -51 60 -122 -56 -73 -46 -50 67 -157 121 -31 -103 -86 -98 -41 -33 188 -88 49
5284 49 92 -32 73 17 48 -75 -166 32 27 -45 -30 77 20 -62 1 -50 133 -87 -22 203 -4 90 -25 80 -84
$$ [...]
8191a19
##END NTUPLES=NMR FID
##END=
