##TITLE=1H_MTBDE0807-3
 CDCl3, 8 sc, 
 9.07.2021
##JCAMPDX= 6.0         $$ Bruker NMR JCAMP-DX V2.0
##DATA TYPE= NMR FID
##DATA CLASS= NTUPLES
##ORIGIN= UXNMR, Bruker Analytische Messtechnik GmbH
##OWNER= root
$$ XWIN-NMR		Version 3.5
$$ Fri Jul  9 09:12:04 2021 Russian Standard Time (UT+4h)  she@DPX200
##.OBSERVE FREQUENCY= 200.131506
##.OBSERVE NUCLEUS= ^1H
##.DELAY= (6, 6)
##.ACQUISITION MODE= SIMULTANEOUS
##.ACQUISITION SCHEME= undefined
##.AVERAGES= 8
##.DIGITISER RES= 18
##SPECTROMETER/DATA SYSTEM= spect
##.PULSE SEQUENCE= zg30
##.SOLVENT NAME= CDCl3
##.SHIFT REFERENCE= (INTERNAL, CDCl3, 0, 15.7039)
##AUDIT TRAIL= $$ (NUMBER, WHEN, WHO, WHERE, WHAT)
$$ ##TITLE= Audit trail, XWIN-NMR		Version 3.5
$$ ##JCAMPDX= 5.01
$$ ##ORIGIN= Bruker BioSpin GmbH
$$ ##OWNER= she
$$ F:/spectra/data/she/nmr/H-F/1/audita.txt
$$ ##AUDIT TRAIL=  $$ (NUMBER, WHEN, WHO, WHERE, WHAT)
(   1,<2021-07-09 09:10:43.50 +0400>,<she>,<DPX200>,
      <created by zg, POWCHK disabled, PULCHK disabled
       configuration hash MD5:
       00 E9 B6 7A A2 85 ED C7 34 08 36 98 17 FE 4E 26
       data hash MD5: 16K
       5D 58 55 99 CB 9B A2 BE EC C5 4B 65 3B 03 9B 36>)
$$ ##END=
$$ 
$$ hash MD5
$$ 03 62 8D 84 6B 8D 4F 12 DC 49 D7 18 41 06 44 FB
##$RELAX= 
##$RELAX= 
##$RELAX= 
##$RELAX= 
##$RELAX= 
##$RELAX= 
$$ Bruker specific parameters
$$ --------------------------
##$DU= <F:/spectra>
##$EXPNO= 1
##$NAME= <H-F>
##$PROCNO= 1
##$TYPE= <nmr>
##$USER= <she>
##$AMP= (0..31)
100 100 100 100 100 100 100 100 100 100 100 100 100 100 100 100 100 100 
100 100 100 100 100 100 100 100 100 100 100 100 100 100 
##$AQSEQ= 0
##$AQ_mod= 1
##$AUNM= <au_zg>
##$AUTOPOS= <>
##$BF1= 200.13
##$BF2= 200.13
##$BF3= 200.13
##$BF4= 200.13
##$BF5= 200.13
##$BF6= 200.13
##$BF7= 200.13
##$BF8= 200.13
##$BYTORDA= 1
##$CFDGTYP= 0
##$CFRGTYP= 5
##$CHEMSTR= <none>
##$CNST= (0..31)
1 1 145 1 1 1 1 1 1 1 1 1 1 1 1 1 1 1 1 1 1 1 1 1 1 1 1 1 1 1 1 1 
##$CPDPRG= <>
##$CPDPRG1= <>
##$CPDPRG2= <>
##$CPDPRG3= <>
##$CPDPRG4= <mlev>
##$CPDPRG5= <mlev>
##$CPDPRG6= <mlev>
##$CPDPRG7= <mlev>
##$CPDPRG8= <mlev>
##$CPDPRGB= <>
##$CPDPRGT= <>
##$D= (0..31)
0 1.2 0 0 0 0 0 0 0 0.06 0 0.03 0 0 0 0 0.0002 0 0 0 0 0 0 0 0 0 0 0 0 
0 0 0 
##$DATE= 1625807442
##$DBL= (0..7)
120 120 120 120 120 120 120 120 
##$DBP= (0..7)
150 150 150 150 150 150 150 150 
##$DBP07= 0
##$DBPNAM0= <>
##$DBPNAM1= <>
##$DBPNAM2= <>
##$DBPNAM3= <>
##$DBPNAM4= <>
##$DBPNAM5= <>
##$DBPNAM6= <>
##$DBPNAM7= <>
##$DBPOAL= (0..7)
0.5 0.5 0.5 0.5 0.5 0.5 0.5 0.5 
##$DBPOFFS= (0..7)
0 0 0 0 0 0 0 0 
##$DE= 6
##$DECBNUC= <off>
##$DECIM= 32
##$DECNUC= <off>
##$DECSTAT= 4
##$DIGMOD= 1
##$DIGTYP= 9
##$DL= (0..7)
0 120 120 120 120 120 120 120 
##$DP= (0..7)
150 150 150 150 150 150 150 150 
##$DP07= 0
##$DPNAME0= <>
##$DPNAME1= <>
##$DPNAME2= <>
##$DPNAME3= <>
##$DPNAME4= <>
##$DPNAME5= <>
##$DPNAME6= <>
##$DPNAME7= <>
##$DPOAL= (0..7)
0.5 0.5 0.5 0.5 0.5 0.5 0.5 0.5 
##$DPOFFS= (0..7)
0 0 0 0 0 0 0 0 
##$DQDMODE= 0
##$DR= 18
##$DS= 0
##$DSLIST= <SSSSSSSSSSSSSSS>
$$ [...]
##$SUBNAM2= <"">
##$SUBNAM3= <"">
##$SUBNAM4= <"">
##$SUBNAM5= <"">
##$SUBNAM6= <"">
##$SUBNAM7= <"">
##$SUBNAM8= <"">
##$SUBNAM9= <"">
##$SW= 20.0188882624521
##$SWIBOX= (0..15)
0 0 2 0 0 0 0 0 0 0 0 0 0 0 0 0 
##$SW_h= 4006.41025641026
##$TD= 16384
##$TD0= 1
##$TE= 0
##$TE2= 300
##$TE3= 300
##$TEG= 300
##$TL= (0..7)
0 120 120 120 120 120 120 120 
##$TP= (0..7)
150 150 150 150 150 150 150 150 
##$TP07= 0
##$TPNAME0= <>
##$TPNAME1= <>
##$TPNAME2= <>
##$TPNAME3= <>
##$TPNAME4= <>
##$TPNAME5= <>
##$TPNAME6= <>
##$TPNAME7= <>
##$TPOAL= (0..7)
0.5 0.5 0.5 0.5 0.5 0.5 0.5 0.5 
##$TPOFFS= (0..7)
0 0 0 0 0 0 0 0 
##$TUNHIN= 0
##$TUNHOUT= 0
##$TUNXOUT= 0
##$USERA1= <user>
##$USERA2= <user>
##$USERA3= <user>
##$USERA4= <user>
##$USERA5= <user>
##$V9= 5
##$VALIST= <valist>
##$VCLIST= <CCCCCCCCCCCCCCC>
##$VD= 0
##$VDLIST= <DDDDDDDDDDDDDDD>
##$VPLIST= <PPPPPPPPPPPPPPP>
##$VTLIST= <TTTTTTTTTTTTTTT>
##$WBST= 1024
##$WBSW= 4
##$XGAIN= (0..3)
0 0 0 0 
##$XL= 0
##$YL= 0
##$YMAX_a= 284307
##$YMIN_a= -412290
##$ZGOPTNS= <>
##$ZL1= 120
##$ZL2= 120
##$ZL3= 120
##$ZL4= 120
##$ABSF1= 10
##$ABSF2= 0
##$ABSG= 5
##$ABSL= 3
##$ALPHA= 0
##$AQORDER= 0
##$ASSFAC= 0
##$ASSFACI= 0
##$ASSFACX= 0
##$ASSWID= 0
##$AUNMP= <proc_1d>
##$AZFE= 0.1
##$AZFW= 0.1
##$BCFW= 1
##$BC_mod= 2
##$BYTORDP= 1
##$COROFFS= 0
##$CY= 11.3945322036743
##$DATMOD= 1
##$DC= 2
##$DFILT= <>
##$DTYPP= 0
##$F1P= 17.5019972093344
##$F2P= -2.517084195857
##$FCOR= 0.5
##$FTSIZE= 0
##$FT_mod= 4
##$GAMMA= 1
##$GB= 0.15
##$INTBC= 1
##$INTSCL= 1
##$ISEN= 128
##$LB= 0.24
##$LEV0= 0
##$LPBIN= 0
##$MAXI= 10000
##$MC2= 0
##$MEAN= 0
##$ME_mod= 0
##$MI= 1.114404
##$NCOEF= 0
##$NC_proc= 0
##$NLEV= 6
##$NOISF1= 3.799351
##$NOISF2= 2.8
##$NSP= 1
##$NTH_PI= 0
##$NZP= 0
##$OFFSET= 15.70392
##$PC= 1
##$PHC0= -12280.97
##$PHC1= 20.00101
##$PH_mod= 1
##$PKNL= yes
##$PPARMOD= 0
##$PSCAL= 0
##$PSIGN= 0
##$REVERSE= no
##$SF= 200.130013532006
##$SI= 16384
##$SIGF1= 3
##$SIGF2= 2
##$SINO= 400
##$SIOLD= 16384
##$SREGLST= <1H.CDCl3>
##$SSB= 0
##$STSI= 0
##$STSR= 0
##$SW_p= 3612.71676300578
##$SYMM= 0
##$S_DEV= 0
##$TDeff= 0
##$TDoff= 0
##$TI= <>
##$TILT= no
##$TM1= 0
##$TM2= 0
##$TOPLEV= 0
##$USERP1= <user>
##$USERP2= <user>
##$USERP3= <user>
##$USERP4= <user>
##$USERP5= <user>
##$WDW= 1
##$XDIM= 8192
##$YMAX_p= 0
##$YMIN_p= 0
$$ End of Bruker specific parameters
$$ ---------------------------------
##NTUPLES= NMR FID
##VAR_NAME=  TIME,          FID/REAL,        FID/IMAG
##SYMBOL=    X,             R,               I
##VAR_TYPE=  INDEPENDENT,   DEPENDENT,       DEPENDENT
##VAR_FORM=  AFFN,          ASDF,            ASDF
##VAR_DIM=   8192,          8192,            8192
##UNITS=     SECONDS,       ARBITRARY UNITS, ARBITRARY UNITS
##FACTOR=    0.0002496,     1,               1
##FIRST=     0,             0,               0
##LAST=      2.0444736,     0,               0
##MIN=       0,             -412290,         0
##MAX=       2.0444736,     284307,          0
$$ Real data points
##PAGE= N=1
##DATA TABLE= (X++(R..R)), XYDATA
0 0 0 0 0 0 0 0 0 0 0 0 -8 8 -8 16 -16 16 -24 32 -40 48 -56 64 -76 88 -104 122 -144 168 -192 220 -251 288
32 288 -327 371 -419 470 -531 595 -666 741 -825 917 -1017 1127 -1247 1377 -1520 1677 -1848
49 -1848 2036 -2244 2470 -2723 3004 -3318 3671 -4071 4531 -5063 5689 -6434 7347 -8485
63 -8485 9956 -11936 14762 -19132 26846 -44417 167558 -147954 -330170 255473 -4942
74 -4942 -220876 207019 187493 -273713 -43389 150366 -87341 20353 179028 -175059 -144184
85 -144184 207614 27003 -135846 140582 247 -246732 93755 220843 -132534 -43939
95 -43939 127444 -169674 -110333 284307 50175 -237748 54479 91397 -178430 36112 223222
106 223222 -92654 -159002 84906 23046 -42840 91475 -14190 -132415 49192 65976 -64142
117 -64142 62671 68310 -172561 -64648 183238 18413 -106909 71135 11344 -154397 40007
128 40007 161614 -53010 -88954 56057 -10422 -62170 77864 63687 -85523 -45778 50155
139 50155 12292 -3565 23290 -19642 -39978 10449 28561 22379 17421 -37854 -60520 28002
151 28002 64319 -13444 -17187 31955 -33452 -65361 58425 80438 -56528 -50312 56556 -2148
163 -2148 -56388 53908 48823 -81944 -26018 79288 -3581 -42805 38530 -2635 -62843 30667
175 30667 55033 -29906 -8856 13974 -46550 3753 65833 -26155 -35892 51179 -23911 -66607
187 -66607 76360 47719 -103672 1706 92369 -64375 -49883 105522 -11368 -109550 59746
198 59746 66398 -82440 652 70976 -63077 -38466 81645 -9030 -52770 49294 -5602
209 -5602 -64688 53804 36351 -73916 21134 58821 -77779 -15835 100737 -42485 -80259
220 -80259 89355 24579 -102625 43450 78442 -92211 -28547 100036 -26710 -65003 68848
231 68848 11789 -75447 35846 44875 -55680 8955 45298 -51885 -6949 64906 -36951 -37916
243 -37916 70466 -10548 -72573 61655 43064 -88229 10674 83637 -59732 -45155 87040
254 87040 -5989 -79545 50760 45399 -68775 2937 58795 -40887 -26431 52513 -11846 -34072
266 -34072 38527 -980 -40185 34311 16437 -51517 20318 42790 -54572 -12955 68154 -27867
278 -27867 -56084 60034 20416 -73706 19216 59874 -52254 -28219 63598 -10541 -53207 37134
290 37134 21678 -47393 10241 34098 -31795 -7992 31589 -21209 -15925 35593 -11902 -30688
302 -30688 37248 5953 -49909 25523 39347 -52534 -10532 62969 -24885 -52063 52572 22460
314 22460 -63945 14039 55240 -41448 -28261 50758 -4854 -40311 30423 19049 -34403 8164
326 8164 21466 -25925 2315 27755 -23078 -8297 35200 -18018 -27921 41011 5859 -47010
338 -47010 25304 37487 -47684 -10895 55486 -20744 -43450 47201 19652 -53350 10392 41160
350 41160 -33227 -17847 40944 -4428 -28492 19931 5376 -22963 14759 9941 -22739 12794
362 12794 16371 -32141 1345 35610 -26183 -24782 44262 1493 -48042 24751 32561 -47183 -8296
375 -8296 50992 -18742 -37163 36579 10619 -43373 12269 31663 -26758 -10377 26176 -12474
387 -12474 -15369 20572 -4031 -14375 20282 -3383 -25273 21974 12847 -36496 9072 37668
399 37668 -31059 -22103 44642 -4931 -45382 29571 30299 -41640 -3223 41184 -21920 -28140 34604
412 34604 7172 -30294 15230 16802 -24011 1986 17305 -15477 750 19501 -17583 -7020
424 -7020 28650 -13374 -25745 34187 10522 -41722 15391 36283 -37265 -17491 47277 -6213
436 -6213 -38374 29079 19521 -39390 3003 33348 -19885 -14316 26875 -5483 -19675 16874 3285
449 3285 -16970 12624 5976 -18879 11470 12812 -27105 732 29247 -19581 -18335 34587 -1028
462 -1028 -39721 17678 28544 -30515 -9626 33825 -10497 -28320 20929 13442 -22542 669
474 669 14252 -9984 -4025 9756 -4982 -4556 6213 -5627 -1749 13646 -6615 -15423 12944
487 12944 6767 -17084 7514 18449 -19486 -15063 23722 5118 -21631 9578 16797 -20791 -9912
500 -9912 24990 2631 -20916 5045 13380 -9847 -3730 13323 -1697 -11201 2209 5153 3070
513 3070 4800 -6151 -8115 8385 3313 -8715 10363 10807 -21918 -7952 27407 -740 -21830
526 -21830 16205 10563 -29060 3601 33485 -14705 -23966 21941 5169 -23243 14901 18889 -24931
539 -24931 -8951 19271 -4103 -3438 14442 -12160 -15037 17865 943 -13977 20188 1959 -36683
552 -36683 11819 34248 -26111 -14852 33917 -14368 -33749 35769 21194 -42025 -837 28911
564 28911 -22882 -8044 35316 -11084 -30458 18494 7524 -16211 17845 6674 -30945 5219
576 5219 21747 -18004 2455 24786 -28093 -20359 39845 2552 -33148 22199 13770 -41676 7498
589 7498 44685 -21719 -27623 26970 -305 -23039 23998 14436 -27943 -1934 13640 -9244 9117
602 9117 15934 -23328 -9978 23623 -5940 -10334 26085 -4954 -34493 17321 26429 -21109 -3237
615 -3237 20688 -19727 -15481 31605 7805 -25207 3972 9033 -14753 5739 19233 -9411 -13268
628 -13268 3137 372 5368 10405 -10228 -10694 9273 -1611 -6905 17709 4353 -27761 -2301
641 -2301 23715 -3274 -11728 10461 -719 -17752 4554 18300 -2702 -12222 -1963 1457 1009
654 1009 4180 3402 -3245 -9182 -3607 8918 6890 -4651 -4730 -980 -3325 1112 9709 2951 -10082
669 -10082 -7360 4693 7482 -94 -3256 2076 -1997 -9808 5602 17557 -6664 -18217 8213
682 8213 10544 -11507 2083 16414 -11558 -16885 14742 11017 -9985 1222 4326 -9873 639
695 639 11082 -1564 -2069 1674 -8724 920 15232 -4815 -10353 11455 -1609 -15416 15701
708 15701 14667 -22753 -5498 21828 -8234 -13305 21326 2661 -25622 6370 18050 -11552
720 -11552 -3598 12016 -8674 -8115 11865 343 -5914 6975 -5638 -10196 14441 4390 -17334
733 -17334 6854 11681 -19398 -1559 24533 -9899 -20446 17458 6850 -20826 7651 16744
745 16744 -17644 -8331 17164 -2503 -9609 9732 -517 -10669 6429 3435 -7405 6006 2457
758 2457 -13159 5482 12417 -13433 -3960 17114 -8208 -15150 18261 7745 -21544 2949 17627
771 17627 -12511 -8732 18159 -157 -15570 6914 8573 -8549 231 6689 -5020 -1799 5063
784 5063 -2600 104 6173 -5506 -4021 10164 -944 -10034 8072 6673 -12934 120 14628
797 14628 -6096 -11064 11633 4987 -13589 2378 12659 -7159 -8275 8847 2836 -7904 1608
810 1608 5554 -3082 -2572 2206 251 418 -27 -3484 1547 3567 -5107 -2401 7590 -1229 -9386 5277
826 5277 7623 -9696 -3994 11363 -2607 -11470 7485 7621 -11059 -2706 10931 -3186 -8831 6932
840 6932 4380 -8093 -718 5612 -2259 -2332 2096 -597 55 1070 -2979 564 5277 -4129 -5126 8242
856 8242 1989 -10201 3311 9523 -8506 -5483 11729 328 -10975 5366 7835 -8611 -2252
869 -2252 9237 -2307 -5723 5159 2116 -4144 1584 2154 -2105 1341 599 -2692 3367 2318 -6426
884 -6426 1655 7717 -6328 -5487 10541 977 -11775 4959 10102 -9122 -5210 11156 -420 -9571
898 -9571 4780 5418 -6382 -746 5053 -2477 -1936 2728 -1501 -1012 2923 -2180 -2237 4470 -1556 -5249
914 -5249 5245 2020 -8495 2102 8139 -7246 -5484 10656 21 -11865 5048 8813 -9228
927 -9228 -4485 9702 -985 -7864 3947 3902 -4762 -449 2483 -1904 690 1479 -3483 1110 3955
942 3955 -4718 -1908 7064 -2038 -6643 6099 3783 -8426 1033 8629 -6207 -5560 9398 1247
956 1247 -9241 3799 7019 -6451 -2872 7062 -291 -4781 2400 2089 -1782 1000 -166 -851 3169
971 3169 -520 -4143 3932 3916 -6321 -883 7764 -2821 -6444 7032 3432 -8623 1190 8065 -5010
986 -5010 -4906 7116 1047 -7226 2105 5378 -4048 -2585 3697 109 -2066 797 -133 68 782 -2589
1002 -2589 -903 4284 -1095 -5371 3512 4150 -6583 -1567 7702 -2567 -7373 5329 4320 -7485
1016 -7485 -616 7161 -3803 -5811 6285 2241 -6675 919 4523 -3529 -2032 3648 -279 -2340
1030 -2340 851 -449 -100 2787 -2150 -3148 4961 776 -6830 3630 6866 -7501 -4082 10100 2
1045 2 -9251 5487 6201 -8904 -954 9628 -3107 -5844 6140 965 -5829 3613 3811 -4907 355
1060 355 3559 -3498 1070 4550 -4633 -1708 6800 -3447 -4878 8939 659 -11189 5024 9392
1074 9392 -9659 -3380 11753 -3826 -10296 8755 5411 -9741 514 6604 -5445 -2012 6534
1087 6534 -2249 -3597 3961 -1735 -2833 5927 -1091 -6743 5013 2561 -7757 3072 7280 -8763
1101 -8763 -4328 10336 -2000 -8853 7199 3714 -10465 992 8842 -4746 -4381 5181 -1017 -3901
1115 -3901 3545 928 -2821 1767 -931 -3011 4997 1265 -6860 2387 5290 -6576 -1332 8996
1129 8996 -2942 -8157 6314 4402 -7324 1225 6583 -4862 -3602 5950 1119 -4049 1308 1348
1143 1348 -1584 970 1203 -557 881 -819 -2204 3133 2359 -4375 -147 4491 -2722 -2851 5119 1587
1159 1587 -5689 143 4934 -1373 -3013 2527 1541 -2883 -789 3207 1168 -3246 -1016 3106 -8
1174 -8 -2679 1546 2416 -3015 -2006 3684 807 -3278 195 1634 -1285 -574 1119 387 -590 -1898 -306
1191 -306 2950 -231 -4120 1570 3168 -4688 -1470 6691 -1656 -6992 4456 4241 -6393 -245 5983
1206 5983 -3918 -4380 5440 1217 -4440 1776 1196 -3217 1799 1812 -2931 1447 1583 -4771 1747 5932
1222 5932 -5014 -3446 7396 -1316 -7336 6850 4730 -9581 219 8792 -4671 -4270 7656 -463
1236 -463 -6801 4465 3495 -4854 1529 2879 -4432 1238 4395 -4249 -289 5517 -4639 -3323 8332
1251 8332 -821 -8462 5865 4698 -9339 1272 9505 -6465 -5955 8783 225 -7605 4545 3752
1265 3752 -6870 362 5155 -3547 -1020 3630 -3588 -1450 5225 -2781 -3643 6058 -885 -7257 5186
1280 5186 4791 -8452 -411 8126 -4795 -5397 8029 710 -8175 3240 5000 -5636 -888 5179
1294 5179 -2649 -3119 3673 22 -2595 2257 -248 -2370 2680 577 -3661 2507 2638 -5077 -250
1309 -250 5990 -2811 -4893 5206 2028 -6055 1203 5258 -3314 -3094 4192 1282 -3380 686 2383
1324 2383 -1307 -871 1333 463 -99 -227 -363 1069 639 -1403 295 1906 -1360 -1723 2436 1202 -3081
1341 -3081 38 3389 -1554 -2875 2644 1904 -3495 -529 3778 -628 -3403 1969 2101 -2755 -966
1356 -966 2508 -218 -2001 490 964 -517 -731 -215 368 790 -1372 -983 2152 211 -3206 1074 3056
1373 3056 -3003 -2272 4175 28 -4835 1941 3668 -3959 -1964 4354 -704 -3794 2263 1853 -2882
1388 -2882 -284 2059 -1002 -694 1074 -694 73 1212 -1735 -344 2886 -1758 -2628 3783 1048 -4691
1404 -4691 1592 4390 -3953 -2336 5463 -185 -4949 2998 3284 -3934 -497 3965 -1187 -2331 2354
1419 2354 523 -1728 1142 554 -950 1450 121 -2019 1999 1616 -3529 392 4148 -2527 -2960 4675
1435 4675 889 -5358 1934 4262 -4137 -2168 4826 -527 -4011 2272 2152 -3028 -257 2351 -1142
1450 -1142 -837 1198 -506 -267 907 -1461 -368 2371 -1323 -2518 2718 1142 -4236 760 4057
1465 4057 -3077 -3015 4375 575 -4613 1561 3283 -3274 -1605 3171 -363 -2758 1512 1074 -1649 319
1481 319 745 -694 510 193 -1234 1137 1279 -2332 -264 3052 -1472 -2573 3404 1310 -4344 857
1497 857 4041 -2706 -2520 3869 809 -3888 1276 3097 -2247 -1138 2571 -45 -1530 869 486 -477
1513 -477 580 -234 -409 1520 -209 -1940 1720 1632 -3012 -51 3760 -1704 -2912 3249 1443 -4022
1529 -4022 445 3651 -2320 -2531 3319 530 -3352 820 2231 -1883 -928 1607 -224 -1079 582 -188
1545 -188 -399 619 -768 -847 1723 -224 -2399 1476 1956 -2962 -956 3608 -785 -3424 2356 2133
1561 2133 -3612 -500 3358 -1219 -2621 2274 982 -2464 27 1733 -831 -713 666 -232 -191 309
1577 309 -633 80 1207 -1236 -981 2398 -75 -2847 1740 2312 -2988 -768 3865 -1041 -3156 2874
1593 2874 1880 -3323 241 3143 -1332 -1695 2147 207 -1506 889 416 -603 938 -67 -1267 1537
1609 1537 713 -2469 944 2696 -2453 -1678 3676 -375 -3606 2418 2375 -3593 -111 3629 -1661 -2511
1625 -2511 2661 696 -2748 965 1605 -1770 -169 917 -1074 334 809 -1656 243 1906 -1920
1640 -1920 -1487 2937 -396 -3600 1965 2386 -3533 -637 3665 -1554 -2971 2645 924 -3103 571
1655 571 2110 -1535 -888 1636 -445 -891 755 -305 -252 962 -859 -828 1801 -46 -2039 1477 1822
1672 1822 -2533 -586 2938 -660 -2298 1985 1388 -2170 -83 2226 -616 -1446 1114 887 -798 -172
1688 -172 781 330 -559 -199 764 554 -818 -339 1192 219 -1126 386 1349 -556 -964 1145 967 -1284
1706 -1284 -557 1324 409 -1557 161 1686 -769 -1560 1278 1196 -2020 -469 1929 -417 -1598 1048
1722 1048 1071 -1437 -433 1092 -344 -746 242 -156 -135 -78 -520 296 875 -1428 -721 1884 -144 -2258
1740 -2258 1508 1465 -2835 -366 3234 -1105 -2703 2153 996 -2662 540 2333 -1477 -1129 1379 -266
1756 -266 -561 915 -479 -600 1336 -606 -1113 2059 221 -2722 1248 2460 -2766 -780 3439 -1290
1772 -1290 -2834 3131 1727 -3326 537 2775 -2072 -1361 2922 -201 -1909 1290 570 -925 892
1787 892 371 -1059 1021 527 -1756 1042 1855 -2351 -927 3055 -542 -2665 2368 1316 -3238 151
1803 151 2779 -1449 -1781 1935 90 -1870 934 1020 -1147 -382 419 -463 326 295 -946 463 655 -1531
1821 -1531 43 1929 -1220 -1803 1991 704 -2372 413 2074 -1687 -1563 1858 652 -1759 197
1836 197 1073 -825 -658 633 442 -400 -371 1 628 -51 -846 297 754 -1100 -501 1265 108 -1514
1854 -1514 412 1222 -764 -845 1248 409 -1326 119 1280 -226 -1026 631 885 -830 -639 1064 480
1871 480 -1043 -130 1197 -48 -828 467 830 -490 -503 654 620 -612 -502 778 322 -856 -222 1172
1889 1172 111 -1465 457 1397 -958 -1125 1388 361 -1642 307 1590 -885 -1040 1097 216 -1038
1905 -1038 215 705 -462 -443 153 19 -78 -216 -255 363 258 -1126 54 1115 -860 -1091 1469 457
1923 457 -1877 321 1762 -1298 -1405 1733 402 -1823 180 1183 -952 -761 739 352 -544 -82
1939 -82 156 166 114 -543 84 808 -511 -852 1028 684 -1431 190 1507 -785 -1042 1630 430 -1634
1957 -1634 334 1444 -677 -753 1236 347 -1093 152 757 -269 -389 18 348 124 -490 -135 580 85
1975 85 -796 193 1066 -680 -797 1064 590 -1363 111 1357 -738 -1056 1007 550 -1200 45 1012
1992 1012 -542 -817 513 392 -570 -388 181 -17 -355 -217 198 322 -322 -625 607 316 -1029 -54
2010 -54 1031 -575 -994 928 629 -1389 -289 1378 -443 -1176 734 826 -1024 -272 867 18 -758
2027 -758 245 563 -250 -279 143 304 -86 -398 80 476 -269 -616 570 552 -784 -249 1092 -199 -1013
2046 -1013 639 823 -985 -403 1177 -16 -935 228 940 -425 -428 751 331 -507 -34 487 127 -351
2064 -351 -171 457 99 -565 -195 727 45 -804 387 753 -789 -494 1033 92 -1185 435 921 -732
2082 -732 -817 924 130 -1039 88 689 -399 -514 336 346 -365 -261 266 176 -219 -420 266 305 -539 -386
2102 -386 826 41 -838 498 780 -749 -582 871 88 -1024 223 892 -460 -465 686 282 -401 -24
2120 -24 400 43 -227 -16 252 300 -596 -18 792 20 -820 568 750 -870 -421 1235 127 -1028 357
2139 357 928 -756 -459 905 253 -798 167 598 -407 -370 283 358 -369 -219 280 423 -255 -248 339 504
2159 504 -446 -259 728 -126 -815 374 703 -577 -582 819 295 -853 27 759 -521 -642 425 560 -595
2178 -595 -381 579 -60 -472 157 346 -172 -572 98 381 -209 -431 86 266 -359 -319 490 174 -747 -201
2198 -201 779 -122 -759 422 657 -906 -294 1106 -2 -1073 322 726 -586 -175 680 75 -642 119
2216 119 385 34 71 35 17 200 -381 14 740 77 -852 351 839 -700 -406 1263 -84 -1194 846
2235 846 1063 -984 -382 1024 -295 -694 769 492 -646 91 252 -108 131 95 -491 193 149 -576 275
2254 275 834 -900 -741 1037 -87 -1146 697 886 -1388 -380 1382 -271 -1164 811 350 -1087
2270 -1087 143 800 -489 -411 237 -85 71 209 -519 -60 363 -658 -198 1050 -295 -1253 608 824
2288 824 -879 -207 1142 -495 -1008 903 661 -971 -222 631 -231 -266 448 50 -159 -6 20 105 259
2307 259 -205 -201 550 -200 -528 737 354 -851 -160 791 -212 -470 516 293 -730 -71 840 -35 -620
2326 -620 101 451 -162 -214 332 417 -208 -535 451 332 -472 -139 587 -135 -564 392 537 -715 -272 454
2346 454 50 -375 185 330 -198 -365 187 347 -210 -501 227 426 -537 -259 627 -90 -735 234 649 -436
2366 -436 -373 468 111 -590 149 365 -250 -269 -126 1 103 -353 -223 324 -180 -688 363 574 -715 -336
2386 -336 857 -230 -981 613 516 -841 -75 737 -219 -434 533 235 -385 112 170 -88 251 -47 -220
2405 -220 518 74 -632 504 628 -855 -240 1084 -183 -953 665 618 -1050 -59 1031 -384 -677 739
2423 739 130 -562 313 371 -219 33 6 -247 183 195 -494 287 466 -758 -304 855 -358 -906 751 415
2443 415 -967 -4 975 -656 -703 643 222 -672 38 527 -322 -373 124 31 89 -118 -278 236 72 -455
2463 -455 -41 665 -302 -764 602 492 -781 147 673 -412 -621 745 205 -727 5 436 -379 -330 277
2482 277 202 -155 -120 39 195 37 -219 133 338 -223 -125 575 174 -497 27 619 -186 -583 457 308 -688
2503 -688 -123 629 -47 -618 338 439 -304 -258 269 137 -408 85 295 169 -260 129 409 1 -343 281
2523 281 144 -300 -367 464 334 -584 -218 618 -145 -505 305 420 -534 -386 416 75 -641 124 405 -418
2543 -418 -418 221 130 -314 -177 320 73 -404 -98 223 150 -234 -37 390 48 -467 159 449 -363 -280 517 156
2565 156 -675 284 573 -369 -400 489 212 -354 -39 395 131 -294 62 393 -13 -153 68 315 -21 -174
2585 -174 422 424 -480 -165 568 64 -500 179 490 -357 -317 578 52 -541 157 359 -267 -233 248 229 -250 0
2607 0 210 196 -202 -90 221 247 -169 -178 384 -17 -515 129 471 -395 -263 456 134 -689 -6 587 -463 -356
2629 -356 396 81 -464 -27 303 -215 -203 85 90 -214 -1 -148 168 -23 -384 141 296 -343 -263 303 87
2650 87 -482 51 578 -453 -412 534 181 -642 -22 376 -338 -267 274 194 -252 52 222 48 -7 -136 155
2671 155 105 -137 -173 338 54 -272 51 432 -375 -314 310 167 -571 217 457 -227 -368 315 203 -364 -48
2692 -48 141 -57 -251 -72 181 -63 -142 -45 268 32 -262 154 22 -203 -228 377 27 -555 -41 358 -218
2713 -218 -379 243 111 -476 -71 395 -112 -336 196 135 -293 -50 293 -10 -245 -181 192 23 -233 -73 163
2734 163 18 -338 76 294 -215 -304 202 72 -341 105 434 -114 -422 147 241 -400 -153 385 -37 -384 156
2755 156 325 -161 -90 152 156 -126 -125 -49 224 -59 -122 231 264 -326 -88 422 66 -310 179 351 -405 -194 608
2778 608 -43 -398 394 237 -251 -61 410 9 -265 74 129 -125 14 -141 25 51 -285 -10 371 44 -357
2799 -357 59 216 -503 -196 525 -71 -535 248 296 -239 23 203 -72 -202 92 126 -87 -126 -183 1 134
2820 134 -223 -3 159 -86 -432 256 374 -498 -172 472 -173 -480 418 381 -553 -81 518 -149 -356 180
2840 180 129 -253 87 167 10 -75 -68 20 172 -5 -234 130 271 -313 -50 427 -33 -457 293 315 -435 -45
2862 -45 469 -154 -457 294 298 -237 -37 286 -29 -222 73 110 -9 -103 -42 217 -5 -276 -16 255 -268 -406
2884 -406 179 235 -399 -35 405 -35 -347 174 268 -349 -130 299 86 -99 -27 330 -176 -167 122 -67 -237 -156
2906 -156 242 13 -70 -171 117 -34 -83 -40 231 -190 -326 337 174 -300 -268 292 82 -301 39 420 -93
2927 -93 -386 293 159 -381 -95 401 -226 -286 198 195 -219 -3 154 51 -187 -118 54 123 -5 -70 402 149
2949 149 -286 20 401 -145 -150 387 196 -443 50 399 -102 -198 299 167 -171 40 212 38 -74 -60 11 127
2971 127 -70 -106 91 92 -337 -43 328 -259 -359 320 62 -451 22 421 -215 -481 320 235 -380 14 301
2992 301 -194 -155 174 145 -34 -122 21 1 -20 -149 83 138 -208 -241 275 25 -396 -84 344 -222 -325 368
3014 368 49 -477 -86 296 -83 -257 122 97 -236 -61 353 24 -155 -140 59 34 -176 -117 70 -112 -213
3035 -213 123 341 -212 -242 303 76 -217 -2 386 -252 -236 499 180 -115 -59 308 -93 -124 20 173 -166
3056 -166 -57 -34 43 -126 -197 131 198 -105 -241 281 197 -289 -38 281 -37 -205 256 189 -320 -120 261 -93
3078 -93 -301 189 213 -87 -197 292 -59 -81 -21 75 -93 -28 -52 28 -22 -224 -19 200 -102 -143 236 210 -195 -117
3102 -117 157 -63 -304 219 187 -309 -241 343 -100 -288 127 338 -49 6 146 70 -48 -79 141 -64 -54 -49 135
3125 135 143 -290 -127 201 34 -425 30 295 -170 -97 286 110 -305 124 206 -224 -299 249 -8 -253 31 270
3147 270 -37 7 47 -24 4 -5 13 137 -116 -121 113 234 -200 -9 303 -105 -243 111 120 -203 -103 266 42 -266
3171 -266 -74 256 -115 -332 185 128 -134 -44 -79 99 4 -70 35 187 -185 -53 348 8 -204 77 271 -158
3193 -158 -4 304 -103 -171 51 166 -10 -231 205 124 -126 -66 244 -86 -159 73 -10 -36 -42 -4 216 -27 -184
3216 -184 77 110 -75 -199 171 63 -154 -91 310 -37 -171 293 151 -336 -74 162 -10 -110 114 190 -163
3237 -163 -168 274 56 -113 -53 175 -47 -70 -43 23 9 -140 -32 146 -36 -84 204 87 -166 34 201 -22 -274
3260 -274 148 329 -145 -197 171 151 -205 18 240 -138 -93 83 78 -67 -157 -54 106 -237 -203 52 -15 -209 28
3283 28 183 -132 -208 107 197 -261 -190 206 -67 -226 131 255 -163 -74 161 26 -110 80 102 25 -18 22 89
3306 89 -33 -23 -44 86 -123 -12 129 102 -314 -3 166 -27 -254 217 257 -97 -111 312 69 -181 -160 169
3328 169 66 -183 -46 127 22 -67 163 133 36 -139 153 177 -187 -76 306 52 -123 113 166 -167 -51 266
3350 266 27 -348 69 165 -177 -47 -9 67 -125 -77 66 -30 -162 -48 209 -28 -131 -9 191 -103 -219 87
3372 87 135 -216 -55 115 62 -190 -123 235 -27 -20 223 57 -151 20 182 -10 -106 42 143 -41 -143 126
3394 126 67 -227 -35 95 78 -15 -41 -56 -53 28 129 36 -76 -63 45 89 -194 -6 150 121 -139 237 94 -139
3418 -139 -42 124 30 -125 151 110 -28 -96 39 -74 -2 -103 -18 11 -137 -108 -60 30 -245 -50 70 28 -104 -3
3442 -3 166 -117 114 58 -46 -89 74 39 6 62 67 -31 -188 18 108 -67 -117 -36 26 -17 -116 3 61 -45 -157 130
3468 130 246 9 -99 206 15 -139 55 182 -182 -27 274 -27 -140 41 118 -98 -113 -5 192 113 6
3489 6 -63 3 -62 -96 100 -65 -207 -27 166 24 -253 7 104 -189 22 207 -3 -18 1 100 -92 -80 60 74
3513 74 -235 35 114 -60 -128 52 99 -81 9 6 128 -6 -24 202 188 -154 -167 216 110 -108 128 50 -94 -159
3537 -159 33 54 -42 -203 35 2 51 143 18 -33 -75 237 55 -178 71 13 -25 -63 5 128 135 -74 -85 58 43
3562 43 -175 61 211 -94 -147 254 -20 -98 77 187 -66 -121 205 32 -73 18 89 -1 41 19 -74 -93 -66 175
3586 175 159 -105 -120 102 111 -118 -38 142 -56 -286 149 106 -6 -173 208 -49 -157 -40 215 -210 -92 32
3608 32 -11 -169 81 -21 -32 -160 59 -12 -20 -26 -118 188 -77 -5 20 227 -114 -50 75 67 -193 -22 137 -147 -75
3633 -75 286 94 -138 -15 136 21 -127 60 -1 16 87 28 -51 106 -94 77 148 -100 -19 128 165 -162 -61
3656 -61 284 -83 12 223 60 -183 103 178 -15 -87 134 137 -51 64 141 9 -33 5 55 -1 -35 -7 81 -52 -93
3681 -93 25 -10 -64 151 110 -10 -89 40 110 -249 -192 101 161 -149 -49 130 -47 -33 155 77 -94 -55 -13 -6 -80
3706 -80 27 20 96 25 -29 118 -116 -168 16 256 -76 9 67 102 -66 -50 124 -101 -58 95 -24 -224 61 42
3730 42 -84 -193 -33 -133 -2 -51 -51 26 -94 -3 -96 92 -20 54 96 -7 -165 -10 55 -20 -231 76 120 -126
3754 -126 -7 276 -86 -179 64 104 -24 -3 -26 -70 15 8 141 -71 -11 57 -13 -22 -58 -102 162 -105 -90 65 134 -88
3780 -88 -91 117 10 -214 59 110 -140 41 312 50 -234 67 -41 -73 -64 108 87 -26 49 -67 59 32 -126
3803 -126 -28 -3 -133 -199 104 -90 -190 50 71 -150 -25 110 65 -190 34 -34 -95 108 67 -2 -95 -3 -131 -76
3827 -76 -16 -228 -25 231 -192 -96 43 -58 -192 -2 4 -130 -154 77 29 -131 47 57 -107 10 -29 119 -179
3850 -179 79 26 -168 -142 -167 8 -86 16 60 72 74 -103 99 109 75 -62 129 48 -143 -17 44 -91 39 152
3874 152 72 -168 1 134 -38 -17 143 60 -108 60 76 -71 -62 -94 101 15 75 -19 162 -53 -138 69 145 -74
3898 -74 -143 89 -68 -14 -38 141 -131 -143 -2 -2 -139 20 130 -88 -1 60 -119 51 -90 -104 93 -62 -21 -43
3922 -43 140 -23 -86 33 39 -147 107 212 -38 -95 89 80 -190 89 206 -42 -90 36 146 -16 42 15 66 8
3946 8 48 43 -102 72 -60 26 -14 -244 43 150 -121 -102 20 11 -179 21 205 -53 -117 42 137 -129 15 178
3970 178 -39 23 -109 85 -51 66 28 88 160 -93 -60 -22 68 -113 82 -45 -112 -29 179 -23 -75 75 126 -82
3994 -82 -157 165 -158 -50 3 73 -81 -43 96 -54 -92 20 86 86 -47 -13 -26 -12 -36 6 48 10 -1 91 23 -75 43
4021 43 128 28 -207 130 111 -140 -135 193 46 -137 113 52 -180 127 152 -48 26 -9 43 -10 2 89 -74 73
4045 73 -40 144 138 -54 -118 -60 67 -63 -29 122 -76 -177 -85 -23 -81 -21 126 -118 -124 -42 63 76 -78 -3 -72
4070 -72 -151 40 85 64 -29 10 141 -65 -180 -101 196 64 21 136 74 -87 26 34 74 26 -48 8 103 -111 49
4095 49 47 -208 78 32 -13 -102 -77 180 -9 -49 33 1 56 -95 -113 7 -113 -159 105 -10 -131 -6 126 -100
4119 -100 33 99 -78 -86 66 13 -17 4 44 90 3 -93 -173 54 88 20 -137 77 -64 -144 -25 -113 -104 -14 104 41
4145 41 37 51 14 -61 -23 60 -76 -112 -73 54 -54 -12 41 144 17 -18 15 114 -125 -62 -1 85 45 73 27 -23 40 172
4173 172 25 -134 -32 80 52 -107 139 33 10 -33 8 -23 -43 60 130 -60 -41 54 73 125 3 73 44 20 -69
4198 -69 58 60 -4 -81 -21 111 -62 198 31 -105 80 129 10 -172 -36 75 -10 -33 12 -1 -40 74 31 58 56
4223 56 100 -10 1 -10 -42 34 128 32 -110 60 -34 26 98 87 -120 47 83 40 -36 -2 -14 -69 40 71 22 -202 -80
4250 -80 3 -26 -193 60 -18 -193 81 33 10 -111 9 74 22 -138 53 69 28 -83 105 105 -125 -56 64 -55
4274 -55 -70 -23 22 -18 -186 -37 140 -89 145 61 17 -100 -162 14 -69 -36 78 57 -72 -124 -30 97 -44 -3 68
4299 68 -34 71 61 95 87 -22 91 -15 40 -14 21 22 -117 43 -20 124 -43 40 73 -40 51 63 16 -107 -20 157
4325 157 30 -70 211 -102 -114 -66 136 -40 33 -7 74 133 141 41 -4 0 -76 38 -84 -93 0 1 -97 -27 129 100 -89
4352 -89 40 -83 -1 43 -51 146 -145 -34 -71 33 -17 -146 -41 86 -63 -103 -75 -81 -100 22 -40 -65 -49 180 70
4377 70 -19 52 35 -97 -165 -38 76 25 -111 2 87 -59 19 -16 -1 -38 37 55 -28 -27 70 -50 -102 -69 68 48 -27
4404 -27 -40 -44 16 -16 231 -56 8 -18 5 9 -35 -98 2 -10 -151 -6 55 -156 54 114 23 -88 -99 135 16 -119
4430 -119 80 123 -86 43 94 46 15 -26 52 -24 -110 161 -27 61 1 41 33 -14 -6 179 40 19 -43 44 -14 -6 111
4457 111 96 -53 9 113 -74 50 -50 54 -18 81 -50 -172 -98 23 14 -53 -70 19 1 10 -75 -75 -28 13 -77 30
4483 30 104 -231 -85 -2 49 159 66 31 65 -25 -9 -41 -84 -24 130 -74 -34 69 -107 -63 -135 89 -13 20 38 82
4509 82 97 37 27 60 131 109 -71 122 -180 -1 178 98 -115 -72 5 42 -3 111 58 -30 -25 74 -12 21 -100 128
4535 128 7 -127 73 73 84 -102 13 -14 -23 -57 -62 22 -65 2 42 73 61 -31 16 -155 4 -105 -101 -30 24 -4 -48 3
4563 3 -3 -25 0 -75 32 12 -67 -132 37 -36 148 132 111 -46 -28 71 48 -120 75 177 -46 -201 37 1 -112 19
4589 19 82 28 -14 76 -96 22 -51 -28 36 106 -92 -43 117 -6 -83 179 92 -54 77 111 72 -134 63 -1 -85
4614 -85 42 49 64 -159 -90 6 35 -68 -83 -20 37 36 44 114 -69 -45 8 -80 9 28 66 -12 -110 4 183 -35 -70 -6
4642 -6 153 22 131 -54 3 -22 32 6 -14 87 -80 9 -130 -1 -20 -42 -47 35 35 -57 30 -13 12 -49 -100 4 -10
4669 -10 -161 26 59 214 -125 107 -73 -91 60 -23 149 -16 -37 55 -6 -38 150 85 23 12 56 121 -101 33
4693 33 -51 62 -109 -82 191 55 33 72 -69 -103 -3 64 20 -53 38 -50 -164 -100 -40 -10 52 -34 50 -62 17 -16
4719 -16 81 130 -54 -100 181 -122 -47 107 109 46 -19 65 -91 46 95 21 -123 -98 -105 -126 25 36 36 48 -83 12 65
4746 65 -3 28 1 -74 -73 11 -3 -21 74 -19 -81 -86 -57 15 23 -103 -25 116 -19 -92 110 -61 -76 57 -32 -79 -7 22 68
4775 68 11 -127 -13 -147 -38 3 98 88 41 -55 73 102 -51 113 -105 -39 -30 119 -59 -195 -149 89 -97 -103 -62
4800 -62 96 -133 122 40 -73 100 -99 10 27 -55 -50 -118 102 -32 37 71 -124 -33 67 -27 -121 -25 86 -40
4824 -40 41 16 13 -121 -39 91 11 -18 26 40 0 54 21 -36 -83 2 85 34 65 -106 53 -74 -84 -125 38 -128 -5
4851 -5 -30 78 47 40 175 -42 -94 35 126 1 -47 -40 -137 -78 -62 79 -98 -58 149 28 -41 109 110 26 6 24 68
4878 68 5 -113 34 60 69 -42 69 23 -76 18 -22 -9 2 1 28 91 79 58 139 -33 -5 -217 -83 5 129 -20 27
4905 27 -1 -161 129 107 -157 25 40 -55 -10 -44 -123 -79 82 142 61 -199 95 -10 -8 14 6 -39 -112 109 45 68 -52
4932 -52 4 96 -43 -36 -190 62 -40 10 117 -30 -18 61 93 -27 -88 175 -109 84 148 135 -119 -38 -56 61 -150
4957 -150 -58 141 -62 -113 107 129 21 -96 -14 62 -12 -64 17 -78 -64 46 -23 -124 -5 -29 52 -50 -206 56
4981 56 38 -29 -35 89 -49 6 9 13 105 -47 -6 -120 153 -63 -36 4 -111 29 22 29 54 113 103 -16 -7 144 -64 -12
5009 -12 3 29 -105 -115 -42 -111 10 3 121 121 10 -111 11 6 -54 49 23 2 -108 53 -36 16 -79 42 23 -75 -5
5036 -5 29 76 -35 144 5 -106 -54 65 64 -84 -86 75 -177 23 76 123 -27 -65 -27 32 4 -54 53 19 4 26
5062 26 85 -57 50 123 154 -22 94 36 90 38 -28 -71 100 18 -11 62 -69 -5 27 46 7 -62 -42 10 -169 -103 -65
5089 -65 -66 -49 -29 24 -142 35 80 -6 -53 -48 -17 57 8 10 28 -109 -2 30 -14 -159 21 -17 -77 40 38 94 -33 66
5117 66 32 -69 -60 110 27 -135 -94 98 -86 -15 12 3 105 -56 -26 19 -64 -112 -10 46 -87 46 22 128 97 -33
5143 -33 -6 81 -19 -15 38 61 -36 14 104 12 -127 104 -51 5 -73 21 -85 62 -39 -20 -5 35 118 14 -1 -114
5169 -114 96 118 -46 -42 130 91 -89 39 -47 27 54 76 -33 -51 -66 -57 -200 9 78 -33 -102 -35 -33 60 11 172
5195 172 10 -153 -55 69 100 -113 30 42 18 -177 55 39 75 -55 71 110 -36 72 86 -70 48 -33 71
5218 71 -10 -115 -11 -98 -105 1 27 -115 -47 5 123 -22 -82 -180 73 -96 -35 37 -79 123 44 -31 -7 29 87 17
5244 17 -101 42 37 -65 -61 50 93 -155 104 -89 -30 -2 -34 -62 73 -84 -59 99 67 -44 -56 51 -56 -53 -54 47
5270 47 -75 91 181 82 -113 62 31 -72 12 -46 -59 34 45 60 -64 32 91 -2 3 20 63 36 -41 -151 51 61 -63
5297 -63 58 -14 48 -38 24 -25 -9 -57 106 -43 35 42 111 21 -90 95 48 103 -33 1 -55 -12 96 53 5 -41 24
5324 24 133 109 99 78 -137 -24 67 -8 -22 -31 -28 -75 90 2 62 -105 32 -76 71 -2 78 76 56 44 5 -7 56 -11
5352 -11 116 42 28 -4 -73 -37 54 -18 151 76 -51 -6 -19 -15 -29 22 64 41 9 -15 -9 -116 -104 -120 34 -199 -60 -51
5380 -51 -75 134 -127 -124 15 -47 -62 81 73 0 42 -109 -172 85 40 18 -52 8 29 -84 57 98 17 11 3 40 120 17
5408 17 80 36 45 -46 102 -88 46 -93 -20 -5 57 -58 30 -4 63 46 -13 36 -74 91 -15 -115 -23 27 -30 58
5434 58 -66 7 -95 -8 -11 -97 23 28 -9 -53 -128 14 106 -16 136 98 2 -10 -14 -99 75 7 39 66 -60 173 105
5461 105 -35 -52 -17 42 20 -13 65 32 -67 -32 -88 -83 -99 -60 64 -36 43 20 81 -27 -61 -20 87 92 -45 59 66 -96
5489 -96 -94 23 -49 -44 -50 169 47 0 0 38 119 -19 21 -73 83 0 17 -30 -154 96 39 15 70 -24 57 -4 133 133 41
5518 41 -21 32 160 -52 14 -29 -46 10 20 -8 67 -29 26 1 63 -120 85 -18 14 -122 51 33 55 4 46 35 31
5545 31 59 70 -26 4 10 -18 128 24 -42 42 -8 53 -31 114 -41 46 -38 -18 -35 -43 6 -26 -40 10 -55 24 -12 62 -25
5574 -25 -40 29 2 -119 53 81 25 -7 6 26 81 14 14 -176 71 59 -37 24 41 15 6 -98 -130 82 -102 1 97
5601 97 34 -52 28 -52 -28 -177 -26 49 -20 -72 92 38 -136 -50 48 -43 20 23 68 28 55 69 -9 16 86 69 54 46 22
5630 22 -97 -90 -13 174 -65 -78 4 62 75 6 -1 -49 -70 -153 85 134 -5 49 -30 -26 -40 26 111 -8 -47 -34 -2 -48 -23
5659 -23 79 117 95 34 -20 -22 1 -127 25 13 155 -54 39 123 -175 210 44 -78 -27 -32 -81 -15 54 101 -65 -69 19
5686 19 -37 71 -13 -69 10 0 -14 96 -97 -186 -69 8 -60 -26 -2 -9 2 -45 -88 4 -106 -17 31 -128 -17 6 30
5713 30 -149 47 -15 50 68 -29 -23 -87 -4 69 24 -6 -1 -29 53 -47 34 -71 -173 21 138 -83 35 -35 23 123
5739 123 -136 31 61 -56 -169 104 37 -12 -120 -60 -35 -47 -5 -92 -43 -142 -37 21 48 96 103 101 5 208 -70 40
5765 40 41 94 64 -118 86 0 -131 -12 -60 67 39 -52 52 130 -39 2 -141 -120 -26 28 3 32 123 -40 -60 -92
5791 -92 -29 0 32 13 151 10 -5 -56 -59 133 -89 -2 15 69 -14 29 -74 -1 141 -87 -124 44 -100 -42 -142 -68
5817 -68 -135 -38 -82 -79 -11 -22 42 105 63 23 -1 73 -42 17 -6 65 40 -3 -120 151 58 -219 96 33 -117 -14 2
5844 2 15 2 -83 -40 59 106 -31 -218 40 23 -42 -2 88 -63 -37 24 -72 28 111 -99 -9 -25 -96 -15 -35 71 59
5871 59 -206 -38 -68 -29 12 135 83 -140 -49 3 14 -25 129 0 -75 -102 0 -40 -53 -63 -200 -64 -10 44 17 -176
5897 -176 -9 -130 20 -58 -27 11 54 0 -106 22 128 -57 49 39 25 -35 -73 -35 -65 -81 -60 20 67 -72 -12
5922 -12 -62 -12 -24 -25 54 -33 -67 7 46 30 43 -16 31 -72 -71 -131 -53 -133 51 105 -76 -16 30 74 -29 113 74 -29
5950 -29 10 -108 3 -147 92 -30 28 100 0 31 50 86 177 -10 11 -47 -109 76 16 -99 66 -20 -90 -70 -66 21
5976 21 -7 -12 25 34 72 -30 -129 20 -76 -11 -17 64 -94 -20 -56 134 -23 -104 89 -52 10 -93 11 -84 106 -57
6002 -57 -77 73 33 -15 60 165 -67 120 91 -42 -55 95 101 -39 14 112 -25 9 96 -29 -5 -109 45 51 82 39
6028 39 102 -55 37 -15 114 -129 -300 68 -49 2 35 63 13 -149 -19 44 -33 21 21 9 11 63 -72 -46 140 121
6054 121 124 38 -57 42 -41 -8 97 76 -11 27 -80 4 -85 -114 85 -49 -68 2 91 -14 116 -47 -73 -33 -101 75
6080 75 -13 90 5 -149 20 20 59 56 -68 -64 0 30 87 -126 -143 130 -40 57 -28 118 19 44 86 -105 23 32 8
6107 8 -120 -45 37 -43 -62 -10 -44 -11 13 30 -55 45 114 -3 -63 -63 17 39 -304 -102 77 174 7 -13 -79 -43 173
6134 173 -12 74 6 -141 -44 16 -26 -73 13 -28 -9 -43 115 -182 123 56 46 -123 28 -14 38 49 -63 9 19 33
6160 33 53 -16 12 -122 -28 -31 -1 111 11 26 -44 91 -57 -13 141 49 101 -92 18 -75 -99 -70 -36 29 -80 -145
6186 -145 11 21 -14 -83 134 24 -48 49 116 79 -27 -80 -8 108 -84 68 -88 35 -58 -106 68 0 -65 110
6210 110 7 17 77 43 82 -26 21 5 -44 -76 -32 8 -27 -41 -33 -34 -41 154 84 -17 31 35 106 -47 26 16 -63 110 -19
6239 -19 172 27 15 5 37 52 45 -10 -145 -20 -91 22 -72 -62 16 -27 59 -56 20 -117 27 -37 -95 -2 -78 -40 -58
6266 -58 9 5 -83 44 37 -99 -56 54 -62 -56 73 59 61 88 -24 -10 -206 52 -64 41 5 -116 -10 29 170 32
6292 32 75 75 34 -51 -107 -32 60 -121 122 1 76 -52 0 -164 -166 -63 -53 52 -20 -36 60 -40 -86 -14 -41 -15 -111
6319 -111 -184 12 62 -145 84 -36 37 116 24 -84 5 -41 100 -58 132 59 -1 13 -85 -8 9 -47 -25 98 18
6344 18 -88 21 38 -78 64 -23 -9 -15 86 34 -70 -51 54 80 -25 35 -104 -1 76 -35 17 10 -72 -25 -31 25
6370 25 -41 -114 -71 -3 47 58 -142 -109 -34 -23 -126 -28 13 7 -48 -92 162 51 56 154 118 117 116 49 -12 -15 34 9 39 -36 -62
6401 -62 -55 37 88 -92 44 -60 -45 -10 17 -119 53 -7 -27 68 120 23 -30 7 204 -9 -96 76 84 132 61 37 -26
6428 -26 46 79 16 16 56 -10 -66 13 107 32 51 8 125 36 2 19 -51 -47 103 -23 78 -16 -48 -9 0 105 -87 91
6456 91 124 16 124 -78 -20 48 -67 46 11 27 -63 -80 17 14 142 69 73 -67 -103 105 -209 35 123 -71 18 -58
6482 -58 -50 50 -36 -45 70 -63 -21 87 -79 12 -5 1 -27 -93 -12 49 77 90 -65 11 -113 48 48 -93 41 51 110
6509 110 -33 -87 43 -66 154 -23 78 125 -33 0 -130 -145 -11 22 -1 80 11 18 -25 8 41 111 86 79 80 51 -69
6536 -69 -80 -7 147 -18 -55 122 -142 -52 7 39 -33 -222 -65 41 27 170 21 38 64 39 39 -57 16 51 -18 -92
6562 -92 28 67 161 -14 48 60 18 -69 123 105 -134 126 -146 13 117 32 -88 -57 -33 -91 2 -58 46 -37 -12
6587 -12 58 14 14 -115 -19 113 85 21 -5 -34 69 31 -4 111 120 6 57 -27 10 40 -74 3 80 -66 -20 17 -7 29
6615 29 90 140 103 -42 53 52 48 -13 98 39 -79 -92 -30 -117 43 153 -71 49 39 -3 -52 41 17 12 -50 -21 30 -47
6643 -47 -54 36 -13 -54 5 -77 -32 72 -125 -23 -11 -49 -7 180 38 -68 96 -41 -9 125 126 -26 -6 120 -72
6668 -72 -59 51 -8 -80 -151 14 82 70 -79 -36 -97 29 -10 33 -57 23 -3 10 -69 -19 -41 48 -11 1 30 -23 -21 -5 -28
6697 -28 37 27 -100 7 -3 -29 76 -98 5 20 51 124 -12 -14 -11 -137 39 73 -16 9 25 -94 114 -136 -8
6722 -8 60 14 75 119 115 -125 -61 -92 -38 47 27 33 92 40 61 30 -72 -100 39 58 13 -38 -15 87 -24 -118 11 10 -140
6751 -140 -75 73 54 22 113 -6 61 25 29 -18 -96 53 -66 -11 -120 24 33 16 -10 53 58 32 111 -46 -9 50 -21 11
6779 11 19 113 148 8 -116 17 26 -148 -18 101 -57 -89 -37 -12 10 47 10 60 -176 -55 -48 18 49 -75 10 60 15
6806 15 -40 -33 13 47 -36 4 -106 46 -2 67 -28 12 94 -13 -53 -109 -19 177 35 -18 34 -34 -34 109 -62 -41 -37 11
6834 11 -11 124 14 91 -22 90 -4 58 -8 151 45 -139 -94 15 42 -47 -97 34 79 25 9 60 -89 -52 111
6859 111 -37 -27 -6 74 56 -12 10 34 -15 -221 71 -86 -146 43 -10 48 -23 -42 -164 -118 -37 -158 -21 54 -42 5
6885 5 -60 -142 -114 126 81 77 -56 -1 111 -50 -11 -82 -60 158 12 62 80 21 -38 -105 -1 -21 -69 -108 229 35 64
6912 64 -94 -64 -120 95 53 -31 111 -54 -29 12 -27 59 -35 35 -74 35 -38 8 78 29 -75 38 -69 24 -21 31
6938 31 -84 15 52 -84 58 55 152 -131 32 58 -8 -15 8 -31 48 -40 79 -38 -58 -108 47 -5 -40 -22 63 -90 -60
6965 -60 -91 -97 -73 -30 30 -41 -28 -8 78 -85 91 69 -18 -6 13 -124 -26 -38 -79 11 66 -36 -63 18 -27 36 18 -126
6993 -126 -141 56 33 14 -46 -160 12 -20 -44 -40 53 83 41 -87 31 81 11 112 -117 -19 19 -31 39 -237 -38 -37
7019 -37 31 4 26 -88 -107 82 -82 99 61 -7 13 -1 163 42 1 38 16 13 -31 68 146 -4 -17 -112 72 0 -103
7046 -103 22 78 112 47 162 21 9 -26 -21 47 -59 -12 -38 23 33 -71 -1 -97 176 -91 51 17 -70 39 -72
7071 -72 -65 -36 -23 27 71 30 -36 -32 -112 87 65 9 -57 8 67 -25 -72 74 -116 -52 -8 -91 -34 -72 -2 10 -168 -17 20
7100 20 -71 -48 45 71 -50 -19 15 -53 -28 58 127 -19 48 -33 3 -31 54 139 -20 -16 6 -117 74 113 -14 -147 -49
7127 -49 -13 57 0 11 36 -72 50 30 -4 -7 -20 30 -56 -60 9 46 -34 8 -24 2 -7 98 -3 32 9 46 32 22 7 16
7157 16 -67 -20 -17 105 30 61 -90 -26 28 -68 59 -119 56 36 88 24 72 53 -2 13 -68 -90 36 54 49 39 72 85
7185 85 -7 102 140 85 -83 179 33 -42 9 -2 -45 90 -3 8 84 -32 -66 -108 56 13 -26 -49 -23 -80 -96 119
7211 119 -35 -99 -85 13 -88 23 -20 99 30 -10 -50 -3 -5 -48 9 90 19 -48 26 45 22 40 -53 34 -130 55 -34
7238 -34 -17 -50 -20 -24 -134 -17 16 -33 89 -14 -79 -83 -102 -21 -50 -78 -58 85 45 196 -4 17 26 76 -17 -55 137 -46
7266 -46 -68 -76 -26 -27 -94 63 78 -39 -71 -6 -38 115 20 142 64 -33 82 -1 24 -82 -21 3 26 29 -44 68 -73 -67
7294 -67 -20 67 -25 -11 -94 44 -11 12 -23 -53 65 70 59 -46 -10 125 125 -36 -96 -3 61 10 36 28 -83 146 -152 126
7322 126 -66 86 119 -6 -60 -81 11 -90 9 20 -57 -71 -3 -119 77 -67 -51 -53 5 -73 -50 8 -58 -72 -43 -70 34
7349 34 -88 124 160 -55 123 117 -58 -155 -33 -7 6 25 47 108 68 -4 16 -49 -51 -110 146 4 -11 -18 61 56 -6 47
7377 47 -12 -45 -98 52 -127 75 -20 -95 -11 -177 166 -58 -42 1 46 -17 17 6 -14 76 -8 -36 -122 93 -20 25
7403 25 37 24 37 -27 4 -41 -18 26 -69 -45 -81 -100 -31 -49 33 -32 -109 3 43 -11 -154 85 -73 130 57 34 16 -52
7431 -52 -106 42 57 38 -116 -74 -78 132 29 33 -22 -76 -15 72 -88 -84 12 -4 50 -70 -6 -36 -22 -45 138 -69 -28 68
7459 68 -120 7 -85 -103 46 18 -14 41 3 77 -18 2 -8 7 17 13 77 -4 40 -33 145 -33 -26 153 -10 -10 29 37 -11
7488 -11 -25 4 15 99 -82 173 59 -126 -37 13 151 47 39 -32 -35 63 29 75 -44 -94 -69 -144 -18 69 -34 121
7514 121 112 15 -3 67 -9 51 -113 6 -70 3 -3 31 22 -65 -65 -43 -71 -130 72 -74 -10 -41 -4 -16 -105 27 -54 -33 18
7543 18 18 -60 0 -174 50 -57 13 -67 88 38 52 75 50 -135 24 47 197 -135 -38 25 4 108 109 30 65 -9 -48
7570 -48 53 -15 55 3 -21 -47 -53 -13 -46 -224 7 -175 -34 32 13 25 -43 -7 241 65 25 -74 95 21 38 -14 81
7597 81 17 -110 -86 -38 -75 -31 25 27 13 -20 11 -21 77 -19 25 -74 88 61 -92 49 -19 -59 -39 54 -77 -126 -1 -104
7625 -104 -79 -14 50 121 -32 119 -59 -12 37 180 21 22 -2 52 32 -16 63 74 104 0 13 -29 87 100 -79 91
7651 91 60 47 -42 -25 52 15 -1 9 85 -33 -89 -51 18 78 39 -89 -119 73 96 110 -25 -76 -35 -126 -9 -30 -30 44
7679 44 -23 -68 50 -138 42 111 29 -88 -52 0 -2 10 47 60 -81 24 -19 -28 -55 131 23 197 68 55 -18 -43
7705 -43 46 118 31 -97 -112 -117 -64 -39 -71 -54 0 58 55 50 -60 -88 83 92 17 -7 -60 93 -89 37 -97 1 -52 -16 71
7734 71 93 6 141 -12 -37 102 148 -50 42 30 118 -64 111 101 86 66 26 123 79 -65 22 78 -108 20 90 137
7760 137 38 90 59 -53 119 38 19 -52 -37 -50 -34 32 -67 46 46 -81 -70 8 -12 -121 97 -26 62 33 -52 72
7786 72 -83 -56 79 -7 -66 -3 42 -18 17 -87 54 -50 91 76 69 -117 -48 99 -102 -67 3 -101 142 91 58
7811 58 -18 -59 -129 -1 93 -179 57 76 -17 18 49 14 65 148 -29 167 46 73 44 -85 71 36 -93 21 30 -48
7837 -48 46 -78 141 69 22 15 -76 19 23 -91 -47 -2 51 -150 -9 14 -80 -18 18 -69 1 -36 138 -40 -27 -28 -22 -49 43
7866 43 -19 17 15 20 28 -132 -30 15 30 -57 -24 21 -88 7 -79 24 -25 6 -18 -44 49 77 38 42 40 36 -80 28 25 68 72
7897 72 -18 70 -10 57 87 -76 14 -2 46 -6 88 23 82 -28 59 42 74 -8 -66 -90 67 41 -114 -111 32 -19 18 -11
7925 -11 14 55 -151 42 27 -81 -67 113 18 12 33 78 -96 -98 52 35 -22 -38 -17 -27 -86 -166 93 62 -106 48 28
7952 28 -57 152 -162 12 -62 82 -138 1 -82 -151 -12 61 -7 55 63 -98 -154 -31 -76 -76 10 -83 61 44 54 23
7978 23 98 52 97 121 -8 132 -41 -32 -11 111 0 -13 -24 -41 39 -79 16 -27 99 -119 -36 21 59 44 -92 -9
8004 -9 -144 41 135 -18 -60 53 -20 81 -10 -55 -6 -136 -32 65 155 28 49 178 46 59 -39 97 -12 29 132
8029 132 -90 36 -85 18 -106 -4 34 -60 68 17 -43 -38 -26 -24 -40 9 -94 -4 -69 19 -2 4 -41 25 -37 37 83
8056 83 -49 -111 -46 -26 77 0 29 -20 34 -115 -103 -79 -45 51 -62 -85 35 83 56 -61 -172 16 -96 91 24
8081 24 73 14 160 -61 25 -12 -39 103 -102 -37 48 -67 -30 94 112 46 -30 -70 37 -127 66 -13 -36 -146 57
8106 57 -4 -29 -11 -7 121 100 -87 19 139 -139 -3 65 9 -98 108 85 -55 -114 -39 124 9 85 -30 -38 -34 113
8132 113 -19 95 -9 -64 50 -7 -54 -93 -150 -14 45 -43 -78 -10 -8 -31 -189 -85 -29 49 -19 79 89 -154 -75 -142
8158 -142 67 -27 -43 112 50 -24 -29 87 -44 58 -19 -47 196 50 -149 82 2 -106 9 35 -24 -9 2 19 0
8183 0 -18 -107 -128 -47 -44 39 33 20
8191B0
$$ Imaginary data points
##PAGE= N=2
##DATA TABLE= (X++(I..I)), XYDATA
0 0 0 0 0 0 0 0 0 0 0 0 0 -8 8 -8 8 -8 16 -16 16 -24 24 -32 40 -45 50 -59 70 -80 92 -104 119 -135 154 -173
34 -173 195 -218 246 -273 305 -340 376 -420 465 -512 567 -624 687 -757 834 -918 1012 -1114
52 -1114 1230 -1362 1506 -1672 1860 -2082 2341 -2652 3032 -3508 4126 -4958 6136 -7934 10973
67 10973 -17026 33440 -163906 -412290 226988 154174 -234587 117275 217790 -269483 -120210
78 -120210 223154 -23089 -69804 146887 -109943 -175146 204184 94794 -186556 56821
88 56821 67009 -206170 53044 254627 -121781 -146856 130844 -67991 -122938 246117 85881
99 85881 -279713 -4203 169484 -120860 -20335 214274 -73745 -204343 95218 94302 -66792
110 -66792 40864 13831 -124641 35522 111519 -57991 -4101 67398 -125635 -68926 192176
121 192176 48444 -151954 23727 57224 -117494 22041 170710 -48837 -132178 54877
131 54877 39229 -57738 52057 65689 -87917 -56597 71768 30573 -25357 7178 -11331
142 -11331 -33555 20107 39394 6041 -8033 -33680 -41741 35933 69793 -17795 -44326 18687
154 18687 -10497 -49165 49766 77442 -59139 -70387 55768 25222 -57275 29197 53692 -72232
166 -72232 -39605 84495 11436 -64608 20624 18834 -54242 19354 63404 -34181 -36522 22144
178 22144 -21190 -5795 61847 -14957 -57511 37938 6506 -62593 52181 61587 -94547 -26647
190 -26647 102263 -34180 -75194 88597 19451 -113190 38366 92897 -75363 -34552 80352
201 80352 -35395 -56966 79330 15841 -72267 31642 25038 -61465 32867 56115 -67820
212 -67820 -8981 71182 -51187 -39689 95250 -12567 -95442 69563 56187 -100237 10743
223 10743 95676 -71305 -54926 102333 865 -86189 51539 39802 -76469 14886 64928
234 64928 -49515 -18495 54696 -33172 -28085 63606 -14829 -55373 56433 15094 -75864 37404
246 37404 61550 -78789 -17403 90393 -37269 -67894 76737 19449 -87991 30285 64930
257 64930 -63710 -21847 66676 -25096 -45128 50085 6236 -46854 27304 17070 -43237 18322
269 18322 30501 -46299 640 49717 -39457 -30288 64421 -7491 -65859 45199 39402 -70602
281 -70602 -554 69738 -37677 -45635 60805 8516 -61348 25556 38902 -45014 -5032 43489
293 43489 -22956 -21849 34489 -7326 -25504 30942 3074 -35475 26049 20631 -45558 10014
305 10014 47776 -40044 -26395 60687 -6688 -59711 41059 39616 -60206 -3848 62522 -29509
317 -29509 -43095 49385 12284 -47031 20262 30946 -35030 -5170 30001 -18473 -9657 29924
329 29924 -13117 -19607 31073 -4867 -34059 30727 18573 -46161 9777 44362 -38444 -26143
341 -26143 53627 -5367 -51972 35612 32692 -53240 -4836 48752 -23746 -30678 39013 5695
353 5695 -37371 13019 17013 -23729 5356 18037 -21232 502 20705 -24408 -9128 35823
365 35823 -13778 -32276 36277 13532 -49062 11521 42225 -37613 -21337 51412 -5911 -46509
377 -46509 28878 24386 -41966 1774 39769 -20861 -21813 28326 -1891 -22087 18800 6439 -18907
390 -18907 13552 6491 -24451 13001 21296 -29897 -1969 39598 -20383 -31344 39667 9633
402 9633 -46458 18702 40144 -36938 -17010 43520 -9824 -35680 30740 18702 -34056 5041
414 5041 24746 -21335 -7113 22873 -9553 -8802 19251 -9892 -14954 24380 -2575 -28896 24806
427 24806 19747 -39914 1666 40518 -27827 -28183 44306 5738 -44828 18240 29381 -36604 -8538
440 -8538 37975 -12812 -25065 24776 3405 -25333 11993 11486 -18725 5008 12326 -17333 2080
453 2080 16839 -20578 -7253 29665 -10383 -25553 27655 8793 -39098 9582 35673 -25162
465 -25162 -19956 33168 -1150 -32224 17051 21713 -22793 -5953 19340 -6432 -9411 10847 -739
478 -739 -7568 6811 -90 -4446 10348 -2239 -15524 10328 12666 -14939 567 18591 -13893
491 -13893 -17225 22853 11384 -22956 2627 20035 -15593 -13229 24262 6696 -23408 1523
503 1523 17717 -7418 -7974 12277 372 -12696 2747 8942 414 27 -4990 -7387 7533 6820
517 6820 -8550 2972 9770 -16948 -10229 25667 4435 -25815 8024 16347 -23661 -3780 32509
530 32509 -9874 -30653 18808 15202 -23688 5092 21264 -22163 -14768 23638 2401 -12357
542 -12357 9775 -5364 -16796 16083 9338 -17323 9145 8295 -30219 4690 37803 -19493 -26636
555 -26636 30719 453 -35229 26669 28873 -41331 -12043 37277 -11487 -18734 31115 -2475
567 -2475 -35302 16545 20764 -18263 6117 12355 -26713 -768 29519 -11449 -10547 22752 -15961
580 -15961 -24030 36673 13109 -38318 10114 24715 -32960 -2438 46158 -15591 -38316 25808
592 25808 14393 -25551 14100 19628 -28385 -8245 22821 -3928 -1975 13832 -17722 -14501 25438
605 25438 3036 -18028 16319 2351 -32186 12106 32537 -20380 -15921 21208 -9335 -18670
617 -18670 27486 11974 -30565 -2510 17489 -10009 -898 17793 -9415 -17753 6808 6808 1098
630 1098 5779 -8828 -12411 9817 5421 -8314 9705 5487 -24512 -3790 27001 -252 -18574
643 -18574 6454 4640 -14678 3613 18943 -4261 -15931 244 6681 2089 2285 926 -4584
656 -4584 -6627 163 9922 5824 -7046 -6580 1576 1121 2028 7196 763 -10609 -5333 8163 8301
671 8301 -1589 -5383 449 986 -5005 4337 14413 -6015 -18604 7487 15587 -9308 -4121 14265
685 14265 -7409 -17288 14189 14792 -12853 -4923 7333 -6319 -1612 11840 -1398 -7637 1818
698 1818 -3442 -630 13151 -2726 -14289 7907 4870 -13919 8965 15789 -20487 -11127 23330
711 23330 -1205 -18436 15178 7882 -25033 1938 22910 -9749 -11548 12268 -3533 -10976 11294
724 11294 4184 -10076 3285 50 -9590 10473 8268 -17099 462 15195 -13566 -7075 23136
737 23136 -4457 -23986 14140 14275 -20003 755 19688 -13728 -12804 18836 2877 -13877 6860
750 6860 4437 -11196 4302 7933 -7578 1423 5573 -10117 1630 14023 -9646 -8841 16228
763 16228 -1805 -16590 14030 12191 -20792 -2436 20731 -7814 -13136 16362 4223 -17643
775 -17643 4106 12643 -8193 -3760 8288 -3038 -4282 5698 -543 -2710 4772 -2879 -5689 8192
789 8192 1917 -10716 4490 8647 -10992 -3618 14354 -3196 -13637 8930 8312 -13131 -1498
802 -1498 13234 -5394 -10951 8069 5362 -8669 -517 6652 -2899 -4423 2640 1015 -1063 -136
816 -136 -2283 385 3760 -3326 -3468 6220 721 -8842 3094 8786 -7803 -6397 10711 597 -11699
831 -11699 5357 9925 -9654 -5314 11572 -346 -10143 5501 6839 -7830 -2290 7374 -940
844 -940 -3738 2807 882 -1152 1286 -1178 -342 4478 -1916 -5331 6300 4122 -9259 780 10447
859 10447 -5844 -7564 10632 3227 -11614 2628 9649 -7213 -4941 9510 -88 -7704 4127
872 4127 4063 -5042 -153 3540 -2081 -347 1587 -2201 1294 2940 -4996 -736 7387 -4050 -7390
887 -7390 8503 3298 -11696 1639 11099 -7477 -7955 10382 2181 -10881 2760 7601 -6308
900 -6308 -3219 5844 -1328 -3831 2844 51 -2323 2363 -609 -3033 3322 423 -5384 3398 3969
915 3969 -7166 -242 8646 -4718 -7009 9224 3067 -11743 2614 10729 -7367 -6758 10068 1698
929 1698 -8994 2928 6222 -4525 -1941 3984 -816 -811 2124 -2091 -291 4293 -2920 -3001 6174 377
945 377 -6924 4248 5741 -7430 -1306 9150 -3549 -7334 8286 3820 -9536 1625 8510 -5274
959 -5274 -4986 7053 1395 -6144 1613 3464 -2108 -173 1010 -1466 1503 362 -3907 2115 4310
974 4310 -5354 -2719 7306 -1094 -7544 4887 5121 -8330 -1172 8558 -3268 -6820 6119 2787
988 2787 -7634 516 6394 -3367 -4215 3814 980 -3046 459 760 -690 431 -1417 -1143 3546 -4
1004 -4 -5175 2179 4945 -5162 -2940 7320 -512 -7923 4146 6204 -6776 -2562 7770 -1546
1018 -1546 -6567 5315 4218 -6670 -556 6059 -2231 -3222 3901 828 -2968 906 1049 -497 2055
1033 2055 -735 -3186 3667 2484 -5835 1492 7397 -5554 -5680 9281 2407 -9863 3009 8102
1047 8102 -7442 -3569 9754 -1084 -7958 5046 3614 -6392 1568 5110 -4705 -1738 4668 -2179
1061 -2179 -1405 4418 -3064 -3707 6129 -675 -6376 6367 2824 -10791 2070 10720 -7794 -6914 11043
1076 11043 -373 -11741 6587 8022 -9974 -2577 8331 -3549 -4594 6332 -383 -5510 3470
1089 3470 920 -3780 4162 823 -6970 2865 5109 -6853 103 8027 -6153 -6281 10067 1273
1103 1273 -9983 4875 6452 -9360 -1075 10214 -3141 -6763 5313 1630 -4806 2803 2578 -3468
1117 -3468 690 1249 -2527 3249 2665 -6169 392 6613 -4346 -3298 8168 -850 -8926 5083 6578
1132 6578 -7002 -1434 7475 -3226 -5272 6030 2424 -5181 318 2746 -1626 -51 1569 -1067
1146 -1067 -84 129 -1820 2135 2368 -3999 -1507 4734 -1320 -4029 3830 2120 -5620 -706 5439 -1001
1162 -1001 -4267 1861 2010 -2890 -1193 2939 811 -3436 -1338 2995 634 -3114 325 2461 -2500
1177 -2500 -2238 3419 1385 -3750 -497 2494 -878 -1019 1215 250 -901 -1141 -187 2307 155 -3667
1193 -3667 758 3776 -3016 -2479 5826 -127 -7077 3214 6086 -5388 -2283 6438 -1916 -5241 5038
1208 5038 2909 -4994 502 3054 -2623 569 2896 -2494 -127 2779 -3189 19 5814 -3400 -4952
1223 -4952 6654 1470 -7814 4293 6377 -8697 -2206 9817 -2525 -6841 6617 1930 -7581
1236 -7581 2856 5299 -4978 -1012 4108 -3416 -921 4873 -3190 -2777 5228 -2239 -4857 6892
1250 6892 1337 -9091 3313 6862 -8127 -1892 9688 -4181 -8392 8080 2975 -8879 2292
1263 2292 5765 -6414 -1842 6235 -2291 -3297 3919 -1637 -3039 4691 -748 -4797 4546 1627 -7100
1278 -7100 3114 6309 -7312 -2838 8763 -2201 -6853 6677 3113 -8508 1431 6932 -4699
1291 -4699 -2823 5770 -1073 -4344 3424 1559 -3383 1324 1295 -2431 1840 2023 -3337 1037 3567 -3812
1307 -3812 -1466 5816 -1225 -5567 4362 3678 -5742 -258 5972 -2167 -4233 4069 2217 -3805 17
1322 17 2948 -1182 -1691 1475 592 -817 -231 -62 636 505 -1339 -213 1632 -782 -2002 1763 1474
1339 1474 -2954 -809 3424 -750 -3341 1915 2278 -3216 -1519 3600 -137 -3850 1149 2793 -2340
1354 -2340 -1629 2517 333 -2382 181 1548 -687 -796 192 311 436 -672 -894 1560 739 -2790 328
1371 328 3363 -2052 -2925 3732 1216 -4577 907 4401 -3028 -2878 4463 619 -4281 1594 3057 -2752
1387 -2752 -948 2694 -416 -1416 1277 57 -478 1258 -782 -771 2362 -653 -2921 2823 2202 -4242
1403 -4242 289 4769 -2815 -3527 4929 1362 -5413 1686 4350 -3636 -1923 4142 -430 -3270 1999
1418 1999 1453 -2184 541 951 -1337 614 647 -2178 876 1947 -2949 -808 3918 -1603 -3831 3630
1434 3630 1917 -5233 462 4893 -3214 -3253 4485 643 -4582 1376 3019 -2919 -1235 2711 -537
1449 -537 -1779 1131 -43 -876 927 -657 -892 1868 -278 -2518 1968 1940 -3588 -226 4229 -1916
1465 -1916 -3358 3857 1723 -4691 694 4107 -2437 -2450 3564 676 -2929 1194 2090 -1600 -213 1360
1481 1360 -561 -87 728 -904 437 1517 -1697 -688 2822 -576 -2882 2577 2154 -3949 -162 4270
1497 4270 -1781 -3264 3453 1720 -4165 373 3591 -1845 -2076 2505 496 -2169 658 1009 -886
1512 -886 109 159 -653 954 84 -1807 763 1758 -2433 -1152 3273 -822 -3509 2399 2277 -3785 -610
1529 -610 3936 -1634 -3197 3031 1601 -3463 97 2689 -1640 -1637 1777 263 -1420 296 437 -495
1545 -495 498 -114 -1014 1306 506 -2213 829 2441 -2191 -1503 3300 127 -3673 1787 2959 -3127
1561 -3127 -1377 3754 -410 -3067 1991 1900 -2363 -495 2252 -533 -1277 1096 380 -378 412 -284 -44
1578 -44 1318 -574 -1202 1879 583 -2558 1130 2720 -2352 -1687 3694 -2 -3663 2043 2548 -3217
1594 -3217 -821 3320 -965 -2434 1968 1036 -2107 366 1040 -1006 186 582 -1198 775 1148 -2137
1610 -2137 -147 2667 -1780 -2379 3120 473 -3821 1408 3009 -3278 -1459 3739 -965 -3317 2262
1625 2262 1468 -2779 -52 2035 -1501 -900 1428 -514 -460 1017 -990 -474 2023 -1036 -1976 2573
1641 2573 610 -3247 1241 3215 -2943 -1573 3816 -546 -3264 2386 2100 -3015 -228 2843 -1073
1656 -1073 -1385 1783 144 -1227 740 265 -547 729 -246 -832 1377 515 -2002 937 2052 -1900
1672 -1900 -1118 2801 -48 -2735 1377 1925 -2125 -754 2354 -218 -1863 762 1090 -1105 -530 826
1688 826 344 -641 -232 617 266 -756 -511 987 333 -1288 42 1210 -481 -1314 813 921 -1335
1705 -1335 -829 1275 363 -1386 -152 1433 -495 -1722 972 1456 -1743 -930 1739 -9 -1837 760
1721 760 1476 -1492 -874 1293 31 -806 263 106 -312 47 -128 113 636 -819 -813 1579 273 -2042
1739 -2042 734 1911 -2145 -929 3226 -365 -3000 1738 1851 -2351 -209 2704 -1117 -1728 1798
1754 1798 650 -1217 812 253 -810 1062 149 -1227 1343 775 -2532 572 2793 -2021 -1732 3238
1770 3238 -185 -3498 2326 2486 -3435 -595 3150 -1472 -2119 2643 492 -2632 832 1330 -1244 113
1786 113 644 -1219 278 948 -1331 175 1947 -1809 -1551 2776 137 -2907 1481 1951 -3056 -624
1802 -624 3125 -1035 -2469 1791 765 -2165 402 1257 -1100 -660 778 -249 -56 374 -807 16
1818 16 869 -861 -232 1770 -498 -2014 1462 1488 -2247 -88 2366 -1094 -1876 1766 1105 -1836 -112
1835 -112 1502 -394 -892 716 401 -441 -305 173 699 -57 -707 271 850 -593 -694 1319 364 -1405
1853 -1405 70 1422 -671 -1036 1073 633 -1339 -91 1282 -25 -1119 357 918 -700 -651 791
1869 791 494 -996 -218 1195 70 -1036 320 884 -559 -780 587 605 -759 -552 689 438 -854
1886 -854 -331 990 69 -1345 68 1399 -785 -1472 1222 625 -1775 -54 1603 -679 -1285 903
1902 903 580 -1305 -118 973 -357 -619 276 171 -195 -32 -249 179 326 -716 -150 1245 -469 -1097
1920 -1097 1219 954 -1609 -38 1962 -806 -1481 1621 1013 -1655 13 1677 -599 -850 912 480
1936 480 -628 -72 259 187 125 -200 -42 697 -114 -680 801 691 -1311 -132 1501 -596 -1302 1382
1954 1382 704 -1626 -25 1586 -608 -969 1058 533 -1150 -147 1008 -112 -690 202 330 -24 -404
1971 -404 -189 419 133 -845 -36 908 -457 -1039 876 559 -1368 -137 1325 -518 -1267 939 801 -1227
1989 -1227 -81 1066 -317 -898 403 472 -445 -361 393 126 -357 -214 194 418 -303 -509 501 304 -838
2008 -838 -126 1035 -290 -1074 672 1042 -935 -458 1425 20 -1313 638 915 -824 -580 1103 120
2025 120 -697 85 644 -255 -283 354 244 -135 -254 149 430 -184 -545 362 595 -602 -351 896 -30 -1024
2045 -1024 397 993 -904 -687 1053 119 -1209 23 798 -461 -825 700 329 -714 -157 348 53
2062 53 -302 -226 348 123 -507 -208 720 19 -905 167 694 -571 -777 829 405 -1198 218 1066 -548
2081 -548 -916 864 404 -1025 28 986 -221 -739 196 407 -312 -349 206 345 -145 -299 293 373 -381
2100 -381 -345 899 338 -744 223 928 -418 -651 786 542 -1071 11 1016 -363 -500 708 470
2117 470 -391 -25 486 153 -236 -29 247 164 -386 -100 657 150 -717 209 923 -610 -524 1022 299 -1141
2137 -1141 95 1037 -590 -758 876 383 -921 -12 830 -174 -535 189 402 -351 -224 265 228 -254
2155 -254 -388 294 382 -370 -457 591 29 -808 32 878 -521 -962 625 479 -816 -162 831 -230 -746
2174 -746 462 742 -658 -536 397 195 -563 -66 459 -241 -487 278 500 8 -396 142 358 -327 -196
2193 -196 448 347 -669 -195 957 118 -710 317 811 -771 -439 1156 371 -1042 205 915 -401
2210 -401 -205 649 174 -766 243 562 4 -79 55 -5 7 -78 -85 371 -40 -793 286 989 -584 -657 862
2231 862 -7 -1109 472 1377 -1006 -950 1130 41 -992 519 547 -727 -107 523 -108 19 83 -264
2249 -264 -36 389 -537 -65 699 -625 -724 1101 270 -1268 337 1020 -1175 -522 1491 -2 -1279 476
2267 476 707 -961 29 814 -306 -602 307 187 -12 168 -323 -239 432 -145 -459 900 72 -1120 398
2286 398 973 -639 -484 1178 -40 -953 835 860 -788 -332 744 -218 -400 492 211 -418 -61 171
2304 171 244 232 -147 -200 409 -74 -531 557 449 -892 -206 987 -69 -779 483 428 -618 -330 792
2323 792 -6 -722 33 347 -214 -351 49 159 -324 -383 335 414 -542 -366 603 50 -540 285 494 -626
2343 -626 -432 423 46 -424 -35 197 -52 -382 41 320 -108 -565 -48 380 -266 -419 552 211 -865 128
2363 128 809 -371 -525 320 383 -504 -61 367 -60 -374 106 201 64 -171 -71 356 -62 -521 449 749
2383 749 -534 -419 960 211 -885 548 848 -682 -266 983 -48 -660 378 403 -401 121 286 -94
2401 -94 14 -61 -200 249 104 -629 163 740 -765 -552 1021 25 -1082 476 764 -946 -441 870 -397
2420 -397 -848 513 405 -721 4 348 -143 -257 80 -225 32 195 -320 216 506 -491 -359 794 98
2439 98 -747 507 668 -885 -238 950 -285 -872 662 479 -754 -160 533 -140 -415 229 178 -117 -52
2458 -52 -205 79 342 -324 -119 596 -139 -681 461 568 -821 -249 958 -171 -791 541 375 -625
2476 -625 -220 521 -8 -390 415 308 -329 -202 227 78 -66 -191 88 366 -220 -280 476 263 -564 10
2496 10 579 -212 -578 459 353 -668 -179 676 -47 -579 116 512 -325 -431 415 214 -417 -49 337 -11
2516 -11 -304 -117 188 -83 -268 43 355 -194 -259 263 394 -399 -250 535 52 -515 269 530 -377 -348 325
2537 325 151 -609 69 513 -209 -398 310 263 -333 -195 187 11 -234 -50 342 -69 -203 -103 292 83
2557 83 -544 -41 525 -290 -275 589 221 -521 110 608 -342 -519 372 395 -297 -12 313 82 -235 -86 314
2578 314 -146 -211 132 296 -63 -279 243 409 -271 -371 471 225 -628 75 554 -327 -448 454 159 -605
2598 -605 60 382 -130 -306 225 180 -254 -61 177 -70 -199 13 216 25 -320 -195 227 68 -527 44
2618 44 594 -237 -418 457 181 -551 64 492 -342 -454 413 119 -532 4 455 -96 -214 76 119 -60 -180
2639 -180 34 159 131 -259 20 349 -196 -381 349 258 -589 75 507 -162 -419 551 374 -540 -27 523 -208
2660 -208 -408 277 193 -227 6 277 6 -127 -21 -49 92 -187 -135 386 88 -451 -16 457 -212 -361 458
2681 458 209 -464 -79 457 -149 -371 375 168 -388 -246 350 -96 -299 70 43 -147 -200 70 217 -43 -156
2702 -156 145 260 -205 -156 319 127 -399 -54 434 -136 -365 294 151 -302 -206 435 -90 -308 83 292 -268
2723 -268 -229 245 -17 -103 -16 96 133 -159 -38 212 -174 -75 80 339 -38 -309 205 356 -276 -79 431 -73
2745 -73 -442 142 355 -339 -117 301 12 -263 126 252 -167 -132 53 115 -63 -3 30 77 -41 -184 190 242
2767 242 -288 -308 508 77 -291 226 421 -390 -291 432 11 -517 31 323 -361 -170 281 109 -321 113 113
2788 113 -58 -124 23 111 4 -213 7 259 -12 -504 70 340 -305 -255 317 -46 -593 199 369 -361 -213
2809 -213 344 -57 -410 283 303 -87 -164 5 74 140 -23 -95 224 170 -247 182 234 -374 -257 425 -69 -384
2831 -384 377 403 -535 -245 615 21 -452 310 187 -256 -111 229 132 -207 108 99 25 -58 -52 169 114 -224 -54
2854 -54 409 12 -526 116 499 -280 -182 460 122 -550 263 380 -252 -72 357 16 -190 192 147 17 -123
2875 -123 52 209 140 -295 -118 321 -123 -218 111 287 -229 -139 323 7 -401 167 245 -219 -203 349 165 -411
2897 -411 -17 299 -50 -332 121 195 -177 -246 156 158 -104 -231 88 145 -139 86 184 -83 -263 120 387 -98
2919 -98 -266 251 115 -248 -61 380 -124 -212 139 284 -120 -47 298 52 -374 57 195 -95 -115 126 163 -38
2941 -38 -97 -16 1 -181 -74 342 99 -350 -54 391 -156 -315 286 374 -392 -76 554 -167 -455 242 122 -332
2963 -332 22 69 -73 -215 -16 123 -101 28 18 -109 -26 -242 121 317 -72 -208 281 105 -424 -12 426
2984 426 -70 -417 243 422 -432 -150 476 -118 -206 117 220 -204 -63 130 127 5 34 85 77 -79 -179 203
3006 203 211 -398 -24 435 -83 -321 271 212 -315 39 366 48 -364 169 281 -77 -100 164 70 -109 -66 19
3028 19 147 -93 -42 65 -57 -245 115 347 -119 -290 260 154 -284 45 283 -181 -280 189 266 -270 -130
3049 -130 237 -12 -174 164 193 -208 -63 64 79 -33 88 129 14 -129 -111 177 207 -177 -219 413 -99 -261
3071 -261 192 202 -370 -111 322 -27 -365 61 325 -242 -133 292 -6 -177 -27 204 -46 -123 33 119 45
3092 45 -158 13 93 -19 -213 25 322 -227 -139 315 125 -300 45 379 -129 -229 362 24 -207 71 164
3113 164 -56 -188 190 54 -65 -71 54 -30 -51 -106 54 254 -149 -98 165 -28 -312 8 386 -159 -227 353
3135 353 74 -205 85 237 -138 -141 224 51 -201 59 188 -119 -208 187 -7 44 -5 -107 116 25 -229 6
3157 6 78 -65 -98 389 -14 -202 142 255 -121 -128 265 168 -314 -119 178 -71 -143 106 103 -167 -53 -56 92 -122
3181 -122 69 53 111 -100 -162 174 15 -172 -2 95 -166 -211 298 30 -156 -26 183 -93 -260 186 90 22
3203 22 -46 221 115 -281 -58 196 -34 -43 -27 119 -57 -183 156 64 1 -199 166 71 -296 -49 254 -220 -234
3226 -234 205 124 -188 -94 262 -80 -205 53 17 -105 -150 93 -25 -140 -198 32 77 -69 -88 216 55 -210
3248 -210 -20 29 14 -194 99 251 -190 -81 264 3 -234 92 193 -140 -206 102 141 -72 -98 100 -78 -162
3270 -162 24 166 -128 -54 118 26 -81 -169 75 61 -103 -29 153 -55 -194 124 113 -146 -86 145 77 -141 2
3293 2 212 -69 -59 126 110 -138 -22 119 42 -82 -122 154 95 -136 -73 277 41 -190 93 179 -97 -25 166
3316 166 142 -210 53 213 -164 -128 193 154 -154 7 130 -36 -106 13 55 -13 -20 62 -78 -151 -164 -28 79 -85
3340 -85 -9 201 -11 -199 103 175 -20 -198 296 -16 -190 17 207 -46 -171 115 150 16 21 -4 18 -23 90
3363 90 10 69 -185 106 153 -169 -46 -31 126 -108 -115 184 39 -210 80 109 -80 57 44 42 -106 -139 182 100
3387 100 -180 53 181 -30 -188 128 -77 -152 -80 141 2 -88 8 -7 68 -199 142 138 -50 -235 125 52 -80
3410 -80 -70 83 14 -243 83 156 -201 -132 142 38 -197 1 112 -30 -18 -24 -61 -236 70 -11 70 -175 16 106
3434 106 53 -97 -150 94 -66 -163 11 212 -67 -70 198 11 -262 30 44 -171 -152 205 -12 -140 -97 137 -37
3457 -37 -56 -53 -34 41 -46 45 13 9 16 10 180 -20 -70 265 140 -82 180 89 -171 -54 156 31 -148 26 11 -120
3483 -120 -78 150 14 -114 -33 70 233 5 -3 -63 35 -89 27 151 23 -199 115 211 -141 15 166 100 -116
3506 -116 -102 253 -68 -123 106 -114 3 1 76 -58 -11 -34 34 -60 -84 -92 35 51 -132 80 -133 -185 -182 65 72 -114
3532 -114 -81 41 -13 -74 81 159 -104 -179 108 -20 -32 157 178 -89 -123 247 47 -128 -105 223 43 -65 2
3555 2 -1 78 -238 183 264 -146 -6 87 70 -25 6 225 33 -155 -22 166 1 -282 118 -37 -232 35 130 -125
3579 -125 -160 60 131 -52 5 120 38 -107 -72 26 127 24 -17 141 -45 -164 85 98 -243 -144 275 37 -224
3602 -224 8 36 7 -85 94 -12 -196 130 100 -170 -66 35 13 83 91 16 236 -100 -95 27 56 -176 -140 287
3626 287 48 -156 -67 241 -40 -148 152 -92 -49 -4 138 -18 43 -44 123 -74 122 -36 23 -31 15 56 -15
3649 -15 -39 -96 143 55 -132 -89 121 -150 -83 239 139 -223 33 81 -57 -166 175 183 -42 -74 10 -8 -48 62
3673 62 -37 19 -29 -72 85 137 -17 -55 -55 -13 -45 102 102 -161 27 162 -67 -7 33 176 -113 58 154 -83 -92 79
3699 79 90 -3 -92 -23 -72 61 -24 4 56 62 -110 91 112 -91 78 49 -46 -198 170 97 -170 -26 278 0 -222
3724 -222 197 93 -145 -36 63 19 -92 21 98 -93 79 19 45 -138 -41 81 51 -72 -126 37 143 18 -49
3747 -49 219 -137 -168 100 131 -30 -34 259 66 -167 -14 133 -63 25 146 63 70 -53 77 39 10 9 82 0 24
3772 24 -68 204 -59 -82 -16 160 -84 -135 262 -51 -176 117 135 -225 -46 -7 1 -116 4 98 -163 -38 49 -52
3796 -52 -94 36 -20 94 43 -65 119 87 -51 -139 -113 39 -150 -57 182 -5 34 47 -13 -119 -79 260 -63 -199
3820 -199 83 -38 -23 -137 -13 41 1 60 -39 6 -51 -95 128 -12 -176 -30 105 -23 -48 108 60 -86 60
3843 60 102 -94 -14 31 58 -55 3 125 -118 -66 47 -24 -14 185 61 39 -33 -51 -6 100 3 -107 135 2 -137
3868 -137 -126 73 7 -105 114 215 -64 78 92 -126 -113 85 25 -39 31 -119 -157 -126 -36 -16 46 -80 -4 90 -34
3893 -34 -95 5 35 51 -89 137 -43 -97 -13 143 -41 -115 140 25 -9 15 -14 35 -160 106 129 -84 -2 5 20
3918 20 -74 37 -37 -14 104 -2 185 21 -44 -46 154 14 -127 134 161 -95 -23 134 -30 -198 10 236 -172
3941 -172 -109 64 38 -16 35 137 -43 -20 -50 108 5 -36 -159 35 6 -155 108 124 -121 -35 179 20 -111
3964 -111 79 32 -122 21 155 -14 -131 110 11 51 -16 -25 120 -181 9 35 -15 -8 -49 -35 8 -61 -124 105 112 -205
3990 -205 102 81 -93 -75 58 30 -158 16 196 -196 -136 187 -39 12 133 45 25 -39 37 16 32 108 -31 0
4014 0 -82 -112 108 80 41 -170 209 77 -137 43 108 -113 98 144 81 -283 -13 -48 -143 -155 97 37 -57 -17 8
4039 8 68 118 14 20 126 -20 -36 -17 165 -132 -17 111 -87 -71 31 51 -98 10 83 -42 58 2 -101 -20
4063 -20 77 24 63 -116 90 41 79 -50 37 -53 25 -4 -103 85 -92 19 69 121 -96 -101 -14 -27 -170 98 132 -41
4089 -41 -99 -7 -105 -75 109 18 -60 -71 4 54 39 168 -100 25 -34 99 7 163 1 41 62 -142 -46 102 153 -73
4115 -73 36 80 -79 -21 59 15 -28 115 38 7 -59 43 -10 -32 -61 106 -10 -103 93 118 191 19 -40 132 143 -84
4141 -84 -12 210 32 -59 -30 92 -38 -126 43 -33 -82 95 125 -53 -27 29 67 -114 46 48 10 21 9 4 -125 -121 -66
4168 -66 84 -82 -73 -22 142 -39 26 186 52 -44 71 63 78 72 -9 40 -31 22 25 77 -111 14 -21 -24 19 27 -72 -155 -24
4197 -24 83 48 -106 41 92 58 43 110 7 24 -40 151 52 -157 67 97 85 -39 -61 -48 -45 -34 25 -77 -75 -110 -17
4224 -17 -6 -97 13 0 -196 12 -7 115 -17 -98 118 120 9 8 103 -53 -67 -23 98 -100 -69 42 -127 -35 109
4249 109 131 -68 -32 50 37 46 -17 200 22 -13 51 -40 -23 -119 -39 55 25 -38 81 80 -45 -167 -92 -28 -134 22 11
4276 11 -62 26 -34 -22 -47 51 11 34 -144 123 39 35 -147 60 11 -102 -23 146 -85 24 57 101 -82 -65 72 167
4302 167 -138 -47 112 91 63 -40 94 53 4 -3 57 -51 -96 88 -29 -48 -19 155 55 -38 -34 71 -33 -36 -21 31
4328 31 11 34 -5 -30 -28 -98 19 17 -60 -37 -27 -50 -27 -28 -13 -88 -36 157 -76 -149 42 11 -29 -46 73 124 -179 1
4356 1 115 -81 -117 14 92 -77 -153 -30 -3 51 82 140 258 138 35 153 -92 -19 48 113 0 -131 73 84
4380 84 1 -15 67 -141 16 172 34 -141 -103 28 -38 -59 9 255 35 4 -73 60 -2 0 38 44 -119 112 49 -76
4406 -76 34 28 18 -27 -31 -47 -73 -32 -6 76 49 -164 33 38 -76 -54 -52 67 27 5 44 23 -81 51 -22 -115 -99 24
4434 24 25 -106 -20 -10 -3 -64 99 -56 5 -84 18 -4 -11 -28 86 50 -38 51 3 -70 -22 163 67 -16 -26 -38 -88 -58 -19
4463 -19 92 101 -16 16 38 -90 -73 -36 35 44 -16 -43 -13 -117 59 22 61 -63 104 74 15 -65 3 31 -100 -104 54
4490 54 72 6 -77 -81 -94 6 147 66 -106 -140 97 40 -117 -30 -9 -18 -58 56 18 74 -63 23 2 166 -120 -50 29
4517 29 -50 60 -125 -107 -5 29 -35 -46 -15 64 -52 -40 65 96 -177 -15 -28 -56 -70 -31 0 -33 -69 -63 24 -27 -140
4544 -140 133 -88 18 18 57 -117 24 -56 -1 -15 -41 11 30 -192 97 3 -69 -46 -40 -56 -59 -125 -47 -55 -36 -56 85 58
4572 58 -11 11 86 -81 -93 60 36 24 -56 132 -19 -37 -38 119 -54 -35 57 69 4 53 121 1 -12 39 19 70 -122
4599 -122 71 -115 55 -105 40 -10 127 -100 17 -61 -48 24 74 31 9 96 -32 -167 41 163 -21 -89 -8
4622 -8 -3 -93 102 -105 63 12 69 -15 67 -52 10 50 137 -27 140 7 -79 -151 90 22 -99 137 207 -34 -45 33
4648 33 24 -42 -117 83 -9 -149 103 32 -11 21 70 -32 47 29 10 63 -31 111 137 17 0 81 -25 13 -84 19 115
4675 115 -117 44 52 6 -117 15 117 70 23 66 -69 75 -36 45 33 -258 14 66 97 -49 -36 117 -9 -98
4699 -98 51 87 -31 16 183 -69 -82 8 174 33 -92 8 5 -13 -71 7 87 -78 19 -69 -22 53 14 -20 -191 72
4725 72 62 -17 -42 9 69 12 -25 38 26 42 15 5 12 -9 118 -29 -73 -4 39 -84 -35 93 37 -95 35 59 -30 33
4753 33 22 -157 40 -37 -32 -17 90 -96 134 35 -63 -231 122 123 -75 53 113 57 6 52 79 -143 -173 -68 77
4778 77 -13 -151 -61 -35 -11 -55 79 -45 -24 82 62 -2 -35 79 52 -145 -117 45 -112 -20 138 120 -51 74 181
4803 181 -12 50 13 119 -24 8 6 -16 45 -69 -128 -4 126 29 -38 22 -44 -10 176 41 -120 13 81 -20 -150
4828 -150 -24 30 -47 127 79 27 5 17 -3 88 -38 61 59 -88 100 3 -10 86 115 184 -12 -40 50 162 30 -87
4854 -87 -9 148 57 66 -34 0 -39 41 -30 -38 42 40 -183 36 -96 -53 19 -111 121 6 -5 26 31 -84 5 48 167
4881 167 212 -132 -23 26 -31 -91 24 -48 -56 35 55 -3 -71 36 63 39 -83 51 -115 -17 20 68 105 50 30 136
4907 136 -61 -102 134 -48 6 -57 194 35 -139 39 4 -4 63 125 -49 -39 -14 121 90 17 107 -161 22 -40 166
4932 166 -104 -128 -74 -43 -65 -92 -93 9 133 -113 -30 39 60 -41 -5 90 34 114 193 -70 -12 21 74 -74 -51 71
4958 71 24 3 39 67 -24 -83 -10 -18 -130 40 38 -17 27 14 96 60 -25 -37 165 38 35 65 92 -61 62 63 18 -140 -49
4987 -49 40 66 -165 -67 2 -2 71 79 -23 83 -17 20 32 -44 88 68 -45 11 13 276 12 10 140 -156 -64 -87 73
5014 73 -120 -8 -83 -16 62 98 138 -32 -8 69 42 95 -147 21 46 -69 55 123 -11 -63 -29 117 -70 -38 7
5039 7 19 -18 -16 36 7 94 -61 111 -7 -10 16 130 -32 -75 30 11 -67 56 118 -63 -75 105 90 -3 -107 -28 27
5066 27 -143 -58 117 65 -118 38 -4 50 28 123 7 -32 -16 -53 -22 -95 -99 85 47 -136 -37 103 -85 90 -40
5091 -40 -97 -13 -66 49 -11 10 -14 -36 -129 -6 46 -46 -115 4 140 21 -44 -5 60 -48 -88 -70 15 -47 -3 -62 32
5118 32 12 -50 108 -63 -130 -35 -104 -14 41 -67 19 114 17 114 67 -71 14 13 3 -120 2 -81 61 81 57 -19 -122
5145 -122 -33 -54 40 52 33 -29 -53 4 242 -36 -68 -26 26 -112 -101 60 21 -51 29 6 -63 -39 -132 -4 32 99 42
5172 42 131 -67 160 -84 133 -118 35 0 -15 -9 -126 47 -73 60 98 -6 -35 -38 38 88 -19 -97 33 -64 23
5197 23 181 -70 118 -80 97 29 -112 118 11 -135 -126 92 27 -40 -52 88 -9 118 72 -59 62 -107 5
5220 5 6 -77 -6 -89 -100 45 -83 118 28 -23 -72 60 -56 -94 91 79 -80 -87 32 168 -56 18 107 58 -72 4
5246 4 114 79 -68 80 -59 -130 -7 24 48 -25 101 64 -76 63 -110 96 -32 -82 35 -59 24 69 -3 -108
5270 -108 -43 111 78 -138 -111 3 11 34 -44 54 -114 65 134 -197 -16 -155 -56 45 26 89 144 55 -4 106 -96
5295 -96 -121 35 76 7 -92 96 116 -35 -2 -81 -27 21 0 33 -45 -82 88 -20 10 75 -168 60 18 -8 212 6
5321 6 -86 67 96 -16 -140 67 33 -64 23 5 -106 -148 19 -2 -39 -12 -102 38 -11 57 4 -13 -68 55 33 -125
5347 -125 35 100 -49 16 14 16 108 57 -51 -11 -95 -160 -46 87 -68 70 21 85 -25 26 0 -75 -110 -47 -15 1 -77
5374 -77 -43 89 -105 -8 -21 -36 -51 -52 6 -42 -78 87 116 54 -64 130 -13 -82 -57 73 -148 -90 133 46 30 -107
5400 -107 -34 -60 -97 89 3 99 0 -31 -13 -78 -46 102 -19 -56 -112 54 -55 -45 2 -2 -93 -127 -111 22 -13 -64 116
5427 116 0 -6 -19 99 87 39 90 -52 141 13 -10 -16 65 72 -55 12 -4 -127 64 109 -79 76 18 -12 -76 -16
5453 -16 69 -48 -43 14 -68 -105 -23 -56 -70 -4 9 -57 -49 -83 -53 -82 32 58 36 -71 -47 78 39 -2 -43 58 -33 -104 -42
5482 -42 125 7 8 -37 -113 -21 38 -21 -51 50 -41 51 -132 -51 111 -46 -4 -86 6 -18 -222 -40 -91 -6 -18 121
5508 121 -152 -11 31 -77 20 -167 90 97 -149 125 91 -24 31 -20 -71 -52 -110 -38 -16 53 38 -36 55 -22 -41 34
5534 34 44 -8 109 -22 -69 -199 -56 65 -111 13 -50 74 50 -29 75 11 68 -19 -85 6 55 78 -71 21 -31
5559 -31 2 -75 -115 101 149 -17 -17 65 29 -54 -120 111 -8 162 61 64 -89 -72 -126 -54 20 -18 21 142 91 43 -43
5586 -43 -30 -75 -20 -27 56 -111 85 42 -185 -3 5 -63 -35 -71 -55 -113 33 169 1 -17 -55 78 -152 55 114 63
5612 63 72 14 105 109 3 -44 16 -51 -31 64 -140 -5 -54 -28 65 -146 57 35 11 -3 -66 -45 110 -49 15 -49 68
5639 68 114 32 121 2 51 32 -26 -39 12 104 16 144 -11 58 -83 -181 4 -1 -13 45 -69 -98 73 234 -12 62
5665 62 4 -72 -17 -83 31 -127 -119 -37 30 26 -97 31 200 -49 -49 -5 99 -79 -73 113 -35 40 30 64 30 -4 202
5692 202 -2 52 -35 45 26 62 -104 -176 -12 -161 -7 33 -75 21 61 28 -42 -155 110 -66 44 11 -30 -38 -29 54
5718 54 70 -37 3 49 29 42 71 -8 -107 -19 95 -101 70 -46 -53 18 -31 -82 19 62 -82 -60 -36 17 52 62 51
5745 51 -15 -110 112 -44 18 5 38 17 -97 56 -51 -116 105 155 1 42 39 20 44 -32 142 -82 -29 54 -113 122
5771 122 -7 82 3 -15 62 26 72 -4 119 17 67 35 35 -48 -178 125 33 -75 -23 61 -20 48 -59 71 -4 -15
5797 -15 5 -30 45 -54 57 -35 10 1 115 174 -98 73 -10 127 27 133 -111 -45 -38 -65 -2 23 -71 -66 -31 59 -35 10
5825 10 5 132 -21 3 -87 -16 58 30 -9 -17 122 23 60 -1 -11 -26 112 -36 43 -65 18 97 16 -100 -4 -12 79 -42
5853 -42 -27 20 -43 -77 -78 42 -40 68 -13 75 -30 24 89 -52 -96 54 14 -126 4 -57 -20 -5 -18 1 1 -8 -37 15
5881 15 52 -39 64 118 34 -40 -67 -18 39 -11 -6 -7 -116 18 9 -2 -28 65 78 -70 -63 -35 -48 -16 104 -6 -118 49
5909 49 -42 68 23 -15 39 -38 -39 39 -17 68 -65 -100 19 -58 10 12 40 -14 -3 104 -50 -14 67 -6 -24 -113 19 -55
5937 -55 91 -70 -42 45 -10 -23 18 77 -9 120 79 2 4 56 66 -22 -9 -70 55 -25 -8 38 -80 -131 17 -41 -28 8
5965 8 7 53 -61 -71 -13 121 41 43 106 -96 34 17 15 28 86 -14 -71 -14 -37 -84 -54 -30 -8 54 -97 11 -50 13 -27
5994 -27 55 76 19 -43 13 207 84 90 17 -112 -64 -62 50 -71 -34 29 30 14 13 45 -92 -28 -31 93 -110 -12 -6 27 109
6023 109 -15 25 -69 -15 -43 148 115 18 28 64 -55 -48 -4 -48 -40 130 83 -57 -118 32 -122 -3 30 -14 12 -69 44
6050 44 12 8 -76 -70 -90 2 -10 -73 49 4 73 14 39 -85 -86 -25 67 -73 124 1 154 85 5 51 15 106 -80 -134
6078 -134 49 154 80 -49 -128 -34 119 28 -72 25 17 -24 -123 -37 -112 74 40 71 -32 106 -33 -8 7 128 128 46
6104 46 43 44 -120 53 -34 -58 -22 -31 -21 -3 -158 -28 84 68 -30 1 -68 -65 67 -25 104 -3 -34 -67 -30 -28 -67 19 -65
6133 -65 27 -51 25 45 46 -79 -116 -80 43 30 -16 33 -42 -149 67 54 59 -53 -114 105 37 56 12 59 -35 51 -84 36
6161 36 9 -76 -49 -69 -81 -39 95 -98 -7 -16 82 -10 3 87 66 -136 78 157 -68 -35 -22 -12 -9 -25 -76 -137 -88 51
6189 51 -120 -21 -12 -11 50 -44 122 -38 61 7 6 15 37 -194 -49 138 9 -24 17 -23 -42 -140 109 35 -120 -72 -35 51
6217 51 -50 -36 25 -79 -17 -93 43 15 -44 -115 59 -56 38 -30 -125 36 -41 38 56 21 -68 88 -80 47 87 26
6243 26 -90 98 66 36 100 -22 153 -75 34 17 69 -74 -3 -32 -77 -151 57 15 43 65 -46 -73 6 -37 -92 28
6269 28 35 52 167 145 -29 -111 39 58 72 -22 -21 -40 74 -73 -22 12 109 27 -8 5 -17 91 -55 -62 -2 122 -48
6296 -48 -33 9 11 -67 -50 33 87 21 112 -15 10 38 34 14 -11 -36 20 -74 -31 10 -26 66 0 34 -104 14 -2 110 -17
6325 -17 -34 35 103 3 43 48 3 41 -11 69 -11 62 137 54 33 12 74 -54 39 -57 -24 -18 -73 83 188 -88 31 11
6353 11 16 -86 -35 6 -23 55 98 32 -18 56 13 38 21 166 113 60 -53 127 139 -48 -49 174 -136 -12 102 8 5
6380 5 -46 -32 53 51 50 44 -102 107 12 -49 -53 64 -32 77 72 1 -60 -7 -34 -25 -9 132 -88 -30 52 -6 -101 -64 7 12 -58
6411 -58 -49 -2 22 12 70 88 10 89 -40 -41 117 47 164 57 -9 48 -74 -128 14 -43 -115 -104 -47 -14 -107 -88 -20 -16 14
6440 14 23 -61 -1 58 -23 153 -5 95 64 6 35 35 -97 117 -33 93 -80 -86 138 28 30 95 213 -25 -2 107
6466 107 113 -87 4 46 -18 153 128 37 -21 -47 -26 115 -40 1 -72 -126 13 37 124 -40 111 25 6 48 32 -36 -46
6493 -46 84 29 27 10 -201 -118 -40 -79 -51 -34 67 15 -136 -73 111 -93 44 53 -104 -57 16 -43 32 -17 -2 -64 -30
6520 -30 -64 -48 27 19 -50 -15 90 -26 -15 61 38 106 -20 -3 -58 30 -44 -63 -100 121 -20 10 10 19 -24 -37 52 -106 125
6549 125 -12 21 103 6 18 -62 -30 -47 26 39 -46 -17 -39 106 117 -12 -56 51 -46 44 35 126 -138 112 119 69 17 -51
6577 -51 -25 13 12 15 -35 -89 31 -59 112 32 24 25 -103 147 -76 -11 -37 77 -12 13 89 4 217 -43 -55 32 -42 -166
6605 -166 -78 173 -16 -62 46 22 24 -1 -40 -91 -192 -12 -98 -111 23 -11 -24 -93 47 -107 113 -85 -44 106 -17
6630 -17 -56 -125 -41 -40 -43 131 56 -102 30 19 -50 83 16 12 -18 -138 -37 59 -106 -128 -77 109 70 -10 29 -13 -111 109
6658 109 30 128 15 23 23 139 3 -33 -80 70 -165 -4 -82 -105 -26 -154 27 43 63 78 92 44 -15 -94 94 -139
6684 -139 8 84 117 18 -44 109 -40 -2 -27 1 50 3 -61 -96 -107 136 -52 -115 87 108 82 -88 -8 -38 -32 19 -25
6711 -25 74 -102 -4 -72 -36 -86 15 -79 -73 95 -20 -62 4 -138 18 -38 132 51 125 12 153 38 178 -72 12
6736 12 35 32 65 -79 -13 -31 127 166 71 41 -14 56 -2 2 54 23 -19 34 22 -50 18 90 -27 43 33 -3 -61 136 -27
6765 -27 123 70 33 -23 -70 48 59 107 239 36 6 34 -30 -61 -13 -32 -8 79 -26 -20 39 -111 86 -6 -152 24
6791 24 16 -2 -61 -45 -22 -86 51 54 7 -26 -22 94 5 99 -145 18 -102 -54 71 10 -18 18 82 83 -55 -63 -62 -57 -95 7
6821 7 139 116 127 -16 11 103 21 -114 -27 -105 2 30 5 -158 3 -130 74 -90 118 9 -76 15 40 -37 60
6846 60 102 -20 -23 91 -22 9 84 -65 38 35 -55 72 -52 -31 9 -63 -71 -7 -69 -197 -95 -96 96 58 44 -79 -82
6873 -82 -32 -135 -36 -14 146 150 -240 -36 -128 17 -109 -15 102 -53 23 -18 -49 -49 133 60 184 164 19 41 104 7
6899 7 90 6 61 -7 -71 -76 -7 2 6 -109 187 -103 -106 24 88 -47 -32 88 -214 -12 -6 36 87 147 32 65 79 -24
6927 -24 55 53 73 146 -66 67 -35 -156 -31 18 86 6 18 -35 -96 101 -36 -13 -91 59 -13 100 -95 -133 -90 63
6953 63 -12 45 98 7 91 118 -51 0 76 25 -65 56 58 52 -45 -67 -30 -45 -5 -32 32 -43 50 -143 -108 77 -11 184 115
6982 115 82 -92 -98 6 102 34 -55 -123 -161 11 0 81 -107 85 23 35 120 -19 15 -98 -50 28 -13 95 -51 -44
7008 -44 -76 112 -3 -56 -40 76 31 -10 17 3 4 3 69 -14 47 59 2 21 99 -90 -22 44 93 -55 136 -36 -2 -92
7036 -92 1 20 81 -45 28 -91 81 -57 -92 -63 -1 55 -139 146 -110 84 -99 122 55 68 29 12 -66 -23 53
7061 53 125 -6 45 8 14 21 -14 -9 -41 15 87 49 -172 -13 -37 18 -45 39 -61 -25 107 -71 -20 -94 30 196 -79
7088 -79 83 -136 120 -70 60 123 169 32 1 48 115 -11 -12 -56 -41 -2 -206 -125 -83 -62 -91 47 -42 56 5 119
7114 119 -2 -15 -58 -106 -136 33 8 -117 61 -31 -27 61 57 125 19 -45 -74 48 -73 -52 66 12 -8 -87 56 -58
7140 -58 8 153 6 78 31 139 -29 70 -17 97 -125 -50 34 28 32 -48 159 6 25 -51 55 -40 2 26 -119 -47
7166 -47 -16 62 7 -158 -27 -14 56 -57 -43 14 113 88 54 -123 -31 -50 30 98 -71 108 -42 -58 -61 -74 -25 -11 -25
7193 -25 -19 -67 -157 -58 15 -134 -91 -180 -89 76 29 -64 -79 30 67 22 -27 -51 -82 119 46 -9 163 118 6 160 55
7220 55 -36 -99 54 -35 21 16 12 -29 -109 -42 75 102 137 39 -33 -83 60 -60 112 -20 -67 -34 -55 -7 -9 50 -53 122
7248 122 21 53 45 -15 48 74 55 97 -87 -61 -87 24 58 23 16 95 64 -18 66 57 24 14 -71 50 -105 -17 -135 92
7276 92 -34 32 18 -18 31 90 99 -100 13 -48 -76 33 163 8 104 -1 63 -11 -37 48 36 -97 46 -45 19 -66
7302 -66 -64 -91 25 -63 8 24 95 -79 91 -13 -13 45 129 -154 -41 98 -60 22 -19 -17 50 -8 16 -8 -43 8 90 11
7330 11 64 -38 27 57 7 -142 -30 5 67 -39 26 63 1 -13 -54 42 -36 24 76 105 -127 20 47 7 -56 24 29 -21
7358 -21 24 -56 -52 34 99 -14 -12 57 121 50 -113 -48 50 91 27 166 114 -154 -20 49 -14 -36 -76 -98 78 -11 6 -41
7386 -41 -31 121 84 -40 82 -6 26 -71 16 -54 30 -42 43 10 -2 4 -151 55 -28 -53 25 -62 61 -98 67 11 -89
7413 -89 -65 90 -68 -20 56 -40 48 -113 -8 -30 -35 15 64 66 35 108 1 31 -60 -3 -15 -43 116 -100 58 23 -61
7440 -61 92 -38 47 -102 24 -20 5 74 28 -37 -32 43 -103 -137 -24 75 114 -62 81 30 6 -43 -50 48 22 -19 61
7467 61 37 -70 126 197 -66 8 -87 -41 60 -60 37 -56 -31 20 -30 80 -64 122 -30 -99 -66 67 -15 -55 -75
7492 -75 -35 36 -40 -176 -104 -2 23 -22 -1 -35 -111 31 -7 -10 65 28 70 112 15 -112 -83 11 -16 -46 -10 126 -126 48
7520 48 -14 141 -76 15 66 185 -63 -83 24 85 -41 0 2 -123 -24 53 -132 89 85 -56 74 66 -111 -98 60
7545 60 -29 -41 -39 -21 -71 -78 -6 6 -41 9 16 16 -15 101 0 87 79 60 25 55 13 12 40 -20 -32 100 -31 -194 50 51 -96
7576 -96 -44 -35 -18 7 44 101 36 -24 89 -19 30 48 78 -43 -35 -12 -12 23 81 22 -149 -126 72 60 -30 -41 50 -48 -85
7605 -85 -20 -62 -113 -149 16 54 45 -101 7 -110 -16 -32 47 3 -33 2 12 -51 -71 -98 -17 186 -54 -156 58 -19 41
7632 41 40 16 119 -96 -123 44 59 -4 154 190 -142 183 -7 53 14 8 36 -38 -40 -33 36 108 21 -17 -48 24 -10 142
7660 142 -43 -11 91 -26 2 -21 53 113 -8 35 -126 102 11 -66 -35 78 14 -61 -48 17 -47 -52 -66 7 7 -183 144
7687 144 -74 -87 52 63 -22 -1 -92 -41 171 -39 -19 -50 34 20 138 25 -12 124 -66 -146 -94 -44 18 -39 -60 88
7713 88 15 -7 -71 54 -57 63 -38 -41 158 82 -90 -35 -33 -130 -14 -110 110 -59 23 -59 -5 -47 118 85 -3 64
7739 64 25 46 -106 -42 64 102 16 79 -2 5 -22 21 -93 -11 61 9 84 15 -75 -12 -11 -125 -30 20 -25 -18 -101 -33 -28 -5
7769 -5 -191 -30 9 -68 -118 48 -22 -88 -29 -24 56 -24 -44 87 71 -53 1 43 75 -52 2 -96 -64 -37 -82 14 65 37
7797 37 -54 -69 -88 -121 -11 -67 4 64 75 -23 38 -41 9 -15 102 -31 -118 70 1 57 -25 143 40 -56 45 12 -23
7824 -23 95 10 -26 30 -5 -63 52 1 30 -101 55 69 38 -49 5 -6 -5 30 -10 -13 -33 41 82 -85 92 11 17 -15 -15
7853 -15 -13 -46 9 21 -3 -71 -62 25 2 37 -92 39 -61 4 59 -60 -19 -40 90 -40 11 -117 27 -85 22 -87
7879 -87 -4 105 -54 -18 0 67 -63 6 53 24 73 41 101 80 -58 24 69 120 -57 -96 18 19 47 56 -69 -85 -131 -109
7907 -109 68 -94 81 -32 28 90 3 -11 5 14 29 -42 -7 106 -50 -44 -36 14 66 -10 -10 -18 40 22 -68 -84 59 -8 -7
7936 -7 87 -42 -17 -39 -12 109 -59 27 -47 17 122 -2 -104 -21 -27 132 73 -14 42 17 -6 15 130 -6 20 1 -71
7963 -71 -70 -45 -96 59 20 25 -6 36 -16 147 -16 -23 -2 12 -66 -13 29 -126 -127 -9 68 -36 83 158 88 -3 77 83 20
7992 20 13 -7 72 -30 -81 34 62 96 40 30 79 102 -12 -51 -76 -136 36 -104 3 53 -75 112 -31 3 -57 21
8018 21 -45 -27 80 -50 118 90 -42 -23 -75 -44 100 2 -53 -35 -44 51 -34 107 10 -38 50 -14 -15 94 92 108 93 -36
8046 -36 15 -86 -47 -19 83 -17 87 -64 30 -202 -70 -46 -33 13 102 -53 -104 -113 5 -31 -36 -132 -107 21 -109 114
8072 114 -43 -83 -47 -26 -27 -80 -32 -52 -94 2 -84 51 6 -39 -47 152 140 0 -84 54 17 -69 88 -107 -29 -101 18
8099 18 -26 -91 -105 26 43 26 90 7 -25 -60 64 66 26 12 -3 -2 61 -67 32 0 163 48 36 35 47 -100 -5 52 35
8128 35 -28 45 132 -102 67 -19 21 -122 122 -49 -126 38 50 33 40 45 96 6 -22 104 -62 10 59 123 70 105 9
8155 9 76 38 -31 107 -34 -57 18 28 105 80 -99 -10 73 -11 29 -73 -63 -97 97 39 -86 -94 51 61 11 29 -42 -1
8183 -1 114 -30 -43 9 -55 -66 131 -72
8191g2
##END NTUPLES=NMR FID
##END=
