##TITLE=1H_MTBDE0807-28
 CDCl3, 8 sc, 
 9.07.2021
##JCAMPDX= 6.0         $$ Bruker NMR JCAMP-DX V2.0
##DATA TYPE= NMR FID
##DATA CLASS= NTUPLES
##ORIGIN= UXNMR, Bruker Analytische Messtechnik GmbH
##OWNER= root
$$ XWIN-NMR		Version 3.5
$$ Fri Jul  9 09:00:35 2021 Russian Standard Time (UT+4h)  she@DPX200
##.OBSERVE FREQUENCY= 200.131506
##.OBSERVE NUCLEUS= ^1H
##.DELAY= (6, 6)
##.ACQUISITION MODE= SIMULTANEOUS
##.ACQUISITION SCHEME= undefined
##.AVERAGES= 8
##.DIGITISER RES= 18
##SPECTROMETER/DATA SYSTEM= spect
##.PULSE SEQUENCE= zg30
##.SOLVENT NAME= CDCl3
##.SHIFT REFERENCE= (INTERNAL, CDCl3, 0, 15.7039)
##AUDIT TRAIL= $$ (NUMBER, WHEN, WHO, WHERE, WHAT)
$$ ##TITLE= Audit trail, XWIN-NMR		Version 3.5
$$ ##JCAMPDX= 5.01
$$ ##ORIGIN= Bruker BioSpin GmbH
$$ ##OWNER= she
$$ F:/spectra/data/she/nmr/H-F/1/audita.txt
$$ ##AUDIT TRAIL=  $$ (NUMBER, WHEN, WHO, WHERE, WHAT)
(   1,<2021-07-09 08:58:55.03 +0400>,<she>,<DPX200>,
      <created by zg, POWCHK disabled, PULCHK disabled
       configuration hash MD5:
       00 E9 B6 7A A2 85 ED C7 34 08 36 98 17 FE 4E 26
       data hash MD5: 16K
       FD A7 15 80 3B 10 92 66 E0 36 BC 66 63 2B 6F 7D>)
$$ ##END=
$$ 
$$ hash MD5
$$ 4D 3F 3D DB D3 35 21 98 68 71 74 0D 6A 4F 8C 7C
##$RELAX= 
##$RELAX= 
##$RELAX= 
##$RELAX= 
##$RELAX= 
##$RELAX= 
$$ Bruker specific parameters
$$ --------------------------
##$DU= <F:/spectra>
##$EXPNO= 1
##$NAME= <H-F>
##$PROCNO= 1
##$TYPE= <nmr>
##$USER= <she>
##$AMP= (0..31)
100 100 100 100 100 100 100 100 100 100 100 100 100 100 100 100 100 100 
100 100 100 100 100 100 100 100 100 100 100 100 100 100 
##$AQSEQ= 0
##$AQ_mod= 1
##$AUNM= <au_zg>
##$AUTOPOS= <>
##$BF1= 200.13
##$BF2= 200.13
##$BF3= 200.13
##$BF4= 200.13
##$BF5= 200.13
##$BF6= 200.13
##$BF7= 200.13
##$BF8= 200.13
##$BYTORDA= 1
##$CFDGTYP= 0
##$CFRGTYP= 5
##$CHEMSTR= <none>
##$CNST= (0..31)
1 1 145 1 1 1 1 1 1 1 1 1 1 1 1 1 1 1 1 1 1 1 1 1 1 1 1 1 1 1 1 1 
##$CPDPRG= <>
##$CPDPRG1= <>
##$CPDPRG2= <>
##$CPDPRG3= <>
##$CPDPRG4= <mlev>
##$CPDPRG5= <mlev>
##$CPDPRG6= <mlev>
##$CPDPRG7= <mlev>
##$CPDPRG8= <mlev>
##$CPDPRGB= <>
##$CPDPRGT= <>
##$D= (0..31)
0 1.2 0 0 0 0 0 0 0 0.06 0 0.03 0 0 0 0 0.0002 0 0 0 0 0 0 0 0 0 0 0 0 
0 0 0 
##$DATE= 1625806734
##$DBL= (0..7)
120 120 120 120 120 120 120 120 
##$DBP= (0..7)
150 150 150 150 150 150 150 150 
##$DBP07= 0
##$DBPNAM0= <>
##$DBPNAM1= <>
##$DBPNAM2= <>
##$DBPNAM3= <>
##$DBPNAM4= <>
##$DBPNAM5= <>
##$DBPNAM6= <>
##$DBPNAM7= <>
##$DBPOAL= (0..7)
0.5 0.5 0.5 0.5 0.5 0.5 0.5 0.5 
##$DBPOFFS= (0..7)
0 0 0 0 0 0 0 0 
##$DE= 6
##$DECBNUC= <off>
##$DECIM= 32
##$DECNUC= <off>
##$DECSTAT= 4
##$DIGMOD= 1
##$DIGTYP= 9
##$DL= (0..7)
0 120 120 120 120 120 120 120 
##$DP= (0..7)
150 150 150 150 150 150 150 150 
##$DP07= 0
##$DPNAME0= <>
##$DPNAME1= <>
##$DPNAME2= <>
##$DPNAME3= <>
##$DPNAME4= <>
##$DPNAME5= <>
##$DPNAME6= <>
##$DPNAME7= <>
##$DPOAL= (0..7)
0.5 0.5 0.5 0.5 0.5 0.5 0.5 0.5 
##$DPOFFS= (0..7)
0 0 0 0 0 0 0 0 
##$DQDMODE= 0
##$DR= 18
##$DS= 0
##$DSLIST= <SSSSSSSSSSSSSSS>
$$ [...]
##$SUBNAM2= <"">
##$SUBNAM3= <"">
##$SUBNAM4= <"">
##$SUBNAM5= <"">
##$SUBNAM6= <"">
##$SUBNAM7= <"">
##$SUBNAM8= <"">
##$SUBNAM9= <"">
##$SW= 20.0188882624521
##$SWIBOX= (0..15)
0 0 2 0 0 0 0 0 0 0 0 0 0 0 0 0 
##$SW_h= 4006.41025641026
##$TD= 16384
##$TD0= 1
##$TE= 0
##$TE2= 300
##$TE3= 300
##$TEG= 300
##$TL= (0..7)
0 120 120 120 120 120 120 120 
##$TP= (0..7)
150 150 150 150 150 150 150 150 
##$TP07= 0
##$TPNAME0= <>
##$TPNAME1= <>
##$TPNAME2= <>
##$TPNAME3= <>
##$TPNAME4= <>
##$TPNAME5= <>
##$TPNAME6= <>
##$TPNAME7= <>
##$TPOAL= (0..7)
0.5 0.5 0.5 0.5 0.5 0.5 0.5 0.5 
##$TPOFFS= (0..7)
0 0 0 0 0 0 0 0 
##$TUNHIN= 0
##$TUNHOUT= 0
##$TUNXOUT= 0
##$USERA1= <user>
##$USERA2= <user>
##$USERA3= <user>
##$USERA4= <user>
##$USERA5= <user>
##$V9= 5
##$VALIST= <valist>
##$VCLIST= <CCCCCCCCCCCCCCC>
##$VD= 0
##$VDLIST= <DDDDDDDDDDDDDDD>
##$VPLIST= <PPPPPPPPPPPPPPP>
##$VTLIST= <TTTTTTTTTTTTTTT>
##$WBST= 1024
##$WBSW= 4
##$XGAIN= (0..3)
0 0 0 0 
##$XL= 0
##$YL= 0
##$YMAX_a= 131757
##$YMIN_a= -173975
##$ZGOPTNS= <>
##$ZL1= 120
##$ZL2= 120
##$ZL3= 120
##$ZL4= 120
##$ABSF1= 10
##$ABSF2= 0
##$ABSG= 5
##$ABSL= 3
##$ALPHA= 0
##$AQORDER= 0
##$ASSFAC= 0
##$ASSFACI= 0
##$ASSFACX= 0
##$ASSWID= 0
##$AUNMP= <proc_1d>
##$AZFE= 0.1
##$AZFW= 0.1
##$BCFW= 1
##$BC_mod= 2
##$BYTORDP= 1
##$COROFFS= 0
##$CY= 11.3945322036743
##$DATMOD= 1
##$DC= 2
##$DFILT= <>
##$DTYPP= 0
##$F1P= 17.5019972093344
##$F2P= -2.517084195857
##$FCOR= 0.5
##$FTSIZE= 0
##$FT_mod= 4
##$GAMMA= 1
##$GB= 0.15
##$INTBC= 1
##$INTSCL= 1
##$ISEN= 128
##$LB= 0.24
##$LEV0= 0
##$LPBIN= 0
##$MAXI= 10000
##$MC2= 0
##$MEAN= 0
##$ME_mod= 0
##$MI= 1.114404
##$NCOEF= 0
##$NC_proc= 0
##$NLEV= 6
##$NOISF1= 3.799351
##$NOISF2= 2.8
##$NSP= 1
##$NTH_PI= 0
##$NZP= 0
##$OFFSET= 15.70392
##$PC= 1
##$PHC0= -12281.78
##$PHC1= 23.00101
##$PH_mod= 1
##$PKNL= yes
##$PPARMOD= 0
##$PSCAL= 0
##$PSIGN= 0
##$REVERSE= no
##$SF= 200.130013532006
##$SI= 16384
##$SIGF1= 3
##$SIGF2= 2
##$SINO= 400
##$SIOLD= 16384
##$SREGLST= <1H.CDCl3>
##$SSB= 0
##$STSI= 0
##$STSR= 0
##$SW_p= 3612.71676300578
##$SYMM= 0
##$S_DEV= 0
##$TDeff= 0
##$TDoff= 0
##$TI= <>
##$TILT= no
##$TM1= 0
##$TM2= 0
##$TOPLEV= 0
##$USERP1= <user>
##$USERP2= <user>
##$USERP3= <user>
##$USERP4= <user>
##$USERP5= <user>
##$WDW= 1
##$XDIM= 8192
##$YMAX_p= 0
##$YMIN_p= 0
$$ End of Bruker specific parameters
$$ ---------------------------------
##NTUPLES= NMR FID
##VAR_NAME=  TIME,          FID/REAL,        FID/IMAG
##SYMBOL=    X,             R,               I
##VAR_TYPE=  INDEPENDENT,   DEPENDENT,       DEPENDENT
##VAR_FORM=  AFFN,          ASDF,            ASDF
##VAR_DIM=   8192,          8192,            8192
##UNITS=     SECONDS,       ARBITRARY UNITS, ARBITRARY UNITS
##FACTOR=    0.0002496,     1,               1
##FIRST=     0,             0,               0
##LAST=      2.0444736,     0,               0
##MIN=       0,             -173975,         0
##MAX=       2.0444736,     131757,          0
$$ Real data points
##PAGE= N=1
##DATA TABLE= (X++(R..R)), XYDATA
$$ [...]
2101h97Q89R86j653L6J843j162j183J810p5j597J092Q37j471P4J384r66p40J509
$$ -897 -8 978 -675 -639 1204 42 -1141 669 594 -1003 89 926 -545 -471 913 -53 -793 716
2119G16k17j495J283N38j674M15J416j122o26J524l47j391J304L76j337N10J194
$$ 716 499 -996 287 825 -849 -434 982 -140 -766 758 411 -980 324 700 -637 -127 1067
2136A067j455k59J556q08j109J520K02j514O11J366j621k60J622q00j088J394
$$ 1067 -388 -647 909 101 -1008 512 714 -800 -189 1177 -444 -704 918 118 -970 424
2152D24J67j316O70P50j134lJ257r23o20J397l56j319J203N88j635M35J214j008
$$ 424 591 -725 -55 695 -439 -442 815 -108 -728 669 313 -1006 197 785 -850 -415 799 -209
2170b09p04J558l19j259J132N13j393M80J103j279l95J450l66j244J300K45j282
$$ -209 -913 645 326 -933 199 712 -681 -201 902 -377 -772 678 312 -932 368 613 -669
2187f69M98J092j275l70J389n98q19R90J71j147N76Q89j214J13J036p26o80J321
$$ -669 -171 921 -354 -724 665 67 -752 238 409 -738 -162 727 -487 -374 662 -64 -744 577
2205E77q4j214P79P70j361J47J191p81p49J270j65j117R95N69j287K77R44j026
$$ 577 493 -721 58 828 -533 -386 805 24 -725 545 380 -737 258 827 -460 -183 761 -265
2223b65l59J158j92j148R30O82j342L27J024r46l92J167m82p41Q79K74j186M54
$$ -265 -624 534 342 -806 124 806 -536 -209 815 -131 -523 644 162 -579 300 574 -612 -158
2241a58R73j109k87J286o69p54J147N7j200P08O60j165OJ062n21o86R81J02j049
$$ -158 815 -294 -581 705 36 -718 429 486 -714 -6 654 -511 -505 557 36 -650 331 433 -616
2260f16O94M64j057J76Q68o78m56J158k61r81P63N45j112J54J071q22n55J093
$$ -616 78 542 -515 -339 529 -149 -605 553 292 -689 74 619 -493 -339 732 -90 -645 448
2278D48k11q89R05K02j170O05P00p37l75J085k71j045R63L14j112M41P75q74n1
$$ 448 237 -652 253 455 -715 -110 590 -147 -522 563 292 -753 210 524 -588 -147 628 -246 -297
2297b97Q53m51o90P96O1r60O42P25j136R7R80n35p41J163l0j068N47P37r17j62
$$ -297 556 105 -585 211 272 -688 -46 679 -457 -360 620 85 -656 507 477 -591 -44 693 -224 -386
2317c86J047o91m37P83m1p22O11K49q24L69N07o34l49J127m36p68R12K53j086
$$ -386 661 -30 -467 316 275 -447 164 413 -411 -42 465 -169 -518 609 173 -595 317 570 -516
2336e16L30R11r33l82J144k85r46Q31K19q20K16Q13p54l15R52l45o61P51Q9p30
$$ -516 -186 725 -208 -590 554 269 -677 154 373 -447 -231 582 -172 -487 465 120 -541 210 299 -431
2356d31L78M66p82K7P23m01l19O02Kq47P48L83q78L4Q71o74n04P77J14r06N82
$$ -431 -53 413 -369 -342 381 -20 -339 263 265 -582 166 549 -329 -295 576 -98 -602 175 289 -617 -35
2377c5N11o85k30P35k81l52M80m2n07N43J05o62M07M22o74j94R97j98q63O45L68
$$ -35 476 -209 -439 296 15 -337 143 101 -406 137 242 -420 -13 409 -265 -459 538 340 -523 122 490
2398D90r26K28Q39o64l13P13j24p91P31L32r36K70N81o94p7P69l13l99M28J18
$$ 490 -436 -208 631 -33 -346 367 243 -548 183 515 -421 -151 430 -264 -341 428 115 -284 144 262
2418B62o50M07L60p85J14R09o75n01R01K1r72N63O32j009o6J043m46n43O28K01
$$ 262 -388 19 379 -406 -292 617 -58 -559 342 363 -609 -46 586 -423 -489 554 108 -435 193 394
2438C94q23K96N84o00l8M05n00R0N00l35m14N80K17p02K90M95p46n6R72n72q09
$$ 394 -429 -133 451 -149 -187 218 -282 -192 308 -27 -441 139 356 -346 -56 439 -307 -363 609 37 -772
2459g72J051J69r72M00N76o35k73Q19k97m62N95L5n69L53M11o24P5M95m87k26
$$ -772 279 448 -524 -124 452 -183 -456 363 66 -396 199 234 -335 18 429 -195 -120 375 -112 -338
2479c38P98l81m44N15K19o13N3P21o15m95J103j81q41P07L02q82L6Q68o74k51
$$ -338 460 79 -365 150 369 -244 -191 530 -85 -580 523 342 -499 208 510 -372 -336 532 -142 -393
2499c93O50J44p70L35L19n66K43M80o93J15M62l20m09P80j44o42M26N60q01j00
$$ -393 257 401 -369 -34 285 -281 -38 442 -251 -136 326 6 -403 377 233 -409 17 577 -224 -324
2519c24Q15l93o61P21J39q05M95L59n69l9N43l71l74O28J8o63N27L21n18J8N68
$$ -324 491 98 -563 158 297 -508 -13 346 -223 -262 281 -90 -464 164 182 -481 46 367 -151 -133 435
2540D35m84m20Q62k97n80N82K47q22L73O85p31k66Q83l18p03P39K52q46Q7Q23
$$ 435 -49 -469 393 96 -484 98 345 -477 -104 581 -150 -416 467 149 -554 185 437 -409 -322 501
2560E01n72k86P38k77l87M38Mm06K25L19n73Q9N81l29m84P29l2p64N48N31p69
$$ 501 -71 -357 381 104 -283 155 159 -247 -22 297 -276 -187 394 65 -419 310 278 -486 62 593 -176
2581a76j17Q23m62l82N42J87p27K25O64p71Q2M46l19l39O01n8m94M62J31o48J58
$$ -176 -293 530 68 -314 228 415 -312 -87 577 -194 -112 334 15 -324 277 219 -275 187 318 -330 -172
2602a72O43o41j29O49k83m11O07J11p19K21N72q31J26Q05n45n72P77J03p16J42
$$ -172 471 -170 -299 350 67 -344 263 374 -345 -124 448 -383 -257 548 3 -569 208 311 -405 -263
2622b63O09m61k27O54k37m69N46%n30L74L07p08J26P02n71l29Q12j72p16O45M15
$$ -263 346 -115 -342 312 75 -394 152 152 -378 -4 303 -405 -279 423 -148 -477 335 163 -553 92 507
2643E07q30j8P50m02n49Q95k51n99N88K07n05k9M82m36k6N55k88o05P89N0p27
$$ 507 -323 -341 409 7 -542 353 102 -497 91 298 -207 -236 246 -190 -216 339 51 -554 235 285 -442
2664d42M73M78p27j59Q43k16o30O00j05n60N53M81q16J02O23m13m88O27Q9o47
$$ -442 31 509 -218 -377 466 250 -380 220 115 -445 108 589 -227 -125 498 85 -403 224 313 -334
2684c34L56L26n61J46N56n55m17Q79j57p20N42K83o27J70N79n98l68Q63j00p37
$$ -334 22 348 -213 -67 489 -66 -483 396 239 -481 61 344 -283 -113 466 -132 -500 363 263 -474
2704d74M72N05r20J12O84l35m35O28J5o77N09J40o08K67N94p88K7P14l56n90O30
$$ -474 -2 503 -417 -305 379 44 -391 237 252 -425 84 224 -384 -117 477 -311 -284 430 74 -516 114
2725A14O7p29O83K42n60j9N87l57n29Q38j10q07N78M85p61N7P05n14m22O97o6
$$ 114 181 -548 135 377 -183 -202 385 28 -501 337 227 -580 -2 483 -278 -221 484 -30 -452 245 179
2746A79m90M40J58n42J79N01n07j85N94j59n82N91R2n65K51N68o31k09Q13l14
$$ 179 -311 129 287 -255 -76 425 -82 -267 327 168 -414 177 269 -296 -45 523 -108 -317 496 182
2766A82n52O24J10n57O2N34n30j86O53l68l90P22O2p45M03L80p32m8Q09m33m21
$$ 182 -370 254 364 -193 -131 403 -127 -313 340 -28 -418 304 366 -379 24 404 -328 -376 433 0 -421
2787d21N70J20o98L55M48o38lO10m40k64O50j79n19M54L16p07J08O44m34m61Q31
$$ -421 149 269 -429 -74 374 -264 -267 343 -97 -361 289 110 -409 45 361 -346 -238 406 -28 -489 342
2808C42r6o89N30J57m97M6P12o33k49P53k98n52Q24j32o45K82N95o94k2P16l55
$$ 342 246 -443 87 244 -253 -207 505 -128 -377 376 78 -474 350 218 -427 -145 450 -244 -266 450 95
2829I5n43O17M8p10N63K50n51J9O31m87k23O17k12n28N64K68q43L09O31n52k94
$$ 95 -448 169 217 -493 70 320 -231 -212 419 -68 -291 326 114 -414 150 418 -425 -116 515 -37 -331
2850c31O51Po96M63L25n79o8O22m96k72O45m1o69P46J8o63L80M14o04j26O36k05
$$ -331 320 327 -369 94 419 -160 -228 394 -102 -374 271 230 -439 307 325 -338 42 456 -148 -274 362 157
2872A57n05N48J24p36K63N72n06j54M60j91l99O22j7n64L32M65p30N8N37m15l42
$$ 157 -348 200 324 -412 -149 423 -83 -237 223 32 -367 255 238 -326 6 471 -259 -201 336 -79 -421
2893d21O61q7n98N86J25o50K28N67n04l40Q83l11n99M80L00n70j10P39m06j81
$$ -421 240 153 -445 141 266 -384 -156 411 -93 -433 450 139 -460 20 320 -250 -360 379 -27 -208
2913b08M74k54l86O15L8o60M65M54q18j09P39k75m69N72J45p18L43N33o50p4P59
$$ -208 266 12 -374 241 279 -381 84 538 -280 -389 350 75 -394 178 323 -395 -52 481 -169 -243 516
2934E16m20m35O31O3o78K26M22n38J08M44n13k90O75j17l79M19K18o57L12M19
$$ 516 96 -339 292 355 -323 -97 325 -213 -105 339 -174 -464 211 94 -285 134 352 -305 7 426
2954D26n10j22N70j61o47P24K4p37K82M34m46k33P18j84m42L72K11n76K26L64
$$ 426 -84 -206 364 203 -444 280 304 -433 -151 283 -163 -396 322 138 -304 68 279 -297 -71 293
2974B93l80r9N06m52k66O12j61m50M20M59q18J45N67m81k14N97p9o04L97L53o18
$$ 293 -87 -186 320 -132 -398 214 53 -397 23 482 -336 -191 376 -105 -319 278 199 -405 -8 345 -273
2995b73m8P11l43m11O26j34m28M43N5m17P6N34m22k76O89k28o15O20J90p41K16
$$ -273 -321 390 47 -364 262 128 -300 143 198 -219 -143 391 -31 -307 382 154 -461 159 349 -392 -176
3016a76N11n44L9O59m51l90N19Q4o23L33N41p15k6P18m64m31O43m7n42L36K82
$$ -176 335 -209 -170 489 38 -352 167 251 -372 -39 502 -213 -239 479 15 -416 227 180 -362 -26 256
3037B56m91M2N07m03k11O03k13n36N73K56o70K07O67o18m00Q28k12o11N33K45
$$ 256 -235 -193 314 -89 -300 303 90 -446 127 383 -287 -80 587 -31 -431 397 185 -426 107 352
3057C52q54L40N34n27k18O18k00l80N02K1m98K24L95n73R6N89n00l37O10R4p16
$$ 352 -502 -162 372 -155 -373 245 45 -335 167 188 -310 -86 309 -264 -168 421 -79 -416 194 288 -428
3078d28M32L50n27j04O41m07m29P97n5n86L73L51o24R3M97l64m59Q81l69m76O52
$$ -428 4 354 -173 -277 364 -43 -472 325 270 -316 57 408 -216 -123 374 10 -449 432 63 -413 239
3099B39Kn37K96L06l91j90O76m16l72O40j19n00K86M43o92j8Q22l99l18L31J52
$$ 239 241 -296 0 306 -85 -275 401 -15 -387 253 134 -366 -80 363 -329 -347 475 76 -242 89 241
3120B41n77K35M34o36LN91m01j95O32n9n20L67K68o55K03N80n22n14Q06j01o47
$$ 241 -336 -101 333 -303 -300 291 -110 -305 327 268 -252 115 383 -272 -69 511 -11 -525 281 180 -467
3141d67O21J65o50K81M43m56l19P52k75n35M71L15o19J77L92n12j27N68n3o37
$$ -467 154 319 -331 -50 393 -63 -382 370 95 -440 31 346 -273 -96 296 -216 -343 225 172 -465
3161d65P68j48n96M37M79o69j16Q54o94k09O11j08o30M37M35o30q4P09l52l67
$$ -465 303 155 -441 -4 475 -194 -310 544 -150 -359 252 144 -486 -49 386 -244 -328 381 29 -338
3181c38O64j75l68L86K1m44K08N08p45M0O74k67o48Q01l6o06L23N47q55J65N51
$$ -338 326 151 -217 169 190 -254 -46 462 -283 -243 431 164 -484 317 281 -325 -2 545 -310 -145 406
3202D06l34m43O14Q4p51M38L26m80j64N94k77l66O02K9o68L76L94m94LM74m49
$$ 406 72 -371 243 327 -424 14 340 -140 -304 290 13 -353 249 278 -390 -14 380 -114 -111 363 -86
3223h6l06N99r6m99N31J87p26J92N78l23l65O52p3p48M75M66p04K6N05l89k37
$$ -86 -392 207 111 -388 143 330 -396 -204 374 51 -314 338 265 -483 -8 458 -246 -220 285 -104 -341
3244c41O26j30n28N26J42n11O8M46m84k8O46m51m88O42J34n95L42K57m57q5M21
$$ -341 285 155 -373 153 295 -216 -148 298 -186 -214 432 -19 -507 135 269 -326 16 273 -184 -269 152
3265A52j54k92L99J51n94K96L65n04n6O12n19k03N88q1l88K76L13n67R2O26m31
$$ 152 -2 -294 105 256 -338 -42 323 -181 -237 375 -144 -347 241 160 -228 48 361 -206 -114 512 81
3286H1l43O39k53n25O30K52p41J45M45l60j83N87k21o32O58J39n08J99L99n31
$$ 81 -262 377 124 -401 229 481 -260 -115 330 -30 -213 374 153 -479 179 318 -190 9 408 -123
3306a23Q2L55k97l42O43l2p23L87L17n44Q0P37o07k43M86j09m72M36K45m12J15
$$ -123 -41 314 17 -325 318 286 -437 -50 267 -277 -197 540 -67 -310 176 67 -405 31 276 -136 -21
3327b1L02l56k31N39K3p00N05J23m61J29M51m62o9O10l02m89M67L28q30K50O16
$$ -21 281 -75 -306 233 256 -444 61 184 -277 -148 303 -159 -228 382 80 -409 58 386 -444 -194 422
3348D22o49j4N19k46l45L15K09o98L80M66o38KO40k30n44M64K23m86K81L15o28
$$ 422 -227 -241 278 32 -313 2 211 -487 -107 359 -279 -277 363 133 -411 53 276 -210 71 386 -242
3369b42J50L91k77m01O27j16m49M89J90o12J08N02n60k6N21l75j90M52J25n46
$$ -242 -92 299 22 -379 248 132 -317 172 362 -250 -142 360 -200 -226 295 -80 -270 182 307 -239
3389b39J83N46m99k20O41k41n09O40j71m56M56K05m87j07N22j64m40N01k3m89
$$ -239 -56 490 -9 -229 412 171 -338 302 131 -325 131 336 -151 -258 264 100 -340 161 138 -351
3409c51M10J16l52p2N81m91j46P56j55n78L76J91n94J96N77n25k28M29P0n45L83
$$ -351 59 175 -177 -249 332 -159 -305 451 296 -282 94 285 -309 -113 464 -61 -289 140 210 -335 48
3430D8J52m70J99L33m56n9M38j68j67L19J3m80J60M39n01J6M63k72k97L25J79
$$ 48 200 -270 -71 262 -194 -253 185 17 -150 169 182 -298 -138 301 -200 -184 279 7 -290 35 214
3451B14m90K06L28m51jM55l65j99N78k03m29L24M24n41l5N03m25j14M67%m52M02
$$ 214 -276 -70 258 -193 -194 261 -104 -303 275 72 -357 -33 391 -150 -185 318 -107 -221 246 246 -206 196
3473A96Q7m56N4M70n31k23O02j61m34M80P8n08K67M72o02p2N52k75k37L13J67
$$ 196 283 -173 -119 351 -180 -403 199 38 -396 84 162 -346 -79 393 -209 -281 271 -4 -241 72 239
3494B39m96J94M32o09K5N32l52l01O63k03m77L93L00m74N9L27k90j99M88j71m10
$$ 239 -257 -63 369 -240 -215 317 -35 -336 327 124 -353 40 340 -134 -75 252 -38 -237 251 80 -330
3515c30L04L38n03lM76k66l12O12o4n12M59r6k59o3M27k94k00M82j04n10N70r8
$$ -330 -26 312 -191 -194 282 16 -296 316 252 -260 199 103 -156 -219 208 -86 -286 196 92 -418 152 54
3537E4k90O1L37m44j9O86l52l89N53O5n98K65L79m77j49N77q8m39N10j51l02K93
$$ 54 -236 -175 162 -282 -301 385 33 -356 197 262 -336 -71 308 -169 -318 259 171 -268 242 91 -211 82
3559H2L03n55l7O06l27l71N98J0m91K13K54m57L3L49l31r0N05j85l66L01L15o11
$$ 82 385 -170 -207 399 72 -299 299 309 -182 31 285 -172 -139 210 -121 -211 294 109 -257 44 359 -252
3581b52K02M80o43K3N31k41l97M25N4l56j4M88m23j0L44m05L2L62l8n57M01L30
$$ -252 -50 430 -213 -190 341 100 -297 128 182 -174 -188 300 -123 -133 211 -194 -162 200 162 -395 6 336
3603C36n80K13K39k52k45M77K6m98M24K6l33L0N34m68r9L77j15l64L01K68n09
$$ 336 -244 -31 208 -44 -289 188 214 -284 140 166 -167 -137 397 -71 -170 207 92 -272 29 297 -212
3624b12P8L27l15k36O16Ln14L38K07m16N3L76m50n7L64j16l52N15J13n65K33L20
$$ -212 -134 193 -122 -358 258 261 -253 85 292 -124 -71 305 -145 -202 162 46 -306 209 322 -243 -10 310
3646C10n48J07M44k20l51L84J00m05J78K08k99k0M01l37l29P08k11l49L18K19
$$ 310 -238 -131 313 93 -258 126 226 -179 -1 207 -92 -112 289 -48 -377 331 120 -229 89 308
3666C08o14K58M96m38k42M39J3m58L55J54m63J54L28l02k43N56k11k21L84j91
$$ 308 -306 -48 448 10 -232 207 220 -238 117 271 -192 -38 290 -12 -255 301 90 -131 253 62
3686F2k57K67J67m96M1M64j95k13K40J13l58K03K88n71o5O26l24l10M30Q0l78
$$ 62 -195 72 239 -257 -216 248 53 -160 80 193 -165 38 326 -245 -310 316 -8 -318 112 192 -186
3707a86J48K98m32q0L72j12k06K93o2k28L46J9m61K43K45m20j07P76l74n41N87
$$ -186 -38 260 -172 -252 120 8 -198 95 33 -195 151 170 -291 -48 197 -223 -330 446 72 -469 118
3728A18J97o50K99K80m34J5M16j46l08L37N9m26M02N6j91k21M36k26k08K84J7
$$ 118 315 -335 -36 244 -190 -175 241 95 -213 124 183 -243 159 215 24 -197 239 13 -195 89 106
3749A06l67K69K86m00j15N04l26j46M17o4m50M18J53m27j8N41l18k20L40j55k11
$$ 106 -261 8 294 -106 -221 283 -43 -189 228 164 -286 132 285 -142 -160 381 63 -157 183 28 -183
3770a83K26K16m79J06K70j64j39L49j14k95L14l0l97K61J93k91Q4L94l96j47K94
$$ -183 43 259 -220 -114 156 -8 -147 202 88 -207 107 77 -320 -59 134 -157 -73 321 -75 -222 72
3791G2J10l60LN84m93k9L96j85l09K98J08m38L08J32n03K16L86m25j27M83l5n43
$$ 72 182 -178 -175 409 -84 -113 283 98 -211 87 195 -243 65 197 -306 -90 296 -129 -256 227 192 -351
3813c51L97K32n62Q2L69k93j70M44L5n36M77R7m72J72L76l32k12N33k25k84K80
$$ -351 46 278 -284 -202 167 -126 -296 148 183 -353 124 221 -251 -79 297 -35 -247 286 61 -223 57
3834E7J55m47K52K45l29j23M47k01l16L35J75m31J66K48l10J3L25k57k73M61P0
$$ 57 212 -235 17 262 -67 -190 257 56 -260 75 250 -181 -15 233 -77 -64 261 4 -269 192 262
3855B62m76K78J42k50j66L96k07j67M16k07j93K07L43o53Q1N19l44k91N28q5l81
$$ 262 -214 64 206 -44 -210 186 -21 -188 228 21 -172 35 378 -275 -194 325 -19 -310 218 133 -248
3876b48L46R4m88J69L16k78j25K97Ql85K54K49l76J63Q1j42j00M26j90l03L80
$$ -248 98 192 -296 -127 189 -89 -214 83 91 -294 -40 209 -167 -4 77 -65 -165 261 71 -232 148
3897A48L7l84J88L60m69Q3L41k56k43L76P4m31K25P8l93J93L98l66k37M86p9k68
$$ 148 185 -199 -11 349 -120 -37 304 48 -195 181 255 -176 49 127 -266 -73 325 -41 -278 208 129 -139
3919a39J78K46m56P0K77k68p5K49j05k27K65K11l99J05L59k74l10N41j71l48M56
$$ -139 39 285 -171 -101 176 -92 -167 82 -23 -250 15 226 -173 -68 291 17 -293 248 77 -271 185
3940A85Kl73J56L80k93j38L38k74j74K79K1l07O3K41l19K1L08p7k01K87l2l17
$$ 185 187 -186 -30 350 57 -81 257 -17 -191 88 109 -198 -135 106 -213 -192 116 39 -162 125 93 -224
3962b24K26J57k93q9L99l30m8M89j57k66J46K01l51O9K31k32k60O01k60j69K89
$$ -224 2 159 -134 -223 176 -154 -202 287 130 -136 10 211 -140 -71 160 -72 -332 269 9 -160 129
3983A29O2k53k8K71k15k18M38j51k45K53O3l36K10K61l26j15M16j95k22K57J35
$$ 129 191 -62 -90 181 -34 -252 186 35 -210 43 106 -230 -20 241 -85 -200 216 21 -201 56 191
4004A91l97J78K78l94JL87j96k01K42j5j43K4L27n01m4M41j23k01M03k16j84J70
$$ 191 -206 -28 250 -144 -143 244 48 -153 89 74 -69 -45 282 -219 -263 178 55 -146 257 41 -143 27
4026B7O4k99O8K42l8k33M01j70k87J87J70k60oL72k32q0K80o8m40M24R8m22J59
$$ 27 91 -208 -140 102 64 -169 232 62 -225 -38 132 -128 -134 238 6 -74 206 138 -302 122 220 -202 -43
4049d3K63k61m4L68j68n31N47j06k53J6L94l36Q7K97j84l52M52J9l28K84M6l40
$$ -43 220 -41 -85 283 115 -416 131 25 -228 -212 182 -154 -67 230 46 -306 146 165 -163 121 167 -173
4071a73k3L91k45r9K54J8n48M39K06m84J43K92j64k19L36L3l31J56J62k62Q0L01
$$ -173 -196 195 -50 -149 105 123 -425 14 220 -264 -121 171 7 -212 124 157 -174 -18 144 -118 -38 263
4093B63l82j1L10j56k34K00J99l38J3L73l48j10M31k51j43L53j14k70K89J57l96
$$ 263 -119 -130 180 24 -210 -10 189 -149 -136 237 -111 -221 210 -41 -184 169 55 -215 74 231 -165
4114a65L4K85n1k09L68k12k56K35K22l06k2L53l72m4K89q1k52K71J60n29J33M29
$$ -165 -131 154 103 -106 262 50 -206 29 251 -55 -77 276 -96 -140 149 68 -184 87 247 -282 -149 280
4136B80k78k37M35k15k36L46J95l93j26M75l53n1M38j41l69J20K40k30M3J50m09
$$ 280 2 -235 200 -15 -251 95 290 -103 -229 246 -107 -158 280 139 -230 -110 130 -100 -57 93 -316
4157c16J57L92k12k80L57M8m46K13L03k79j22L52j37l28L97J02l47J66K39k62
$$ -316 -159 233 21 -259 98 146 -300 -87 216 -63 -185 167 30 -298 99 201 -146 20 259 -3
4177ck8K46k61r8J56N2l08L12J57k59k04L89j76j62K58K7k71M22J04n50J42K23
$$ -3 -31 215 -46 -144 12 64 -244 68 225 -34 -238 151 -25 -187 71 98 -173 249 353 -197 -55 168
4199A68j97k14M45j47l47K39L19m57J61K85l42j58L93j58n7J89J1l06K25J45k31
$$ 168 -29 -243 202 55 -292 -53 266 -191 -30 255 -87 -245 148 -10 -67 122 133 -173 52 197 -34
4220c4n8M35k86k51M08Ql11J34J79m60R4M55k99l86M74N7l06J7M24n52J97M09
$$ -34 -92 343 57 -194 214 222 -89 45 224 -236 -142 313 14 -372 102 159 -147 -130 294 -258 -61 348
4242C48l82j08L64l4k54l6L32n63K00M44l76j94L99p9l85M50J5l49J84L21n43
$$ 348 -34 -142 222 188 -66 -102 230 -333 -133 311 -65 -259 140 61 -324 126 141 -208 -24 297 -246
4263b46M8M77k01k45K08K00n62K64K15k17m4K56o5k39L19r5l10L55J41m16K8M88
$$ -246 -198 279 78 -167 41 241 -321 -57 158 -59 -103 153 88 -151 168 73 -237 118 259 -157 -129 359
4285C59n29j47N20j79k68L43R4l78J62K00k36j72M59r8l59K57J18k52M2K74l55
$$ 359 -170 -317 203 24 -244 99 193 -185 -23 177 -59 -231 228 130 -229 28 146 -106 -64 210 -145
4306a45N1K77l7m56M55L6m90O1M96k98j20M83k94k92M71J3n98K70M23l57l8L90
$$ -145 -94 183 146 -310 145 181 -309 -248 248 -50 -170 313 19 -273 198 211 -387 -117 306 -51 -89 301
4328C01l90r5J32J88l30J21L45l20j0K82k43k50N69l40j67L39Jl04j9M31l41j26
$$ 301 -89 -184 -52 136 -194 -73 272 -48 -58 224 -19 -269 300 -40 -207 132 133 -171 -190 241 -100 -226
4350b26M05r1k89K70L42n38Q7L57l56j81L65j09j28K33N4m11J68K61l32r4L83
$$ -226 179 88 -201 69 411 -127 -40 317 -39 -220 145 36 -92 141 195 -216 -48 213 -119 -213 170
4371A70j25j79J92J60n20L19J50k04K3K23j42l49L80M5m46M84K49p08J39M04k34
$$ 170 45 -134 58 218 -302 17 167 -37 -14 209 67 -282 98 143 -303 181 430 -278 -139 265 31
4392C1k28K37Qk46J71K50l53M4K94k83j19L69k43j25K49J90n26J86M06m19k18
$$ 31 -197 40 48 -198 -27 223 -130 -86 208 -75 -194 175 -68 -193 56 246 -280 -94 312 -107 -325
4413c25N46Rn29M15j2k67J06K53l71Q8K29j19j59K98n7m93K68K80k28r2M26l36
$$ -325 221 230 -299 116 104 -163 -57 196 -175 -87 142 23 -136 162 105 -388 -120 160 -68 -160 266 -70
4435g0j60K63Q6l71K30K20l89J69L49l87k70M88N5n20L64N4l83L8N21l27k13L86
$$ -70 -230 33 119 -252 -22 198 -191 -22 327 -60 -330 158 213 -307 57 111 -272 -234 287 -40 -253 133
4457A33j91j41K83J48m95K41K07l14K8L60k11l76M74P7n53L93K44m42P7K52j34
$$ 133 -58 -199 84 232 -263 -22 185 -129 -101 259 48 -328 146 223 -330 63 307 -135 -58 194 60
4478F0l58M63l9l81K25K11l10Q1L21k49j95M71k36k61J90J91l82J13L73l52j68
$$ 60 -298 165 126 -255 -30 181 -129 -48 273 24 -171 300 64 -197 -7 184 -198 -85 288 -64 -232
4499b32M26k14l01M40p5k67N0L65k88q8L89j43k31K05K18l61m2M62k85j30K35
$$ -232 194 -20 -321 119 44 -223 -173 192 -96 -184 205 62 -169 36 254 -107 -149 313 28 -102 133
4520A33j52j86L49mn20L04K82m56J37N33m33j96L80K0n57L07L76m75RM57m56o5
$$ 133 -19 -205 144 140 -380 -76 206 -250 -113 420 -13 -209 171 191 -366 -59 317 -158 -149 308 -148 -213
4542b13M71k25m14L58K63k58J01K06m40j49M44p1m18N71Pm49J96K45k39k38M18
$$ -213 258 33 -381 -23 240 -18 83 289 -151 -300 144 73 -345 226 233 -216 -20 225 -14 -252 166
4563A66k8l78L63L1m17K67L94n55n1M29k41j55M23On27K88K12m04R9M13m71j36
$$ 166 138 -240 123 154 -263 4 398 -157 -208 221 -20 -175 248 254 -273 15 227 -177 -78 335 -136 -272
4585b72M50Ln42M03K32l37j21O06m18l32O02j9n58K73K21m50K01K10k31j62M95
$$ -272 178 181 -361 42 274 -63 -184 422 4 -328 274 255 -303 -30 191 -259 -58 152 -79 -241 254
4606B54m33j68M04J09l51J52L48n13j14N81k57k58K49J75l99K78K01l66j35N17
$$ 254 -179 -347 57 166 -185 -33 315 -198 -312 269 12 -246 3 178 -221 57 258 -108 -243 274
4626B74k42k05L12Kl87M59J0l35n6M96l25j79L75m4l74J96L09n71J36L88l50p4
$$ 274 32 -173 139 141 -246 213 223 -112 -168 328 3 -176 199 155 -219 -23 286 -285 -149 239 -111 -185
4648a85M45j77m14M39J25m75J91K56k89n8M85l47k79M88o8l46L24J2l27J13L51
$$ -185 260 83 -331 108 233 -242 -51 205 -84 -142 343 -4 -283 205 137 -209 115 127 -200 -87 264
4669B64m78j53N04J42o18K29M73n95K0M07k40l25M40L05n01J32K60m57J54K81
$$ 264 -214 -367 137 279 -339 -110 363 -232 -212 195 -45 -370 70 375 -126 6 266 -191 -37 244
4689B44l45j31M50j56m93N13J64o76M45K26k20k94M69q3l94J87L37n68K69L32
$$ 244 -101 -232 218 62 -431 82 246 -430 15 241 21 -273 196 113 -281 -94 243 -325 -56 276
4709B76m71k3L84k10k36M04M1m05K31K71m90Q7L79k65k71M44j7l89K67K87m90
$$ 276 -195 -218 166 -44 -280 124 165 -240 -9 262 -228 -141 238 -27 -298 146 129 -260 7 294 -196
4730a96O5M57k26k74M07j26l18L15J44l10l3M56l43j26K54ml90K13K14l58J42
$$ -196 -131 326 100 -174 233 107 -211 104 248 -62 -95 361 18 -108 146 142 -248 -35 179 -179 -37
4751c7L19l49j16N60m02l37M63J92o37K61L54m18j2N55l98k04L00N6l28J04K23
$$ -37 282 -67 -183 377 -25 -362 101 293 -344 -83 271 -147 -159 396 -2 -206 94 150 -178 -74 149
4772A49l13o7L57k74j56L84n1l18M84M9m65J06L74k61j57M82j91l33L67Lm83K28
$$ 149 -164 -231 126 -148 -304 80 29 -289 195 244 -221 -115 259 -2 -159 323 132 -201 166 169 -314 -86
4794h6L47m29r9M98j70l51L76J08l03p3L52j86k25M80k15k70M24J42o33L01K86
$$ -86 261 -168 -267 231 61 -290 86 194 -109 -182 170 -16 -241 239 24 -246 178 320 -313 -12 274
4815B74m70N9L35j47l43N14n6m13L38K26m12q9M54k86j25L96j5l35L02M8n12J32
$$ 274 -196 -137 198 51 -292 222 166 -247 91 317 -95 -184 270 -16 -141 255 240 -95 207 255 -257 -125
4837a25M43k60k89M52p0m37L12K97o18J26M00l25j1K95j60k80L22J89n14K15K71
$$ -125 318 58 -231 221 151 -286 26 323 -295 -169 231 -94 -105 190 30 -250 72 261 -253 -38 233
4858B33l87lL93l31k06M21qk13KL70m45M9L31k90j79K64J86m51K13K97m56j7N21
$$ 233 -154 -157 236 -95 -301 120 112 -101 -99 271 -174 -125 206 -84 -263 1 187 -264 -51 246 -210 -227 294
4881B94l74k81N32Jm04J97K07m12M9M32l69k25N83n5m99M37J48l89K4K84j95j67
$$ 294 -80 -361 171 172 -232 -35 172 -240 -191 241 -128 -353 230 175 -324 113 261 -128 -104 180 -15 -182
4903a82N39j39n62M09J58n53K74L21l54o8M24k24l44M11J5m17L52J10l74J13L32
$$ -182 357 218 -344 65 223 -330 -56 265 -89 -157 267 43 -301 110 125 -292 60 170 -204 -91 241
4924B41k74j66L62K7m28K49K60m07J1M09l41j38K24J94n95M84O4m15M3O09m98
$$ 241 -33 -199 163 190 -238 11 271 -136 -125 284 -57 -195 29 223 -372 112 176 -239 -196 413 -85
4945h5j47M54r5j94J06K13m85J50L61m17j19N97l59k63N09j73k76K20K85m88J07
$$ -85 -232 222 127 -67 39 252 -233 -83 278 -139 -258 339 -20 -283 226 53 -223 -3 282 -206 -99
4966i9M27l90o7K73J73n70J96L30n13P3M53l55l43O50j25m11K53K25l78k5K96
$$ -99 328 -62 -129 144 317 -253 -57 273 -240 -167 286 -69 -412 238 113 -298 -45 180 -198 -223 73
4987G3j78m6M05k63k75L46J19m07K04L14l94j11O21l77l60M74M7m51L20L41n34
$$ 73 -105 -151 254 -9 -284 62 181 -226 -22 292 -102 -213 408 31 -329 145 192 -259 61 402 -132
5008a32R3L59j89l47L94r3l29L27J88m43k3M75l70J3L48k19l31L26M02n87J27
$$ -132 -39 320 131 -216 178 85 -244 83 271 -172 -195 280 -90 -77 271 52 -279 47 449 -138 -11
5029a1K12j49k64L84p1l42L29K55m21j06M45m14R5K03j28l19L38J58l99K07L95
$$ -11 201 52 -212 172 101 -241 88 343 -78 -184 261 -153 -58 145 17 -302 36 194 -205 2 397
5050C97m10l2M45m78j86M14m5k25J20K78m95k0N47k60l81N07J0m46K90L03n10
$$ 397 -13 -45 400 -78 -264 150 105 -120 0 278 -217 -237 310 50 -331 176 186 -260 30 333 -177
5071a77P0L42l46K1L37j31k00K85L3n22K27L86l72j38M36j22m57M10K27m75L1
$$ -177 -107 235 -111 -90 247 116 -84 201 234 -288 -61 325 -47 -185 251 129 -328 82 309 -166 -135
5092a35L88k55j96M30k5l54K62J8l12J57L14m19o5N53l17j55J97K8k81K20K06
$$ -135 253 -2 -198 232 207 -147 115 133 -179 -22 292 -127 -192 361 44 -111 86 114 -167 53 259
5113B59m04R4L05j14l83M63K6n81L92L00n96J50L43k68l27N92k19l01K57J59l02
$$ 259 -145 -51 254 140 -243 220 246 -335 57 357 -239 -89 254 -14 -341 251 32 -269 -12 147 -155
5134a55M7L16l69M9K64k10q1L53j11m27L30M27o42O6L64k30l58N14K8l81L07J72
$$ -155 -108 208 -161 -112 152 -58 -139 214 103 -324 6 433 -209 -143 221 -9 -367 147 175 -206 101 273
5156B73m04l4M60m27m8K69J58l98K43K05m79L7L51k57j29L61q0m83L74K58m31
$$ 273 -131 -165 295 -132 -180 89 247 -151 92 297 -182 -145 206 -51 -180 181 101 -382 -8 250 -181
5177a81QM14k66k29L29r5j58J44K85m35J97K10m46O9M37l34k13M03J10m52J81
$$ -181 -173 241 -25 -254 75 -20 -178 -34 251 -184 13 223 -223 -154 283 -51 -264 139 249 -203 -22
5198b2K53m00r6N50k66j45L85j62k13K26J58l30Q7K99l70j06L57j26l23J71K91
$$ -22 231 -169 -265 285 19 -126 259 97 -116 110 268 -62 25 324 -46 -152 205 79 -244 -73 218
5219B18l60RK68j91j15M15j26m11N04M6n22J19M64l23k89N01j64j81K23Q4l89
$$ 218 -142 -133 135 -56 -171 244 118 -293 211 257 -265 -146 318 -5 -294 207 43 -138 85 169 -220
5240b20J01L83m61J35K58j48k46K72Ml62K51K20l27o6N01k62k76L78o2l82L31
$$ -220 -119 264 -197 -62 196 48 -198 74 78 -284 -33 187 -140 -206 295 33 -243 135 73 -309 22
5261B2J71l60M7K67j74j96M32j00l66L69J78m43J6L09j94rK74k57k28L18J80l85
$$ 22 193 -167 -120 147 -27 -223 209 109 -257 112 290 -153 -137 172 -22 -31 243 -14 -242 76 256 -129
5283a29K4K63l48o4N30j26m16L72R8m94K62J56k63%K63j7m94N06J01l24Q4K21
$$ -129 -105 158 -190 -254 276 150 -266 106 204 -290 -28 128 -135 -135 128 111 -383 123 224 -100 -16 205
5305B05m08K05L63l81l02N39p2m67K94K64m97o6O55l07l26N41j11l79K57K38m77
$$ 205 -203 2 365 -16 -318 221 149 -318 -24 240 -257 -323 332 25 -301 240 129 -250 7 245 -232
5326b32J39K63l83p3L94K8m66N88Jm98J01M36m05l3L72j71n26N83K3m84K95L24
$$ -232 -93 170 -213 -286 108 136 -330 258 259 -239 -138 298 -107 -140 232 61 -465 118 141 -343 -48 276
5348B76l55q9N21m75j57M32o6l37K50K61l21j51M56j87k59K90P6n05L45K13n15
$$ 276 -79 -168 353 -122 -279 153 87 -250 0 261 -60 -211 245 58 -201 89 165 -340 5 218 -297
5369b97J30L04k06p8M70k57k83K99J81n04J31L50l12r3M57k12k52J84K04k71P
$$ -297 -167 137 -69 -147 323 66 -217 82 263 -241 -110 240 -72 -165 292 80 -172 12 216 -55 -48
5390d8M39m66j86N37k26k42K92P2m19K72J15l84N5L54k51j78M94j19k48M7K73
$$ -48 391 -75 -261 276 50 -192 100 172 -247 25 140 -244 -189 165 -86 -264 230 111 -137 -90 183
5411A83n93K30L60q5m49M19J16n81M26J42l83J82L59m01j62M10M4m80K21K88m08
$$ 183 -410 -180 180 95 -354 65 181 -400 26 168 -215 -33 326 -75 -237 173 217 -263 -42 246 -162
5432a62k4M18l68j6L69j09l24L04J43m47P1L89n08J47K66j23k30M15j47l05K83
$$ -162 -186 232 -136 -152 217 108 -216 88 231 -216 -145 244 -264 -117 149 26 -204 211 64 -241 42
5453D2J90l04j61M89l34j75L32J09m90K93K22l26J37L17l81k78M35M6m78M17R2
$$ 42 232 -72 -233 256 -78 -253 79 188 -302 -9 213 -113 24 341 -40 -318 117 163 -315 102 194
5474A94m53J96N65n17j08L13j43k24K06m4k10J97J58k14j5L45k44j71M07r4m61
$$ 194 -259 -63 502 -15 -123 190 47 -177 29 -15 -225 -28 130 -84 -99 246 2 -169 238 144 -317
5495c17L25K11m14J61K40k02k08L44O4m47K17J83l11J5K68j68j44K93Qm34L57
$$ -317 8 219 -195 -34 206 4 -204 140 204 -243 -26 157 -154 -139 129 -39 -183 110 118 -316 41
5516D1J60k81j49M19k37k48L67N1l59N77p1n34L18J23l01l1L76k07m09N29Q4m00
$$ 41 201 -80 -229 190 -47 -295 72 123 -236 341 270 -264 54 177 -124 -155 221 14 -395 134 218 -182
5538a82K31L03l12k38L99r0k91J94M5l25K24K91l58o1L96k40j96L20J40n55M11
$$ -182 49 352 40 -198 201 111 -180 14 59 -266 -42 249 -109 -170 226 -14 -210 110 250 -305 106
5559A06J55l80j1L26j49k87N08j87m33M24J18k66j6K21k13q1K98r7l10L07J17
$$ 106 261 -119 -130 196 47 -240 268 81 -352 72 190 -76 -92 129 -84 -165 133 36 -274 33 150
5580A50l37J97K40l88JL55k72j46K84R8m31J23K77l22j79O82l39k42M03j44k51
$$ 150 -187 10 250 -138 -137 218 -54 -200 84 182 -249 -126 151 -171 -350 332 -7 -249 154 10 -241
5601b41K63J40j71j2K32k40m7J39R0m49M64j03j92L0L83l33k21N05q0l02L64N2
$$ -241 22 162 -9 -21 211 -29 -76 63 153 -296 168 65 -127 -97 286 -47 -268 237 157 -145 219 271
5623B71l81m8M09l30j43M25Jm78L53L1k80J78K37l55M5L36l33k50M95J06n43N0
$$ 271 -110 -158 251 -79 -222 203 204 -274 79 110 -170 8 245 -110 -65 271 -62 -312 183 289 -254 -204
5645b04M34k83q5M09j97l66L74J16l81L38j7k06n5L16l02M9J72j4l37K96J70n38
$$ -204 230 -53 -138 271 74 -292 82 198 -183 155 138 -68 -123 193 -109 -60 112 98 -239 57 227 -311
5667c11J05L55k79n7L32m7l23K11K98m83J25L39l75j22M20l6n09M54M1l39J79
$$ -311 -206 149 -130 -187 145 98 -225 -14 284 -199 -74 265 -110 -232 188 152 -357 97 138 -201 -22
5688b2J80l19j24L92o9l22L00J39l83L63J0m00L1M88l31k39M97j26k93K63J62
$$ -22 158 -161 -285 107 38 -284 16 155 -228 135 145 -255 -224 264 -67 -306 191 65 -228 35 197
5709A97m79J18K87n6l33M25R4m54J70L19m68J59K66l06r2M43k73j07L02k1l60
$$ 197 -282 -164 123 67 -266 159 253 -201 -31 288 -180 -21 245 -61 -153 290 17 -90 212 191 -169
5730a69k5M45j53l37N61k93l77L75M2k03J27J06j88j38M26k17p0J90M5l32O1L98
$$ -169 -194 251 98 -239 322 29 -348 27 69 -134 -7 99 -89 -227 199 -18 -88 102 147 -185 -124 274
5752B74k78j14K88q7j77K11K9l44J56K48l41JM67l67k32L65j5k24K81K7l88k0
$$ 274 -4 -118 170 83 -94 117 146 -198 -42 206 -135 -134 333 -34 -266 99 84 -140 141 168 -220 -240
5774b40M54k15k66L55N3l63K87jk38P5L55l27j88M20j55k31J71J47k68Q9J87k16
$$ -240 214 -1 -267 88 141 -222 65 64 -174 -99 256 -71 -259 161 6 -225 -54 93 -175 -86 101 -115
5796a15p8L35j61j02J04J27m50M52J02l90J50L72l47j11J04K02k85P5K40k87j0
$$ -115 -193 142 -19 -121 -17 110 -340 112 214 -176 -26 346 -1 -112 -8 194 -91 -16 224 -63 -73
5817g3K68r3j85K88j73k90L22J01l43J43K63j69m35O55j63l34K05K04l94K48J06
$$ -73 195 102 -83 205 32 -258 64 165 -178 -35 228 59 -376 279 116 -218 -13 191 -203 45 151
5838A51j87p5J77p9j54K63Q4m32J80L27m98M7J50J19k91L21J7k59J10K29m54K65
$$ 151 -36 -111 66 -13 -167 96 180 -252 -72 255 -243 -196 -46 73 -218 103 120 -139 -29 200 -254 11
5860A1J44j43j79L71j40k72L53J43m56l6M34j66k66K83J79n40K50K00l55J05K07
$$ 11 155 12 -167 204 64 -208 145 288 -168 -204 230 64 -202 81 260 -280 -30 170 -185 -80 127
5881A27j70j10J82K3k91L27M4m32K12M34m81j7K30n6k33K55K34l91J07K48l40
$$ 127 -43 -153 29 52 -239 88 132 -300 -88 346 -135 -152 78 22 -211 44 278 -113 -6 242 -98
5902i8l3L54j56k86L57k0l33K78K12m90J07L37l07o9J66O4k15K53p4q2m1K62k9
$$ -98 -131 223 67 -219 138 118 -215 63 275 -215 -108 229 -78 -147 19 83 -132 121 47 -35 -76 186 157
5925A57l76M30j48k96M41Mm38J06K61k05j24L38j66j47J29K70m35J88J93k72L2
$$ 157 -219 211 63 -233 208 212 -226 -120 141 -64 -188 150 -16 -163 -34 236 -199 -11 182 -90 -58
5946e8L64k01m33L53L0k78K02K41k90j94N66k83k88M07J13m90K96j2j41M8K88
$$ -58 306 105 -328 25 55 -223 -21 220 -70 -264 302 19 -269 138 251 -239 57 45 -96 -48 240
5967B40k39j78M62k58k79M10O6m10N2M08k63k23L29Mk92K27P0k98J23J72j73j36
$$ 240 1 -177 285 27 -252 158 224 -186 -134 274 11 -212 117 121 -171 56 126 -172 -49 123 -50 -186
5989a86M36k60j69L48K5l92J75L17l27n2L94l14j35K27J16k93J08K29l15j26M27
$$ -186 250 -10 -179 169 194 -198 -23 294 -33 -85 309 -5 -140 87 203 -90 18 247 -68 -194 233
6010B33k75k61M70L2m53J92M43m71m6K76j05k00L97j15l14J18K44k71M4K81l29
$$ 233 -42 -303 167 199 -254 -62 381 -90 -136 140 35 -165 232 117 -197 -79 165 -106 -62 219 -110
6031a10Q1J42p4k28L54M6l86P8L47k12k95M93j77l04J08J95k58J71K93m84Q8L67
$$ -110 -29 113 39 -189 165 211 -175 -97 250 38 -257 236 59 -245 -137 58 -200 -29 264 -220 -132 235
6053B35k85k15M21Ql64K95J57l69pK56j61k63M46Qm14L71O5k32q8L86j89r5L29
$$ 235 -50 -265 156 164 -200 95 252 -117 -124 132 -29 -292 154 162 -252 119 184 -48 -136 250 61 -34 295
6076B95k54k77K66J87l74J45K08k03j04L54k12j43L45j3m00O0L45l36l9M36j30
$$ 295 41 -236 30 217 -157 -12 196 -7 -111 243 31 -112 233 220 -180 -120 225 -111 -150 286 156
6097A56l26K11J7k17M9K42k18P2J84j15j64K84j24r3J82lk55j04M60k49n2J53
$$ 156 -170 41 58 -159 -110 132 -86 -14 170 55 -109 175 51 -42 140 137 -118 -222 238 -11 -63 90
6119I0P5l49K41J65l74J10N4l7k81M67o6k42J91J81l83J22K76l47n4K94j71j61
$$ 90 165 -184 57 222 -152 -42 12 -25 -306 161 95 -147 44 225 -158 -36 240 -107 -161 133 -38 -199
6141a99M18o8l44K5M94l93j02L96k37k14K49J06l54K25J88j96k18M48q2l64L34
$$ -199 219 151 -193 -168 326 -67 -169 227 -10 -224 25 131 -223 2 190 -6 -224 224 142 -222 112
6162A12Pl51K08K47l54J34J13j10j02J47R3l68K10K97k82o7K69k43k05M13R2l97
$$ 112 119 -232 -24 223 -131 3 116 6 -96 51 144 -224 -14 283 1 -66 203 -40 -245 168 260 -137
6184a37J67K56m17M1M18m51j01L43j23j54L01J18m55P5L48l62Q7L78k89k51L40
$$ -137 30 286 -131 -90 328 -123 -224 119 -4 -158 143 261 -194 -119 229 -133 -46 332 43 -208 132
6205A32Rk89K9L14l95l5N37l07j54J13J56l61J18J75k10N0L91k46j01J18J48l92
$$ 132 141 -148 -119 195 -200 -235 302 -5 -159 -46 110 -251 -133 42 -168 -118 273 27 -74 44 192 -200
6227b00J61J15j72N2K40k84m8L14O4l89J28K32m07J44L07l34m9L28k03k90L21
$$ -200 -39 76 -96 -44 196 -88 -136 178 242 -147 -19 213 -194 -50 257 -77 -126 202 -1 -291 30
6248C0J66l88J74R6j58K9J25Q1l80L23O3l20J0L69k64N0L18l26j45K56j52k71
$$ 30 196 -192 -18 78 -80 -51 74 155 -225 98 161 -159 -149 220 -44 6 324 -2 -147 109 -43 -314
6270c14L59N5k24Q8M29m74m0K50j4k43Q5K00l33M6L44k25j48L64r8l37L50jl20
$$ -314 45 100 -124 -36 393 -81 -121 129 115 -128 -43 157 -176 -130 214 -11 -159 205 107 -230 120 119 -201
6293b01O6K57j82l4L12k36k25L03J94l65J31Q4o0k32M62k72j11K33Om57L04K72
$$ -201 -135 122 -60 -94 218 -18 -243 60 254 -111 20 104 44 -188 274 2 -109 124 130 -327 -23 249
6315B49l54Q2K01k57j06L34l6k22K46Q5m00Q2L42k47k02M85k28j53K40O7l48J36
$$ 249 -105 -23 178 -79 -185 149 113 -109 137 222 -178 -96 246 -1 -203 282 54 -99 141 208 -140 -4
6337dJ70j40k79M74j80l05L80Q0m87K91K14j84o3J04k0q8J42l9k04M5L62m09O2
$$ -4 166 26 -253 221 41 -264 116 196 -291 0 214 30 -33 71 51 -37 105 66 -138 -93 269 -140 -78
6360g8K79k21k94M76mm17K47L51l44K7q7O3k06K67P4k93J14K66l12J26J87k89
$$ -78 201 -20 -314 162 158 -259 -12 339 -5 22 -65 -2 -208 59 133 -160 -46 220 -92 34 221 -68
6382f8o5L89k81k45K17J65m83L29J97l44O6K29l3j50J25Q7m09L00J7k12J07K37
$$ -68 -133 256 -25 -270 -53 112 -371 -42 155 -189 -123 106 73 -77 48 135 -274 26 43 -169 -62 175
6404A75l3l33K71j4j94J48R9k20P6J18k11J09K01m2l05K42J44l66P7K92k56k72
$$ 175 142 -191 80 66 -128 20 119 -101 -25 93 -118 -9 192 150 -155 87 231 -135 -58 234 -22 -294
6426b94L98J9l74L72q0k22J43J17p7j02J38r5j42K01Q4k58n4M62l39j5K06R6k65
$$ -294 104 123 -251 121 41 -181 -38 79 2 -100 38 -57 -199 2 86 -172 -226 236 -103 -118 88 184 -81
6449h1pK48j24M7J29l18J11J7l7j15Q7J55k13K10J51m17J66K47m06j20M29J3l74
$$ -81 -88 160 36 83 212 -106 5 22 -15 -130 -43 112 -101 109 260 -157 9 256 -150 -270 159 172 -202
6472b02J72K07k68m6M15k56k76M55q6l55K22K38m07J69J72k12k19N48k28k78M06
$$ -202 -30 177 -91 -137 278 22 -254 201 115 -240 -18 220 -187 -18 154 -58 -277 271 43 -235 171
6493A71O1l88O9K63k81q9L19j16j42K99J5l87J92K75k95qJ60j32r8K85L1k53R
$$ 171 232 -156 -87 176 -105 -194 125 9 -133 166 181 -206 -14 261 -34 -42 118 -14 -112 173 204 -49 -40
6516d0K44l07m3K69j38j55L06p2k14K50R4l36Q3K43j89k27K67J53m21K79R2k36
$$ -40 204 -103 -146 123 -15 -170 136 64 -150 100 194 -142 -59 184 -5 -232 35 188 -233 46 138 -98
6538i8k1K77l14l5M21k50j92L04P6l97J41J34j77O5K29j89r2K06J5l04J07L88
$$ -98 -119 158 -156 -191 230 -20 -212 92 168 -229 -88 46 -131 -66 163 -26 -118 88 103 -201 -94 294
6560B94l93m7L92k62r1K99j57k64K69J11l34RL56j63k32L64q8k03K77j01j50L7
$$ 294 -99 -146 246 -16 -107 192 35 -229 40 151 -183 -174 182 19 -213 151 63 -140 137 36 -114 -77
6582g7K22k41J3K46j59k36L44J5l35J53M11l68j39K92r9k42L50o4j33M6K47l56
$$ -77 145 -96 -83 163 4 -232 112 127 -208 -55 356 -12 -151 141 42 -200 150 86 -47 -1 246 -110
6604a10K57O2j03k16K48L9l05K35K03l95O5J01lj20K01j11k75J52J00nj08K29
$$ -110 147 209 106 -110 138 177 -128 107 310 -85 -20 81 78 -42 159 48 -227 -75 25 20 -88 141
6626A41o4j73J25J9j63K53k3k43k6L39k33J5J32j1k24J92O3l03K62J50m25K3K68
$$ 141 77 -96 29 48 -115 138 115 -128 -154 185 -48 -33 99 88 -136 56 119 -184 78 228 -197 -174 94
6649I4q0k14M07%k99R8J17q7j43K96n8l18L09j11k09K92J6l86J60K96k37j20K47
$$ 94 14 -200 207 207 -92 6 123 36 -107 189 131 -187 122 11 -198 94 110 -276 -116 180 -57 -177 70
6672G0o0r7J15J11l39J45J24k29J6L33r0k47J31J62m33J37L06k08q2J82p7j66
$$ 70 10 -87 28 139 -200 -55 69 -160 -144 189 99 -148 -17 145 -288 -151 155 -53 -135 47 -30 -196
6694a96K22J62k94P3K21k37j08L09q1l68L91M3l34K05K55l24j89L82j79p0K78
$$ -196 26 188 -106 -33 188 -49 -157 152 71 -297 94 137 -197 8 263 -61 -250 132 -47 -117 161
6715A61J5k52Q0J05j82l3J96j10M8m5R3j27J13J18l19J9J97j34m1J50o1k20K31
$$ 161 176 -76 4 109 -73 -106 90 -20 28 -17 76 -51 62 180 -139 -120 77 -57 -98 52 -9 -229 2
6738BK53l41n5L28j92j47K06p4j77M63j94k79K74J60l43j72M55j76j59K32q8j52
$$ 2 255 -86 -141 187 -5 -152 54 -20 -197 266 72 -207 67 227 -116 -288 167 -9 -168 64 -24 -176
6760a76J64Q1j33j58L95l31qK73K4k51J36Q2k55J79Q1j22j83L19K2l07P7K29k10
$$ -176 -12 69 -64 -222 173 -158 -166 107 131 -120 16 98 -157 22 103 -19 -202 117 139 -168 -91 138 -72
6783g2qJ79j39q1K04j7k94L88Ll14J7K97k77n2L47j83K0O7j02j32J34J64j31j89
$$ -72 -80 99 -40 -121 83 66 -228 160 163 -151 -134 163 -114 -166 181 -2 18 85 -17 -149 -15 149 18 -171
6807a71L14j27k15K25P3m66N09p8j39P2J56k61R8R3j44k8Q4K4j13J63O4k05o1
$$ -171 143 16 -199 26 99 -367 142 64 -75 -3 153 -108 -10 83 -61 -89 -5 19 -94 69 133 -72 -133
6830a33L19r5k90J32L07k57n5K11p7l07K60n1j8Q1j3j67Q6K44k61p0L51j40j83
$$ -133 186 91 -199 -67 240 -17 -72 139 62 -245 15 -36 -54 27 14 -153 -67 177 -84 -154 197 57 -126
6853a26J01M6k86L17L4j54J4L02j62k89K26p9o8K19J04k83K0K33k11j84K40J04
$$ -126 -25 21 -265 52 86 -68 -54 248 86 -203 23 -56 -124 95 199 -84 -64 169 -42 -226 14 118
6875A18k95J79K80l76J81J37j81j12Q6l2j00K97K1l82Q0K30k65l1L06j70k26L43
$$ 118 -177 2 282 -94 87 224 43 -69 17 -15 -115 182 203 -179 -99 131 -134 -165 141 -29 -255 88
6897H8K8j81k6K20k22m7K40j32qP0L0j94N4L75m17L01j28j9j57L22n5j21J20J3
$$ 88 116 -65 -91 129 -93 -140 100 -32 -40 30 60 -134 -80 295 -122 179 51 32 -125 197 142 21 141 154
6921A54k21j7L36k59k48K64k6j16J87J21k02J05N8k22k8L01j08m17N27j98r2j5
$$ 154 -67 -84 252 -7 -255 9 -17 -133 54 175 -27 78 136 -86 -114 187 79 -338 189 -9 -101 -116
6943a16K50j02j85L21r3k90K32K25m92K9L69m09K89J24k33j88K11J41j79N5K67
$$ -116 134 32 -153 168 75 -215 17 242 -250 -221 148 -261 28 152 -81 -269 -58 83 -96 -41 226
6964B26l91J8K23j10j95K49m0j44K28K03k92j22K81l58K8M42j99l28K09K02k41
$$ 226 -165 -147 76 -34 -229 20 -20 -164 64 267 -25 -147 134 -224 -196 246 47 -281 -72 130 -111
6985a11O0K47j62j60L52r6k37R5P9j99K03K7l52J80K53j58j72K23J07k18L6K12
$$ -111 -51 196 34 -126 226 130 -107 -12 67 -132 71 98 -254 -74 179 21 -151 72 179 -39 -3 209
7007B09j57MR8r2k14K35P1l15J19J67j31j49K98j29j24J85p4Q2j26J10k10L7K10
$$ 209 52 56 154 62 -152 83 154 -161 -42 125 -6 -155 143 14 -110 75 1 83 -43 67 -143 -106 104
7030A04j29o5J27j48q6K09L5k46L16r9j16o0J88op1J68n0k02R2Q0j09K8J38j01
$$ 104 -25 -90 37 -111 -197 12 47 -199 117 18 -98 -158 30 24 -47 121 71 -131 -39 41 -68 -40 98 -3
7054cj54K81p6j95Q6K27k30j41L48j48j48K87m5o9o5J94k36r3K75j73m1L16j68
$$ -3 -157 124 48 -147 -61 166 -64 -205 143 -5 -153 134 89 20 -45 149 -87 -180 95 -78 -119 197 29
7077B9k00J29J37j51Q0J39k67J0J90k19p4K24P7j03n0M4P5k30K51k9k45J56J13
$$ 29 -171 -42 95 -56 24 163 -104 -94 96 -123 -197 27 104 1 -49 -5 70 -160 91 62 -183 -27 86
7100H6k03J51J24j54j67L21k07r8Q9J39k30J52J62l98K07J26j11j24J87J07k72
$$ 86 -117 34 158 4 -163 158 -49 -147 -58 81 -149 3 165 -233 -26 100 -11 -135 52 159 -113
7121a13K09J10k97K1K25j33r5P8Q4k44P2J92k55O2J37j29N4J53j13j84K20L3k36
$$ -113 96 206 -91 -70 155 22 -73 5 89 -155 -83 109 -146 -84 53 -76 -22 131 18 -166 54 87 -149
7144a49Q3K00j24j78K94j04j67K70o6k01J99O8j96QJ64k1l02K57n8m4M9K08l55
$$ -149 -66 134 10 -168 126 22 -145 125 59 -142 57 125 -71 -63 101 80 -222 35 -23 -67 -18 190 -165
7167a65Q9K83k31l3MJ65k49J49P0j86J53J92l83J58K11j58k40K82J2j78R5Prk83
$$ -165 -76 207 -24 -57 -53 112 -137 12 82 -104 49 241 -142 16 227 69 -171 111 123 -55 40 47 38 -245
7191b45K80K2j73J40L7j30K4J51k45lK88j47j85K03Q2k61K40N6j80P8%p9k0J54
$$ -245 35 57 -116 24 61 -69 -45 106 -139 -142 146 -1 -186 17 99 -162 78 134 -46 32 32 -47 -67 87
7215H7j67m7J09M1n2q9K26p9m5J12q9j53K29j53O1J27J35j92j70J97k1k74J98
$$ 87 -80 -127 -18 23 -29 -118 108 29 -16 96 7 -146 83 -70 -9 118 253 61 -109 88 67 -207 -9
7238iJ19j79O7P3mj95J48N3j13QR5M1j8L4q1j55K49q1n7Q4L7j23kL2q7j09K57
$$ -9 110 -69 -2 71 67 -128 20 73 -40 -32 63 104 86 120 39 -116 133 52 -5 79 116 -7 -9 23 -64 -173 84
7265H4j11l6J91j32P6k5K6j03Q2P3j93J6J10m7r9J20R6j78l3J61j79J29L8l7k19
$$ 84 -27 -63 128 -4 72 47 73 -30 52 125 -68 -52 58 11 -88 32 128 -50 -83 78 -101 28 66 29 -190
7290a90J37J34j63Q6J04l06K24R6n9j25R0j1n2O3J90m06J54K25j36j41J91r0j42
$$ -190 -53 81 -82 4 108 -198 26 122 63 -62 28 17 -35 28 218 -188 -34 191 55 -86 105 15 -127
7313a27J27O1j68J2J46j13j00K14Jj07j3J50m3j12R8P1j44O7K1r0O9L2k9p7N1
$$ -127 0 61 -107 -95 51 -62 -162 52 53 -54 -67 83 40 -72 26 97 -47 20 41 -49 20 52 23 -54 -3
7338cL9j16K03k7j60K72k05p6KK54k37J0J29m1k19L30j26p7k5K26o6j52J19j31
$$ -3 36 -80 123 96 -64 208 3 -73 -71 183 -54 -44 85 44 -175 155 29 -48 -73 153 87 -65 54 -77
7362g7Q4R1l7j68L1K11k66J59k6oj7R0r9j03Q3K01j82L5rj49m6J87K2o2J08n9
$$ -77 7 98 61 -107 -76 135 -131 28 2 -4 -21 69 -30 -133 -50 151 -31 4 -5 -154 -200 -13 9 -53 55 -4
7388djN4P4j60j64L76p1j78K43Pk48P3J22j95j0J70j09n0J85M7k99J00J72k11
$$ -4 -5 49 123 -37 -201 175 104 -74 169 176 -72 1 123 -72 -82 88 -21 -71 114 161 -138 -38 134 -77
7412g7l8K09j45L4J84j51q9PL27l05q0J09J3k1K15k42K4L8J67l90K13q5n6Q4l
$$ -77 -115 94 -51 -17 167 16 -73 -66 261 -44 -124 -15 -2 -23 192 -50 -26 12 179 -211 2 -83 -139 -55 -58
7437e8N1kQ5l9k5J34k21n7K7J59j1j82K18J43k87P7j6P6j28R3m8o7J92Q5l80L35
$$ -58 -7 -9 76 37 12 146 -75 -132 -105 54 43 -139 79 222 -65 12 -4 72 -56 37 -11 -78 114 199 -181 154
7463A54l9r3o3J00j29r0J86J2j54N9K07k58J17L08l37J00no9j59J26N4l6j3J09
$$ 154 115 22 -41 59 -70 -160 26 38 -116 -57 150 -108 9 317 -20 80 75 6 -153 -27 27 -9 -22 87
7487H7k9p8O8N0j34PJ81k95n4L15j72KK43k05o7K7K08k63K0J58j21n8K65k87p0
$$ 87 58 -20 48 98 -36 -29 152 -143 -197 118 -54 -52 191 -14 -81 -54 154 -109 -89 69 -52 -110 155 -132 -202
7512b02K77R6j27P5o8o6p5K05j60N7NM4r8k9K64l29J78R0k6q6l7N3j66J33L0L5
$$ -202 75 171 44 119 51 -15 -90 115 -45 12 17 61 -37 -66 198 -131 47 137 111 25 -12 41 -125 8 38 73
7538G3j42J95j56j01K33o9p8J76j80o6J10J37j40q2J49K6k12J26K9k30K68J5j43
$$ 73 -69 126 -30 -131 102 33 -45 131 -49 -115 -5 132 -8 -90 59 85 -127 -1 28 -202 66 81 -62
7561f2J29P6n8k48K04l3oM4m7m2jP6rp8K26r8j94M2R7j65J31O1pk07K41k53O0
$$ -62 67 143 85 -163 41 8 2 46 -1 -43 -44 32 23 -55 171 73 -121 -79 18 -147 -16 45 38 -169 72 -181 -121
7588a21P1J06j15J21j35M7LQ2J04k24Q4J39k05J10N8kj13r7L4p5K09l4p2j1K5
$$ -121 -50 56 -59 62 -73 -26 -23 59 163 -61 23 162 -43 67 125 123 10 -87 -53 -128 81 47 -25 -36 -11
7613a1o6j8K36o6jk1q2l4j7K12k12pJ21m5m2J25j56q2K44j26M4O5k3Pj22J84j01
$$ -11 -77 -95 141 75 74 53 -29 -63 -80 132 -80 -87 34 -11 -53 72 -84 -166 78 -48 -4 61 38 45 -77 107 6
7640Fn7K06o9j62l1K43k47K6K9lN6l5N9n6J3k9J02l7l5J41k47K45l9p5m8J85j61
$$ 6 -51 155 86 -76 -107 136 -111 -85 -56 -59 -3 -38 21 -35 -22 -51 51 14 -21 120 -127 118 79 4 -44 141 -20
7667b0J42j32q7O8Q0k3k2m9Q8o2o5K78k46j4L5J73j60j03J56P0j48J38k27J29
$$ -20 122 -10 -97 -29 51 28 6 -43 45 -17 -82 196 -50 -64 -29 144 -16 -119 37 107 -41 97 -130 -1
7691aNk9L9N5q8rJ54k68Q6J2J14k3r4M2ln5J4J70j03o2R6j7k67K83q9N0J4O9j67
$$ -1 4 -25 14 69 -19 -28 126 -142 -56 -44 70 47 -47 -5 -8 -63 -49 121 18 -44 52 35 -232 51 -38 12 26 95 -72
7720g2M5J07l8j19N3m6k0J85Q6j67j8J55j76J5J73k51L2J89M6l71J26J32j99J14
$$ -72 -27 80 42 -77 -24 -70 -90 95 181 14 -4 151 -25 -10 163 -88 -56 133 179 -192 -66 66 -133 -19
7744a9M5q7l0J06k8j06K2K67k05q8K02j61J9Q7J09k15J22N4J2j24M5J9j39K50
$$ -19 26 -61 -91 15 -13 -119 -97 170 -35 -123 79 -82 -63 24 133 -82 40 94 106 -18 27 46 -93 157
7768A57p6k51K99j15k5j9j2J15j33J69k19n8J86p4K19j84R1j08r0J11J7O3l3r
$$ 157 81 -170 129 14 -11 -30 -42 73 -60 109 -110 -168 18 -56 163 -21 70 -38 -128 -17 0 63 30 21
7792B1M7n9N6j72J1J14r5PJ44m6j96J84Q2n3k31K34N2nj03J9j56mK52k9m5O2j02
$$ 21 68 9 65 -107 -96 18 -77 -70 74 28 -168 16 98 45 -186 48 100 95 -8 11 -145 -149 103 74 29 91 -11
7819a1p3Q1M7p4J15q9J03j82R8p9rJ24nm5n7L1M1M1M4j11o1l9J31L0q5N5j45J05
$$ -11 -84 -3 44 -30 85 -4 99 -83 15 -64 -73 51 46 1 -56 -25 16 57 101 -10 -71 -110 21 51 -34 21 -124 -19
7847a9Q6m9k5QL9j22J15N5k15J12MJ8m2K40j19j31J09rj51J80r2l2J7J78j24K0
$$ -19 67 18 -7 1 40 -82 33 88 -127 -15 -11 7 -35 205 86 -45 64 55 -96 84 -8 -40 -23 155 31 51
7873E1Q7q5j1k9O1j65r1K96j42j75L17j01pn8J75j09p3Q7l9q4J92J2k43P4J03
$$ 51 138 53 42 13 74 -91 -182 114 -28 -203 114 13 6 -52 123 14 -59 28 -11 -95 97 109 -134 -60 43
7898D3j81Q7J58j40n8J67k21P7J32o1j23J96j69N3J24L9k02O4J09j25j6j14K28
$$ 43 -138 -51 107 -33 -91 76 -145 -68 64 3 -120 76 -93 -40 84 123 -79 -15 94 -31 -47 -161 67
7921F7k89K12M0rj31K40p6j42J74N2k48P3lJ34k67K55m4k58K58q5j25J64J16j59
$$ 67 -222 -10 30 21 -110 130 54 -88 86 138 -110 -37 -40 94 -173 82 38 -220 38 -47 -172 -8 108 -51
7945e1L5O8j3j03J12m8j36m7L36j92Q2J67k34J13j5n5Q0q3j2j51J74N2m9j62L02
$$ -51 -16 52 39 -64 48 0 -136 -183 153 -39 43 210 -24 89 74 19 99 16 4 -147 27 79 30 -132 170
7970A70k43mK76ml03J97m1j51j1R4P6j05K01j51N2n5P0j09P2L0j14q7K30k06j4
$$ 170 -73 -77 199 195 -108 89 48 -103 -114 -20 56 -49 152 1 53 -2 68 -41 31 61 -53 -140 90 -116 -130
7995a30R9J05j32n1K70j35L0j4L8j71Q8N6j77Q2J4j9k3O9j12Q5j70L24j77K0J93
$$ -130 -31 74 -58 -109 161 26 56 42 80 -91 -3 53 -124 -42 -28 -47 -70 -1 -113 -28 -198 126 -51 -31 162
8020A62k24J28j8j12LQ6N7j32O8N1or8J02j21PnJ30j17P5m2j33J11J18N5j61j15
$$ 162 -62 66 48 -64 -61 25 82 -50 18 69 63 -35 67 -54 -47 -52 78 -39 36 -6 -139 -28 90 145 -16 -131
8046a31J31n8O8J37l4j46R5j06K0K3N0l0K8k8M4j48J45j6j55K35q9n6q5J29Rj57
$$ -131 0 -58 10 147 113 -33 62 -44 -24 -1 49 19 47 19 63 -85 60 44 -111 124 35 -21 -106 23 32 -125
8072a25K48j73m0K17K6k13QR9M3j66J45mK0n1L4j43M2P2n8O4l1k6j3N2k1J24p6
$$ -125 123 -50 -90 127 153 -60 -52 47 90 -76 69 65 85 34 68 -75 -33 39 -19 45 14 -12 -25 27 6 130 54
8099E4J9j67P5J70j47j00K21k20n8J36J59j02k2Q5l6q8k5n2k5J17N2k08J24J78
$$ 54 73 -94 -19 151 4 -96 125 -95 -153 -17 142 40 18 103 67 -21 -46 -98 -123 -6 46 -162 -38 140
8123A40l1q3Mn4m0J16M8r5L2O1l10J88J44j06Kr1O8K8n1qj14P3K04j06l9J49j19
$$ 140 109 26 30 -24 -64 52 100 5 37 98 -212 -24 120 14 16 -75 -7 21 -30 -38 -152 -79 125 19 -20 129 10
8150A0j17J40K1k7r0kp6K56j35k5J12l9Q9l0m5j07K8Q8n4o3n7J20l7lR2j7k0j0
$$ 10 -107 33 54 27 -63 -65 -141 115 -20 -45 67 28 117 87 42 -65 -37 51 -3 -66 -123 -3 -40 -43 49 32 12 2
8178BJ03j96J40L9j32k8P3J25k09J25j6r5j11
$$ 2 105 -91 49 88 -44 -72 1 126 -83 42 26 -69 -180
8191a80
$$ Imaginary data points
##PAGE= N=2
##DATA TABLE= (X++(I..I)), XYDATA
0@%%%%%%%%%%%%%%%qJ6j6J6j6J6k4L2l2M0m8N6o4P2q5R4j05J20j36J54j75J97
$$ 0 0 0 0 0 0 0 0 0 0 0 0 0 0 0 0 -8 8 -8 8 -8 8 -16 16 -16 24 -24 32 -32 40 -45 49 -56 64 -72 82 -93 104
37A04k20K46k73L02l35L73m12M54n02N53o11O75p42Q16q99R91j095J212j343J494
$$ 104 -116 130 -143 159 -176 197 -215 239 -263 290 -321 354 -388 428 -471 520 -575 637 -706 788
57G88j667J868k110K404k769L233l847M701n965Q024j1900K1482q3871j04346
$$ 788 -879 989 -1121 1283 -1486 1747 -2100 2601 -3364 4660 -7240 14242 -69629 -173975
71a73975K79949m0627j95860J54648Q9224j96510L3580J35857j14932k9692J38390
$$ -173975 105974 65347 -130513 24135 113359 -83151 -49571 86286 -28646 -58338 80052
82H0052q1359q3995J41182q645j35770J02467O6897j48450K6565J32649j13091
$$ 80052 -1307 -85302 55880 47235 -88535 13932 80829 -67621 -41056 91593 -21498
93b1498o1491J53363l6121j33012J25550N9067j65869L5025J42603j14008o7397
$$ -21498 -82989 70374 34253 -98759 26791 85858 -80011 -44986 97617 -16391 -83788
104h3788J48907k1974j28513R4318O5055j21351J2927R4644p8458l2440J04027
$$ -83788 65119 43145 -85368 8950 74005 -47346 -34419 60225 -18233 -50673 53354
115E3354l0283p6630P4534J3175q9365N3173O6260r6502q445J04779o1854p4193
$$ 53354 23071 -53559 20975 34150 -55215 -2042 64218 -32284 -40729 64050 2196 -71997
127g1997J14049J5101j27074N0605R6046r9522l3269J14052l6399q7136Q6993
$$ -71997 42052 57153 -69921 -19316 76730 -22792 -56061 57991 21592 -65544 21449
138B1449K7012r8695M0223O8889q5437j2459R1388m4902n9304P9015J707p8183
$$ 21449 48461 -50234 -10011 58878 -26559 -39018 52370 7468 -51836 27179 28886 -49297
150d9297N6549M1237q8453J7005Q0810p4138l7676J04850k2873r7142P7788N3833
$$ -49297 7252 48489 -39964 -22959 57851 -16287 -53963 50887 28014 -69128 8660 62493
162F2493j05812Q978R5127o6745n0462R3812r945p8333O0804K9785q2617K6797
$$ 62493 -43319 -34341 60786 -5959 -56421 37391 27446 -50887 9917 39702 -42915 -16118
174a6118O5789o8353j8229P9999l7019n5252P4287M183p7470M9301M6316q1917
$$ -16118 49671 -18682 -36911 43088 6069 -49183 25104 29287 -48183 1118 47434 -34483
186c4483O125Q2289n7517n1726Q7803J317q5426M9298N2723p7422l258P2319m2445
$$ -34483 -28358 53931 -3586 -55312 32491 33808 -51618 -2320 50403 -27019 -30277 42042 -403
199d03l9486O6787o363o0484M7234K9071o5505J3615N3385m8965j7814O1675k3750
$$ -403 -39889 26898 20535 -39949 7285 36356 -29149 -15534 37851 -11114 -28928 32747 8997
212H997m5264N4528Q490o3207L2161M6972o2087j0958O9760k9046n1638N7270
$$ 8997 -36267 18261 26751 -36456 -4295 42677 -19410 -30368 39392 10346 -41292 15978
224A5978J5047o3554K3076M6525m9230j2727N5417k4067l9626M8843O641n1890
$$ 15978 31025 -32529 -9453 37072 -12158 -24885 30532 6465 -33161 15682 22323 -29567
236b9567K8051L2702m8394N58M6104l3108k3789N0375j0887m5755M4202K0366
$$ -29567 -1516 31186 -17208 -16650 29454 -3654 -27443 22932 12045 -33710 10492 30858
248C0858o1269J6044N3298m8487k5091O2363j1120n2741M1914K4024n5089J1487
$$ 30858 -30411 -14367 38931 -9556 -34647 27716 16596 -36145 5769 29793 -25296 -13809
260a3809M5053m1122j6206N1761j7721l8586M2206Q422m6960K3429L0378m4134
$$ -13809 31244 -9878 -26084 25677 7956 -30630 11576 19998 -26962 -3533 26845 -17289
272a7289R59M6098l3810k6511N3001o629n0786L8192K8507n3180L903M7740l2940
$$ -17289 -16330 29768 -4042 -30553 22448 15819 -34967 3225 31732 -21448 -17545 30195 -2745
285b745k4868M6667o692m0187L4824J6707m5884J3369L6927l6949j3637M4090
$$ -2745 -27613 19054 12362 -27825 6999 23706 -22178 -8809 28118 -8831 -22468 21622
297B1622j3028l2812L3117R463l7988J7057K4703l6053J277L8383k7351k2899
$$ 21622 8594 -24218 8899 18362 -19626 -2569 22134 -13919 -12642 25741 -1610 -24509
309b4509M3201k487m3556K6611K8377m1280l136M1707k2054k5813L6136P20l4836
$$ -24509 18692 16205 -27351 -740 27637 -13643 -16779 24928 2874 -22939 13197 13917 -20919
322b0919K1795J9903l3300K390L0200k2148j5558L1741o883k7065K7063R521l5267
$$ -20919 876 20779 -12521 -10131 20069 -2079 -17637 14104 7221 -19844 7219 16740 -18527
335a8527J3773K7980l2589j0099L9375j2116l2251L1089J3676l8888R880L0389
$$ -18527 -4754 23226 -9363 -19462 19913 7797 -24454 6635 20311 -18577 -8697 21692
347B1692k9151j0544L5540j2454k6673K9625P604l4980J3770K5896k9589n533
$$ 21692 -7459 -18003 17537 5083 -21590 8035 15639 -19341 -5571 20325 -9264 -14797
359a4797L2515j6128k0105K9698k009k9682K3258J5856l5205O696L3408k7895
$$ -14797 17718 1590 -18515 11183 9174 -20508 2750 18606 -16599 -9903 23505 -4390
371d390j7996L8906n921l4436K7534J6893l6785P378L1102k7624j3765L5773q500
$$ -4390 -22386 16520 10599 -23837 3697 20590 -16195 -8817 22285 -5339 -19104 16669 8169
384H169k9497K7130J1811l3185J0091K3811k5694m593K8562j5739j7475K9207
$$ 8169 -21328 5802 17613 -15572 -5481 18330 -7364 -11957 16605 866 -16609 12598
396A2598j363l0847K1011J8836l3068J376L2487k0520j8837L0575j280k8852J9225
$$ 12598 11235 -19612 1399 20235 -12833 -11457 21030 510 -18327 12248 10968 -17884 1341
409A341J5800k8863L020K7550k0373j5053K8790l107k6036J8533J3460k4847L425
$$ 1341 17141 -11722 -8702 18848 -1525 -16578 12212 9105 -16931 1602 15062 -9785 -6360
422f360K0640j7589q619K3280q061j8516K2006N368k6946J1261K0352k4137o226
$$ -6360 14280 -3309 -11928 11352 3291 -15225 6781 12149 -14797 -3536 16816 -7321 -13547
435a3547K7474r924k0903K3208O493k7965J0479K1483k3919o875K7829r597k0326
$$ -13547 13927 4003 -16900 6308 12801 -15164 -4685 16798 -7121 -13996 13833 4236 -16090
448a6090K0998N817k3758R846J6377k1216j215K3472j4906j4364K4809j442k4372
$$ -16090 4908 10725 -13033 -3187 13190 -8026 -9241 14231 -675 -15039 9770 8328 -16044
461a6044J6584J4061k4510J957K2710j6828j1536K4665n264k2284K0893J0161
$$ -16044 540 14601 -9909 -7952 14758 -2070 -13606 11059 5795 -16489 4404 14565
473A4565k7504O589K3596k0490j1647K6367l774k2143J7067R908k1932N689J5958
$$ 14565 -12939 -6350 17246 -3244 -14891 11476 7702 -14441 2626 12534 -9398 -3709 12249
486A2249j7345l072J9962j0815j2823K0560r9k1682J3263J3512k2337J010K2562
$$ 12249 -5096 -8168 11794 979 -11844 8716 8617 -13065 198 13710 -8627 -7617 14945
499A4945j5276j3247K3365r29k3095J3842J4431k0737j873K0474j0168j2425J6553
$$ 14945 -331 -13578 9787 8858 -14237 -395 14036 -6701 -8574 11900 1732 -10693 5860
512E860l82j5383J1516P466j6587L541J4537j3199o951J7389l933j4802J3539
$$ 5860 5478 -9905 1611 9077 -7510 -3969 10568 -2631 -9582 7807 3874 -10928 2611
525B611N845j7149N926J3047j5654l732J8816p070j5224J6520O392k0792M583
$$ 2611 8456 -8693 -2767 10280 -5374 -9106 9710 2640 -12584 3936 10328 -10464 -5881
538e881J7933j4073r056J7832j692j4179R890O200j3261L431R994j1257j269J3994
$$ -5881 12052 -2021 -11077 6755 5063 -9116 774 6974 -6287 -2856 7138 -4119 -5388 8606
552H606q672r325J5228p08j5671J1431R519j8028J482J8396j2704j1736J9993
$$ 8606 -66 -9391 5837 5129 -10542 889 10408 -7620 -6138 12258 -446 -12182 7811
565G811j21j9898J1687J3063j7835j487J6127q735r307J4374o96j3069J0031N782
$$ 7811 7690 -12208 -521 12542 -5293 -6780 9347 612 -8695 5679 4983 -8086 1945 7727
579G727j3953M166J0755j2141k358J4222p379r136J4368j45j6139R845J1116j6969
$$ 7727 -6226 -2060 8695 -3446 -5804 8418 1039 -8097 6271 6126 -10013 -168 10948 -6021
593f021j090J8424r489j2836J5756L290j6060N514J0784j0872k655J1440n176
$$ -6021 -7111 11313 1824 -11012 4744 8034 -8026 -2512 8272 -2600 -5255 6185 1009
606A009o774Q972q64q365P739L396r955K768P748q125k574J0556m671q408J0673
$$ 1009 -5765 3207 2343 -6022 1717 5113 -4842 -2074 5674 -2451 -5025 5531 860 -7548 3125
621C125K907j3355M749J1026j1276n648J3895q08j2259O653P428r776r56Q482
$$ 3125 6032 -7323 -2574 8452 -2824 -8472 5423 4615 -7644 -991 6437 -3339 -4295 4187
635D187m520l918P073j911n187O144R24p564M064N464q080n4R516n938o807J0232
$$ 4187 -333 -4251 2822 911 -4276 1868 2792 -4772 -708 4756 -3324 -3378 6138 200 -6607 3625
651C625N92j0874O085P911j0534k243J2016m475r155R393K950j0799M288P783
$$ 3625 4217 -6657 -572 7339 -3195 -5438 6578 2103 -7052 2341 5291 -5508 -1220 6563
665F563q349j895Q054l718m771O872j99o382N325K343p533L481N363q290l56R889
$$ 6563 -1786 -3681 4373 655 -4116 2756 2557 -3825 1500 3843 -3690 -209 5154 -3136 -3492 6397
681F397n531p314J0122K241j2103L272J0239q065n130R871n71p896M576L175n645
$$ 6397 866 -6448 3674 5915 -6188 -2916 7323 -742 -5872 3999 3428 -4468 108 3283 -2362
696b362J414L629m600L01N399m415l197O526j385n860N594K367o847J640N811
$$ -2362 -948 2681 -1919 -1618 3781 -634 -3831 2695 1310 -4550 1044 3411 -3436 -1796 4015
711D015n256l059P096r26o803N111M302p324m88P094l512m832N753J715n762J452
$$ 4015 -1241 -4300 2796 1870 -4933 178 4480 -2844 -3332 3762 250 -4582 1171 2886 -2876 -1424
727a424M212l749j479M344k089k001L732j054k678L602Q8m567K737L831n790n64
$$ -1424 2788 -961 -2440 1904 -185 -2186 1546 492 -2186 1416 1504 -3063 -326 3505 -2285 -2849
743b849P525l446o566O970L128q411J020P487m184m733O223Q48n875K786K903
$$ -2849 4676 1230 -5336 1634 4762 -3649 -2629 4858 674 -4059 2164 3012 -2863 -77 2826
758B826m372P92L722l649j000M498k681k806M848l51m990M063K978o590J229O130
$$ 2826 -1546 -754 2968 -681 -1681 2817 136 -2670 2178 1827 -3163 900 3878 -2712 -1483 4647
774D647n496l148P580j154o651M457M058o618m84O206k813m002N135M54m790K463
$$ 4647 -849 -3997 3583 2429 -4222 235 4293 -2325 -2809 3397 584 -3418 1717 2171 -2619 -156
790a56K341l755N27K750k380q74L177j704k454M047r11m158M070K579o040P10
$$ -156 2185 -1570 -1043 1707 -673 -1547 1630 -74 -2528 1519 608 -3550 520 3099 -2941 -2231
806b231N958l629m566N418K066n989J010M913l109k540L562k5k843J891J395k449
$$ -2231 3727 98 -4468 950 3016 -2973 -1963 2950 -159 -2699 863 838 -2005 -114 1281 -1168
822a168N64J983k215l82K416j355j424K941m80l039K671J655l963K87M312k802
$$ -1168 -604 1379 -836 -1218 1198 -157 -1581 1360 880 -2159 512 2167 -1796 -1509 2803 1
838Al080M962N34n288K315L793m109j367M707j104l833L204J818m344P96L512
$$ 1 -3079 1883 2417 -2871 -556 3237 -872 -2239 2468 1364 -2469 735 2553 -1791 -995 2517
854B517k747j058L048j114j790K542p33k291K679Q80m205J898M085m970j890O193
$$ 2517 -230 -1288 1760 646 -1144 1398 665 -1626 1053 1933 -2272 -374 3711 -1259 -3149 3044
870C044j445n348M064L273n242m52M817k352l041L767K67l492K370J773l463P50
$$ 3044 1599 -3749 315 3588 -1654 -2106 2711 359 -2682 1085 1352 -2140 230 2003 -1460 -710
886g10K351k590n06L081j592k315L527J67m148K074L111l982o46M499j868l219
$$ -710 1641 -949 -1455 1626 34 -2281 1246 1413 -2735 -661 2450 -1532 -2178 2321 453 -2766
902b766L360R76l772J249L124l050j072L807j319k896K822J176l416P17L013k111
$$ -2766 594 1570 -2202 -953 2171 -879 -1951 1856 537 -2359 463 1639 -1777 -1060 1953 -158
918a58j558K792k79k402K219L60k541J962J633l596M78L784k622k947M397J041
$$ -158 -1716 1076 797 -1605 614 974 -1567 395 2028 -1568 -1090 2694 72 -2875 1522 2563
934B563n095J917L836l892j378M349j435l046L362Q88l893J747K800m004j84L999
$$ 2563 -2532 -615 3221 -671 -2049 2300 865 -2181 1181 2069 -1824 -77 2723 -1281 -1465 2534
950B534k321k453M215n12l947L106K138m810O69M483l274k573M707l54m620L404
$$ 2534 213 -2240 1975 1463 -2484 622 2760 -2050 -1381 3102 -172 -2745 1962 1608 -3012 392
966C92J849m195J014L471l297j301M282j619l810M077J358m993J864L826l837
$$ 392 2241 -1954 -940 2531 -766 -2067 2215 596 -3214 863 2221 -2772 -908 2918 -919
981i19j469M277j371l097L344R08l991J769L038m184o00M630k192l088L851R52
$$ -919 -2388 1889 518 -2579 765 1673 -2318 -549 2489 -1695 -2295 2335 143 -2945 906 1858
997A858m148J636K879l611m62M058k092k673M146q0m182K389K745l953l51M402
$$ 1858 -2290 -654 2225 -1386 -1848 2210 118 -2555 1591 1511 -2671 -282 2463 -1490 -1841 2561
1013B561k510k667M265J65m720L002K800m530k2M553k434k946M120O2m035K641
$$ 2561 51 -2616 1649 1814 -2906 96 2896 -1634 -1656 2897 463 -2483 1637 1699 -2336 305
1029C05K224m179O84M143l945j709N247j530m635M339K347n505R78M700l922k307
$$ 305 2529 -1650 -966 3177 -768 -2477 2770 1240 -3395 944 3291 -2214 -1236 3464 -458 -2765
1045b765N041r84m161M134J082m944K027L676m406j131N283k245l691M597N20
$$ -2765 2276 1292 -2869 1265 2347 -2597 -570 3106 -1300 -2431 2852 607 -3084 1513 2033
1060B033n236L074K854m832J46N212l400l379N627k15n477L496L245n314L02M894
$$ 2033 -3203 -129 2725 -2107 -1961 3251 -149 -3528 2099 1884 -3593 -97 3148 -2166 -1864 3030
1076C030l577k550M989o00m689L669K539m980P98L968l465j420M381j863k996
$$ 3030 -547 -3097 1892 1292 -3397 272 2811 -2169 -1371 2597 -868 -2288 2093 230 -2766
1091b766M209K71m828K904L498n264j070O401k345m831M827K117n860J251M650
$$ -2766 1443 1714 -3114 -210 3288 -1976 -3046 3355 1010 -3821 1006 3123 -2737 -1486 3164
1106C164l668j747M170j062l109L610L73l978K309K498m148M03M256l467k150
$$ 3164 -504 -2251 1919 857 -2252 1358 1731 -2247 62 2560 -1588 -1185 3071 -396 -2546
1121b546M831p51m768L684L073n626L02N518l578l297N102P2m978L193K983n176
$$ -2546 2285 1534 -3234 450 3523 -2103 -1801 3717 139 -3158 1944 2016 -2962 231 3214 -1962
1137a962M85M763l757k744N571p34m834L547K308m680J128L526l637r17M532k542
$$ -1962 -1477 3286 -471 -3215 2356 1622 -3212 335 2643 -2037 -909 2617 -1020 -1937 2595 53
1153E3l130N269l00n871L952M080o440n65O636k978m768N325J663o128K009M359
$$ 53 -3077 2192 1892 -3979 -27 4053 -2387 -2952 3684 706 -4062 1263 2926 -3202 -1193 3166
1169C166m571o27M770k996k697M596l24m286L520J855m977J618M353m849j374
$$ 3166 -1405 -2032 2738 -258 -2955 1641 1317 -2969 551 2406 -2571 -953 3400 -1449 -2823
1184b823O124k568m662N331J759o283J834M995m807j819N733j507m635M456J414
$$ -2823 3301 733 -3929 1402 3161 -3122 -1288 3707 -1100 -2919 2814 1307 -3328 1128 2542
1199B542n137K092L602m247r36M780k022l258M279J37m612L224K477n035J267
$$ 2542 -2595 -503 3099 -1148 -2084 2696 674 -2584 1695 1832 -2780 444 2921 -2114 -847
1214h47M211l997k258N803j008n585M042L380n930L03N486l702k871N133m27m613
$$ -847 3364 -633 -2891 2912 1904 -3681 361 3741 -2189 -1886 3600 -102 -2973 2160 1733 -2880
1230b880L317K450m861P01M086l383j883M703j505l688M442M42m848K654L352
$$ -2880 437 2887 -1974 -1273 2813 -570 -2453 2250 745 -2943 1499 1941 -2907 -253 3099
1245C099n302k47O023l173m427N859P39o210L108M075n447o09N512k794l560N107
$$ 3099 -2203 -2450 3573 400 -4027 1832 2571 -3639 -531 3544 -1903 -2512 3000 206 -3354 1753
1261A753R5n191L151L390n124R1M597l412j698M463j474l601M173J070n427K448
$$ 1753 1848 -3343 -192 3198 -1926 -1835 2762 -650 -2348 2115 641 -2960 1213 2283 -3144 -696
1277f96M551n765j266O754k663m896N331J838o187J836M822m723j524N411j797
$$ -696 3855 -1910 -3176 3578 915 -3981 1350 3188 -2999 -1163 3659 -1064 -2588 2823 1026
1292A026l887M398P99m764K402K824m333Q7M358l243k300N222r49n074M240K734
$$ 1026 -2861 1537 2336 -2428 -26 2798 -1535 -1448 2910 -333 -2633 2589 1640 -3434 806 3540
1308C540o184J042N474m168k889N780p55n109L834K670n676J082N060m516k024
$$ 3540 -2644 -1602 3872 -296 -3185 2595 1840 -3269 565 3235 -2441 -1359 3701 -815 -2839
1323b839N493j426m627M237J804n025J559L540m046p55M856k855l181N330j10
$$ -2839 2654 1228 -3399 838 2642 -2383 -824 2716 -1330 -2085 2771 -84 -3265 2065 1955
1338A955n679L677L719o024k75O266l220m423O003N65o232L271L785n515k0M964
$$ 1955 -3724 -47 3672 -2352 -2627 3639 419 -4004 1999 2564 -3668 -397 3388 -2127 -2147 2817
1354B817k917k853M651m60m329L692J799n212K207L941n074j180O451k678m881
$$ 2817 -100 -2953 1698 1238 -3091 601 2400 -2812 -605 3336 -1738 -2918 3533 855 -4026
1369d026N450J851o511J976N147m886k001N896j885m380M750J063n090K374L545
$$ -4026 1424 3275 -3236 -1260 3887 -999 -3000 2896 1011 -3369 1381 2444 -2646 -272 3273
1384C273m963m31N248l038l059N142l05m947L647K277n256J231M885m512k185
$$ 3273 -1690 -2121 3127 89 -2970 2172 1867 -3080 567 2844 -2412 -1181 3704 -808 -2993
1399b993N864j171n416M420K693n883R31N290m285k478N528j050m675L724K326
$$ -2993 2871 1700 -3716 704 3397 -2486 -1555 3735 -550 -3028 2500 1450 -3225 499 2825
1414B825n207J220M125l914j253M753k158l399M646K58n108L125L567n577m61
$$ 2825 -2382 -1162 2963 -951 -2204 2549 391 -3008 1638 1896 -3212 -87 3480 -2097 -2558
1429b558O060l343m140N753O98n929K825L945n185l29N151k864l317M982J40n153
$$ -2558 3502 159 -3981 1772 2470 -3459 -634 3311 -1874 -2203 2948 84 -3233 1749 1889 -3264
1445c264L441K677n324Q67M768m002j916N291j482m564M518J823n927K083M705
$$ -3264 177 2854 -2470 -1603 3165 -837 -2753 2538 1056 -3508 1010 2833 -3094 -1011 3694
1460C694m812j812O116k076m848N043J426n595K145M237m812j119N582k643l724
$$ 3694 -1118 -2930 3186 1110 -3738 1305 2731 -2864 -719 3518 -1294 -2413 3169 526 -3198
1475c198M730N23m734K727K812m628L50M481l267k835N628p47n373L985K945n601
$$ -3198 1532 2055 -2679 48 2860 -1768 -1418 3063 -204 -3039 2589 1842 -3531 454 3399 -2202
1491b202L69N092l345k670M888n98m519L644J899n044J602M108m265j508M998
$$ -2202 -1833 3259 -86 -2756 2132 1534 -2985 659 2558 -2486 -884 3224 -1041 -2549 2449
1506B449j434m176M198J443n216J960L897m409j068N100k292l522M529N31n017
$$ 2449 1015 -3161 1037 2480 -2736 -776 3121 -1288 -2356 2744 452 -3070 1459 1990 -3027
1521c027K596L567m987m41N371k976l242N029l6n042L153K960m774J0M776k996
$$ -3027 -431 3136 -1851 -2292 3079 103 -3139 1890 1854 -3188 -35 2925 -1849 -1839 2937 -59
1537e9k776M707m89m336L517J848m962J522M267m283j489N159j717m379M353K029
$$ -59 -2835 1872 1383 -2953 564 2412 -2550 -1028 3239 -1044 -2533 2626 909 -3470 883 2912
1553B912n445J442M230l972j455M831j959l441M355N58m819K549L301m609n53
$$ 2912 -2533 -1091 3139 -833 -2288 2543 584 -2857 1498 2056 -2763 -214 3087 -1522 -2075
1568b075N187k770l353M820K85m960K736L006m601j6M727k953k632M732p08m058
$$ -2075 3112 342 -3011 1809 2094 -2866 -130 2876 -1725 -1741 2986 33 -2599 2133 1425 -2633
1584b633L366J807m847J446L885l760j748M953j435m241L868K070n156J298M164
$$ -2633 733 2540 -2307 -861 3024 -736 -2484 2469 1034 -3207 661 2731 -2425 -1127 3037
1599C037l830j390M404j557l292L534R20m383K196L119m282l80M480k393l052
$$ 3037 -793 -2183 2221 664 -2628 906 1826 -2557 -361 2758 -1524 -1904 2576 183 -2869
1614b869M249J95m240K388K931m479J70M306k853k641M608k64m336L041K431m624
$$ -2869 1380 1575 -2665 -277 2654 -1825 -1655 2651 -202 -2843 1765 1501 -2835 206 2637 -1987
1630a987M15M292l123k089M399o97m018L363J869m536J159L562l397j157M133
$$ -1987 -1572 2720 -403 -2492 1907 1210 -2808 555 2424 -2112 -953 2609 -788 -1945 2188
1645B188j669l033L696P83m314K004L236m222o20M679k309l296M356O44m560K149
$$ 2188 519 -2514 1182 1965 -2349 -345 2891 -1331 -1951 2728 419 -2877 1479 2123 -2437 -288
1661b88L041l953m98M193k402k519L954n1l882K675K175l999M53L734k943j923
$$ -288 2753 -1200 -1698 2495 93 -2426 1528 1477 -2405 270 2445 -1554 -1101 2633 -310 -2233
1677b233M265j063l607L379J432m465J544L584l636j275M309j284l703L415J365
$$ -2233 2032 969 -2638 741 2173 -2292 -748 2836 -800 -2075 2234 950 -2753 662 2027
1692B027m258J412L363l457q97L875j672k852L327O46l609J804K356l391J20L463
$$ 2027 -2231 -819 2544 -913 -1810 2065 393 -2459 868 1514 -2095 -291 2065 -1326 -1206 2257
1708B257k541k032L927l54l965K760K282m178L67L905k597k256L991k64l555K242
$$ 2257 -284 -2316 1611 1257 -2708 52 2334 -1844 -1477 2428 -169 -2425 1566 1302 -2253 -11
1724a1K093l683M41L312k553j671L754q17l028K797J229l674J169K971l153p58
$$ -11 2082 -1601 -1160 2152 -401 -2072 1682 865 -2163 634 1863 -1811 -642 2329 -824 -1582
1740a582L765j691k748L354R05m267J869L039l921n48M362k120k943L903M38m031
$$ -1582 2183 492 -2256 1098 2003 -2264 -395 2644 -1277 -1825 2537 417 -2526 1377 1815 -2216
1756b216J874K968l566p71L969j976k315L252j01l041K360J345l509J004L091
$$ -2216 -342 2626 -940 -1711 2258 282 -2033 1219 1118 -1923 437 1782 -1727 -723 2368
1771B368l028j381M174j357l529L565J379m175R72L465l113j422L868j148k972
$$ 2368 -660 -2041 2133 776 -2753 812 2191 -1984 -1012 2453 -660 -2082 1786 638 -2334
1786b334K923J033l562J415K535k997m36L219j835k106L246J41l319J940K055
$$ -2334 589 1622 -1940 -525 2010 -987 -1423 1796 -39 -2145 1101 1242 -2077 -137 1918
1801A918l330K67L402k701j725L704o89l122K416J983l733N06L301k537j809L632
$$ 1918 -1412 -1145 2257 -444 -2169 1535 846 -2276 140 2123 -1610 -1104 2197 -340 -2149 1483
1817A483l76l121K311J433k905L73K448k031r59K762j087k004K656M50l209J688
$$ 1483 1107 -2014 297 1730 -1175 -802 1646 -385 -1344 1418 331 -1673 983 1433 -1776 -88
1833h8K395l488m43L795j759k712L294Q44l794J560K803l235o98L251j426k172
$$ -88 2307 -1181 -1624 2171 412 -2300 994 1838 -1956 -396 2407 -828 -1526 1725 299 -1873
1849a873K800L46k836J608J641k752K76K536k131j137L149r12k658K585J123l420
$$ -1873 927 1273 -1563 45 1686 -1066 -790 1746 -385 -1522 1627 715 -1943 642 1765 -1655
1865a655Q77K816k526j382L602q82k969K613J170l327R01K783k564j013K875p47
$$ -1655 -778 2038 -488 -1870 1732 850 -2119 494 1664 -1663 -762 2021 -543 -1556 1319 572
1881E72k422K308P88k681J114J637k341P6K451j787j350K745k14k923K023J916
$$ 572 -1850 458 1246 -1435 -321 1316 -1025 -949 1502 -285 -1635 1110 896 -2027 -4 1912
1897A912l234ML337j946k187L211J90l000J654J711k535r8K509j571j330K470
$$ 1912 -1322 -1318 2019 73 -2114 1097 1287 -1713 -59 1652 -883 -981 1528 -43 -1373 1097
1913A097m98k073K043O04k487J090J862k351o22K827j047k258K680O80l232J222
$$ 1097 599 -1474 569 1173 -1314 -224 1638 -713 -1335 1492 445 -1813 867 1547 -1685 -463
1929d63K449k535p01K756j025k344K538P01k646R54K055k325m21K437j313j438
$$ -463 1986 -549 -1250 1506 481 -1863 675 1376 -1270 -316 1739 -586 -1007 1430 117 -1321
1945a321K179j52k090J849P16k314O26K261k192j059L038r29k502K192J214k874
$$ -1321 858 706 -1384 465 1181 -1133 -507 1754 -438 -1497 1541 612 -1890 302 1516 -1358
1961a358M20K496j836j147K523m37k226J717R94k246O40J730j913k90K036j157
$$ -1358 -938 1558 -278 -1425 1098 661 -1565 152 1146 -1100 -460 1270 -643 -933 1103 -54
1977e4j369K198J1k314J398J729k689j1K699j573j665K462k3k247J408J487k340
$$ -54 -1423 775 786 -1528 -130 1599 -1090 -1101 1598 25 -1640 822 799 -1448 -40 1447 -893
1994h93J08K146j523j240K269r5k061J416J120k096K05J909j537p51K047o53j584
$$ -893 -785 1361 -162 -1402 867 772 -1289 127 1247 -849 -644 1265 -272 -1023 1024 371 -1213
2011a213J855M10k190Q49J698k021k88K157q63j820J972O39k358R50J624j756
$$ -1213 642 1052 -1138 -289 1409 -612 -900 1257 394 -1426 546 1185 -1173 -223 1401 -355
2027c55o10K093q38j477J682K20j677R54J211j771R6J646j333r72K070k91k045
$$ -355 -965 1128 290 -1187 495 715 -962 -8 1203 -568 -472 1174 -159 -1131 939 648 -1397
2044a397J491J195k156J78K019j512j007K066l66j712J474P68j961N52J693j700
$$ -1397 94 1289 -867 -689 1330 -182 -1189 877 511 -1201 273 1041 -920 -368 1325 -375
2060c75p51J989n18j537J568M66j816O45J339j603j18J728q51j264J748J7j875
$$ -375 -1126 863 345 -1192 376 842 -974 -329 1010 -593 -711 1017 166 -1098 650 667 -1208
2077a208J231J219k035K0J970j262j147J843Q0j815J166R81j691o8J687j124p21
$$ -1208 23 1242 -793 -773 1197 -65 -1212 631 711 -1104 62 1043 -648 -716 971 -153 -874
2094h74J511j99j320J146N62j595N70J313j435n69J815n54j288J344O03j867O09
$$ -874 637 438 -882 264 826 -769 -199 1114 -321 -890 925 371 -917 427 1030 -837 -228
2111b28J333j432l55J521n51j153J271L52j785Q48J194j427l00J719p70j124J344
$$ -228 1105 -327 -682 839 288 -865 406 758 -1027 -179 1015 -412 -712 1007 237 -887 457
2128D57J85j556R44Q12j363L9J405r92q36J570l69j235J090Q13j775M37J420j249
$$ 457 642 -914 30 842 -521 -482 923 -69 -905 665 296 -939 151 964 -811 -374 1046 -203
2146b03r07J885l43j397J008P57j480J93J131r57k72J215m10j004J215M9j508
$$ -203 -1110 775 432 -965 43 800 -680 -487 644 -313 -585 630 220 -784 431 480 -1028
2163a028Q81J021j444j38J479o96j104J308L36j367O18R63j392J7J496j040p00
$$ -1028 -147 874 -570 -708 771 75 -1029 279 615 -752 -134 829 -563 -546 950 -90 -790
2180g90J391j21j232P72R46j460j6J409r46q31J510k73j039Q95M92j333M52R36
$$ -790 601 480 -752 20 966 -494 -510 899 -47 -878 632 359 -680 215 707 -626 -174 762
2198G62q19n05J144k64j003J105L27j444N08J082j092m73J380l36j148R85M08
$$ 762 -57 -562 582 318 -685 420 747 -697 -189 893 -199 -672 708 372 -776 209 617
2215F17j267M66R74j083j53J166o59r00J222K6r59M67Q60j134p5J241q50o91J093
$$ 617 -650 -184 790 -293 -446 720 61 -839 383 409 -550 -83 777 -357 -432 809 -41 -732 361
2234C61P3j269Q37N82j041K18Q76p85m53J152m40r62J052L91j073J08J026p47
$$ 361 434 -835 2 584 -457 -239 637 -148 -601 551 111 -851 201 592 -481 -373 653 -94
2252i4o84J314l05r41O04N50j134M34O84q08r9J041n28o89R78P8j055O25P56j011
$$ -94 -778 536 231 -710 -106 444 -690 -256 428 -380 -479 562 34 -655 323 401 -654 -29 727 -284
2272b84j85J095m44p49R95m5r76O10P74j151k7J178q10o42J075o1r10N68N08r03
$$ -284 -469 626 182 -567 428 383 -593 17 791 -360 -387 791 -19 -661 414 353 -557 11 519 -384
2292c84J82Q43o81m87J030j77j011J020J81j088L70Q06q05l57J071k71q20P55
$$ -384 -202 641 -40 -527 503 326 -685 335 516 -572 -202 604 -201 -558 513 242 -578 177
2310A77M44j207L73R43q61m12J046k26q54P96K08q43K81O45q98J50R21p25n57
$$ 177 621 -586 -213 730 -131 -543 503 277 -577 219 427 -416 -135 510 -388 -238 683 -42 -599
2329e99J037j6j153O31O39r35M6Q84n18n48Q44l0r06N60N74r95J26R23p17m54
$$ -599 438 422 -731 -100 539 -396 -350 534 16 -532 312 282 -624 -64 510 -485 -359 564 -153 -607
2349f07J018j69p30M36M60o62kP84p45j17P55m72m07O82R0p49K82P62r49m9J109
$$ -607 411 242 -488 -52 408 -254 -256 528 -217 -334 421 -51 -458 224 314 -435 -153 609 -340 -389 720
2370G20m94q13Q16L63j089K39Q67l83n90O78j39m60N42l4m82L90J63o48J33P44
$$ 720 226 -587 229 592 -497 -258 609 226 -364 314 175 -285 257 223 -259 131 294 -354 -221 523
2390E23m75m20P72N7j050N63P03r44l1P04l46m83O44R2p03L12M90p12Q9N24l57
$$ 523 48 -372 400 457 -593 -30 673 -271 -302 402 56 -427 217 309 -394 -82 408 -304 -215 309 -48
2411d8l95N96J04o18N17L45p98K65N22n56k83P06k79o26Q25J41r74L29P90p81
$$ -48 -443 153 257 -361 156 501 -297 -32 490 -66 -349 357 78 -548 277 418 -556 -227 563 -218
2431b18l68J046m06o74P75L08r71J99O61n50j91O70k72n69Q46j26o55M94L36p01
$$ -218 -586 460 54 -620 155 463 -508 -309 352 -198 -389 281 9 -560 286 160 -495 -1 335 -366
2451c66K27O72n86m49Q80j68q29P68L72q69J75O68m26n08P22oo40M82K35n35J9
$$ -366 -139 533 -53 -502 378 210 -619 149 521 -348 -173 495 69 -439 283 277 -363 119 354 -181 -162
2472a62N76m15k56O07k36m65O86j15p61M91M53n75m0P35m11n51O31J40q83M64
$$ -162 414 -1 -257 350 114 -351 335 220 -541 -50 403 -172 -212 523 112 -439 192 332 -551 -87
2492h7O10q41q7Q80l74p16Q74J08o85J04M46l88j00M20k18k34O52l43m43N75L09
$$ -87 523 -318 -405 475 101 -615 259 367 -318 -214 232 -156 -256 164 -54 -288 364 21 -422 153 462
2513D62p72P1Q04p52m25R11m4r26P25L06p50K63N54n08l28P16k21o22P41L7o23
$$ 462 -310 -239 565 -187 -612 299 255 -671 54 360 -390 -127 427 -81 -409 307 86 -536 205 242 -381
2534c81K24N12m65k53P52m38k25N02P3o91M16N11p50j10P11l78m39P76p3o96N00
$$ -381 -157 355 -110 -363 389 -49 -274 228 301 -390 26 537 -213 -323 388 10 -429 347 274 -422 78
2555G8L43o03q2O84k48o38P99J2o71N16K50p06K67L33l77j90O49m42m63O97J25
$$ 78 421 -182 -264 420 172 -466 333 345 -326 190 440 -266 1 334 -43 -233 416 -26 -489 208 333
2576C33o72K82O00o89k55O92j88o31N11M84p67J69N93n15k04O00l38m15N81P4
$$ 333 -339 -57 543 -146 -401 291 103 -528 -17 467 -300 -131 462 -53 -257 343 5 -410 171 245
2596B45p04L87M01n97MO31n18j83O49k01o26M92L77q68K84N37l99l56O55p3n92
$$ 245 -459 -72 329 -268 -264 367 -151 -334 315 114 -512 -20 357 -511 -227 310 -89 -445 210 137 -455
2617d55M76M64o73k41J047n35n04O12l3m28M98L6n58J99M36m79nN94m29l82O65
$$ -455 21 485 -188 -429 618 83 -421 191 158 -270 228 264 -294 -95 341 -138 -143 451 22 -360 305
2638C05op80M06O28p51j83Q50l19n25M92J69n87K72M04n97o8P34k96n17N75j0
$$ 305 299 -481 -75 553 -198 -381 469 150 -375 117 286 -301 -29 375 -222 -290 444 148 -369 206 196
2659A96p20O13L19q37J39P13o30k41P44j43o92P15J85p81L71N87o60k91P33j68
$$ 196 -524 89 408 -429 -290 423 -207 -448 296 153 -539 176 361 -420 -49 538 -122 -413 320 152
2679A52o65O82K98o75N1N37o91qP46k48o40O07J32o87M46L51n31r9P39n11m69
$$ 152 -513 169 467 -208 -157 380 -311 -319 427 179 -461 146 278 -409 37 388 -143 -242 497 -14 -483
2700d83P68L7p89N36M24p17q7P61m50m25N60J56p92M32M70n78J5N93m58k46O24
$$ -483 285 322 -467 69 493 -224 -311 450 0 -425 135 291 -501 -69 401 -177 -162 431 -27 -273 351
2721C51j33p79P20K16o64J34M95n87j21O44j21m92N82J47p49K98M77m89k59P53
$$ 351 218 -561 159 375 -289 -155 340 -247 -368 276 155 -337 245 392 -357 -59 418 -71 -330 423
2741D23j97o31N83J31p40L62M51o25k4O19l37m59P39j78m69N68K28p25q4Q42m71
$$ 423 226 -405 178 309 -431 -69 382 -243 -267 352 15 -444 295 117 -352 216 444 -281 -365 477 6
2762Fn70Q69q8p33N91M59q60J60O13m62l64M34M8n96O12J23o79L10M97o53j71
$$ 6 -564 305 217 -516 75 534 -326 -166 447 -15 -379 55 103 -493 119 242 -437 -127 370 -283 -454
2783d54Q37l93m05O23J19o42K18O45o24k99N65j38m06M76J40n87K91M20o23j11
$$ -454 383 -10 -415 208 327 -315 -97 548 -76 -375 190 52 -354 122 262 -325 -34 386 -237 -348
2803c48P29m34m29O67N9o98M53M49p00LO64l45m77O82j10n79N47M09p10j97Q16
$$ -348 381 -53 -482 185 244 -454 -1 448 -252 -249 415 70 -407 275 165 -414 133 542 -168 -365 451
2824D51p46o4O78k23m27M75K86p05J90L64l25k84P25k50n13O29J07p31L22N37
$$ 451 -295 -359 319 96 -331 144 430 -275 -85 279 -46 -330 395 145 -368 261 368 -363 -41 496
2844D96p20r3P36l01n40N30K23o63K10N27m71j00M38l27k56O15l6o79M25M85p80
$$ 496 -224 -317 419 118 -422 108 331 -332 -122 405 -66 -166 272 -55 -311 304 268 -411 14 499 -281
2865b81O5N44l87l95N60K1n30L47N31p06p1P08n07k85P02k31m39M33J82o98M36
$$ -281 -216 328 -59 -454 106 127 -403 -56 475 -231 -302 406 -101 -386 316 85 -354 79 261 -437 -1
2886aL78n67j81P01k20m69L33J89m12K38M00m82k74P26k62n14O51J14p41K10O49
$$ -1 377 -190 -371 330 110 -359 -26 163 -249 -11 389 -93 -367 359 97 -417 234 348 -393 -183 466
2907D66o11j23O28l76l37O09k8o89N38K33n40J10M52n21j57P06j53n69N39K94
$$ 466 -145 -268 360 -16 -353 256 228 -461 77 310 -230 -120 332 -189 -346 360 207 -362 177 471
2927D71r24L03O91o04l37Q24j84n26M47J48o69L25M31l13l05M17j87l75O55j83
$$ 471 -453 -150 541 -63 -400 424 240 -286 161 309 -360 -35 396 83 -222 195 8 -367 288 105
2947A05n21N14L13o66k6O36l85m28Q39j71n82L65L89p01J28O80n44k29N52k26
$$ 105 -416 98 411 -255 -281 355 -30 -458 381 210 -372 -7 382 -319 -191 489 -55 -284 268 42
2967D2n21L65N25p62R7O84l56m44Q00l94m03M60J62n54L18L20o23o2P81l53m65
$$ 42 -479 -114 411 -351 -254 430 74 -370 430 36 -367 93 255 -299 19 339 -284 -346 435 82 -383
2988c83N72L91q68L07M26n90j81O19j84m65M15K89o42K17L55n06N1M81l60l29
$$ -383 189 580 -288 19 445 -145 -326 293 109 -356 59 348 -294 -77 278 -228 -177 304 -56 -385
3008c85O57P7p48L54L69n36O2N75m47m14N90N9o10M37M53r08K96O14o06k25P08
$$ -385 272 349 -399 -45 324 -212 -150 425 -22 -436 154 213 -397 40 493 -415 -119 495 -111 -336 372
3029C72k13m25M08K71n86L8M95n24j95P21k11m78N72R2p18L62L78o88N1P35m50
$$ 372 159 -266 142 413 -173 -135 360 -164 -359 362 151 -327 245 337 -381 -19 359 -329 -278 457 7
3050Gm89N90J50p20M42L89n63P2M69k84m46O47k38k96M57J28n86J17N52n67j77
$$ 7 -482 108 258 -462 -20 369 -194 -122 347 63 -383 264 26 -270 187 315 -271 -154 398 -169 -346
3071c46O81k43m73N35L10r21L12N50n53k23P46k87m48O08J09p96L42M36o33Q0
$$ -346 335 92 -381 154 464 -457 -145 405 -148 -371 375 88 -360 248 357 -439 -97 339 -294 -214
3091b14O22k71n60N98O4o09K84L51l29j04N17l39k51M95k53m31N11L65p87J93
$$ -214 408 137 -423 175 239 -370 -86 265 -64 -168 349 10 -241 254 1 -430 81 446 -341 -148
3111a48O32n82l15P26j17p04M72N02p15Q6N76n18n7M78k46n13N28K85o77L57M62
$$ -148 484 -98 -413 313 196 -508 -36 466 -249 -163 413 -105 -162 316 70 -443 85 370 -307 50 512
3132E12o18j72P03m68n17P25j5n10L02L90n03j43P15l00m86N73K7n28J81L27l42
$$ 512 -106 -278 425 -43 -560 165 150 -360 -58 332 -171 -314 401 101 -385 188 215 -313 -132 195 -147
3153a47Q4M25m07j36N08k21n53N23J61o58L25N84o57j98P29j88o13N79K18p22
$$ -147 -63 362 -45 -181 327 106 -447 76 237 -421 -96 488 -169 -367 362 174 -439 140 358 -364
3173c64K03O21n13k62O36o1n97M15K19n72K19K59k25l9M30l74l38N53M0o46N07
$$ -364 -161 460 -53 -315 321 260 -337 78 297 -275 -56 203 -22 -61 369 -5 -343 210 250 -396 111
3194A11K35o72J38N08l27l41O78q0p70L78N12o96N3O34m47l16O47K1o76M65K27
$$ 111 346 -326 -188 320 -7 -348 330 250 -520 -142 370 -326 -273 361 -86 -402 245 266 -410 55 282
3215B82o06K51M63n69j10O94k43n47N30Om55L40L59o65j50Q67l66m97O18K04p35
$$ 282 -324 -73 390 -179 -289 405 162 -385 145 151 -304 36 395 -270 -420 447 81 -416 202 406 -329
3236c29K23M83o41p6N23j79l54N08p6m57L92K67m88mO13n89k32P12j99m89N05
$$ -329 -106 377 -264 -340 183 4 -350 158 82 -375 17 284 -204 -208 405 -184 -416 296 97 -392 113
3257A13J56m02k3N90n75j58O42k20m38N23O8m05N8L57l78j85N89m22l32N35R1
$$ 113 269 -133 -156 434 -141 -299 343 123 -315 208 276 -129 -71 286 -92 -277 312 -110 -442 93 184
3278A84n25L90K53n31J4N04k36l10L63J52n87L12M63p99L4O74m38l27O09j8m41
$$ 184 -341 49 302 -229 -215 289 53 -257 106 258 -329 -17 446 -353 -319 355 -83 -410 199 181 -260
3299b60J89N73o84N2L77l70k11O27j88m14L76J80n12K51L75n50m9O56k05o61O93
$$ -260 -71 502 -182 -130 247 -123 -334 293 105 -309 67 247 -265 -14 361 -189 -238 418 213 -448 245
3320B45N5o49J88M96l66j65M04j36n17M79K29n81K94L50n06O1M40m28k72O65j91
$$ 245 300 -349 -161 335 -31 -196 208 72 -445 34 263 -318 -24 326 -180 -119 321 -107 -379 286 95
3341I5m58M57L21o81m5P25n27k10N34k4n52L97K60o07K25N08m37k53O32j45o07
$$ 95 -363 94 415 -266 -311 414 -113 -323 211 187 -365 32 292 -315 -90 418 -19 -272 360 215 -392
3362c92M80K08n02K84L78n19j51N84k96o29O89J04n65L32L53o20Q4M57l02l75
$$ -392 88 296 -206 78 456 -63 -214 370 74 -555 134 238 -327 5 358 -262 -178 279 -23 -398
3382c98N85%n46L06L32n62J53M84l67k23N29n2n54M23J24n78Q5P35o26j57O74
$$ -398 187 187 -359 -53 279 -283 -130 354 -13 -236 293 241 -313 110 234 -344 -259 476 -150 -307 367
3403C67k52l66L37L40o24K4M70m57r3M18r5m46M69l4l75L39L56o06o3O51k42m34
$$ 367 115 -251 86 426 -198 -174 296 -161 -254 164 69 -377 92 58 -317 22 378 -228 -291 360 118 -316
3425c16M72P1n20K00K48l88j54O90k92k57N35j02l88J76L27n82K19L20m22k24
$$ -316 156 227 -293 -93 155 -233 -387 303 11 -246 289 187 -201 -25 302 -280 -61 259 -163 -387
3445c87P52j12n03L11K72m17j11M14k70k82P00j84n37N80P1n98J88L28l05j18
$$ -387 365 253 -250 61 333 -84 -195 219 -51 -333 367 183 -354 226 297 -301 -113 215 -90 -208
3465b08M64k14l11M46j67l04K86L08l72l8M39k62l39N35j99m23M16K92n62N1M32
$$ -208 256 42 -269 177 10 -294 -8 300 -72 -110 329 67 -272 263 64 -359 57 349 -213 -162 270
3486B70k22l10M84p9m96K37M72n06q6N72m20j62M69o8m19L94pm22J55N26n41j03
$$ 270 48 -262 222 143 -353 -116 356 -150 -236 336 -84 -246 223 155 -264 130 123 -299 -144 382 -159 -262
3508b62N28k64m03N51J20o77L28M01n56l5O01l12m25N43J58n29J75L29n04J06
$$ -262 266 2 -401 150 270 -407 -79 322 -234 -269 332 20 -405 138 296 -233 -58 271 -233 -127
3528a27L81l48j41M01M5m95L25K00n65K03L83m65j00N06q8m10K44K11k90P4L74
$$ -127 254 -94 -235 166 211 -284 41 241 -324 -121 262 -203 -303 203 115 -295 -51 160 -130 -56 318
3549C18m00k58O27j15n27M95J93n02J19L84m85K3L00j47l93N01J82o43L67K62
$$ 318 -82 -340 287 172 -355 140 333 -169 -50 334 -151 -128 172 25 -368 133 315 -328 39 301
3569C01l01j89N02l22k94N31Lm10K42K71n23J03L89k89l31M54m8m47L90L67n64
$$ 301 0 -189 313 -9 -303 228 231 -179 63 334 -189 -86 303 14 -317 137 89 -358 32 399 -165
3590a65j8L61k02k13L42j92j94L52K00m01L5M12m63q4O09k80l53L33K28n34L9
$$ -165 -183 178 -24 -237 105 -87 -281 71 271 -130 -95 317 -146 -230 379 99 -254 79 307 -227 -188
3611a88N09n18l4N81l73k49L68o4k09K45J22l12M5M31m00j76M30k3n56L31L57
$$ -188 321 -197 -231 350 -23 -272 96 32 -177 68 190 -122 -77 354 -46 -222 208 185 -371 -40 317
3632C17m95o2M65k05l26O66j95m84K96K01n45K18O01m91q3L34r8m81M58N7k23
$$ 317 -178 -240 225 20 -306 360 165 -319 -23 178 -367 -149 452 -39 -122 212 114 -367 91 148 -75
3653g5Q1K45k88p3K65o9k89L90L6m78L00K99n03m4N61l81l12M10J41m92K24L17
$$ -75 6 251 -37 -110 155 86 -203 187 223 -255 45 344 -159 -203 358 -23 -335 75 216 -276 -52 265
3675B65m66n6N10j44l72L72R0m61K95L06n51J67L39m71j28M13M5m40M30M4l64
$$ 265 -201 -257 253 109 -263 109 199 -262 33 339 -212 -45 294 -177 -305 108 153 -287 143 187 -177
3696a77K0L95m34l5L48p1l99L65J75m21N3N21m01j00M76k68j90J82J64m17K41
$$ -177 -157 238 -196 -231 117 46 -353 12 187 -234 -181 340 -61 -161 315 47 -143 39 203 -214 27
3717B7K05n15K12M17l41k35L73Kl53K04J94l37N9L96m66p8M56pm66L10K68m46
$$ 27 232 -283 -71 346 5 -230 143 145 -208 -4 190 -147 -88 308 -158 -236 220 213 -253 57 325 -121
3739a21q2L99j44k85N68k49k55K48K25n74J86M21l99j96M70j86k80M17Q2n26J45
$$ -121 -203 196 52 -233 335 86 -169 79 304 -270 -84 337 -62 -258 212 26 -254 163 245 -281 -136
3760a36M72l69j58N20k79l54L66J95n10J41L39l48m7L61q0l17K39L8k80J97K82
$$ -136 336 -33 -191 329 50 -304 62 257 -253 -112 227 -121 -168 193 113 -204 35 73 -207 -10 272
3781B72n32K4M91k31l32N71q0n60N36J93n37k2O54m97k11L33J60m49L42J21k88
$$ 272 -260 -236 255 24 -308 263 183 -377 159 352 -185 -207 447 -50 -261 72 232 -217 125 246 -42
3802d2oL75l03k77N75k07k71L88j25m54L30L79n11j22M93p0k05J31J49m09J65
$$ -42 -48 327 24 -253 322 115 -156 232 107 -347 -17 362 -149 -271 222 152 -53 78 227 -182 -17
3823a7J51j65j17L66k92n2K78kl02J60L62n34m6M46l74n7M58j68l21L29J2l03
$$ -17 134 -31 -148 218 -74 -126 152 150 -152 8 370 -164 -210 236 -138 -195 263 95 -226 103 115 -188
3845a88J02M29m29k39N74k76l88M12K60o09J93L66k49j19L08j10l03K89O5l03
$$ -188 -86 343 -86 -325 249 -27 -415 -3 257 -352 -159 207 -42 -161 147 37 -266 23 88 -215
3865b15R6K91k70j21M39l68j61M94j48k55J70L19m72p3N17j83k91L37R3m46L22
$$ -215 -119 172 -98 -219 220 -148 -309 185 37 -218 -48 271 -201 -274 243 60 -231 106 199 -247 75
3886G5J49k47j44L86k26j79M42j9m47K55K81m82P9L37k50j98M52k13k75L75ok86
$$ 75 224 -23 -167 219 -7 -186 256 237 -210 45 326 -156 -77 260 10 -188 264 51 -224 151 145 -141
3908a41K08P5k47r2M06j01l68M16J07m80J71K39l09j53L58p0l54M76J2l45K61
$$ -141 67 142 -105 -197 209 108 -260 156 263 -217 -46 193 -116 -269 89 19 -335 141 153 -192 69
3929F9J20k16r1L73j89k75N15j59l22J50K13k96j00M39k38j61L62o0m47L14K81
$$ 69 189 -27 -118 255 66 -209 306 147 -175 -25 188 -108 -208 231 -7 -168 194 134 -313 1 282
3950B82m51Q9L54k91k56L21N8l04J54K44l02kK75k89j19M25j71j56J20J78m43
$$ 282 -169 -80 274 -17 -273 48 106 -198 -44 200 -102 -104 171 -118 -237 188 17 -139 -19 159 -284
3971b84L09J84l47J1K23j44m32M75K28l93J11K45k42k41M68j87l00N03J05o57
$$ -284 25 209 -138 -127 96 -48 -480 -5 223 -170 -59 186 -56 -297 171 -16 -316 187 292 -365
3991c65L04J68j81n1L82l94j87M81Q4m71K61K65m64K10J34j71l22N46j25k54K97
$$ -365 -61 107 -74 -125 257 -137 -324 157 241 -230 31 296 -168 42 176 5 -317 229 104 -150 147
4012A47j1k47J16L02l88j31M00k33j90L69O4n87K98L79l39j66K98m1k59L72R1
$$ 147 136 -111 5 307 -81 -212 188 -45 -235 134 198 -389 -91 288 -51 -217 81 40 -219 153 244
4033B44m81J18M18m66j51N50j73l53M94n7m98M04J16m26J55K98k95j63N88k90
$$ 244 -237 -119 299 -167 -318 232 59 -294 200 143 -355 49 165 -261 -106 192 -103 -266 322 32
4053C2l29K57K96m71P8K90k89j22N52k06m04L48J72l90J82J88k69k22N38k39k52
$$ 32 -297 -40 256 -215 -137 153 -136 -258 294 88 -316 32 204 -186 -4 184 -85 -307 231 -8 -260
4074b60L90N7m68K45L06l99K5K39O3l82L70j00j87J17J94k24r5L76k29j40K68
$$ -260 130 187 -281 -36 270 -129 -104 135 198 -184 186 86 -101 16 210 -14 -109 267 38 -102 166
4095A66o8k35J61L28m06k62M63j30l05M60N1l93K17K20l10j41L34j72k94N14j18
$$ 166 98 -137 24 352 -54 -316 147 17 -288 172 223 -170 47 267 -43 -184 150 -22 -316 198 80
4116H0l63L19J63l78J47L02l93j31L72o3j80K75m0m18L45J70l75R2M15l87o9K08
$$ 80 -283 36 199 -179 -32 270 -123 -254 118 55 -125 150 110 -308 37 207 -168 -76 339 -48 -117 91
4138I1O0l83O9M85l90m3K76n0m56O22j31k06M7J57l27J9N11l76k17L65r3k87L16
$$ 91 151 -232 -163 322 -68 -111 165 115 -341 281 150 -56 -9 148 -179 -160 351 -25 -242 123 30 -257 59
4161E9O2k96J09M14l80j95N06j00m86M99Q6m73J76L40k98k12K93o6l44M61J93
$$ 59 121 -175 -66 348 -32 -227 279 179 -307 192 278 -195 -19 321 23 -189 104 38 -306 155 348
4182C48n21J47J84j06j06M45l19l27M04K0m57K90J77l51P4L19k10l19M61Q2o58
$$ 348 -173 -26 158 52 -54 391 72 -255 149 169 -288 2 179 -172 -98 221 11 -308 153 235 -423
4203d23M25K66m86J21M19j57l79L60l9m46K75K56m12O3K43j35j74M78k87m26N11
$$ -423 2 268 -218 -97 322 165 -214 146 107 -339 -64 192 -220 -157 86 -49 -223 255 -32 -458 53
4224E3J67m66J61K60l15j01M22j02m12L81J14l88J18M08n85O7M79k33k56K71J07
$$ 53 220 -246 -85 175 -140 -241 181 79 -333 48 162 -226 -108 300 -285 -218 261 28 -228 43 150
4245A50l48K85J12l79R6L15l23j20L93J04m80K85K35m43Q2K82k25m67O11L8m73
$$ 150 -198 87 199 -180 -84 231 -92 -212 181 285 -195 90 325 -118 -36 246 21 -446 165 203 -270
4266b70K27L04l42j41L80k22n5K64p7k05L17L6m74L41J64m07L0L48j30l24M22
$$ -270 -43 261 -81 -222 158 -64 -119 145 68 -137 180 216 -258 83 247 -160 -130 218 88 -236 186
4287A86M2n59J28L26j28k34M74j98l73N53L7m88L09R5j93j03L73k37l32K66O4
$$ 186 228 -331 -203 123 -5 -239 235 37 -336 217 254 -234 75 170 -23 -126 247 10 -322 -56 8
4308Hk20K36J38l44N5L62k48k10K80J2k15J65J91m69J21L93k45k33L85q7k72J13
$$ 8 -212 24 162 -182 -127 235 -13 -223 57 69 -146 19 210 -259 -138 255 10 -223 162 75 -197 -84
4330h4L51m48N8K78k56j57M33j87k40L51O3m09K21L76o00P7L17o1k96M52j21l91
$$ -84 267 -181 -123 155 -101 -258 175 -12 -252 99 162 -247 -26 350 -250 -173 144 83 -213 239 118 -273
4352b73J64L18k84p1M65k94j48L20j11k01J20J82l78J14K69k28k65M81j34k31
$$ -273 -109 209 -75 -146 319 25 -123 197 86 -115 5 187 -191 -77 192 -36 -301 180 46 -185
4372a85J24K50m03J8M49k73j76M33k56k56L80O1l38J69K13n24N7M40j24k39M27
$$ -185 -61 189 -214 -196 253 -20 -196 237 -19 -275 105 166 -172 -3 210 -314 -257 183 59 -180 247
4393B47j33l60J00M12l85L5L32l43k62M50J24m84K38J49l38R0L55l15k46M55o1
$$ 247 114 -246 -146 266 -119 -84 248 -95 -357 93 217 -267 -29 120 -218 -128 227 -88 -334 121 60
4414F0k82J98K77l47q8N69m38j98M36m0n47M93J74m93J95M05n44p2N45l12k1J68
$$ 60 -222 -24 253 -94 -182 387 -51 -249 187 147 -400 93 267 -226 -31 374 -170 -242 303 -9 -30 138
4436A38J03l33Q3K88m51M3K60k5m45N31p9l90K99K89m64r1N20j78l56L31J23l87
$$ 138 241 -92 -9 279 -172 -129 131 106 -339 192 113 -277 22 311 -153 -244 276 98 -258 73 196 -191
4458a91K75K01m86J28L95l66j42L19m8l26K81K70o36K41L63k93k15L38m0k38J89
$$ -191 84 285 -201 -73 322 -44 -186 133 85 -241 40 310 -326 -85 278 -15 -230 108 68 -170 19
4479A9J89l54Q4L48m76J28L63k69j45J35J90m47J91L73m40m1K67r7k24L03M4l50
$$ 19 208 -146 -62 286 -190 -62 301 32 -113 22 212 -235 -44 329 -111 -152 115 18 -206 97 141 -209
4501b09L35n2l03N1L75l16k07M35P3n44M62J69n19P2L61k96j84M65%m44M47R9
$$ -209 126 74 -229 -178 197 -119 -326 109 182 -362 100 269 -250 -178 183 -113 -297 168 168 -276 171 270
4523B70n31K64L33m20k99O48k20l36L43J44m47J35M78l66k82N06q0l72M06L8l43
$$ 270 -261 3 336 -84 -383 265 45 -291 52 196 -251 -116 362 -4 -286 220 140 -232 174 212 -131
4544a31J39K57m27kN42l93k97N90p5o33L83M36n14j26O02m32k47M71m5l02K36
$$ -131 8 265 -162 -164 378 -15 -312 278 203 -430 -47 389 -125 -251 351 -81 -328 143 98 -204 32
4565C2K52n88J77L97l31j56L63k0m87L70J69l82J57K10k49k49N28j51l29L64P9
$$ 32 284 -304 -127 270 -61 -217 146 126 -361 9 178 -204 -47 163 -86 -335 193 42 -287 77 156
4586A56m19L06R7l35j78O66j91l72L17J65l55N4K89l15j46L94p3k41K74m3k31
$$ 156 -263 43 140 -195 -373 293 102 -270 47 212 -143 -89 200 -115 -261 133 60 -181 93 50 -181
4607a81K35K29l45J1L49m26j90N80j34m33M36J56n35J47K81j66k20M82k00l64
$$ -181 54 283 -62 -51 298 -128 -318 262 128 -305 131 287 -248 -101 180 14 -206 276 76 -288
4627b88L44J95m76O7M88m57PL65j39l62L81P5n07K34M01k99l01N25k13k79M61
$$ -288 56 251 -225 -158 330 -127 -120 245 106 -256 125 200 -307 -73 328 29 -272 253 40 -239 222
4648B22J2m84K68K01l53LM06k99k87M63l1m58K69K99k98n4L61l16j68M64j84k85
$$ 222 234 -250 18 219 -134 -131 275 -24 -311 152 121 -337 -68 231 -67 -121 240 -76 -244 220 36 -249
4670b49L65O7n02K50M13m08k71O17k52l07K38J32l58J89L08l49n7M59k36l51M15
$$ -249 116 183 -319 -69 344 -64 -335 282 30 -277 -39 93 -265 -76 232 -117 -174 285 49 -302 113
4691A13ol91M30R8m02O6L09l05k28N13M2n28K58J77k97P8J62j40j92L77r9l53
$$ 113 107 -284 146 244 -158 -92 217 -88 -316 197 239 -289 -31 146 -151 -73 89 -51 -243 134 35 -318
4713c18M15J55l82M7L70k80k77M01k8m60L00K30m18K68K49l98J7N33m06l96N84
$$ -318 97 252 -130 -83 287 7 -270 131 103 -357 -57 173 -245 23 272 -126 -109 424 18 -378 206
4734B06l8m87K74K92l39n8K12K7m12L36J97m43K28J27l33O1N23m25j91L98n0m16
$$ 206 168 -319 -45 247 -92 -150 62 89 -323 13 210 -233 -5 122 -211 -150 373 -52 -243 155 105 -311
4756c11K40L94n35l9N65l81k42N27j59k94K91J68m04K7M12m45k4M19j69l58L73
$$ -311 -71 323 -212 -251 314 -67 -309 218 59 -235 56 224 -180 -153 259 -186 -210 209 40 -318 55
4777E5J91l86Q0L60m36j87O51k83l31L37K18n25J53M46m11q9M47k25l04M26p5
$$ 55 246 -140 -60 300 -136 -323 328 45 -286 51 269 -256 -103 343 -68 -157 290 65 -239 187 112
4798A12l05K65K13l10j71M08k23l08N80j94m00L69K56o38L56J62j99l55N55qm83
$$ 112 -193 72 285 -25 -196 212 -11 -319 261 67 -333 36 292 -346 10 172 -27 -382 173 165 -318
4819c18L78L7l13J65J93j36l10M77Nn61M73K0l92L3M51l57j28N20k54o4K28N1
$$ -318 60 97 -216 -51 142 6 -304 173 178 -383 90 110 -282 -249 202 -155 -283 237 -17 -81 147 198
4841A98l69J06L93m55j59M96k05l35M02mk51K13K17m46O8M82k96l35N30r9m81
$$ 198 -171 -65 328 -127 -286 210 5 -330 72 68 -183 30 247 -199 -131 351 55 -280 250 151 -330
4862c30K27L66n44Q9N10m42q1L03J2l91L18K27m76J77K49l83j41N20j07n02M65
$$ -330 -103 263 -281 -192 318 -124 -205 98 110 -281 37 264 -212 -35 214 -169 -310 210 103 -399 66
4883F6J98m90J57M50l99j50M84k69k67M57n7m18K51K83n08O1L85k47k03N57k85
$$ 66 264 -226 -69 381 -18 -168 316 47 -220 237 180 -238 13 296 -212 -151 234 -13 -216 341 56
4904E6m14L62L33m43l5M13l49k89N80M1l82J82J25k64n5M85n38j52M86o5k45J96
$$ 56 -358 4 337 -106 -141 272 -77 -366 214 255 -127 55 180 -84 -139 346 -192 -344 142 77 -168 28
4926B8J35m46K36K85m13Q6K62j03l08K15J48n78M79K55m95L2N17m33k48L88K15
$$ 28 163 -283 -47 238 -175 -89 173 70 -238 -23 125 -453 26 281 -214 -182 335 -98 -346 42 257
4947B57m93K78J92l78n8M86l10j57L72j93k10L54m6j90QL56l57q9M59k15l52K54
$$ 257 -236 42 234 -144 -202 284 -26 -183 189 -4 -214 140 94 -96 -88 268 -89 -178 281 66 -286 -32
4969c2K51m34J56L21m40j58O29k24k43L34J45n06K66K47l92j56M52k03k55N02
$$ -32 219 -215 -59 262 -178 -336 293 69 -174 160 305 -201 65 312 -80 -236 216 13 -242 260
4989B60m6n04L10J78m05J80L28m20j95N77q6m16J90L04n12J33M70l98k24L99Q0
$$ 260 214 -290 20 198 -207 -27 301 -119 -314 263 177 -239 -49 255 -257 -124 346 -52 -276 123 203
5010B03n20K60K07j75j50N07m25o5M07j05k51J95J4m42K97L35m89l3M85l08k50
$$ 203 -317 -57 150 -25 -175 332 -93 -158 249 144 -107 88 102 -340 -43 292 -197 -230 255 -53 -303
5031c03L50J71m02J29L96n83k1M07l71n9M35J13m38K83J27l77M7L62k89j88L72
$$ -303 47 218 -184 -55 341 -242 -263 144 -227 -286 149 262 -176 107 234 -143 -96 266 -23 -211 161
5052A61j14l77M42J47m39Q8L53k17k78L85p9l97L56K79o11J63M95n40r5M91m8
$$ 161 47 -330 112 259 -180 -92 261 44 -234 151 72 -325 31 310 -301 -138 357 -183 -278 213 165
5073A65m42L24K12m53J40J87k44m8M71k42k57M12mn54J83N09n29l3M25j52l23
$$ 165 -277 47 259 -194 -54 133 -111 -159 312 70 -187 225 221 -333 -150 359 -170 -203 222 70 -253
5094b53M67m2m03J15L14l88R2L97l74k35M58o6m31M85J32n64J66L74l23k01N03
$$ -253 214 172 -231 -116 198 -190 -98 299 -75 -310 148 82 -349 136 268 -296 -130 244 -79 -280 223
5115B23j27l07K42J50m48K17L20m35kN31m86r6M49j8n03J31L60l77K5L86j72m30
$$ 223 96 -211 31 181 -267 -50 270 -165 -167 364 -122 -218 231 213 -290 -159 201 -176 -151 235 63 -367
5137c67N23rl72K40L19n44J72K54l06j72N46k30m68M49K30n43J97M43k85l22M29
$$ -367 156 147 -225 15 334 -210 -38 216 -90 -262 284 54 -414 35 265 -278 -81 362 77 -245 184
5158A84j58k14K70O8l97J53K73k55j17L34j46k71M46J01n81K43L74m43j93O41
$$ 184 26 -188 82 150 -247 -94 179 -76 -193 141 -5 -276 170 271 -310 -67 307 -136 -329 312
5178C12l70j78K56R9m23M00J93m21P9K74k68o3K18Ol94K32K45j89j77M99m33k41
$$ 312 -58 -236 20 119 -304 96 289 -132 -53 221 -47 -110 108 114 -280 -48 197 8 -169 330 -103 -344
5200c44N50p0l99K26K83n29J88K31k75k05N33r6n50M53J50l80J34L27k83k16M10
$$ -344 206 136 -263 -37 246 -283 -95 136 -139 -344 189 93 -457 -4 146 -234 -100 227 -56 -272 138
$$ [...]
8191F0
##END NTUPLES=NMR FID
##END=
