##TITLE=1H_MTBBC0906K
 CDCl3, 8 sc, 
 10.06.2021
##JCAMPDX= 6.0         $$ Bruker NMR JCAMP-DX V2.0
##DATA TYPE= NMR FID
##DATA CLASS= NTUPLES
##ORIGIN= UXNMR, Bruker Analytische Messtechnik GmbH
##OWNER= root
$$ XWIN-NMR		Version 3.5
$$ Thu Jun 10 09:56:49 2021 Russian Standard Time (UT+4h)  she@DPX200
##.OBSERVE FREQUENCY= 200.131506
##.OBSERVE NUCLEUS= ^1H
##.DELAY= (6, 6)
##.ACQUISITION MODE= SIMULTANEOUS
##.ACQUISITION SCHEME= undefined
##.AVERAGES= 8
##.DIGITISER RES= 18
##SPECTROMETER/DATA SYSTEM= spect
##.PULSE SEQUENCE= zg30
##.SOLVENT NAME= CDCl3
##.SHIFT REFERENCE= (INTERNAL, CDCl3, 0, 15.7039)
##AUDIT TRAIL= $$ (NUMBER, WHEN, WHO, WHERE, WHAT)
$$ ##TITLE= Audit trail, XWIN-NMR		Version 3.5
$$ ##JCAMPDX= 5.01
$$ ##ORIGIN= Bruker BioSpin GmbH
$$ ##OWNER= she
$$ F:/spectra/data/she/nmr/H-F/1/audita.txt
$$ ##AUDIT TRAIL=  $$ (NUMBER, WHEN, WHO, WHERE, WHAT)
(   1,<2021-06-10 09:55:25.92 +0400>,<she>,<DPX200>,
      <created by zg, POWCHK disabled, PULCHK disabled
       configuration hash MD5:
       00 E9 B6 7A A2 85 ED C7 34 08 36 98 17 FE 4E 26
       data hash MD5: 16K
       7B C1 6E 85 B7 D2 2F 6A 2D 1D 8C 64 81 53 8C A8>)
$$ ##END=
$$ 
$$ hash MD5
$$ ED 20 91 47 30 16 FD F5 67 E2 43 30 FB 60 3B 76
##$RELAX= 
##$RELAX= 
##$RELAX= 
##$RELAX= 
##$RELAX= 
##$RELAX= 
$$ Bruker specific parameters
$$ --------------------------
##$DU= <F:/spectra>
##$EXPNO= 1
##$NAME= <H-F>
##$PROCNO= 1
##$TYPE= <nmr>
##$USER= <she>
##$AMP= (0..31)
100 100 100 100 100 100 100 100 100 100 100 100 100 100 100 100 100 100 
100 100 100 100 100 100 100 100 100 100 100 100 100 100 
##$AQSEQ= 0
##$AQ_mod= 1
##$AUNM= <au_zg>
##$AUTOPOS= <>
##$BF1= 200.13
##$BF2= 200.13
##$BF3= 200.13
##$BF4= 200.13
##$BF5= 200.13
##$BF6= 200.13
##$BF7= 200.13
##$BF8= 200.13
##$BYTORDA= 1
##$CFDGTYP= 0
##$CFRGTYP= 5
##$CHEMSTR= <none>
##$CNST= (0..31)
1 1 145 1 1 1 1 1 1 1 1 1 1 1 1 1 1 1 1 1 1 1 1 1 1 1 1 1 1 1 1 1 
##$CPDPRG= <>
##$CPDPRG1= <>
##$CPDPRG2= <>
##$CPDPRG3= <>
##$CPDPRG4= <mlev>
##$CPDPRG5= <mlev>
##$CPDPRG6= <mlev>
##$CPDPRG7= <mlev>
##$CPDPRG8= <mlev>
##$CPDPRGB= <>
##$CPDPRGT= <>
##$D= (0..31)
0 1.2 0 0 0 0 0 0 0 0.06 0 0.03 0 0 0 0 0.0002 0 0 0 0 0 0 0 0 0 0 0 0 
0 0 0 
##$DATE= 1623304525
##$DBL= (0..7)
120 120 120 120 120 120 120 120 
##$DBP= (0..7)
150 150 150 150 150 150 150 150 
##$DBP07= 0
##$DBPNAM0= <>
##$DBPNAM1= <>
##$DBPNAM2= <>
##$DBPNAM3= <>
##$DBPNAM4= <>
##$DBPNAM5= <>
##$DBPNAM6= <>
##$DBPNAM7= <>
##$DBPOAL= (0..7)
0.5 0.5 0.5 0.5 0.5 0.5 0.5 0.5 
##$DBPOFFS= (0..7)
0 0 0 0 0 0 0 0 
##$DE= 6
##$DECBNUC= <off>
##$DECIM= 32
##$DECNUC= <off>
##$DECSTAT= 4
##$DIGMOD= 1
##$DIGTYP= 9
##$DL= (0..7)
0 120 120 120 120 120 120 120 
##$DP= (0..7)
150 150 150 150 150 150 150 150 
##$DP07= 0
##$DPNAME0= <>
##$DPNAME1= <>
##$DPNAME2= <>
##$DPNAME3= <>
##$DPNAME4= <>
##$DPNAME5= <>
##$DPNAME6= <>
##$DPNAME7= <>
##$DPOAL= (0..7)
0.5 0.5 0.5 0.5 0.5 0.5 0.5 0.5 
##$DPOFFS= (0..7)
0 0 0 0 0 0 0 0 
##$DQDMODE= 0
##$DR= 18
##$DS= 0
##$DSLIST= <SSSSSSSSSSSSSSS>
$$ [...]
##$SUBNAM2= <"">
##$SUBNAM3= <"">
##$SUBNAM4= <"">
##$SUBNAM5= <"">
##$SUBNAM6= <"">
##$SUBNAM7= <"">
##$SUBNAM8= <"">
##$SUBNAM9= <"">
##$SW= 20.0188882624521
##$SWIBOX= (0..15)
0 0 2 0 0 0 0 0 0 0 0 0 0 0 0 0 
##$SW_h= 4006.41025641026
##$TD= 16384
##$TD0= 1
##$TE= 0
##$TE2= 300
##$TE3= 300
##$TEG= 300
##$TL= (0..7)
0 120 120 120 120 120 120 120 
##$TP= (0..7)
150 150 150 150 150 150 150 150 
##$TP07= 0
##$TPNAME0= <>
##$TPNAME1= <>
##$TPNAME2= <>
##$TPNAME3= <>
##$TPNAME4= <>
##$TPNAME5= <>
##$TPNAME6= <>
##$TPNAME7= <>
##$TPOAL= (0..7)
0.5 0.5 0.5 0.5 0.5 0.5 0.5 0.5 
##$TPOFFS= (0..7)
0 0 0 0 0 0 0 0 
##$TUNHIN= 0
##$TUNHOUT= 0
##$TUNXOUT= 0
##$USERA1= <user>
##$USERA2= <user>
##$USERA3= <user>
##$USERA4= <user>
##$USERA5= <user>
##$V9= 5
##$VALIST= <valist>
##$VCLIST= <CCCCCCCCCCCCCCC>
##$VD= 0
##$VDLIST= <DDDDDDDDDDDDDDD>
##$VPLIST= <PPPPPPPPPPPPPPP>
##$VTLIST= <TTTTTTTTTTTTTTT>
##$WBST= 1024
##$WBSW= 4
##$XGAIN= (0..3)
0 0 0 0 
##$XL= 0
##$YL= 0
##$YMAX_a= 73522
##$YMIN_a= -88287
##$ZGOPTNS= <>
##$ZL1= 120
##$ZL2= 120
##$ZL3= 120
##$ZL4= 120
##$ABSF1= 10
##$ABSF2= 0
##$ABSG= 5
##$ABSL= 3
##$ALPHA= 0
##$AQORDER= 0
##$ASSFAC= 0
##$ASSFACI= 0
##$ASSFACX= 0
##$ASSWID= 0
##$AUNMP= <proc_1d>
##$AZFE= 0.1
##$AZFW= 0.1
##$BCFW= 1
##$BC_mod= 2
##$BYTORDP= 1
##$COROFFS= 0
##$CY= 11.3945322036743
##$DATMOD= 1
##$DC= 2
##$DFILT= <>
##$DTYPP= 0
##$F1P= 15.9154993809931
##$F2P= -4.1035820241983
##$FCOR= 0.5
##$FTSIZE= 0
##$FT_mod= 4
##$GAMMA= 1
##$GB= 0.15
##$INTBC= 1
##$INTSCL= 1
##$ISEN= 128
##$LB= 0.24
##$LEV0= 0
##$LPBIN= 0
##$MAXI= 10000
##$MC2= 0
##$MEAN= 0
##$ME_mod= 0
##$MI= 1.114404
##$NCOEF= 0
##$NC_proc= 0
##$NLEV= 6
##$NOISF1= 3.799351
##$NOISF2= 2.8
##$NSP= 1
##$NTH_PI= 0
##$NZP= 0
##$OFFSET= 15.70392
##$PC= 1
##$PHC0= -11635.45
##$PHC1= 4.801015
##$PH_mod= 1
##$PKNL= yes
##$PPARMOD= 0
##$PSCAL= 0
##$PSIGN= 0
##$REVERSE= no
##$SF= 200.130013532006
##$SI= 16384
##$SIGF1= 3
##$SIGF2= 2
##$SINO= 400
##$SIOLD= 16384
##$SREGLST= <1H.CDCl3>
##$SSB= 0
##$STSI= 0
##$STSR= 0
##$SW_p= 3612.71676300578
##$SYMM= 0
##$S_DEV= 0
##$TDeff= 0
##$TDoff= 0
##$TI= <>
##$TILT= no
##$TM1= 0
##$TM2= 0
##$TOPLEV= 0
##$USERP1= <user>
##$USERP2= <user>
##$USERP3= <user>
##$USERP4= <user>
##$USERP5= <user>
##$WDW= 1
##$XDIM= 8192
##$YMAX_p= 0
##$YMIN_p= 0
$$ End of Bruker specific parameters
$$ ---------------------------------
##NTUPLES= NMR FID
##VAR_NAME=  TIME,          FID/REAL,        FID/IMAG
##SYMBOL=    X,             R,               I
##VAR_TYPE=  INDEPENDENT,   DEPENDENT,       DEPENDENT
##VAR_FORM=  AFFN,          ASDF,            ASDF
##VAR_DIM=   8192,          8192,            8192
##UNITS=     SECONDS,       ARBITRARY UNITS, ARBITRARY UNITS
##FACTOR=    0.0002496,     1,               1
##FIRST=     0,             0,               0
##LAST=      2.0444736,     0,               0
##MIN=       0,             -88287,          0
##MAX=       2.0444736,     73522,           0
$$ Real data points
##PAGE= N=1
##DATA TABLE= (X++(R..R)), XYDATA
0 0 0 0 0 0 0 0 0 0 0 0 0 0 0 0 0 0 0 0 0 -8 8 -8 8 -8 8 -8 16 -16 16 -20 24 -24 32 -32 39 -40 48 -54 58 -64 72
41 72 -80 89 -98 109 -120 132 -145 160 -176 194 -214 236 -262 289 -321 357 -401 450 -510 583 -678
62 -678 801 -963 1198 -1557 2167 -3401 6767 -33271 -88287 53533 33360 -73240 12618
75 12618 68857 -40507 -29891 49743 -15172 -42056 42459 8798 -47623 27275 30227 -49382
87 -49382 5193 49857 -37739 -28368 53236 -12293 -52623 44539 26332 -61609 13561 56077
99 56077 -48332 -29126 63291 -12263 -60184 43911 35245 -56216 5095 52220 -35806 -29781
111 -29781 43932 -7422 -35599 35589 14050 -39277 18314 24975 -43109 1201 46539 -31491
123 -31491 -27566 54664 -2530 -55818 35200 37834 -54940 -6018 55824 -25130 -36636 45367
135 45367 7037 -43839 24920 26912 -41500 1529 39083 -27733 -19714 41368 -5317 -34512
147 -34512 28833 13450 -38900 12449 28954 -34540 -4806 42748 -22224 -31533 42174 6498
159 6498 -48437 20871 37306 -40856 -13135 45580 -14554 -34568 32620 11031 -36010 13416
171 13416 23055 -30409 -2482 30124 -19870 -16634 32545 -6029 -30714 26107 12638 -37657
183 -37657 10474 32639 -30898 -13703 39958 -11156 -35311 30573 15950 -39402 8636 33202
195 33202 -27789 -14062 34706 -9363 -27959 26429 10237 -31057 10769 22816 -25016 -4843
207 -4843 27234 -14731 -16086 27251 -2837 -25896 22787 13875 -33060 6592 32180 -24972 -17485
220 -17485 35878 -2225 -32682 21780 18663 -30736 1567 27975 -18373 -13603 27046 -4250
232 -4250 -23059 19465 9059 -25529 8260 19955 -21145 -4196 24630 -12774 -16568 24456
244 24456 97 -26021 17562 16585 -28992 481 29043 -18583 -19228 28944 1560 -28267 15457
257 15457 17220 -26016 -1011 24265 -15776 -14013 23728 -2361 -20908 15963 8774 -22445 6001
270 6001 16825 -18965 -4216 23208 -11802 -17614 23384 3003 -26802 12399 19109 -23511 -4574
283 -4574 25657 -11102 -18205 21432 3519 -23431 11485 15557 -20682 -1522 21074 -11926 -12689
296 -12689 19550 -629 -17695 13556 8912 -19031 5352 16424 -17297 -5366 22555 -8546
308 -8546 -17510 20762 6367 -24237 8096 19382 -19016 -6805 23218 -6921 -17121 17926
320 17926 5156 -20880 8085 14895 -16626 -3009 18328 -8949 -11065 16353 -867 -16156
332 -16156 12486 8036 -18727 4698 16804 -16006 -7826 20855 -5163 -18494 15864 8803 -20958
345 -20958 3970 17330 -15289 -8296 18854 -4700 -15703 14234 6217 -17806 4456 13366 -13738
358 -13738 -4435 15215 -7003 -10046 14372 -704 -15199 10628 8143 -17796 2223 16894 -12759
371 -12759 -9750 18632 -1786 -17758 12769 9723 -18200 2082 16825 -12088 -9272 17067 -1907
384 -1907 -15284 11280 7577 -14639 2905 12107 -10937 -3577 13510 -6302 -8766 13617 681
397 681 -14539 9255 10019 -15963 -265 16697 -9213 -9833 15941 519 -15884 9490 10251 -15288
411 -15288 -135 15420 -8523 -9063 14218 167 -13147 8140 6683 -11877 2219 10444 -9658
424 -9658 -3791 12493 -5208 -9922 12295 2329 -14264 6836 10416 -13427 -2481 14355 -7019
437 -7019 -10413 13485 1999 -15288 6621 10510 -13420 -2721 13537 -6027 -9023 10512 726
450 726 -10553 6428 4974 -11093 2334 9946 -9819 -3905 12655 -4416 -10610 10510 3964
463 3964 -13149 4358 10820 -10880 -3871 13118 -4417 -10119 10839 3449 -12460 4476 9684
476 9684 -9815 -3159 11323 -3804 -7538 8698 1592 -8614 5369 4943 -9436 2166 9022
489 9022 -8143 -3798 11748 -2712 -9971 9444 4490 -12637 2924 11272 -9322 -4968 12481
502 12481 -1772 -10508 7568 5301 -9857 1434 8130 -6599 -2248 8364 -4102 -5655 8480
515 8480 142 -8871 5978 5422 -9448 479 9100 -6440 -5315 9994 -1482 -9484 7565 4786
529 4786 -11317 1439 10272 -7556 -6277 10246 -95 -10098 5199 5403 -8231 -255 6395
542 6395 -4671 -2086 5761 -3049 -4061 6893 -715 -8097 5643 5166 -9168 -28 9421 -5722
556 -5722 -6205 9067 452 -9031 5259 6047 -8388 -682 8756 -4510 -5592 7830 730 -7153
570 -7153 4372 4140 -6331 836 5841 -4361 -2191 6313 -1869 -4219 6107 417 -6831 4503
584 4503 4507 -7828 250 8884 -4810 -6308 8570 2069 -9299 3017 7172 -6166 -2523 6792
598 6792 -1824 -4716 4393 865 -4431 3121 2102 -5240 1712 4384 -5305 -2025 6432 -2183 -5254
613 -5254 5243 1817 -6851 2460 5153 -6145 -1361 7317 -3170 -6033 6461 2179 -7699 1656
627 1656 5744 -4905 -2850 5292 -1014 -3830 3026 483 -3801 2241 1481 -4331 1981 3685 -4762
642 -4762 -1080 6082 -2642 -5168 5633 2431 -6811 1474 6251 -4976 -3238 6158 -544 -5299 3328
657 3328 2558 -4460 747 4035 -3082 -1289 4381 -1126 -2576 3582 441 -3529 2156 1864 -3688 1243
673 1243 3651 -3432 -1176 5247 -1624 -4725 4830 2274 -6124 1404 5893 -3589 -3514 4896 594 -4464
689 -4464 1522 2737 -2999 49 2104 -2119 -316 2666 -2153 -1562 3336 -473 -3529 2790 2027 -4313
705 -4313 270 4061 -3359 -2197 4322 -652 -4221 2567 2511 -4532 -495 4073 -2087 -2591 3372 178
721 178 -3487 1418 1485 -2565 245 1828 -1393 -298 1923 -1844 -1078 2903 -965 -3159 2830 1667
737 1667 -4033 473 4123 -2606 -2711 3958 1040 -3932 1470 2938 -2554 -1068 2391 -691 -1413 1658
753 1658 5 -1164 1523 448 -1805 988 1355 -1971 279 2448 -1710 -1438 2967 -271 -2804 2222
769 2222 1774 -3294 -135 3477 -1516 -2651 2745 1060 -2883 582 2154 -1292 -880 1257 -391 -640
785 -640 750 -302 -768 1348 -266 -1655 1456 603 -2406 423 2170 -2067 -1467 2726 85 -3097
801 -3097 1174 1895 -2387 -728 2589 -551 -1997 1125 882 -1611 -5 888 -810 -18 618 -799
817 -799 -76 848 -1023 -385 1578 -538 -1471 1600 549 -2229 499 2214 -1649 -1392 2643 172 -2571
834 -2571 1065 1619 -1448 -682 1669 7 -792 801 497 -465 435 118 -640 740 365 -827 979
851 979 856 -1256 -139 1774 -574 -1479 1850 977 -2108 258 1978 -1256 -1256 1635 380 -1324 470
868 470 907 -683 -421 581 -414 -265 494 -768 25 749 -773 -585 1085 -183 -1505 899 1018 -1637
886 -1637 -331 1914 -1137 -1609 1591 549 -1900 199 1556 -1083 -956 881 -30 -850 521 80
902 80 -656 361 -118 -902 570 413 -1235 244 1384 -1085 -778 1611 -125 -1953 1037 1241 -1872
919 -1872 -223 2061 -727 -1612 1232 712 -1523 414 909 -668 32 899 -610 -266 1032 -343 -683
936 -683 1222 -8 -957 959 766 -1547 254 1982 -1351 -865 2315 -22 -2169 1166 1524 -1822
952 -1822 -301 2174 -581 -1240 1394 353 -1517 797 577 -1263 301 997 -1140 -167 1143 -1046
968 -1046 -1057 1489 -105 -1840 1266 743 -2226 92 2000 -1433 -1374 2299 171 -2545 999 1499 -1922
985 -1922 -614 1950 -845 -1300 1509 -203 -1458 748 638 -1475 324 1333 -1295 -283 1826 -1168
1001 -1168 -1151 1862 -246 -2105 1493 1449 -2409 -144 2610 -1037 -1878 2394 577 -2300 979 1713
1017 1713 -1803 -332 1982 -1119 -1074 1706 -19 -1543 1412 633 -1851 757 1531 -1941 -212 2466
1033 2466 -958 -1489 2399 413 -2608 1169 1928 -2345 -550 2908 -938 -1894 1945 680 -2218 713
1049 713 1735 -1839 -417 1656 -1034 -1316 1749 -473 -1629 1480 257 -2201 874 1501 -2350 -445
1065 -445 2701 -1160 -2425 2393 869 -3052 598 2375 -2199 -918 2419 -644 -2035 1878 636
1080 636 -2339 742 1481 -2039 -200 2119 -1212 -975 1909 -366 -1887 1383 666 -2288 983 2153
1096 2153 -2381 -626 2991 -1055 -2702 2783 1203 -3265 698 2728 -1824 -1607 2647 -183 -2330
1111 -2330 1575 919 -1825 827 1487 -1700 67 1971 -1492 -844 2487 -503 -2266 2437 1164 -3014
1127 -3014 785 2745 -2167 -1450 2962 -358 -2726 2047 1302 -2919 330 2702 -1907 -1228 2872 -341
1143 -341 -2417 1612 1102 -2114 621 1474 -1756 -219 1805 -1473 -1157 2631 -760 -2621 2396 1379
1159 1379 -3570 -2 3124 -2162 -2152 3024 258 -3058 1577 1837 -2929 -222 2129 -1501 -1153 2400
1175 2400 -190 -2141 1734 933 -2082 1072 1837 -2356 -232 2513 -1542 -1343 3077 193 -2820 1812
1191 1812 2180 -2968 -75 3349 -1458 -2170 3056 493 -3006 1329 2194 -2457 -506 2427 -1013 -1305
1207 -1305 2217 -303 -1625 1916 545 -2356 1256 1741 -2469 -252 3392 -1478 -2463 3270 694
1222 694 -3433 1391 2628 -2852 -893 3234 -1136 -2373 2378 917 -2943 898 1925 -2368 -365
1237 -365 2217 -1234 -1408 1976 -572 -1895 2083 421 -2936 1082 2212 -3049 -708 3376 -1277
1252 -1277 -2952 2961 1248 -3515 763 2886 -2247 -1459 2948 -592 -2512 2136 881 -2658 814
1267 814 1803 -2042 -163 2116 -1541 -1003 2719 -719 -2289 2334 1196 -3111 1007 3043 -2637 -1231
1283 -1231 3535 -524 -2973 2510 1727 -3371 466 3012 -1902 -1574 2846 -49 -2356 1823 906 -2256
1299 -2256 712 1734 -1975 -14 2341 -1680 -1384 2851 -295 -3068 2414 1856 -3401 190 3448
1314 3448 -2166 -1940 3231 90 -3261 1832 1733 -3090 -58 2799 -1772 -1700 2276 -244 -2444 1546
1330 1546 990 -2446 967 1627 -2535 -317 2749 -1805 -2238 3068 259 -3541 1753 2269 -3190 -643
1346 -643 3367 -1622 -2515 2863 572 -3262 1319 1890 -2503 -365 2379 -1350 -1390 2290 -451 -2072
1362 -2072 2087 791 -2676 1291 2246 -2684 -693 3286 -1254 -2572 2904 1150 -3524 1150 2938
1377 2938 -2766 -1057 3241 -935 -2523 2375 926 -2912 990 2138 -2078 -308 2379 -1310 -1187
1392 -1187 2533 -453 -2362 1857 1124 -3228 901 2583 -2456 -1287 3444 -643 -2920 2760 1259
1407 1259 -3414 497 2862 -2534 -1603 3137 -479 -2723 1999 1108 -2630 648 1640 -2135 -361 2260
1423 2260 -1527 -1403 2690 -409 -2668 1849 1610 -3295 211 2956 -2288 -1731 3300 -223 -3291 2180
1439 2180 1742 -3020 188 2854 -1964 -1862 2727 -247 -2433 2035 1209 -2439 670 2060 -2230 -578
1455 -578 2431 -1319 -1955 2913 92 -2869 1866 1983 -2858 -143 3205 -1534 -1816 3249 219 -2972
1471 -2972 1718 2227 -2491 -346 2935 -1520 -1518 2378 -168 -2454 1677 1003 -2364 841 2021 -2247
1487 -2247 -723 2839 -1016 -2323 2652 677 -2759 1155 2274 -2370 -788 2947 -1339 -2249 2729
1502 2729 406 -3050 1279 2075 -2381 -517 2737 -1141 -1951 2419 112 -2304 1705 1041 -2769 430
1518 430 2487 -2180 -1134 2874 -980 -2344 2376 1029 -3268 913 2489 -2334 -929 2956 -849
1533 -849 -2633 2378 1000 -2668 797 2100 -1927 -551 2526 -1138 -1450 2268 92 -2418 1608
1548 1608 1591 -2889 256 2456 -1600 -1543 2926 -436 -2734 2105 1441 -2846 367 2495 -1907 -1202
1564 -1202 2920 -223 -2425 1787 1215 -2425 306 2175 -2047 -885 2343 -1019 -1882 2070 382
1579 382 -2521 1352 1656 -2326 -72 2596 -1620 -1630 2692 193 -2562 1358 1750 -2891 -21 2761
1595 2761 -1749 -1489 2303 231 -2391 1536 1220 -2168 341 2042 -1631 -892 2352 -540 -2012 1962
1611 1962 730 -2583 850 1890 -2077 -480 2440 -1025 -1959 2266 410 -2819 1383 1808 -2594
1626 -2594 -543 2598 -1280 -2089 2185 464 -2122 1319 1217 -2115 460 2042 -1679 -909 2328 -290
1642 -290 -1937 1988 992 -2196 776 2146 -1880 -574 2445 -1265 -2044 2339 922 -2503 795 1901
1658 1901 -1964 -554 2532 -797 -1861 1862 387 -2133 1091 1425 -2054 139 1817 -1337 -1122
1673 -1122 1790 -610 -1943 1718 900 -2416 720 2080 -1910 -1192 2340 -609 -2362 1603 935 -2539
1689 -2539 408 1751 -1813 -946 2164 -475 -1684 1575 470 -2177 596 1250 -1773 -87 1631
1704 1631 -1377 -1134 1940 -236 -2085 1578 1092 -2411 227 2230 -1622 -1431 2388 -119 -2377 1616
1720 1616 1445 -2192 -13 1851 -1275 -885 1994 -247 -1588 1244 673 -1781 686 1283 -1514 -549
1736 -549 1951 -1064 -1312 2166 -157 -2027 1256 1472 -2153 -279 2325 -1183 -1472 2305 396 -2226
1752 -2226 1121 1595 -1797 -169 1844 -1154 -1008 1625 -161 -1468 1183 593 -1591 909 1195 -1703
1768 -1703 -324 2108 -1016 -1641 1852 424 -2242 673 1751 -1808 -556 2184 -664 -1593 1769
1783 1769 580 -1873 588 1283 -1591 -417 1796 -1022 -828 1775 -321 -1542 1085 780 -1764 343
1799 343 1612 -1479 -730 2207 -514 -1696 1778 749 -2077 319 1995 -1485 -1048 2075 -317 -1661
1815 -1661 1214 768 -1776 496 1155 -1314 -204 1505 -616 -800 1398 -54 -1405 1342 1038 -1855
1831 -1855 460 1905 -1272 -1057 2057 66 -2081 1300 1254 -2031 -257 1758 -948 -1198 1533 -134
1847 -134 -1357 1059 676 -1413 250 1142 -1137 -376 1469 -699 -893 1637 48 -1798 916 1073
1863 1073 -1762 -177 1925 -978 -1250 1819 213 -1715 771 1316 -1573 -323 1563 -770 -1030 1122
1879 1122 93 -1449 929 474 -1408 339 1171 -1081 -423 1574 -803 -1118 1499 508 -1787 732
1895 732 1406 -1618 -346 1926 -439 -1507 1329 829 -1446 601 1348 -1182 -348 1362 -311 -898
1911 -898 1311 122 -1253 663 692 -1148 317 1281 -1224 -399 1358 -493 -1382 1343 629 -1646 410
1928 410 1514 -1085 -720 1841 -170 -1200 1071 668 -1282 195 1022 -639 -558 1073 -389 -763 1038
1945 1038 101 -1150 596 459 -1411 162 1353 -1152 -786 1452 -12 -1577 899 901 -1621 97
1961 97 1361 -852 -1023 1355 171 -1367 771 618 -1000 285 818 -711 -453 818 -374 -753 839
1978 839 213 -1011 539 818 -1180 -241 1454 -525 -885 1342 289 -1224 542 1155 -1180 -132
1994 -132 1318 -444 -886 836 163 -1116 421 657 -883 64 698 -588 -325 920 -264 -584 880
2011 880 204 -1154 346 841 -1002 -315 1186 -453 -911 936 494 -903 319 1012 -826 -324 1056
2028 1056 -332 -808 601 341 -986 132 548 -612 -30 659 -623 -371 960 -352 -793 796 283
2045 283 -1042 43 895 -929 -452 1118 -213 -998 716 325 -967 66 857 -691 -445 784 -237
2062 -237 -615 549 204 -772 269 392 -845 -6 759 -551 -453 776 -69 -753 625 451 -1002 102
2080 102 848 -719 -382 961 -3 -922 567 613 -566 -39 656 -353 -476 550 -96 -366 477 76
2098 76 -746 366 572 -556 -77 816 -334 -330 897 130 -816 550 750 -813 -173 815 -384 -607 776
2117 776 244 -755 339 574 -570 8 577 -315 -306 521 -194 -519 278 184 -621 263 473 -447 -150 545
2137 545 -372 -516 575 18 -624 287 569 -446 -371 680 -170 -749 455 -15 -676 34 346 -627 78
2156 78 451 -332 -209 483 -289 -316 430 230 -548 112 466 -461 -8 625 89 -451 518 35 -453 55 654
2177 654 -503 -449 506 -65 -459 357 372 -359 108 388 -343 -120 360 -252 -326 447 -90 -466 229 252 -477
2198 -477 108 272 -388 -361 520 -68 -620 285 404 -606 103 495 -91 -496 488 -208 -550 152 345 -249
2218 -249 30 314 -119 -207 240 -212 -335 191 43 -240 171 399 -316 110 466 -318 -292 437 57 -570 237
2239 237 349 -302 -6 404 -235 -296 445 63 -301 217 173 -249 88 436 -247 -154 272 -42 -341 231 108
2260 108 -533 200 213 -306 -257 455 4 -290 334 197 -269 18 411 -228 -288 385 97 -267 184 -32 -16
2281 -16 63 352 -180 -60 306 -77 -118 131 109 -360 313 178 -232 153 182 -441 -81 407 -99 -323 130 237
2303 237 -233 18 399 -35 -277 304 -38 -324 172 209 -168 -131 199 -56 -196 101 -165 -135 250 -62 -139
2324 -139 112 23 -323 14 324 -233 -182 158 -39 -343 13 303 -202 -125 356 19 -182 19 187 -160 145
2345 145 316 -116 -34 98 -169 -23 98 -48 -65 231 -26 -213 18 91 -215 34 198 -80 -419 287 59
2366 59 -277 156 284 -131 -227 208 42 -225 147 136 -119 -15 86 -61 -35 103 -33 -40 130 -101 -86 99
2388 99 93 -235 172 283 -138 -212 72 18 -290 176 181 -164 -137 123 28 -178 19 109 -109 -20 -77 -56 -33 -37 -15 -63
2414 -63 -98 -76 75 145 103 -81 26 36 -231 -92 275 -138 -233 208 103 -139 -156 224 -61 -269 178 81 -80
2437 -80 -117 -10 119 -10 93 144 84 -54 -98 -51 103 -95 -7 245 110 -221 -83 192 -76 -171 171 213 -83
2460 -83 38 339 -159 -191 273 58 -140 73 39 -165 -104 104 2 -27 -46 -29 21 -11 -117 -17 111 -87 -118
2483 -118 -74 40 -279 -19 251 112 -322 -17 124 -271 -111 212 -89 -245 35 16 -126 -128 123 -142 -185 -20
2505 -20 13 -147 -5 -29 -52 152 145 -112 225 -41 -80 17 163 -146 -261 172 -1 -276 84 258 -137 -270 253
2528 253 121 -380 148 125 -115 24 20 33 -89 27 90 -22 156 20 -23 142 138 -63 -51 194 -81 -89 228 -23
2552 -23 -325 200 193 -232 -181 407 -25 -382 177 146 -189 -59 169 -115 -150 -7 33 -130 154 -261 -216 -103 0
2575 0 -159 -38 94 -216 107 305 -207 -299 193 169 -202 135 279 -115 -222 230 55 -224 81 154 -297 -60
2597 -60 143 106 -204 -6 69 -109 104 -14 -131 234 12 -187 -123 216 -257 -127 341 -66 -242 116 80 -302
2619 -302 -81 72 -77 -144 109 -24 -195 17 221 14 55 38 -171 -79 -87 -74 50 112 88 -301 184 138 -153
2642 -153 114 214 47 -131 222 -17 -212 139 182 -309 -57 319 -57 -192 119 15 -238 19 142 -126
2662 -126 96 46 -57 -17 180 -68 -216 75 181 -255 64 412 -276 -71 306 30 -329 213 145 -184 17
2683 17 338 -158 -69 200 57 -72 253 53 -166 91 253 -123 -130 245 -55 -107 253 -95 -200 111 253 -301
2705 -301 -129 453 -123 -175 235 -38 -238 357 219 -265 -55 105 113 -60 262 -183 -95 112 -36 -226 135
2726 135 159 -121 -58 99 -40 -182 286 66 -338 207 245 -277 50 197 -250 -42 402 -4 -367 280 192
2747 192 -64 -81 184 -6 -125 389 53 -274 205 170 -266 138 238 -121 -159 257 -23 -290 88 23 -254
2768 -254 -5 187 -236 32 274 -112 -318 125 -40 -390 133 247 -176 -80 354 -113 -106 143 -13 -135 160
2789 160 186 -307 -117 244 -210 -36 277 -108 -224 240 136 -413 140 281 -154 -86 339 104 -291 235 92
2810 92 -275 151 347 -301 -256 215 -97 -357 139 19 -196 45 375 -325 -2 337 -151 -72 304 53 -253
2831 -253 388 202 -283 77 318 -120 -28 369 -90 -247 53 388 -167 -50 310 -10 -75 238 -119 -390 274
2852 274 73 -236 59 215 -238 -2 214 -270 -233 391 52 -308 183 217 -212 26 391 -42 -317 314 38
2873 38 -316 185 197 -309 140 368 -142 -248 222 -35 -248 26 110 -188 64 212 -236 -32 229 -85 -299
2894 -299 305 67 -296 -88 249 -275 -221 294 -18 -159 360 224 -156 50 185 -251 -112 256 -103 -238
2914 -238 103 2 -241 213 105 -331 189 315 -275 -95 340 -48 -211 113 115 -353 226 428 -286 -324 198
2935 198 11 -277 65 119 -281 33 262 -266 -127 176 -150 -236 192 71 -287 258 210 -236 -52 392 -335
2956 -335 -159 338 -3 -497 58 236 -273 125 278 -255 -293 382 7 -308 105 214 -214 127 38 -202 112
2977 112 165 49 -147 55 -11 -246 122 63 -152 14 497 -242 -363 205 254 -269 215 144 -251 -76 341 -22
2999 -22 -192 242 48 -99 16 149 -20 -28 167 -105 82 342 124 -104 282 -18 -293 122 75 -303 14
3020 14 281 -321 -10 302 34 -313 -16 152 -146 -167 341 -149 -260 133 -41 -159 59 113 -244 61 171
3041 171 -293 -174 334 -62 -229 326 -105 -302 308 205 -133 -296 342 -73 -272 102 -316 -250 7 313
3061 313 -74 -87 377 28 -168 18 32 -191 130 -31 -301 -70 163 -155 19 499 -192 -356 82 -39 -257
3082 -257 304 566 -281 -210 251 118 -210 208 247 -136 -51 -82 -86 167 353 -106 -141 239 88 -124 188 154 -371
3105 -371 53 339 -254 -195 324 -52 -197 240 379 -243 -342 74 68 -238 110 81 -201 288 84 -165 30 -57
3127 -57 -362 122 481 20 -26 261 56 -412 91 202 -203 -171 316 -87 -86 213 66 -410 175 124 -241 25
3149 25 182 -7 -226 199 -33 -112 310 38 -384 51 252 -114 -135 185 21 -441 214 97 -118 164 185
3170 185 -199 -102 315 -26 -166 271 -79 -219 141 161 -104 -214 556 -12 -314 154 -113 -77 8 283 -274
3191 -274 137 328 -14 -19 182 19 -224 -28 -11 -190 126 342 -133 -73 192 53 -355 126 49 -310 -127 133
3213 133 -283 -23 83 -23 -205 412 -102 -343 204 106 -294 78 275 -266 -36 342 -21 -382 180 107 -239
3234 -239 227 244 -249 -264 195 183 -146 -76 58 -256 239 14 -179 -112 93 -264 -184 37 -76 -235 6 442
3256 442 -161 91 318 -93 -115 287 177 -254 179 123 -268 58 106 -10 -171 166 -4 -214 106 173 -240
3277 -240 -71 138 -156 -68 168 86 -245 139 62 -327 75 109 -209 -29 50 -24 18 102 90 -190 25 80 -190
3300 -190 85 248 -10 -105 263 209 -218 72 186 -291 -14 242 -120 -19 232 33 7 115 57 -315 121
3321 121 272 -59 26 279 99 -311 246 0 -89 103 260 -121 -71 208 -28 -215 174 20 -275 128 158
3342 158 -112 -23 152 -142 -96 291 123 -65 -68 289 -159 290 299 -97 -180 186 -219 -395 97 44 -179 20 358
3365 358 -328 -131 212 50 -310 381 47 -191 199 82 -173 -170 105 -171 13 73 41 -311 128 80 -208 -15
3387 -15 93 -168 -429 219 -141 -378 138 21 96 -41 -6 -59 -14 107 -30 41 299 29 -106 -83 174 -74
3409 -74 174 238 14 -82 -238 268 -315 -93 157 -318 -70 122 -293 -149 29 -99 -261 217 176 -329 -150
3430 -150 368 -24 -136 124 180 -18 183 130 -130 67 76 -168 -77 147 -183 297 83 -56 -241 141 193 -165
3452 -165 114 56 -171 -132 430 164 -176 217 -146 -142 -4 20 9 16 74 108 -165 273 214 -106 79 76 -307 -157
3476 -157 90 -397 70 34 163 -210 38 101 -91 -206 239 -83 -293 170 132 -357 -44 211 1 69 143 -65
3498 -65 -183 93 98 -345 -58 70 -238 80 57 104 -50 205 -191 -109 260 115 -355 165 330 -155 -144 263
3520 263 -178 -311 136 205 -163 216 183 -56 -164 66 45 -153 45 -109 -87 121 22 -142 -113 95 -117 13
3542 13 209 99 -138 3 197 -333 75 215 -264 -128 143 61 -255 117 28 -313 -351 159 -69 -58 274 188
3564 188 14 243 -64 -20 -56 -8 -128 -244 215 -34 -216 185 122 -32 293 -138 -39 -223 160 -33 -201 115
3586 115 24 -128 111 -2 -173 124 294 -228 -134 148 -74 -214 223 89 -123 96 114 -133 -43 267 -294
3607 -294 -114 -57 -6 -243 -54 181 -98 45 144 -49 -24 -44 -59 0 -5 101 -309 18 -74 -194 -21 49 -23 -99
3631 -99 97 75 -394 20 0 -172 -127 -84 -63 -258 119 272 9 -289 342 171 -99 245 -252 -71 46 119
3653 119 -145 30 38 -173 -71 170 -50 38 -69 -281 -247 15 260 -44 -85 164 23 -124 -56 105 -444 120
3675 120 134 -244 -19 26 -168 6 188 -198 -43 -67 54 31 -86 209 -68 16 252 -88 -61 167 134 -188
3697 -188 49 76 -418 -104 -58 -17 -144 195 122 103 63 20 331 -249 -22 -80 -86 177 -62 -261 41 -111 -125 335
3721 335 195 -157 23 -43 -72 -299 110 61 -73 73 212 -178 -81 57 172 10 -3 76 -142 29 157 123
3743 123 64 92 -98 -106 112 -10 -319 -8 -17 -128 -58 142 8 -126 -57 45 -28 -63 113 -169 0 245 -39
3766 -39 -143 108 20 -72 -27 197 65 -31 206 -16 -39 238 29 44 -53 -81 -185 108 106 -81 -44 50 -159 65
3790 65 113 6 -73 116 478 -31 -31 -20 -198 -141 -100 -195 -1 74 -27 -131 -58 80 -146 -91 103 -72 -75 103 38
3815 38 -136 -208 65 -50 -47 72 -75 -50 -79 74 -83 186 297 -42 -57 55 -190 -55 -102 -93 -42 -36 -43 -40 -124 162
3841 162 -136 -33 33 -335 -181 45 18 -52 -181 97 -53 -11 140 11 -111 90 -25 25 -73 -122 398 -260
3863 -260 240 100 -239 147 88 -5 320 144 -162 148 43 -324 -215 192 0 -135 -71 -23 -319 -138 211
3884 211 58 -194 215 -60 -173 48 26 -334 -207 104 28 -16 -126 164 3 131 111 -46 -43 62 -257 175
3906 175 -22 -105 49 182 -23 -114 109 97 -212 -89 380 98 -160 128 121 4 -6 222 131 -258 338 3
3928 3 276 65 151 161 87 49 59 149 -23 -276 25 141 95 -171 222 56 10 117 160 -103 -17 131 79 -223
3952 -223 241 -6 -151 37 230 169 -30 105 149 -157 41 -131 -53 43 127 92 -96 -93 80 -18 -40 84 -23
3975 -23 138 37 83 -47 327 -49 -109 -33 181 23 -309 46 -142 -80 81 -145 -64 -123 201 -106 -99 155 53
3998 53 -159 -28 0 -319 186 191 -174 -26 233 -22 17 53 -281 117 353 -64 -81 -131 87 -95 -33 9 155
4021 155 -14 11 164 -83 180 -32 -29 -19 166 -338 44 334 68 -14 293 -7 -153 -81 175 63 -64 -128
4043 -128 -109 -140 337 -84 -68 -4 190 -18 -70 190 56 -91 48 -123 -123 147 -91 -20 -111 114 -333 -181 109
4066 109 53 -189 53 74 -281 -6 469 5 85 -153 -239 -15 317 212 -15 218 119 -80 128 372 71 -306
4088 -306 213 317 57 127 185 -193 42 77 29 3 3 73 -74 115 55 31 -110 141 69 -82 18 -48 166 -104
4112 -104 249 -183 -150 76 -64 51 38 -172 -149 159 -62 -4 108 165 -146 72 173 -87 -397 -162 -199 -175
4134 -175 -77 88 -202 12 85 -76 -205 -71 195 9 259 -155 -105 1 26 -346 -110 -163 151 -43 1 57
4156 57 -87 -26 -76 19 -91 14 -32 -91 121 75 -230 92 105 197 -140 12 -12 43 255 -35 -107 54 237 -4
4180 -4 97 46 302 -264 27 -55 -105 -115 -137 -60 -246 -8 -226 -271 -110 56 -46 96 192 -119 -49 87 -91 -14
4204 -14 36 -80 -90 -14 113 -246 -334 -41 -235 -156 38 -113 -167 80 -3 37 62 -358 92 -110 -116 -192 -251 138 186
4229 186 -54 208 216 -329 133 225 -180 16 -241 -121 261 -113 265 -166 -59 85 153 -69 -94 68 29 -66
4251 -66 -4 -128 0 209 -131 -85 108 113 -88 38 104 -254 87 53 -87 -298 213 -142 -2 113 -44 82
4273 82 101 -10 5 -105 37 -7 -350 172 323 -42 264 44 -112 -137 111 64 -241 90 34 -284 28 309
4295 309 -167 199 37 109 -177 346 166 20 62 6 -65 -196 359 -165 -56 -86 -331 94 27 -124 -141 -132 56
4318 56 -229 -17 242 -189 -455 -47 136 -42 -66 19 81 46 113 33 -86 190 34 -39 -43 45 -70 4 -167 -75
4342 -75 -252 215 -68 -177 53 -85 -6 9 173 -234 -250 96 22 -159 97 -30 -298 117 -58 3 -119 226
4364 226 -75 -205 181 43 170 -153 195 -254 53 159 -215 -43 -13 -108 -78 -86 -4 -100 51 21 -61 -152 54
4387 54 -43 16 125 80 -93 -21 135 -106 164 -161 -12 -73 5 -62 -67 165 63 -98 -28 -49 289 -146 23 -134
4411 -134 -187 196 332 -247 -32 206 -191 -84 124 64 -160 -55 -352 169 -98 49 150 -158 100 33 -170
4432 -170 50 125 -296 142 309 6 -128 282 -322 -121 176 -55 -61 234 355 -41 3 -135 172 73 196 -78
4454 -78 -130 196 -170 -42 64 -11 -204 -271 1 -227 -207 -136 13 -26 -20 223 -61 139 120 7 -198 38 345
4477 345 -67 2 163 -212 39 317 208 -157 18 222 -198 162 53 -183 -9 -4 -30 7 54 5 -282 -264 -121
4500 -121 -43 -219 94 -186 -55 153 37 -166 -22 85 34 119 -136 -134 49 -88 -74 -278 169 33 -210 12
4522 12 -150 -93 -159 330 -107 -110 65 54 99 17 -35 -183 -153 -103 78 -72 -126 -45 0 -300 -177 -70 170 23 63
4547 63 -200 155 -69 56 -12 38 -108 -257 -33 -271 -213 300 55 -101 55 -60 -51 96 104 120 -71 -65 11 5 167
4572 167 -20 -108 -121 318 -134 116 248 -117 -17 198 44 -99 92 289 -289 -58 155 18 60 41 -116
4593 -116 -22 250 130 -96 -8 181 -109 -257 58 48 -163 248 -25 -125 -178 135 -126 182 171 10 84 66
4615 66 38 -121 -54 54 -158 -188 15 15 132 0 61 -160 86 -12 0 -81 75 -64 -115 36 -15 -166 99 249
4639 249 -76 -126 117 50 -365 252 44 62 22 -34 -126 -72 232 -110 -114 -27 -151 -74 172 -54 -131 -15 -66 -172
4663 -172 35 137 -3 -109 -31 220 55 70 144 -166 -19 139 -162 -166 -105 85 -53 -160 -38 94 -200 174
4685 174 -185 160 101 236 -89 98 20 -365 -122 158 -27 -97 158 -63 -3 -162 -48 -49 -37 69 -230 -121
4707 -121 339 48 -148 54 114 81 -75 -39 -16 -176 373 30 -302 149 -70 -73 15 153 -226 -24 95 -31
4729 -31 -83 1 -88 -298 33 228 -216 -41 90 -65 -107 -5 6 -255 10 -66 -119 139 49 -44 -50 244 -127 -213
4753 -213 197 78 -122 -138 90 -75 -286 94 126 -191 159 -18 -278 147 61 -9 163 -133 -165 39 17 125
4775 125 -386 48 25 -169 11 -131 -178 -221 4 -247 -196 274 28 -247 31 -155 -19 -128 164 -5 -111
4796 -111 205 89 -65 -95 159 -178 36 117 -164 -173 92 24 -179 -26 2 -109 -138 72 229 -94 145 62 -79
4819 -79 105 96 80 51 219 86 -70 -148 72 -183 -68 -168 -60 -171 138 -110 3 149 -6 2 99 172 -153
4842 -153 91 214 122 -149 93 8 14 131 -18 -1 -24 81 12 61 228 -127 -181 286 -42 117 33 98 -151 216
4866 216 -162 -37 -38 115 -151 -12 142 -47 -247 38 -29 -85 -92 78 -101 -183 24 47 -301 117 69 -4 -44 121
4890 121 182 -106 68 -57 -233 278 -8 158 -146 225 94 -117 125 -68 36 58 -155 44 78 -29 -90
4911 -90 66 -4 69 -324 65 45 -4 -145 88 -100 -141 29 -84 -51 67 45 -115 44 107 -147 -127 103 -61
4934 -61 -177 28 15 -54 -66 108 -42 -17 -46 -256 29 114 -54 -52 -83 107 -29 -18 -104 -14 63 258 27 8 -24
4959 -24 74 -8 -76 236 -52 -55 95 -70 -41 44 103 -114 18 99 -16 -20 73 -4 -188 81 15 -115 64 110 -76
4984 -76 -1 84 3 -68 48 7 -84 93 14 -45 -21 88 -66 22 65 -40 -99 50 160 -166 100 -18 -29 -93 75
5009 75 43 -57 77 -47 13 60 54 -37 -13 88 -28 10 70 -53 -114 49 85 -73 -45 52 44 -16 -5 -45 -118 -90 136
5036 136 -19 -4 100 -84 -74 25 15 -39 90 107 -34 87 -32 -15 15 -57 -55 -29 67 182 -50 35 87 -75 -57
5061 -57 138 -133 -30 117 -62 0 12 -18 36 -75 158 13 -144 87 -18 -108 -84 97 -56 -197 -56 -89 -48
5084 -48 95 106 -50 72 129 -38 3 62 29 -83 92 32 -1 -17 104 -153 -87 9 2 47 8 -45 35 -22 82 -217
5110 -217 -78 -11 -48 4 -18 -11 -12 93 -74 -87 9 60 -153 203 75 120 -67 9 -10 -239 -56 109 61 48 221
5135 221 3 -42 46 117 -121 52 2 -150 -29 10 43 -101 49 107 -108 6 89 -14 120 -81 -54 -39 7 30
5159 30 -35 16 -18 -60 -56 -28 29 -213 -13 -80 -127 -99 -74 -51 76 45 -23 -5 118 -153 -196 -9 -69 -44 78 55 46 18
5187 18 69 -14 -61 64 -23 -65 102 44 -56 -58 155 -46 -52 -32 -5 -11 179 -15 -177 -43 17 -146 16 125 -147
5212 -147 -46 -23 194 -13 -3 0 -15 31 57 -89 -30 -51 15 1 -42 92 -45 -87 34 -193 -29 -36 72 0 -67 -120
5238 -120 -116 -12 -73 -95 -20 26 -125 32 -81 109 -104 79 86 -14 -4 195 -110 1 35 -23 -150 -37 96 -74
5262 -74 -94 -156 -9 161 -99 -20 -87 -13 199 -43 153 7 -186 11 58 -48 -2 59 89 -158 121 174 -27 7
5286 7 82 7 -22 146 -22 -77 47 13 -49 88 -50 -89 3 -60 -17 -49 131 77 -5 -36 -42 10 48 -34 -58 -143 -11 99
5314 99 -133 -98 -21 -13 -86 36 -79 57 45 170 -173 26 90 -81 41 162 -4 -129 -95 158 21 -13 132
5337 132 -96 -18 -60 46 35 64 45 -155 105 -89 109 41 109 -54 34 55 -70 -83 -7 -4 -120 -43 -4 5 80 82 74
5364 74 -55 18 -160 -173 103 1 -95 -31 25 58 48 40 8 -51 -50 99 108 -14 118 23 -76 50 88 -69 8 52 -12
5391 -12 -162 78 12 -19 -11 -25 53 89 69 -86 19 -1 -89 2 13 -1 -36 134 -84 -83 23 56 49 -49 65 -11 29 -53
5419 -53 30 -90 41 -5 52 51 134 42 13 62 67 -72 -10 51 37 -78 178 9 -69 -25 -54 70 49 -16 -2 -124 -6
5446 -6 54 -98 -15 45 -47 34 -57 5 -66 21 12 -31 31 -2 -70 -1 40 -63 68 44 46 -36 16 23 -34 21 29 -55 -46 57 -25
5477 -25 -15 4 18 -33 -2 -3 -53 -35 45 -43 4 33 -8 -15 74 -14 -18 5 50 -85 -25 -20 -59 27 114 27 -48 46 -90 -1 -42
5508 -42 47 -39 -61 69 -1 38 72 10 35 27 43 -14 -27 52 -66 -41 61 -1 -14 14 70 -8 -45 64 -52 -30 39 46 -20
5537 -20 -12 61 18 10 70 -9 -69 59 53 -48 16 -3 -3 -28 38 -57 -61 73 -35 14 -9 34 -13 10 50 66 -61 37 11 -26
5567 -26 34 30 -11 14 25 9 -39 27 -33 -25 55 -33 -37 15 -2 -16 -12 31 -41 -18 9 -19 -8 -54 36 -21 -16 44 -26 -28 37 17 -33
5600 -33 2 30 3 -12 5 -17 -19 34 3 18 35 79 -1 33 39 -6 -29 3 24 -47 41 -36 -58 -17 42 -45 -23 71 42 -41 17
5631 17 13 -39 -13 9 -35 10 16 -16 -29 -20 18 -46 6 66 -8 14 36 -25 -50 51 5 -20 82 70 -39 5 -14 21 -30 2
5661 2 -23 -4 37 0 -9 26 51 -16 -37 25 3 -10 -19 -9 0 -32 75 -1 49 23 -3 -21 -13 21 -57 47 -7 16 -47 -7 11 -34
5693 -34 10 -29 -76 6 15 -7 -27 22 -25 -15 41 4 -23 -35 22 -81 -54 37 -2 -10 28 45 -39 23 -15 -8 15 61 -25 -46 23
5724 23 -5 -17 41 11 13 -16 5 38 -75 80 -2 -9 -22 -19 -10 22 29 -34 -38 39 -38 14 17 -14 17 33 58 -13 46 26 -3 -7 97
5757 97 25 -4 14 -49 -23 -38 35 -4 -2 9 27 16 -23 -51 -30 -2 77 -49 -6 10 -13 -59 23 2 -28 19 30 -40 -26 25
5787 25 -41 -17 -6 10 -51 14 39 5 21 65 -58 -16 -13 28 7 6 10 -77 44 14 -21 -17 25 30 19 47 41 -13 40 -4 22 -40
5819 -40 38 16 -53 -7 31 -41 80 -31 -60 -26 43 -22 -102 21 -5 43 43 0 -8 21 54 -9 -41 4 22 -75 37 12 -24
5848 -24 -17 -20 -35 -41 2 2 -48 30 4 -31 -12 -23 -26 9 33 -24 -49 29 32 -50 2 -14 13 -30 70 -30 -90 -27 -46 -116 24 65
5880 65 -31 -25 68 14 4 27 35 34 15 23 -26 -13 94 -13 24 34 8 -36 17 44 -22 2 11 -41 -52 6 -13 -20 8 3 -10 41 135
5913 135 -14 -40 16 -31 -114 10 27 -71 6 -30 -9 39 17 -32 -44 1 -39 -63 -13 28 -2 -29 31 -35 -18 23 4 -11 -3
5942 -3 55 -52 -12 47 40 -56 -25 46 -46 96 31 -33 -4 60 -12 -14 50 -79 -37 27 52 -15 6 -4 -36 -17 23 24 -58 25 33
5973 33 -6 -21 15 18 -49 45 45 -42 -1 2 9 -1 24 -41 14 -3 -2 25 8 -65 41 35 -38 7 10 17 7 -1 -28 6 -57 6 -2 27 -31
6008 -31 22 18 -37 38 17 -30 4 33 -14 40 -30 -30 -18 34 63 0 58 -20 -40 11 62 -19 28 44 -31 11 72 20 19 22 59 -5
6040 -5 66 0 -23 34 -5 -11 -22 29 14 -45 -48 36 -12 30 8 0 32 -26 -6 -52 -16 27 44 -32 15 -6 -34 -26 -50 -132 48 57 68
6073 68 15 60 58 -41 62 -30 -8 12 83 12 22 20 -24 0 100 -69 -47 17 34 -13 46 77 -6 34 51 22 -48 45 21 13
6103 13 37 43 -58 -11 -43 20 -55 100 -26 -12 -6 7 -8 -29 -4 -32 -18 34 3 -25 72 -3 -55 -38 85 69 -29 22 -26
6132 -26 7 22 27 -23 15 -20 -7 20 -22 35 -39 3 11 7 25 3 5 -21 0 21 -73 -3 -4 -4 -34 30 -19 -17 -8 -1 -11 26 85 -54
6166 -54 -30 24 61 -15 23 35 -47 92 9 91 13 31 -29 11 49 -48 6 25 18 -37 58 73 -62 -17 3 -33 -20 7 -8 -60
6196 -60 -7 -5 -31 29 24 -27 -23 -17 -7 -82 -14 -39 5 19 30 6 18 15 21 -9 22 -31 28 -16 15 -30 20 29 34 8 -17 38 24 14
6230 14 -6 14 39 35 28 -37 -25 3 -20 19 37 -17 31 75 -39 -63 47 -17 -19 17 -11 -11 -45 36 -36 10 38 46 -35 7 17 -7
6262 -7 36 66 -4 56 20 16 18 29 81 -32 10 114 -126 61 60 -33 0 -12 -8 -34 17 32 52 27 -9 -51 -22 -22 21 -67 -40
6293 -40 -13 -8 -3 11 -28 -41 11 -35 -37 -49 -23 -36 -21 29 -17 -110 -20 -24 10 -6 -22 -37 56 17 3 12 82 51 6 33 6 16 24
6326 24 32 -20 -7 -85 48 -15 -40 19 -29 1 -25 26 -21 40 22 -34 26 -71 24 -56 58 -35 12 70 48 2 77 41 47 22
6356 22 41 -34 -18 66 54 2 -13 2 14 79 26 -58 19 40 -16 14 33 11 -49 18 8 42 -29 39 -86 -12 -9 -77 46 15
6386 15 -29 -62 27 11 -110 -18 21 -3 14 -37 -56 -79 27 -44 29 -31 36 3 3 41 52 -7 2 -27 -13 -51 55 -109 57
6415 57 1 64 -10 -86 47 -78 1 28 -30 -36 44 -52 -54 22 26 -22 6 28 -43 -11 32 24 -14 105 2 -22 34 -10 -51 47
6445 47 47 19 -55 71 72 81 76 -69 17 36 62 -83 -69 -33 11 -6 0 59 13 67 18 -43 -42 -68 -8 -36 57 32 38 70 27 62
6477 62 -23 -2 -54 1 47 7 -44 74 -87 64 56 6 -4 -69 2 -76 -44 29 38 -48 38 46 -24 51 -9 105 41 5 9 -100
6507 -100 126 -8 -57 -32 -32 -7 -20 107 73 -43 43 41 -93 -26 70 -7 -110 -9 105 10 50 -81 103 89 5 1
6533 1 93 39 -61 -21 -46 68 -17 -46 -6 -1 -125 103 -10 -32 29 -31 151 11 82 79 -59 11 68 -7 -72 80 -68
6560 -68 -50 109 5 22 -13 7 -16 -34 -47 -53 -125 -10 -51 -10 96 7 -19 23 67 7 29 75 51 17 -102 93 -40
6587 -40 78 76 -149 -64 -15 -116 -18 89 -70 135 -62 42 23 -29 29 -36 -123 39 -54 -68 73 27 33 -25 76 93
6613 93 -49 143 25 -121 49 111 -236 -75 -49 -64 -80 144 -77 -89 37 -84 -11 -21 44 43 120 80 -153 76
6637 76 148 -231 2 -25 -102 -23 -53 140 -16 45 95 -110 12 31 66 -16 155 105 8 -10 -34 -47 -21 71 -38 35
6663 35 18 -26 5 -74 30 4 41 18 139 -151 57 -5 -113 -3 -102 153 -2 -10 -13 19 54 191 40 -1 70 -28
6689 -28 -89 -55 -18 -38 -60 -13 -16 -62 26 3 108 2 -13 -46 160 -59 37 -66 -74 -18 -71 -83 -21 -81 182 79 -55
6716 -55 97 73 29 -69 61 -108 -73 -7 -69 -59 36 -43 -67 50 95 171 14 66 13 -46 -48 -227 71 6 -143 -32
6742 -32 65 86 -9 177 -164 -117 -49 63 36 -74 132 -115 -89 -106 -51 8 -83 102 -2 -48 -8 -25 -61 -102 -24 40
6768 40 55 6 44 -11 -32 80 32 19 36 -58 -59 18 35 21 11 -77 -63 -60 6 -60 84 9 50 60 -46 10 -73 -105 121
6797 121 -64 32 -7 -33 -81 4 -85 7 92 -24 -32 -119 -45 55 -21 -28 -2 28 -11 23 -116 -47 68 -49 -108 26 92
6824 92 -211 -154 44 -26 -29 -86 55 -19 198 49 -6 -33 -177 61 5 -87 220 -114 29 93 75 -54 7 32 87
6849 87 242 -115 -175 -132 -68 -1 -101 -82 -225 -100 3 -104 -57 4 -72 21 -96 50 36 -86 168 -20 6 -104
6873 -104 -24 -11 110 12 -76 13 -62 -162 128 -33 -154 -22 47 38 47 -63 157 -17 -68 165 82 -4 46 -142 -26
6898 -26 -52 20 53 -119 104 -135 5 22 -23 -32 104 184 -30 -89 -40 -93 -147 62 -39 -107 -124 156 -201 -83 155
6923 155 51 78 55 294 -14 -16 -109 75 38 189 -36 -8 38 3 12 49 9 -5 -21 28 22 -63 108 50 -207 106 -16
6950 -16 28 69 80 -22 -78 73 80 -34 74 31 -89 33 -23 -94 75 -23 7 103 105 91 -4 -96 -16 68 38 -141 60
6977 60 15 225 167 48 -10 87 -82 -91 -6 -42 54 80 -49 -115 -3 -17 -64 86 49 -155 59 67 -148 -83 -177 20
7003 20 -24 49 4 -17 -45 -96 27 69 -65 75 5 81 14 -247 -85 -17 31 18 98 104 148 28 5 -118 35 45 -47
7030 -47 -96 46 -264 110 -98 115 -289 48 -112 -192 133 -100 185 -133 7 -12 143 -158 97 44 -172 -99
7052 -99 -259 23 79 18 -60 87 155 -5 55 -105 30 66 -65 244 40 -89 -35 63 26 -153 -108 -45 -147 -38
7076 -38 -107 -2 95 -115 -146 146 235 15 1 -100 32 122 112 -29 94 187 -89 -6 171 107 166 73 137 -71 45
7101 45 -59 83 -216 157 76 81 -95 -24 71 22 63 -102 19 81 -77 -4 -12 152 43 168 64 -454 -53 81
7125 81 -12 154 -113 214 -139 -98 79 89 -50 -187 -67 25 59 -14 160 42 -111 -11 -203 65 30 -26 129
7148 129 -9 31 -181 -185 -26 37 288 -14 105 136 -91 8 -134 1 -33 86 100 156 -3 -186 -101 -174 -153 98
7172 98 -89 124 57 -209 -157 18 -69 39 192 -116 -123 137 -241 351 -164 -15 74 -36 -200 146 5 26 -84
7195 -84 107 57 181 -246 288 -23 -80 128 28 -108 -284 -94 -63 -78 -39 40 -85 41 47 -123 -86 76 48 42
7219 42 190 -90 -51 -230 42 196 -82 -15 -280 94 164 194 -12 -34 219 10 -57 74 -36 -9 1 157 80
7242 80 14 -4 -64 341 73 127 102 -175 -354 88 -132 -14 31 -118 9 -78 220 -239 230 14 -84 207 113
7265 113 -12 57 -50 223 212 -134 103 60 81 -294 -31 -119 -280 228 32 -104 -24 272 -56 -418 -247 -234
7287 -234 169 -634 -325 304 -84 240 -59 -125 25 54 -164 6 -10 125 -229 84 -53 -183 381 25 -227
7308 -227 115 126 -143 -173 -89 162 212 -417 -178 0 187 110 183 -306 -260 179 -32 96 166 -148 -405 -328 23
7331 23 -84 55 21 6 -145 220 -24 -119 233 414 -47 237 30 132 -138 -153 -192 60 146 157 -199 -14 -114
7354 -114 176 96 -46 214 186 14 -285 -108 36 82 -98 -116 164 179 -12 281 -23 118 -94 205 90 -296
7376 -296 129 -124 -188 43 29 -42 -384 141 -5 28 80 93 -175 -122 -33 64 48 86 -182 -55 -8 -11 70 -192 -160
7401 -160 427 -221 83 -242 -89 -348 89 -123 349 6 -109 112 135 -277 110 94 -110 127 165 -90 225
7422 225 120 -34 -229 105 113 -198 -76 203 -66 -94 113 40 33 18 115 5 135 -30 -138 130 73 120 -170
7445 -170 142 50 106 -28 -4 -172 1 -96 56 -46 -21 -76 -17 -26 306 72 27 -111 -84 -63 92 147 37 187
7469 187 -139 -31 37 18 -36 -163 59 219 217 -240 -59 -147 -36 2 189 49 107 66 -56 -197 -167 -18 93
7492 93 214 92 0 -293 117 105 88 30 -85 97 230 -67 -16 242 -46 64 -13 33 -151 130 -91 -3 139
7515 139 82 39 -14 -123 83 27 172 -194 -191 -272 -86 -39 -177 74 73 183 -30 48 7 79 127 -79 18 -50 -170
7540 -170 25 54 -51 -133 80 -13 133 0 -147 -64 37 -5 -31 67 26 102 -231 107 -181 0 -119 167 -222
7563 -222 -224 -198 -77 -105 -8 -78 -181 46 10 -65 207 -62 48 54 -53 35 8 -24 171 -166 -209 186 41 -80 -109
7588 -109 67 72 59 -10 -35 102 100 191 120 -100 -48 81 120 27 -53 23 -172 -68 -169 210 114 224 98 67 -138
7613 -138 29 143 -26 190 41 243 -153 -89 -12 65 69 -40 85 88 -127 -159 80 -5 99 -43 115 145 129 -162
7637 -162 127 -263 -55 89 -19 -72 -39 105 -44 -87 -121 7 172 272 206 335 -106 -10 -10 -215 240 -18 -208
7660 -208 -9 71 133 301 94 49 80 257 95 70 204 61 -268 331 -198 -181 -241 -55 -12 9 78 -60 63
7683 63 149 -63 -74 168 26 -38 -72 78 31 243 124 -49 54 14 19 137 -94 133 -28 -198 278 302 -91
7706 -91 22 94 -57 -114 -72 81 196 -142 113 71 187 350 -35 -120 -20 -59 -196 -43 -63 49 65 -22 102
7729 102 -168 -321 -163 -174 219 7 331 -92 241 -112 116 -131 -348 95 -38 -240 55 167 110 200 171
7750 171 -7 142 -200 -191 44 61 3 127 -364 -159 202 -397 3 104 -9 -552 -140 -4 85 -159 -296 -113
7772 -113 61 248 109 -37 268 -40 -68 -356 305 -82 -154 1 110 -319 -180 31 -52 -13 -133 72 49 105
7794 105 -49 110 129 58 20 406 -7 -341 -50 -29 -196 217 -66 -111 68 -92 -436 -11 -159 211 -251 -131
7816 -131 8 13 82 -47 27 -44 -148 -17 2 -193 -30 -167 -130 -173 2 -243 87 46 131 207 475 103 137 282
7840 282 -51 -508 -550 13 68 -83 250 446 -70 221 -557 -107 110 -137 225 -127 432 -501 -247 149 322
7861 322 10 -178 52 100 -346 442 130 400 -290 -114 143 -14 321 -222 238 338 -16 -133 241 -78
7881 -78 71 -97 290 92 17 -217 -470 351 -63 -432 -11 -171 118 207 165 215 -366 144 -24 -133 67 -243
7903 -243 260 -211 51 484 132 179 248 -28 182 77 -125 352 155 -16 10 0 -235 -218 148 264 169 42
7925 42 276 -79 72 304 237 210 -85 -193 89 -20 92 212 6 160 -446 117 -100 -174 -178 -71 -23 -119 229
7948 229 53 6 405 149 97 -24 47 162 -264 -80 60 -6 -227 286 26 1 65 195 127 83 137 -43 -20
7971 -20 162 268 61 167 -282 175 -59 264 -88 -32 93 174 110 125 250 -195 -214 -146 63 140 226 -99 -185
7994 -185 -38 -72 -55 -104 32 -55 -126 159 -203 -284 201 -68 -51 74 -7 -59 74 -85 -15 60 212 221 -12 -124
8018 -124 18 -246 141 0 -294 53 85 -6 -75 -40 -91 132 54 54 -11 -15 -21 -32 -36 -80 -372 90 -200 -108 80 184
8044 184 26 -278 -283 -195 -23 -155 -201 10 27 -167 51 171 -83 -110 359 -329 127 -172 53 -115 -37 -58 270
8067 270 268 186 -87 -4 -103 -59 18 56 22 -15 -81 221 220 -8 125 -11 -3 177 5 -386 109 162 -174 193 354
8092 354 -30 -338 136 -151 216 -130 -36 -316 294 243 -270 122 -194 -283 85 -87 15 155 316 188 -249
8113 -249 101 345 196 254 -305 -135 -58 156 111 -65 -79 99 -98 141 295 -219 59 -185 -52 84 272
8134 272 222 122 139 154 -85 -107 -70 177 -157 -95 -18 146 -260 33 -161 -61 -135 -327 160 76 4 230 -115
8157 -115 -100 142 112 117 204 -111 -297 60 -173 258 275 98 -41 -53 170 40 175 53 -162 12 159 -16
8179 -16 -156 246 175 6 -3 132 -262 -227 336 40 -158 -34
8191c4
$$ Imaginary data points
##PAGE= N=2
##DATA TABLE= (X++(I..I)), XYDATA
0 0 0 0 0 0 0 0 0 0 0 0 0 0 0 0 0 -8 8 -8 8 -8 11 -16 16 -24 24 -25 32 -40 41 -48 56 -64 72 -83 96 -104 120
37 120 -135 150 -167 185 -206 230 -254 281 -310 342 -377 416 -458 504 -556 614 -677 748 -827
56 -827 916 -1020 1140 -1282 1451 -1656 1914 -2247 2697 -3339 4334 -6099 10141 -39117 28854
71 28854 69464 -69593 -3882 73522 -26279 -54452 48020 3883 -48359 30156 29040 -47777
83 -47777 12103 41729 -39943 -14646 52171 -24345 -41914 47703 9938 -55164 31077 42102
95 42102 -55628 -7855 61604 -32857 -44459 59179 9712 -63840 30631 50012 -52587 -15530
107 -15530 56604 -22210 -42396 43434 12198 -41476 23968 26412 -40053 2391 34871 -31929
119 -31929 -12238 47696 -16647 -39633 44747 13475 -57681 20063 49602 -47117 -23100 57329
131 57329 -10880 -48490 37709 23214 -46608 10126 37045 -36262 -14087 42169 -16013 -30871
143 -30871 37295 7776 -40278 17774 24467 -37151 -1333 35924 -24602 -17636 41077 -9045
155 -9045 -39921 32736 19278 -48226 7217 45041 -32097 -26132 45131 -1652 -43001 24369
167 24369 23372 -36499 1859 31501 -23347 -13474 32177 -9584 -25321 27673 5797 -33422 17411
180 17411 23542 -33701 -1390 36872 -21765 -24429 37546 1956 -39155 22205 27304 -36845 -3958
193 -3958 38136 -19105 -24383 33628 2717 -32536 19237 19987 -30340 474 28743 -18736 -14001
206 -14001 28584 -5351 -23169 22339 6985 -28224 14037 21598 -28992 -3570 34412 -17134
218 -17134 -26383 31790 7929 -35691 12952 27045 -27500 -9009 30376 -10982 -21927 24057
230 24057 4747 -26370 12904 16701 -24744 -863 23451 -16029 -13053 24224 -4549 -21678
242 -21678 19402 8174 -27331 8365 22372 -24484 -8505 30721 -10280 -25671 24379 9883
254 9883 -30294 7119 23785 -21902 -9331 26429 -7950 -20219 20437 5818 -23564 10127
266 10127 16086 -20058 -1213 20837 -13505 -11792 22483 -3654 -21349 18815 11347 -26257 4956
279 4956 24131 -19006 -12102 26358 -3147 -22233 17643 11373 -23567 4428 20444 -16820 -8442
292 -8442 22447 -5136 -17519 16922 6151 -19761 7430 14550 -17098 -1460 19079 -11859
304 -11859 -11798 21004 -1674 -21150 15502 12661 -23227 1038 22777 -14463 -13869 21999 -354
317 -354 -21090 13540 11781 -20630 1393 18189 -13718 -9752 18438 -3548 -15546 13441 5489
330 5489 -17414 6667 12537 -16993 -2223 18762 -10717 -13283 19138 946 -20981 10476 14283
343 14283 -19527 -2468 20393 -10172 -13324 18072 1145 -18742 9912 11569 -16678 -618
355 -618 16760 -9637 -9563 15013 -1667 -13494 11335 5298 -15659 5935 12589 -14897 -3554
368 -3554 18092 -7346 -13839 16797 4526 -18876 7692 14258 -16143 -3747 18586 -7200 -13118
381 -13118 15662 3595 -17289 6978 12144 -13873 -1941 14514 -7192 -8082 13135 -1467 -11978
394 -11978 10617 5513 -14795 4692 13294 -13239 -5515 16780 -5124 -14126 13365 5513 -16786
407 -16786 4635 13391 -13158 -5681 15746 -4599 -12622 12112 4733 -14524 4190 10216 -11199
420 -11199 -2636 11701 -6221 -7334 11558 -964 -12196 8855 6284 -14210 2402 13047 -10523
433 -10523 -6642 14619 -2906 -13483 10495 6365 -14871 2721 13798 -10599 -7028 13964 -1757
446 -1757 -11803 8816 5279 -10979 3219 8510 -9321 -1753 10813 -6413 -7332 12097 384
459 384 -12267 8223 7997 -12199 212 12653 -7642 -7252 13097 -230 -12099 8206 7359 -12332
473 -12332 743 12225 -7330 -6363 11225 -48 -9904 6451 4760 -9109 2456 7688 -7641
486 -7641 -1418 9653 -5516 -6920 10314 538 -11292 6653 7823 -11829 -1301 12164 -6636
499 -6636 -8801 11208 1766 -12027 4974 8188 -9759 -2274 9140 -4486 -5585 7948 -792
512 -792 -7486 6344 2744 -9372 2749 7509 -8131 -2630 9795 -3477 -7661 8303 1813 -10253
526 -10253 4536 7585 -9846 -1659 11091 -4880 -8579 9113 3204 -10503 2662 8352 -6751
539 -6751 -3075 7708 -2587 -4379 5657 -449 -5331 5521 2040 -7690 3150 6845 -7525 -2632
553 -2632 10212 -2662 -8001 8022 3607 -9543 2454 8167 -6851 -3409 9496 -1874 -7376
566 -7376 6372 3337 -7873 1937 6216 -5533 -1448 6654 -2732 -4257 5563 -50 -5753 4278
580 4278 2996 -6671 2235 5833 -6571 -2367 8814 -2579 -8063 7141 4446 -9454 310 8224
594 8224 -5179 -5199 7152 284 -6031 3280 2557 -4836 922 3321 -4642 -363 5132 -3611 -3633 6166
610 6166 -225 -6354 3939 3345 -6314 346 6047 -4381 -3670 6893 -1178 -7001 5114 4312 -7328
625 -7328 -163 7054 -3577 -4648 5386 1106 -4752 2291 2592 -3596 957 2865 -3597 180 4266
640 4266 -3425 -2223 5763 -588 -5911 4216 4074 -6213 -144 6832 -3202 -4597 5991 1453
654 1453 -5947 2318 3880 -3933 -599 4778 -1906 -2996 4192 23 -3870 2543 1667 -3450 1445
669 1445 2778 -3449 -128 3748 -2744 -2589 4868 -172 -5268 3431 3523 -5773 -778 6121 -2547 -5105
685 -5105 4393 2168 -5391 125 3429 -2660 -1441 2664 -1363 -1386 2479 -1175 -2548 2848 474 -3659
701 -3659 1578 2794 -3681 -975 4311 -1962 -3125 4061 1007 -4476 1889 3530 -3814 -1530 4317
716 4317 -1127 -3391 2953 1613 -3461 693 2625 -2233 -630 2022 -960 -807 2144 -548 -1642
731 -1642 2506 418 -3156 1804 2488 -3517 -417 4288 -1435 -3396 3322 1839 -4080 397 3710
746 3710 -1968 -1682 2795 78 -2135 1169 825 -1708 1008 936 -1640 261 1726 -1724 -737 2137
762 2137 -858 -1978 2389 509 -3138 1153 2332 -2873 -1199 3487 -676 -3204 2156 1892 -3107
777 -3107 -223 2455 -1397 -1298 1614 170 -1253 649 176 -1135 798 212 -1548 815 1235 -2210
793 -2210 -344 2239 -1359 -2106 2442 919 -3018 673 2752 -2141 -1586 2408 -49 -2370 1190 1604
809 1604 -1315 -342 1265 -569 -547 1031 -399 -129 1058 -486 -750 1348 -73 -1568 1291 1122 -1949
826 -1949 98 2199 -981 -1745 2271 924 -2521 486 2408 -961 -1232 1586 252 -1350 449 705
842 705 -818 109 656 -551 490 229 -666 426 1112 -920 -464 1567 -351 -1764 1195 1210 -2193
859 -2193 -299 2118 -890 -1769 1284 678 -1820 -54 1216 -790 -611 686 -287 -465 358 -553 -425
876 -425 960 -195 -765 993 64 -1420 455 1131 -1308 -718 1739 -250 -1862 1110 1163 -1900 -219
893 -219 1887 -487 -1065 985 283 -968 202 509 -521 427 477 -627 322 765 -902 -36 1366 -483
911 -483 -1024 1610 468 -1698 659 1695 -1516 -802 1971 -196 -1652 1207 1084 -1445 -70 1291
927 1291 -505 -704 1128 -136 -682 954 -96 -869 936 213 -1186 586 871 -1454 -216 1819
943 1819 -1180 -1697 1948 631 -2240 728 1925 -1768 -1200 1988 -273 -1687 1000 899 -1464 149
959 149 1210 -1144 -254 998 -910 -654 1233 -511 -1238 1344 481 -1974 551 1675 -1696 -547
975 -547 2217 -1119 -1959 1932 738 -2517 450 2096 -1683 -1054 1986 -73 -1545 1276 600 -1570
991 -1570 737 1229 -1288 -2 1429 -870 -781 1741 -345 -1348 1735 634 -2070 984 1961 -2018
1007 -2018 -742 2593 -417 -2252 1812 1471 -2276 483 2141 -1626 -717 1850 -291 -1532 1416
1022 1416 472 -1588 885 1024 -1704 -24 1942 -1488 -906 2199 -308 -2053 1818 967 -2680 302
1038 302 2328 -1966 -1539 2734 -332 -2524 1787 1248 -2484 81 1935 -1525 -1001 1801 -322 -1668
1054 -1668 1523 458 -2009 1025 1147 -1957 113 1961 -1867 -1171 2591 -411 -2736 2019 1661 -3078
1070 -3078 -46 2762 -1707 -1870 2426 141 -2351 1459 1548 -2386 208 2177 -1535 -1082 2163 -509
1086 -509 -1609 1852 480 -1961 1071 1543 -2200 27 2321 -1624 -1430 2876 72 -3106 1881 2102
1102 2102 -3045 -400 3342 -1432 -1968 2555 581 -2471 1043 1732 -1775 33 1678 -1305 -783 1874
1118 1874 -733 -1621 2038 323 -2373 1253 1661 -2755 -430 3014 -1542 -2297 2808 488 -2954 1033
1134 1033 2224 -2638 -560 2914 -1267 -2348 2547 705 -2839 985 1904 -2183 -275 1870 -1158
1149 -1158 -836 1875 -758 -1766 2231 180 -2662 1539 2108 -2945 -466 3706 -1279 -2852 2772
1164 2772 1396 -3385 735 2830 -2022 -909 2570 -711 -2007 1929 565 -2221 949 1615 -2098
1179 -2098 164 2179 -1576 -1097 2635 -576 -2197 2352 1047 -3035 945 2712 -2501 -1398 3168
1194 3168 -702 -2890 2634 1430 -3049 425 2796 -1966 -1411 2540 -396 -1918 1588 568 -2097
1209 -2097 1266 1038 -2252 828 2169 -2363 -1173 3097 -731 -2930 2360 1663 -3403 334 3171
1224 3171 -2351 -1888 3179 -81 -2995 1779 1642 -2846 -71 2620 -1696 -1236 2259 -547 -2154 1868
1240 1868 299 -2399 1048 1172 -2482 365 2768 -2132 -1711 3354 -199 -3388 2158 2223 -3272 -136
1256 -136 3385 -1503 -2270 2889 547 -2909 1509 1964 -2283 -86 2427 -1576 -1020 2221 -662 -1607
1272 -1607 2201 192 -2673 1639 1930 -2840 -172 3478 -1712 -2292 3388 525 -3599 1587 2768
1287 2768 -3122 -593 3432 -1180 -2473 2611 566 -2805 1157 1602 -2033 -17 2221 -1684 -929
1302 -929 2411 -1068 -2110 2629 601 -3260 1147 2582 -2903 -945 3573 -1097 -2884 2999 1114
1317 1114 -3392 884 2806 -2678 -1105 3027 -1117 -2360 2358 801 -2602 1024 1647 -2263 20
1332 20 2275 -1775 -1001 2751 -881 -2604 2734 1280 -3365 770 2883 -2560 -1640 3509 -427 -3061
1348 -3061 2481 1621 -3062 580 2683 -2008 -1419 2644 -311 -2077 1996 523 -2340 1226 1670 -2556
1364 -2556 334 2711 -1783 -1533 3174 -211 -3189 2357 2156 -3431 280 3405 -1885 -2035 3259 178
1380 178 -3008 1762 1811 -2893 203 2609 -1681 -1198 2665 -603 -2084 2073 351 -2564 1248 1647
1396 1647 -2769 -160 3042 -1935 -2108 3222 294 -3462 1925 2273 -2953 -437 3249 -1714 -2346 2997
1412 2997 279 -2988 1365 1945 -2553 -265 2348 -1551 -1022 2371 -667 -2018 2018 650 -2707
1427 -2707 1244 2251 -2688 -639 3201 -1238 -2555 3001 862 -3189 1218 2432 -2635 -922 3295
1442 3295 -1048 -2421 2614 856 -2865 1280 1883 -2327 -187 2503 -1274 -1347 2375 -500 -2297 2087
1458 2087 1180 -2849 1072 2657 -2420 -1118 3362 -800 -2776 2581 1160 -3343 751 2966 -2541
1473 -2541 -1364 2943 -775 -2390 2137 697 -2552 693 1824 -2217 -45 2450 -1753 -1492 2578
1488 2578 -245 -2910 1978 1672 -3090 198 2643 -2206 -1572 2938 -327 -2798 1829 1463 -2983 409
1504 409 2431 -2106 -1235 2649 -536 -2345 1971 963 -2237 951 1786 -2287 -464 2743 -1295 -1853
1520 -1853 2586 210 -2847 1740 1928 -3011 -74 2954 -1667 -2004 2897 147 -2902 1508 1853 -2602
1536 -2602 -210 2554 -1478 -1417 2309 -171 -2105 1786 1101 -2575 743 2129 -2092 -642 2699 -1190
1552 -1190 -2142 2165 568 -2661 1150 2020 -2721 -545 2955 -1136 -2213 2319 485 -2649 1364
1567 1364 2100 -2264 -654 2216 -1353 -1585 2368 -13 -2383 1497 929 -2355 174 2138 -2017 -901
1583 -901 2176 -919 -2209 1974 833 -2815 930 2260 -2319 -882 2816 -882 -2191 2245 686
1598 686 -2766 790 1631 -2147 -552 2358 -842 -1550 2247 179 -2297 1422 1466 -2337 75 2164
1614 2164 -1946 -894 2327 -556 -2252 1938 1315 -2736 542 2328 -1878 -1406 2621 -174 -2175
1629 -2175 1813 1207 -2224 689 1644 -1680 -607 2226 -1079 -1784 1959 208 -2109 1063 1134 -2255
1645 -2255 5 2221 -1401 -1134 2523 -364 -2427 1836 1367 -2577 137 2410 -1805 -1396 2325 21
1661 21 -2150 1214 1503 -2019 343 1914 -1338 -623 1847 -860 -1468 1753 92 -2235 857 1443
1677 1443 -2290 -118 2204 -1402 -1770 2335 -27 -2454 1105 1792 -2231 -258 2323 -731 -1482 2158
1693 2158 181 -2152 1414 1183 -1879 413 1639 -1245 -474 1714 -640 -1427 1578 560 -2183 1035
1709 1035 1713 -2197 -415 2517 -975 -1873 2137 660 -2526 794 1930 -1897 -605 2132 -602
1724 -602 -1245 1739 282 -1830 1104 1087 -1873 52 1809 -1206 -870 2109 -611 -1589 1874 662
1740 662 -2165 603 1849 -1893 -776 2257 -288 -2130 1556 965 -2141 345 1917 -1683 -870 1894
1756 1894 -434 -1679 1390 385 -1689 621 1213 -1561 22 1641 -1389 -999 1839 -491 -1919
1771 -1919 1453 1024 -2240 186 2169 -1453 -1437 1931 -12 -1973 1196 1363 -1646 -86 1760 -1108
1787 -1108 -697 1865 -227 -1299 1421 353 -1536 847 1176 -1470 -156 1784 -1100 -1229 2030 103
1803 103 -2134 1279 1543 -2100 -214 2236 -803 -1469 1888 347 -1794 769 1229 -1606 16 1464
1819 1464 -881 -796 1432 -425 -1361 1296 345 -1545 779 1107 -1647 -274 1928 -747 -1600 1856
1835 1856 653 -2077 762 1699 -1895 -478 2000 -586 -1506 1403 419 -1558 611 1235 -1139 -76
1851 -76 1184 -909 -817 1359 -167 -1335 1251 527 -1726 443 1459 -1694 -824 1907 -362 -1702
1867 -1702 1537 738 -1890 245 1797 -1332 -747 1716 -285 -1300 1214 718 -1495 285 963 -995
1883 -995 -10 1278 -831 -803 1358 -129 -1531 1229 776 -1717 171 1778 -1278 -939 1721 -46
1899 -46 -1711 955 977 -1510 -20 1350 -880 -944 1368 68 -972 889 616 -1201 412 974 -1168
1916 -1168 -31 1217 -815 -768 1535 224 -1485 922 1115 -1533 -184 1468 -818 -1276 1261 244
1932 244 -1442 593 1091 -1436 -317 1312 -506 -851 1053 127 -980 722 442 -1222 480 823
1948 823 -930 -377 1280 -611 -1245 1168 252 -1505 440 1226 -1379 -409 1472 -325 -1273 1136 661
1965 661 -1249 459 1102 -924 -388 1094 -377 -666 814 47 -955 682 407 -1078 378 1059 -927
1982 -927 -558 1277 -383 -947 1019 646 -1234 265 1280 -939 -575 1375 -243 -1093 816 678 -985
1999 -985 130 693 -578 2 861 -455 -699 780 -48 -967 570 552 -1144 -25 1124 -778 -660
2016 -660 1175 -133 -1128 735 579 -1133 -78 1149 -731 -728 991 43 -1025 613 477 -784 121
2033 121 650 -530 -339 836 -444 -690 761 110 -930 493 678 -1076 -4 954 -560 -697 1009
2050 1009 59 -1134 448 636 -917 -147 913 -275 -679 816 156 -664 341 464 -707 199 713
2067 713 -556 -234 840 -264 -629 753 300 -840 236 724 -824 -82 1019 -405 -525 660 208
2084 208 -904 297 965 -774 -177 730 -168 -561 607 302 -466 422 450 -636 -9 377 -455 -408 738
2103 738 -84 -643 566 262 -917 242 750 -658 -309 764 -105 -763 550 416 -897 148 642
2120 642 -482 -204 716 -276 -400 357 173 -689 218 429 -634 -118 396 -432 -277 619 -72 -644 536
2139 536 282 -843 -37 514 -413 -617 799 159 -806 359 406 -665 54 498 -154 -154 618 -146 -299 373
2159 373 159 -633 285 347 -576 -35 710 -316 -375 591 153 -743 147 557 -593 -143 474 -134 -467 711
2179 711 10 -618 150 560 -460 -95 352 78 -318 350 -89 -239 148 14 -331 99 397 -551 -217 534
2199 534 -179 -378 356 83 -681 36 523 -558 -223 415 -330 -464 342 106 -510 44 248 -373 -54 503
2219 503 -305 -178 340 163 -367 140 194 -285 -57 257 -226 -86 420 -123 -474 513 229 -544 60 428
2239 428 -312 -262 390 51 -581 397 381 -517 92 268 -279 -68 324 -17 -208 310 133 -309 229 233 -223
2260 -223 106 230 -222 -215 380 24 -376 216 334 -252 6 246 -231 -293 458 103 -345 73 153 -238 -16
2281 -16 175 -38 -242 140 3 -255 205 65 -222 225 158 -205 6 343 -222 -312 307 186 -222 153 352
2302 352 -306 -60 315 -148 -246 304 204 -517 95 216 -120 -67 245 -66 -184 73 32 -59 139 -86 -85 103
2324 103 169 -113 -162 345 -43 -305 153 173 -174 -26 319 -96 -60 236 75 -166 161 76 -259 3 137 53
2346 53 -25 76 54 -38 171 -45 -113 19 97 -235 74 244 -141 -67 194 -11 -241 117 197 -151 -73 233 -86
2369 -86 -202 192 108 -25 62 50 27 -126 32 -27 -94 17 4 -13 -42 -77 -84 110 50 -49 -98 204 -103 -245 114
2394 114 122 -300 -79 167 -115 -117 172 74 -216 -4 131 -186 -37 102 -93 -55 92 139 87 92 -9 11 113 105
2418 105 -224 22 130 146 -108 107 83 -171 259 154 -203 -52 100 -21 -136 126 216 -21 -29 -42 -73 -59 141
2441 141 -136 -35 14 -85 111 27 -119 -173 101 -50 -74 17 59 -69 -229 152 55 -249 -149 321 -209 -277 220
2464 220 37 -205 81 216 -4 -166 60 -23 -135 -44 -15 -107 -53 -9 -20 76 51 -221 -39 101 71 -73 138
2487 138 0 -51 183 175 -205 -80 235 -55 -188 107 69 -288 -140 97 97 -160 7 108 3 -117 69 -251
2509 -251 -31 9 -209 191 20 -196 -208 250 -40 -262 154 292 -140 52 136 -189 -175 232 -41 -163 -7
2530 -7 165 5 -40 87 77 -137 67 38 -77 57 43 -91 44 20 -189 74 46 -159 -314 120 175 -214 128
2553 128 251 -192 -198 251 -18 -336 129 127 -217 -26 106 71 -79 38 -134 -79 42 42 -188 13 92 -191 -30
2576 -30 140 -306 -145 281 30 -217 266 251 -197 -46 282 -229 -209 107 -146 -113 -119 266 -170 61 67 -124 -94
2599 -94 234 -154 -77 167 40 -182 172 164 -279 30 175 -103 -208 321 219 -479 135 232 -353 49 181 36
2621 36 -175 129 165 -280 -17 98 -163 -84 160 -167 -156 133 60 -144 116 106 -205 24 151 -79 -151 244
2643 244 71 -278 154 141 -264 140 217 -205 -268 353 28 -218 267 165 -291 -60 -23 -150 -29 217 111
2664 111 -76 87 123 -182 86 127 -133 46 314 -91 -273 235 154 -434 143 101 -279 -109 162 -93 -475
2685 -475 286 3 -216 121 316 -218 25 135 26 -178 267 -88 -132 259 311 -136 52 187 -225 -65 256
2706 256 -92 -203 287 16 -406 134 158 -105 -22 407 138 -210 192 107 -347 299 191 -89 -76 338 -314
2727 -314 -312 316 -47 -276 165 -1 -471 10 464 -277 -119 257 6 -302 192 206 -300 21 359 -256 -103
2748 -103 285 -151 -212 158 41 -90 110 106 -309 -87 87 -164 -123 237 -103 -397 68 292 -383 58 375
2769 375 -90 -152 268 188 -304 49 42 -391 14 216 -318 -197 354 -155 -164 235 40 -304 -20 344 -216 -77
2791 -77 250 -71 -38 246 113 -220 165 175 -282 -72 224 -196 -336 337 66 -245 177 183 -357 -87 412 -190
2813 -190 -256 215 -48 -168 117 -128 -323 305 292 -175 -217 243 -198 -247 120 -7 -178 52 373 -236 -98
2834 -98 289 -163 -415 166 -85 -325 223 318 -431 -202 115 -42 -216 236 55 -300 25 130 -311 133 346
2855 346 -103 -97 193 -93 -359 274 107 -366 -73 225 -164 -124 273 -3 -291 113 134 -323 52 338 -262
2876 -262 -39 353 -91 -119 209 58 -92 64 158 -318 -137 136 -149 -380 229 -52 -439 284 166 -494 160
2897 160 286 -306 -167 280 -56 -484 177 194 -190 -123 369 -118 -112 171 48 -285 120 64 -275 80 113 -167
2919 -167 44 296 -34 -150 187 26 -357 206 253 -328 5 320 -241 -229 294 18 -148 317 274 -160 -14
2940 -14 287 -108 -151 214 37 -192 56 146 -360 -75 -36 -348 -44 384 -207 -238 107 61 -266 223 365 -354
2962 -354 -84 292 -172 -335 271 53 -288 180 150 -229 -180 463 -216 -245 361 -56 -133 269 58 -446 5
2983 5 203 -182 -64 171 -95 -237 354 361 -435 78 205 -186 -112 226 -107 -250 220 265 -216 3 125 -218
3005 -218 -54 175 -252 -113 269 79 -324 25 -22 -178 -107 292 -187 -98 304 -117 -156 122 227 -404 -56
3026 -56 305 -115 -80 113 -99 -318 175 253 -428 4 -51 -122 223 133 -26 -153 444 -59 -279 71 212 -19
3048 -19 -55 348 -170 -166 330 63 -234 146 -24 -302 148 113 -151 -210 198 17 -155 244 351 -71 -109 212
3070 212 -285 9 257 62 -164 212 -12 -231 -100 185 -113 -199 516 -210 -230 242 167 -277 45 216 -340
3091 -340 -105 289 -316 -225 -2 209 -242 233 33 -354 -127 174 -97 17 316 -220 -330 254 -228 -145 -5
3112 -5 286 -418 -106 264 -63 -164 263 272 -235 45 67 13 57 167 -55 133 128 131 5 239 73 -161 46 250
3136 250 34 -79 336 -91 -174 304 211 -503 -3 226 -127 -269 224 -271 -40 110 -44 -429 -13 160 -133
3157 -133 62 416 -204 -29 301 -122 -156 139 62 -218 -49 179 -162 -49 164 3 -203 77 46 -261 102
3178 102 234 -13 -61 267 -93 -231 264 0 4 131 305 -108 -110 189 -219 -229 253 104 -357 247 96 -196
3200 -196 -75 218 -267 -202 421 208 -223 205 16 -261 -150 297 -86 -148 116 -102 -323 86 62 -213 67
3221 67 29 -259 -247 28 -116 -138 292 -48 -460 96 253 -168 100 385 -77 -293 49 141 -317 290 303 -149
3243 -149 -47 50 -124 -61 64 -34 -180 154 -15 -252 127 59 -262 -36 172 -105 -235 294 17 -308 -39
3264 -39 328 -203 -176 244 -172 -266 -9 134 -237 104 248 -109 -78 194 -10 -11 238 -57 -220 150 -6 -275
3286 -275 36 92 -161 -225 421 -231 -381 34 -23 -231 198 157 -311 -105 176 254 -190 252 150 -227 -148 307
3308 307 -219 122 208 -62 -207 224 167 -231 20 -19 -128 -1 20 -82 -54 249 50 -308 66 92 -359 69
3330 69 168 -107 -22 181 -144 -184 -6 62 -320 -33 3 -131 71 118 -84 -23 56 153 -109 104 447 -252 -28
3353 -28 4 152 -22 413 52 -87 129 239 -195 -310 196 -126 -214 279 92 -207 192 141 -178 77 168 -174
3375 -174 -214 128 -234 -154 205 275 -152 149 -48 -289 -145 77 -28 -194 300 -18 -118 -36 110 -50 -141 210
3397 210 -69 -16 95 -112 -275 153 -26 -1 119 53 -286 -43 146 -132 24 320 304 -244 2 -80 -26 29
3419 29 553 86 -60 86 364 -119 14 18 98 -70 200 -23 155 55 -481 64 6 225 -249 87 8 134
3441 134 56 281 -125 -225 7 192 -206 158 619 -438 23 245 -152 -25 239 177 -117 -10 366 -55
3461 -55 86 243 -185 74 -172 -151 -154 166 -38 -25 94 178 -243 144 14 -1 -127 -3 354 -243 -25 163
3483 163 -104 -250 80 81 -74 253 193 14 -128 176 -97 -119 10 17 -223 32 -8 -81 20 114 -273 -37 124
3506 124 95 -168 131 102 -273 231 185 -316 -75 127 -41 -156 369 -165 -158 52 228 -343 -274 61 -86 -99
3528 -99 287 104 -59 214 56 -78 113 243 -67 85 302 69 -105 230 30 -195 -100 279 -192 -173 172
3549 172 -180 -239 46 155 -155 -35 35 -279 33 -143 68 12 199 -151 -82 93 313 -53 125 218 12 -30
3571 -30 255 -50 -21 544 60 -112 70 287 -202 186 193 -79 -162 -14 242 -162 46 -2 151 8 102 -44
3593 -44 96 -10 10 -110 52 141 23 46 137 18 -32 94 75 -278 -18 195 -265 11 118 83 -103 160 37
3616 37 -124 28 36 -84 -23 -35 29 -101 62 115 -147 1 203 -209 -91 239 -174 -32 153 7 -274 136
3638 136 162 -161 -70 73 -191 -245 366 28 -161 276 -68 -1 -97 202 -122 30 45 -10 46 294 -6 -129 436
3661 436 -13 -167 92 334 105 -77 249 -33 -190 74 129 -161 -26 115 57 -156 190 2 -97 186 116
3682 116 -105 49 76 -205 -143 117 42 -193 111 112 -143 130 148 -126 -130 340 -291 69 -5 122 -194 160 -7
3705 -7 -370 -60 -131 -430 -15 218 88 -179 111 26 -244 141 -68 -238 -68 309 -38 -38 64 4 -176 64
3727 64 96 0 -120 137 -179 -35 21 44 -286 147 101 -247 146 160 -62 -196 14 136 57 77 70 -127 50 -39
3751 -39 -203 -116 61 -114 7 191 129 -220 -35 192 -67 95 108 -87 -123 84 127 20 119 204 205 36 12 -155
3775 -155 357 19 -205 -65 -198 239 4 -70 169 -102 -104 102 -64 -200 38 99 -171 66 -20 -2 -3 186 16
3798 16 35 -271 209 50 -63 96 -99 66 -83 -23 -176 -46 -119 -165 137 -131 -15 -250 176 -74 0 123
3820 123 116 -327 192 -9 -127 152 72 18 36 142 3 -60 148 -9 102 89 119 49 -242 73 49 -19 137 -17
3844 -17 -58 214 49 -186 32 226 -37 -173 170 423 -126 34 83 -146 -81 139 -87 -147 77 121 -74 -3
3866 -3 8 -84 207 186 11 -101 -27 97 110 96 -58 -272 29 -1 126 -49 105 10 -46 92 55 -107 25 -51
3890 -51 -137 227 44 -26 -258 121 -111 -143 -124 5 -306 55 -71 48 93 111 -259 0 233 -42 -30 -156 -55
3913 -55 -132 -16 129 156 64 92 238 -71 -43 -133 -197 -9 137 385 -79 12 424 -91 -254 79 -377 -98 113
3936 113 70 -149 35 103 -258 109 39 -267 -6 269 -2 -90 -76 112 -275 42 38 -108 -59 120 169 7 -176
3959 -176 29 -66 -37 203 -49 136 147 253 117 -48 -147 -171 -211 173 29 -41 -66 142 -183 219 -123 -262 11
3982 11 -36 -84 -92 160 -123 -178 257 238 -170 128 -3 62 -12 83 36 25 226 -91 84 -73 -180 -156 38 86 -230
4007 -230 -103 -23 -193 -66 -87 -52 -118 -44 5 -54 218 75 192 -94 172 27 -224 95 62 18 -33 -110 -115 -111 194
4032 194 -10 -214 -115 93 -267 33 81 56 150 -134 -57 226 159 -132 -223 65 369 -61 -32 211 162 163 257 -179
4056 -179 48 191 -41 -94 251 123 130 -151 183 135 -221 -109 386 -266 -35 286 -184 -3 232 113 3
4077 3 91 26 -85 -123 -29 77 -20 44 -253 48 111 61 105 -108 21 59 178 17 -33 7 185 -253 -290 215 152
4102 152 -123 22 149 73 -268 37 162 -296 -93 237 -110 -180 243 -159 186 -40 225 -85 18 -31 -29 139
4124 139 31 -9 -59 24 271 -197 219 275 -166 -119 79 48 -147 157 -120 -176 36 -100 -23 111 74 -24 71 90
4148 90 216 -90 409 45 -228 231 172 -259 -81 91 -131 -15 244 71 -43 319 35 -71 136 19 112
4169 112 4 4 39 35 69 48 -54 -183 37 -22 -225 -67 -28 33 -109 25 -28 -17 295 39 60 249 62 -129
4193 -129 -47 54 -155 -81 -26 -186 -2 27 136 -150 68 27 -222 -61 192 4 14 -49 -151 24 -2 -111 -105
4216 -105 25 131 -58 -2 69 -61 -111 39 378 -191 -120 -190 15 62 -34 -134 5 92 -89 -165 69 290 -42
4239 -42 -95 99 -97 -132 34 37 -263 89 -175 -24 152 114 22 -169 113 170 67 -20 88 -217 142 -73 27
4262 27 -13 326 8 293 145 -117 -91 106 247 -309 98 11 -71 -130 -99 219 122 199 57 -191 26 23 25 -82
4286 -82 -32 -78 -36 132 47 -31 171 260 -26 183 173 -6 -107 74 127 -202 252 76 14 52 12 105 -221 164
4310 164 259 -258 12 104 -305 -168 35 22 -198 136 94 -187 218 159 -246 203 113 -90 -154 74 232 54
4332 54 80 208 100 -194 122 168 63 119 7 -10 182 137 -216 -39 -106 -94 -88 114 110 -169 289 -42 185 229
4356 229 0 -226 -12 -30 -77 -59 14 -74 45 108 62 -112 123 159 144 -63 39 123 -271 197 -71 -84 -305 254
4380 254 108 -60 43 171 19 77 234 -152 -138 87 -300 115 121 21 -32 221 90 -242 92 114 31 -17 -73
4403 -73 84 -309 73 -67 123 38 170 -85 29 271 -90 -54 264 102 -27 -139 120 -131 28 233 -351
4424 -351 122 32 -18 -64 147 -15 -157 88 55 -44 22 189 92 -182 -28 55 -61 170 98 -129 94 33 -2 14
4448 14 25 -92 -28 -42 -11 137 -119 -48 -65 -48 95 -27 -181 194 62 -233 150 -60 -142 -129 29 -141 -246
4471 -246 1 -101 -220 81 237 152 -53 147 -39 -78 -25 443 278 251 -83 -170 188 248 -143 10 61 170
4493 170 -185 150 269 -131 219 -48 -97 -146 107 26 73 44 2 88 -12 8 -238 -43 85 32 25 41 28 -271
4517 -271 -22 125 190 -169 199 -170 -218 225 137 139 -46 351 -55 -13 -4 -213 -100 197 -253 1 -51 197 -22
4540 -22 -12 264 -253 -56 26 -21 -100 62 177 -55 -8 273 -20 -112 112 -114 -324 -7 109 -192 198 -97
4562 -97 -308 53 126 11 -281 -46 3 39 -68 -7 -112 186 92 114 -148 216 4 -98 36 250 164 80 287
4585 287 189 -56 118 -239 -124 204 -4 23 -105 -66 -198 -212 -49 -76 -447 -29 90 -161 30 102 -149 100
4607 100 47 2 -164 306 -135 10 -52 37 -87 -7 51 -35 -97 147 131 -7 171 25 -8 -49 314 71 118 56
4631 56 242 36 133 41 -42 -3 46 -24 -54 -82 70 -43 25 140 -191 32 83 43 29 54 -151 1 122 54 -45
4656 -45 7 98 -119 -48 241 -5 -90 189 52 -114 55 157 -201 49 15 96 -29 146 126 40 -120 52 -112
4679 -112 -12 116 -84 46 -11 -137 -178 184 -91 -81 -1 75 -244 -41 173 -305 -39 27 -23 96 -197 206
4701 206 -284 -12 95 -212 -102 10 123 -180 -31 118 -232 116 29 -74 112 -108 7 -201 48 -122
4721 -122 56 -152 -168 -80 -108 260 119 11 -74 -86 -148 165 67 -162 -68 21 76 64 62 -52 -211 -74 229 -72
4745 -72 -43 133 146 -264 107 186 85 52 -53 -132 -114 80 35 -93 155 77 -97 75 112 -14 31 198 -44 142
4769 142 -26 -60 -92 214 144 -30 48 -71 -101 -118 103 -310 -185 127 165 -26 85 28 -125 99 -4 -173 45
4792 45 91 24 -304 106 -6 -65 -75 89 -19 5 234 230 -52 116 137 -67 -9 -13 -123 -53 38 66 155 130 -102 -19
4818 -19 231 133 -149 -150 106 -77 -17 -83 99 -147 50 161 114 47 -127 -73 -171 -151 -23 -194 -9 309 -68 -182
4842 -182 -2 61 -71 -89 115 -87 316 147 -156 60 142 -53 -188 76 51 24 -42 -63 -51 59 -104 -36 -90
4865 -90 39 132 -286 96 153 -61 70 -213 99 120 219 0 -226 3 91 -25 -349 146 74 -179 8 -75 24
4888 24 48 -8 -138 109 -21 -126 32 38 -57 -141 76 -36 -2 76 -152 68 47 194 56 -72 310 -5 29 29
4912 29 108 -194 69 301 -233 -55 -74 -95 -126 38 -34 -65 130 -92 -17 -161 70 25 3 95 108 -1 65 170
4936 170 -119 11 35 -9 -72 -8 69 -99 22 -24 -111 -66 13 16 -84 83 -30 18 44 132 -64 128 34 -134 -51
4961 -51 154 -127 -175 112 16 -22 25 54 -118 -71 53 8 -70 52 76 -63 32 2 -101 -5 68 24 -104 147 -26
4986 -26 -17 49 4 -124 14 53 -89 -92 175 -88 -99 60 31 -112 9 56 -50 -5 37 -24 -9 33 15 -60 -24 65 -14
5013 -14 -50 148 -47 -34 35 38 -104 44 60 41 49 58 -74 10 182 14 40 -20 65 -194 45 88 -74 -16 85 -32
5039 -32 -23 45 -11 -214 22 91 82 -125 71 82 44 44 -61 -123 -17 30 -127 95 120 143 146 14 83 -128 41 -11 -57
5066 -57 -114 73 -61 -36 53 -10 -113 -130 16 -110 122 93 -46 -53 -25 -82 -26 103 -54 -56 31 161 -54 47 113
5091 113 -30 -136 75 -25 -49 24 -13 33 -45 140 -12 2 74 108 -67 -125 137 -77 -51 139 -10 23 -127 -94
5115 -94 -116 -25 64 -137 -22 75 57 -20 127 -176 -203 -56 9 71 83 75 -52 45 -181 -56 -9 -33 57 -20 -17 103 79
5142 79 -62 126 -11 -56 39 53 -92 126 85 12 3 23 -33 -114 64 -41 -139 -4 7 -119 31 135 -16 -49 -53
5167 -53 13 -190 48 66 -213 -95 136 -74 -37 -59 -56 -144 158 -72 -13 80 17 -118 54 242 -7 -219 60 89
5191 89 -44 25 118 -137 -24 123 81 -105 7 136 -34 63 107 84 -30 7 -35 77 13 -38 -149 17 72 -57
5215 -57 -6 106 90 11 31 -15 0 -14 134 -79 12 51 113 -9 82 121 42 48 -109 -208 114 121 -69 42 -28 55 28
5242 28 -9 -22 -115 47 64 -35 -79 32 8 58 139 220 -10 46 -17 9 80 90 -79 75 -51 -41 26 -74 54 -38
5268 -38 280 63 -35 -105 18 120 0 87 75 -26 -21 22 -72 -94 103 94 70 -91 60 -107 -26 232 -77 82 -151
5293 -151 -1 100 -100 87 -7 98 111 -188 -85 155 -41 9 103 -103 -135 3 144 -99 -41 21 -77 -105 108
5316 108 -2 -72 -94 -24 91 -142 123 -47 61 164 22 138 -7 3 -43 74 20 47 -7 68 99 -33 -82 -1
5340 -1 -13 12 145 127 -72 -3 2 -59 196 57 -64 32 -26 -119 -72 55 83 -42 112 -24 -28 60 18 -33 12 95 -9
5367 -9 -48 58 -151 -105 -137 -64 53 -45 35 -78 14 -6 43 -31 77 -19 62 10 -7 61 -63 -35 -109 -22 16 50 -105
5394 -105 83 -33 21 -38 52 -95 -3 -6 18 -75 60 48 -98 16 -23 -31 -78 92 -39 -4 48 85 38 38 21 -68 16
5421 16 8 2 -18 52 -66 -8 -43 38 45 35 53 -24 -86 50 51 -49 67 -2 -67 20 81 1 -91 63 -22 -140 -52 -7 -70
5450 -70 -87 52 -42 -15 33 -86 -83 -5 -17 -19 49 27 12 -8 10 -7 -18 27 29 -29 -50 117 3 -30 31 24 6 -3 -3 -63 26
5481 26 10 -15 -36 3 -51 -17 -7 -30 -8 25 3 19 -12 66 -21 -29 57 17 -35 82 52 -37 30 37 29 -14 42 75 -67 -4 3
5512 3 17 49 -3 -56 -34 31 9 -7 57 -27 27 66 -5 -17 16 23 -58 -29 -18 18 -32 2 14 -15 -38 -11 2 -64 20 14 -31 35
5544 35 -7 -32 47 8 24 4 40 -55 -9 33 19 -70 -26 79 -40 9 43 -21 -59 47 -20 -3 68 14 2 -18 -20 16 -31
5573 -31 -16 16 -81 19 -20 -14 -59 32 -9 -38 74 -7 -28 4 32 -66 11 78 -49 -46 67 -25 -5 -14 61 -58 -3 25 -58
5602 -58 15 27 -12 11 -13 -4 8 55 70 -8 -18 14 2 -4 -13 42 -31 -30 58 -39 -49 73 22 -32 32 25 -23 1 43 2 22 33
5634 33 21 -65 0 44 -61 25 -38 -42 21 42 -20 -69 -5 -38 0 55 32 -25 46 40 -59 -17 82 -12 -50 4 -30 -42 35 15 -11
5665 -11 11 38 -27 -49 43 -1 18 -55 -21 1 -11 51 22 -23 44 -24 -49 17 40 12 29 -13 14 -16 25 -17 -73 14 32 -43
5695 -43 -16 14 -24 -63 27 38 -11 -2 54 -45 0 4 -58 -31 55 58 -16 3 35 -27 -41 46 29 -2 57 69 -5 -15 -13 5 -55 -4
5727 -4 -1 -29 -18 -39 -6 22 -21 -11 -14 -37 6 13 7 -44 -22 42 -6 0 4 28 22 -43 5 -61 7 59 -6 29 37 36 -27 57 21 -28 -10
5762 -10 58 -16 -29 -8 -19 -12 -12 11 14 34 23 -33 -31 -36 -22 -41 -10 46 -14 35 6 -48 21 96 -18 -24 5 15 14 -57 55 -15 18
5795 18 45 19 -25 8 70 -43 50 22 -19 -63 35 58 -67 41 -9 -28 7 -34 -32 -63 60 8 12 -12 -20 -13 -36 42 -18 -41
5825 -41 33 11 -3 -11 0 0 -34 15 -56 -36 50 -10 -41 10 -27 -23 29 53 -33 66 40 -10 -22 54 -11 -83 2 9 -27 -10 62 -52
5857 -52 5 -15 -20 -36 13 -16 14 -22 34 -27 3 0 3 -33 21 40 -49 44 -8 -5 -42 12 -25 2 27 -26 -22 11 42 -33 -13 18 -9
5890 -9 -32 56 30 -42 4 -42 0 55 -28 -21 10 54 39 -17 -25 26 -62 15 64 -42 -92 30 -22 -87 29 -15 -24 18 2 -53 -8
5921 -8 14 34 -46 -10 -2 -7 33 11 -71 -21 53 -14 3 25 -2 -49 46 36 4 26 15 -31 -10 36 39 -12 0 -72 25 -13 38 33 -4
5954 -4 55 1 -23 59 27 -34 -2 10 12 13 48 32 -11 25 4 -21 19 22 -30 -17 10 -9 18 0 59 -32 5 15 29 20 45 -57
5986 -57 -14 36 -18 8 41 41 -65 -7 -2 -45 1 46 30 -11 61 4 -15 1 23 -44 3 50 -9 -9 -27 33 -39 -3 16 6 -23
6017 -23 17 26 -31 40 -28 -33 50 -17 -13 24 33 -16 -1 26 69 -45 14 54 -45 27 78 -59 -27 12 -22 -39 -44 1 -26 9 16 -21
6049 -21 -28 31 -54 12 16 -8 -19 16 11 -2 -33 -34 65 -61 -2 -53 -43 -19 -19 -37 28 -5 11 -50 7 17 -19 50 -49 -18 12 35
6081 35 11 -11 55 4 -38 27 9 -11 30 5 -34 12 16 9 -7 53 -24 -22 -92 54 -41 -5 44 -25 -85 -23 11 -11 -9 7 -33 -23
6113 -23 40 -34 -2 63 36 -57 36 3 -18 5 -17 -20 -40 40 -30 27 40 3 4 -47 48 3 8 -12 48 -48 -4 27 -17 24 8 -44
6145 -44 -57 2 18 -73 20 -28 -61 14 64 -24 47 44 -48 -25 20 -34 -16 19 41 -5 -25 7 -6 -36 11 12 62 38 12 -58 -36
6176 -36 67 29 -24 66 1 -9 68 -31 -35 23 -29 -45 5 23 3 21 33 32 31 27 39 -20 14 -23 -11 -21 60 -18 -50 -6 -14 50
6208 50 9 -7 -2 -23 -16 10 -63 55 -11 14 -31 1 29 -28 -5 6 -13 23 1 10 32 31 -5 -11 33 38 24 -13 86 30 -13 -26 -54
6241 -54 17 -13 -26 -35 -6 14 0 -3 22 -52 -21 -11 10 -74 37 38 -51 46 48 16 36 -2 -20 -45 71 -8 48 59 36 -6 -7 11
6273 11 -80 7 19 -2 1 -13 74 25 -54 36 -75 8 -8 -35 21 12 14 31 -70 -9 -3 -25 -20 -3 30 20 4 66 11 44 -42 3
6305 3 62 -88 -85 41 10 12 -43 0 20 -7 10 -10 -10 12 -8 -29 -3 48 -47 5 18 24 -14 -15 17 -59 29 -25 45 27 -65 -1
6337 -1 -39 15 -8 -31 0 -7 -22 40 41 10 21 18 -29 -57 -26 18 27 14 -52 -50 -13 67 -23 -6 24 4 -4 -37 102 -4 -5 -49 -27
6370 -27 -27 23 9 31 -25 28 14 36 18 9 -41 90 -34 -107 -81 -19 29 -30 22 -10 -41 57 39 18 73 23 19 -78 46 14
6400 14 28 2 25 -16 36 102 -19 21 -20 -4 25 42 50 33 5 -14 -13 21 -47 -17 46 -8 9 -112 15 -7 -38 87 -6
6429 -6 -67 28 10 20 -4 8 77 -93 -86 79 43 -44 39 -11 -58 -56 49 30 41 14 -16 -44 27 -5 65 -13 4 77 45 -9
6459 -9 -53 43 73 -6 -46 16 66 121 -40 12 26 -22 30 28 30 39 -35 20 15 40 13 19 4 4 -16 -15 -9 21 10 19 -83 -91 -20 31 9
6494 9 -53 -37 -83 28 -29 36 101 20 -58 -42 12 88 -3 122 -34 -17 -14 -58 28 118 67 -11 -58 5 -45 22 37 -9 -58 -38
6524 -38 -7 -77 -15 -11 47 -91 -61 -63 -20 20 -17 26 105 87 -30 140 25 100 -18 -3 102 -93 -57 98 57 -100 8
6551 8 22 33 -85 11 32 -12 -106 -43 127 66 62 87 -16 -69 0 34 49 -82 -145 77 -41 84 27 -21 -27 -70 35 -59
6579 -59 88 134 65 -157 204 28 33 -72 101 65 38 138 -50 25 50 -95 37 75 4 36 7 8 -11 14 -35 81
6605 81 -102 43 -94 -101 10 41 -102 -44 54 77 6 -14 -18 -122 108 52 -67 -15 23 62 -28 73 -10 22 62 29 -45
6632 -45 24 12 4 -25 130 58 -116 218 -175 43 -5 105 8 -60 24 -17 -21 -55 12 129 33 72 -104 68 16 -11 -53
6659 -53 62 -14 -124 -88 -49 -27 133 -66 -55 -13 105 34 -133 29 37 -74 118 108 -107 -48 104 105 -44 -11 -44
6684 -44 133 -15 -133 69 -20 -37 -65 -36 24 125 151 55 21 -114 -237 -70 -16 -22 78 80 -83 83 -28 20 115
6709 115 -112 -13 34 -47 -20 4 -82 49 -39 -35 -5 22 -79 131 -137 123 53 -58 -76 20 67 -21 -4 47 -23 -191
6735 -191 34 -29 164 -12 19 -33 -191 79 -130 8 79 49 -4 43 -40 -33 -38 -108 -2 -98 69 -71 -56 196 -6
6760 -6 6 -112 -41 -68 9 151 65 -61 -92 98 -66 -60 67 -28 60 142 -51 106 51 -109 -15 -4 -77 -24 203 -76
6786 -76 -167 104 -71 119 -20 104 -275 91 72 231 79 -52 30 -42 -113 7 -9 24 -89 -21 -198 -118 47
6809 47 -4 -5 -47 7 -129 -100 25 -76 -32 -67 -31 -56 -68 -4 -121 -124 30 -33 -206 53 131 -22 -172 98 -131 262
6835 262 -76 -17 6 -170 68 -42 54 51 -18 -102 61 -59 -195 3 -184 -22 57 -96 72 -68 101 -110 -194
6858 -194 -33 54 -99 108 -103 -76 44 106 -151 -96 -15 -88 -108 33 29 9 54 11 21 -58 28 -86 74 33 -98
6883 -98 -11 127 -12 -10 7 79 52 -17 -104 41 5 4 -85 93 -37 -54 43 -92 110 134 256 -30 -33 -146 -4 23
6909 23 -102 162 50 73 -23 -64 107 57 -110 -37 -132 -17 -82 -40 67 -20 79 -81 82 -67 57 7 6 13 -112
6934 -112 128 -26 38 10 -55 84 -128 84 71 18 -132 -44 0 143 33 -82 132 11 -141 91 -9 11 -34
6957 -34 78 171 71 -9 82 10 49 76 -158 -95 -232 55 -169 -67 14 -197 53 -25 36 -59 11 -31 41 -46 27 14
6983 14 9 138 62 -83 -69 -9 -57 -108 21 -153 82 2 21 21 128 155 24 4 161 -117 -54 48 42 -21 112 17
7009 17 -13 66 -148 -52 -26 69 200 18 -6 -100 -34 17 -110 -15 -4 113 -12 65 59 44 -15 -146 115 -57 -22 239
7035 239 19 -44 40 -216 -35 135 -123 -224 5 -26 -40 118 -28 -55 -42 29 -178 -42 37 -31 -25 -96 -20 59 6
7060 6 8 -48 -44 312 -69 83 33 185 59 -141 58 95 -106 -63 108 21 87 -244 13 71 133 -188 -156 188 -213
7085 -213 -184 25 55 50 115 -262 63 -8 -37 -254 -136 -48 183 183 -154 12 22 76 -56 -10 58 192 -33 -45 55
7110 55 -90 -105 -64 -315 -137 -125 55 219 -61 -49 64 3 35 -10 66 32 -15 -31 104 74 -17 -95 -20 212 50
7135 50 172 8 -147 124 -60 175 174 -25 -369 -34 -201 59 -18 -27 42 268 -54 14 -36 -85 -102 -97 248 -101
7159 -101 -143 91 -26 101 84 -19 -373 -88 193 -238 -60 16 173 114 -232 136 151 178 208 143 -59 -34 51
7182 51 -105 10 -77 -5 -39 52 -100 131 148 -106 -99 297 29 9 -342 -49 -191 42 59 -58 191 136 54 -78
7206 -78 100 45 79 12 93 -128 -242 -36 155 -11 294 90 -72 -127 -360 -133 97 -24 -72 11 -5 -66 0 -106
7230 -106 -20 23 78 22 -51 -114 116 -159 -12 146 -213 58 96 123 12 174 -112 -271 55 -97 9 95 226
7253 226 9 160 -103 180 170 -5 -35 -264 -145 -5 -2 213 214 193 -418 -23 286 -124 38 -146 -89 -244 51
7276 51 -143 -38 31 -85 -157 44 489 -164 -344 26 -43 -353 -376 122 148 204 92 75 -164 30 -298 -49 -86
7299 -86 69 -17 5 -19 -74 55 5 -73 26 129 -41 -253 -318 -79 -202 -143 -139 -28 -165 -278 -144 69 -109 -86
7323 -86 -217 -22 116 -168 -42 -10 -184 -130 27 -179 344 -235 234 -256 -145 184 -171 -170 102 -410 -223 -170
7345 -170 129 26 -38 65 -184 -325 -264 -1 -214 30 -9 144 -247 -94 -52 153 -199 -153 -445 155 -108 -107
7367 -107 -55 20 254 67 182 -153 -36 -206 217 -58 109 95 -227 -147 -132 -37 417 173 118 72 -187 -16 -11
7390 -11 258 -286 108 -7 -331 190 440 -201 -28 -94 -109 13 206 -15 141 42 177 101 -25 -108 115 -64
7412 -64 196 -17 -41 -123 -44 -427 157 -178 -39 91 51 141 -205 73 53 184 -75 -53 -72 159 29 -74 104
7435 104 -153 -85 -87 123 80 105 -99 103 -27 95 127 28 98 -126 -31 197 31 -198 72 -8 -136 -119 147 222
7459 222 75 19 65 5 80 -151 143 -181 194 157 -93 38 -120 135 -114 -82 62 154 -331 -168 -95 -39 -58
7482 -58 -146 43 -104 -3 -15 23 40 -2 236 -30 27 47 -5 -84 -22 63 176 148 -5 181 262 102 69 95 175 3
7508 3 -75 -64 -12 -17 135 9 -228 -141 33 188 22 -119 -69 90 2 167 -96 87 -71 41 -120 133 145 27
7532 27 -180 -7 70 -120 -135 161 -150 -231 -131 86 74 124 24 68 133 43 4 56 -149 91 -280 -307 -115 -28
7556 -28 -93 169 36 108 -170 -155 69 82 -138 -369 59 -100 226 44 24 -31 -73 5 -151 -226 -108 226 -40
7579 -40 -1 23 -158 129 190 206 188 30 -16 14 139 12 137 111 -106 72 34 73 -20 92 200 187 110 -3 -3
7604 -3 45 24 117 74 -15 -37 -292 3 147 -205 76 84 -152 14 18 78 -41 -183 -7 221 133 116 -77 125 -71
7629 -71 86 -238 -246 -39 144 74 -28 120 -33 43 37 38 -125 53 -72 112 110 -9 -203 -58 191 87 226 223
7653 223 86 -175 -137 181 125 71 124 -22 -48 -84 37 -195 158 59 -215 17 32 20 140 -45 189 -31 -40 -396
7677 -396 -267 -16 -110 281 -56 -24 156 -216 10 179 149 -38 70 69 -95 -34 131 -2 238 107 -50 81
7699 81 23 -81 93 -202 -38 103 -68 -328 50 -37 -125 -57 0 -154 -7 -56 -115 -167 89 -50 99 -29 -229
7722 -229 -91 305 -279 -73 1 68 202 12 274 195 -19 29 -77 -111 115 -69 66 58 106 -141 56 94 153
7745 153 35 -13 77 157 -97 88 45 40 -12 -79 78 -85 -137 -288 -290 85 8 -26 58 -61 112 -187 -129 62 118
7770 118 41 -130 251 293 16 87 184 163 -67 -20 -197 308 484 235 81 18 -117 -102 148 -60 67 -7 132
7793 132 30 3 -185 1 -17 -204 -216 -97 -58 -74 10 -78 -102 -216 -138 -56 168 -85 -150 -150 192 197 -174 4 159
7818 159 41 197 -56 -103 135 159 26 296 -168 9 121 67 23 -235 -91 295 381 -101 8 -53 26 -29 81
7841 81 53 111 308 30 -80 16 -333 -336 -341 -4 10 112 372 526 58 -8 -318 -302 76 -235 -6 -13 98 415
7865 415 -239 73 258 -110 -42 -310 -64 -439 -5 397 21 103 90 93 -156 150 59 -182 -141 394 396 -400 217
7888 217 15 -41 148 24 -391 31 114 -10 274 -304 -26 14 -310 -52 319 -38 102 -109 287 -118 -277
7909 -277 154 -10 81 15 20 160 311 83 258 191 128 -258 230 114 -266 47 50 -18 -159 255 -57 -102 58
7932 58 78 -61 371 -38 -29 82 60 -44 17 -81 -144 172 163 3 2 134 -91 240 89 -10 41 -138 34 -47 -232
7957 -232 -172 136 -21 -230 -180 31 -110 -430 61 -308 -37 70 -158 -278 179 -78 370 66 -13 192 255
7978 255 -73 -15 17 25 -27 133 -117 -297 39 -201 -59 -154 282 49 -126 91 253 -364 39 131 205 -165 92
8001 92 166 -107 74 -36 -101 -259 221 77 -37 113 -146 -94 204 -173 -190 115 289 -238 -29 -12 -36 -162
8023 -162 121 -8 123 -218 -8 227 -56 137 67 45 37 8 158 -224 97 -37 -35 -147 -152 46 48 -39 -82 176
8047 176 126 -350 -122 253 59 -25 117 -135 179 -19 340 88 336 98 -144 -50 181 -68 88 113 137 60
8069 60 -88 172 64 -24 195 305 -156 23 106 65 10 56 284 -84 -123 63 -138 19 -204 -283 -142 77 22
8092 22 -5 86 141 -194 72 -103 310 -33 115 -51 34 23 5 -170 171 290 216 17 55 199 75 -29 -189
8115 -189 88 442 -85 182 77 220 42 148 -225 -87 62 187 157 -151 199 -132 -23 -22 -162 -25 34
8136 34 -242 -43 70 285 -12 -443 254 318 77 227 47 -404 -51 25 88 -136 -117 -50 -24 -135 -141 115 -356
8159 -356 -97 287 193 83 74 197 -1 -264 -271 -253 377 273 287 -21 136 -35 -99 150 -189 235 -149 64 -47
8182 -47 139 -121 194 181 -46 -5 24 168 46
8191D6
##END NTUPLES=NMR FID
##END=
