##TITLE=1H_MTBBC0509M
 CDCl3
 8 sc, 
 6.9.2023
##JCAMPDX= 6.0         $$ Bruker NMR JCAMP-DX V2.0
##DATA TYPE= NMR FID
##DATA CLASS= NTUPLES
##ORIGIN= UXNMR, Bruker Analytische Messtechnik GmbH
##OWNER= root
$$ XWIN-NMR		Version 3.5
$$ Wed Sep  6 14:18:46 2023 Russian Standard Time (UT+4h)  she@DPX200
##.OBSERVE FREQUENCY= 200.13135
##.OBSERVE NUCLEUS= ^1H
##.DELAY= (6, 6)
##.ACQUISITION MODE= SIMULTANEOUS
##.ACQUISITION SCHEME= undefined
##.AVERAGES= 8
##.DIGITISER RES= 18
##SPECTROMETER/DATA SYSTEM= spect
##.PULSE SEQUENCE= zg30
##.SOLVENT NAME= CDCl3
##.SHIFT REFERENCE= (INTERNAL, CDCl3, 0, 15.7039)
##AUDIT TRAIL= $$ (NUMBER, WHEN, WHO, WHERE, WHAT)
$$ ##TITLE= Audit trail, XWIN-NMR		Version 3.5
$$ ##JCAMPDX= 5.01
$$ ##ORIGIN= Bruker BioSpin GmbH
$$ ##OWNER= she
$$ F:/spectra/data/she/nmr/H-F/1/audita.txt
$$ ##AUDIT TRAIL=  $$ (NUMBER, WHEN, WHO, WHERE, WHAT)
(   1,<2023-09-06 14:17:17.59 +0400>,<she>,<DPX200>,
      <created by zg, POWCHK disabled, PULCHK disabled
       configuration hash MD5:
       00 E9 B6 7A A2 85 ED C7 34 08 36 98 17 FE 4E 26
       data hash MD5: 16K
       E2 A5 C2 F5 5B 14 13 9F 6B 22 53 4F 48 08 E8 AC>)
$$ ##END=
$$ 
$$ hash MD5
$$ AE 78 97 AE 23 D9 B6 D6 65 3D 2C 28 46 B5 45 34
##$RELAX= 
##$RELAX= 
##$RELAX= 
##$RELAX= 
##$RELAX= 
##$RELAX= 
$$ Bruker specific parameters
$$ --------------------------
##$DU= <F:/spectra>
##$EXPNO= 1
##$NAME= <H-F>
##$PROCNO= 1
##$TYPE= <nmr>
##$USER= <she>
##$AMP= (0..31)
100 100 100 100 100 100 100 100 100 100 100 100 100 100 100 100 100 100 
100 100 100 100 100 100 100 100 100 100 100 100 100 100 
##$AQSEQ= 0
##$AQ_mod= 1
##$AUNM= <au_zg>
##$AUTOPOS= <>
##$BF1= 200.13
##$BF2= 200.13
##$BF3= 200.13
##$BF4= 200.13
##$BF5= 200.13
##$BF6= 200.13
##$BF7= 200.13
##$BF8= 200.13
##$BYTORDA= 1
##$CFDGTYP= 0
##$CFRGTYP= 5
##$CHEMSTR= <none>
##$CNST= (0..31)
1 1 145 1 1 1 1 1 1 1 1 1 1 1 1 1 1 1 1 1 1 1 1 1 1 1 1 1 1 1 1 1 
##$CPDPRG= <>
##$CPDPRG1= <>
##$CPDPRG2= <>
##$CPDPRG3= <>
##$CPDPRG4= <mlev>
##$CPDPRG5= <mlev>
##$CPDPRG6= <mlev>
##$CPDPRG7= <mlev>
##$CPDPRG8= <mlev>
##$CPDPRGB= <>
##$CPDPRGT= <>
##$D= (0..31)
0 1.2 0 0 0 0 0 0 0 0.06 0 0.03 0 0 0 0 0.0002 0 0 0 0 0 0 0 0 0 0 0 0 
0 0 0 
##$DATE= 1693995437
##$DBL= (0..7)
120 120 120 120 120 120 120 120 
##$DBP= (0..7)
150 150 150 150 150 150 150 150 
##$DBP07= 0
##$DBPNAM0= <>
##$DBPNAM1= <>
##$DBPNAM2= <>
##$DBPNAM3= <>
##$DBPNAM4= <>
##$DBPNAM5= <>
##$DBPNAM6= <>
##$DBPNAM7= <>
##$DBPOAL= (0..7)
0.5 0.5 0.5 0.5 0.5 0.5 0.5 0.5 
##$DBPOFFS= (0..7)
0 0 0 0 0 0 0 0 
##$DE= 6
##$DECBNUC= <off>
##$DECIM= 32
##$DECNUC= <off>
##$DECSTAT= 4
##$DIGMOD= 1
##$DIGTYP= 9
##$DL= (0..7)
0 120 120 120 120 120 120 120 
##$DP= (0..7)
150 150 150 150 150 150 150 150 
##$DP07= 0
##$DPNAME0= <>
##$DPNAME1= <>
##$DPNAME2= <>
##$DPNAME3= <>
##$DPNAME4= <>
##$DPNAME5= <>
##$DPNAME6= <>
##$DPNAME7= <>
##$DPOAL= (0..7)
0.5 0.5 0.5 0.5 0.5 0.5 0.5 0.5 
##$DPOFFS= (0..7)
0 0 0 0 0 0 0 0 
##$DQDMODE= 0
##$DR= 18
##$DS= 0
##$DSLIST= <SSSSSSSSSSSSSSS>
$$ [...]
##$SUBNAM2= <"">
##$SUBNAM3= <"">
##$SUBNAM4= <"">
##$SUBNAM5= <"">
##$SUBNAM6= <"">
##$SUBNAM7= <"">
##$SUBNAM8= <"">
##$SUBNAM9= <"">
##$SW= 18.05172834244
##$SWIBOX= (0..15)
0 0 2 0 0 0 0 0 0 0 0 0 0 0 0 0 
##$SW_h= 3612.71676300578
##$TD= 16384
##$TD0= 1
##$TE= 0
##$TE2= 300
##$TE3= 300
##$TEG= 300
##$TL= (0..7)
0 120 120 120 120 120 120 120 
##$TP= (0..7)
150 150 150 150 150 150 150 150 
##$TP07= 0
##$TPNAME0= <>
##$TPNAME1= <>
##$TPNAME2= <>
##$TPNAME3= <>
##$TPNAME4= <>
##$TPNAME5= <>
##$TPNAME6= <>
##$TPNAME7= <>
##$TPOAL= (0..7)
0.5 0.5 0.5 0.5 0.5 0.5 0.5 0.5 
##$TPOFFS= (0..7)
0 0 0 0 0 0 0 0 
##$TUNHIN= 0
##$TUNHOUT= 0
##$TUNXOUT= 0
##$USERA1= <user>
##$USERA2= <user>
##$USERA3= <user>
##$USERA4= <user>
##$USERA5= <user>
##$V9= 5
##$VALIST= <valist>
##$VCLIST= <CCCCCCCCCCCCCCC>
##$VD= 0
##$VDLIST= <DDDDDDDDDDDDDDD>
##$VPLIST= <PPPPPPPPPPPPPPP>
##$VTLIST= <TTTTTTTTTTTTTTT>
##$WBST= 1024
##$WBSW= 4
##$XGAIN= (0..3)
0 0 0 0 
##$XL= 0
##$YL= 0
##$YMAX_a= 320962
##$YMIN_a= -304543
##$ZGOPTNS= <>
##$ZL1= 120
##$ZL2= 120
##$ZL3= 120
##$ZL4= 120
##$ABSF1= 10
##$ABSF2= 0
##$ABSG= 5
##$ABSL= 3
##$ALPHA= 0
##$AQORDER= 0
##$ASSFAC= 0
##$ASSFACI= 0
##$ASSFACX= 0
##$ASSWID= 0
##$AUNMP= <proc_1d>
##$AZFE= 0.1
##$AZFW= 0.1
##$BCFW= 1
##$BC_mod= 2
##$BYTORDP= 1
##$COROFFS= 0
##$CY= 11.3945322036743
##$DATMOD= 1
##$DC= 2
##$DFILT= <>
##$DTYPP= 0
##$F1P= 15.7292609196834
##$F2P= 12.9074282941183
##$FCOR= 0.5
##$FTSIZE= 0
##$FT_mod= 4
##$GAMMA= 1
##$GB= 0.15
##$INTBC= 1
##$INTSCL= 1
##$ISEN= 128
##$LB= 0.24
##$LEV0= 0
##$LPBIN= 0
##$MAXI= 10000
##$MC2= 0
##$MEAN= 0
##$ME_mod= 0
##$MI= 1.114404
##$NCOEF= 0
##$NC_proc= 0
##$NLEV= 6
##$NOISF1= 3.799351
##$NOISF2= 2.8
##$NSP= 1
##$NTH_PI= 0
##$NZP= 0
##$OFFSET= 15.70392
##$PC= 1
##$PHC0= -21045.21
##$PHC1= 15.05271
##$PH_mod= 1
##$PKNL= yes
##$PPARMOD= 0
##$PSCAL= 0
##$PSIGN= 0
##$REVERSE= no
##$SF= 200.130013532006
##$SI= 16384
##$SIGF1= 3
##$SIGF2= 2
##$SINO= 400
##$SIOLD= 16384
##$SREGLST= <1H.CDCl3>
##$SSB= 0
##$STSI= 0
##$STSR= 0
##$SW_p= 3612.71676300578
##$SYMM= 0
##$S_DEV= 0
##$TDeff= 0
##$TDoff= 0
##$TI= <>
##$TILT= no
##$TM1= 0
##$TM2= 0
##$TOPLEV= 0
##$USERP1= <user>
##$USERP2= <user>
##$USERP3= <user>
##$USERP4= <user>
##$USERP5= <user>
##$WDW= 1
##$XDIM= 8192
##$YMAX_p= 0
##$YMIN_p= 0
$$ End of Bruker specific parameters
$$ ---------------------------------
##NTUPLES= NMR FID
##VAR_NAME=  TIME,          FID/REAL,        FID/IMAG
##SYMBOL=    X,             R,               I
##VAR_TYPE=  INDEPENDENT,   DEPENDENT,       DEPENDENT
##VAR_FORM=  AFFN,          ASDF,            ASDF
##VAR_DIM=   8192,          8192,            8192
##UNITS=     SECONDS,       ARBITRARY UNITS, ARBITRARY UNITS
##FACTOR=    0.0002768,     1,               1
##FIRST=     0,             0,               0
##LAST=      2.2672688,     0,               0
##MIN=       0,             -304543,         0
##MAX=       2.2672688,     320962,          0
$$ Real data points
##PAGE= N=1
##DATA TABLE= (X++(R..R)), XYDATA
$$ plain form
0 0 0 0 0 0 0 0 0 0 0 0 8 -8 8 -8 16 -16 24 -24 32 -40 47 -56 64 -72 88 -103 120 -136 155 -178 207 -233
32 -233 264 -298 337 -382 427 -478 534 -594 663 -737 815 -903 999 -1103 1216 -1341 1477
49 1477 -1626 1792 -1975 2177 -2402 2656 -2944 3270 -3643 4081 -4602 5226 -5995 6970 -8253
64 -8253 10019 -12613 16796 -24635 44253 -193358 -197935 320962 -47202 -288156 130681 236735
76 236735 -162648 -40898 206168 -43840 -144598 139916 12674 -192497 77145 147813
86 147813 -182683 -63109 221122 -42541 -208468 157856 144010 -217596 -12207 259716
96 259716 -99493 -211988 187698 103411 -271401 -29366 238427 -85578 -179109 172482
106 172482 106688 -158563 24424 126664 -110398 -51192 130765 -69744 -131026 161195
$$ packed form
0@%%%%%%%%%%Qj6J6j6K4l2M0m8N6p2Q7j03J20j36J60j91K23k56K91l33L85m40
32b33M97n62O35p19Q09r05J012j128J257j400J552j718J902k102K319k557K818
49A477l103L418l767M152m579N058n600O214o913P724q683R828j1221J2965j5223
64h253J8272k2632K9409m1431O8888k37611m577N18897l68164k40954M18837J06054
76B36735l99383J21750K47066k50008j00758K84514j27242k05171K69642P0668
86A47813l30496J19574K84231k63663j65927L66324j3846l61606K05389K71923
96B59716l59209j12495L99686q4287l74812K42035K67793l24005r3531L51591
106A72482o5794k65251J82987J02240k37062N9206J81957k00509o1282K92221
$$ plain form
116 161195 75474 -214519 29966 235087 -124607 -185835 198935 97126 -225788 8450
126 8450 206981 -100144 -142755 155723 35977 -182669 52565 135693 -126923 -54047 163129
137 163129 -21377 -132399 99042 68398 -149206 9455 137459 -105795 -88052 175043
147 175043 13539 -185002 84603 166731 -155576 -106985 195193 22606 -194973 60438
157 60438 148366 -117471 -70141 130738 -18090 -108557 82008 46794 -120182 31291 119137
168 119137 -103741 -72955 150904 -4331 -161020 77714 121534 -136618 -52745 168689
178 168689 -22379 -151378 103267 103329 -152171 -28211 159343 -48153 -126687 103607 68014
189 68014 -124838 2961 109463 -68984 -61449 105364 -12978 -106332 82232 67309 -131615
$$ packed form
116A61195q5721k89993K44485K05121l59694o1228L84770j01809l22914K34238
126H450J98531l07125m2611K98478j19746k18646K35234Q3128k62616P2876K17176
137A63129j84506j11022K31441l0644k17604J58661J28004k43254J7743K63095
147A75043j61504j98541K69605Q2128l22307M8591L02178j72587k17579K55411
157F0438Q7928k65837M7330K00879j48828r0467J90565l5214j66976J51473Q7846
168A19137k22878L0786K23859j55235j56689K38734M3820k58152Q3873K21434
178A68689j91068j28999K54645O2k55500J23960J87554k07496p8534K30294l5593
189F8014j92852J27799J06502j78447P535J66813j18342r3354J88564j4923j98924
$$ plain form
200 -131615 -7705 145992 -62488 -129074 120659 77386 -153127 -5319 151128 -60317
210 -60317 -108292 108328 48562 -121592 18982 104851 -74494 -57008 107002 -5909 -101099
221 -101099 66705 61394 -104639 -3253 108834 -60400 -84587 109286 30687 -136283 34424
232 34424 124302 -97442 -82669 133885 21399 -138490 40747 113515 -87217 -61833 111057
243 111057 378 -98341 58022 57261 -88394 2767 90288 -57415 -60838 98691 11170
254 11170 -114570 47518 96703 -100650 -52596 126524 -8796 -123730 62981 90311 -104057
265 -104057 -41124 117609 -17774 -102476 67278 60112 -92203 -3748 87872 -45525 -54626
276 -54626 79926 8043 -86829 47399 68291 -90737 -21804 111814 -33974 -100935 83873
$$ packed form
200a31615J23910J53697k08480o6586K49733m3273k30513J47808J56447k11445
210f0317m7975K16620n9766j70154J40574Q5869j79345J7486J64010j12911r5190
221a01099J67804n311j66033J01386J12087j69234k4187J93873p8599j66970J70707
232C4424Q9878k21744J4773K16554j12486j59889J79237P2768k00732K5384J72890
243A11057j10679r8719J56363p61j45655R1161Q7521j47703l423J59529q7521
254A1170j25740J62088M9185j97353M8054J79120j35320j14934J86711K7330j94368
265a04057O2933J58733j35383q4702J69754p166j52315Q8455R1620j33397r101
276e4626J34552p1883r4872J34228K0892j59028O8933J33618j45788o6961J84808
$$ plain form
287 83873 64383 -115435 -14528 119828 -41484 -99619 83830 52751 -104868 1214 92851
298 92851 -49978 -58339 77076 9816 -79554 39618 57162 -76427 -11655 91645 -39474
309 -39474 -74410 84572 37404 -105761 13108 104847 -60643 -78702 96761 33511 -110213
320 -110213 18100 94160 -62057 -58046 82150 10003 -81488 32884 55527 -65674 -14522
331 -14522 74190 -33937 -57095 71995 18677 -87978 28711 81272 -70082 -50821 100357
342 100357 7913 -105091 42544 86140 -80086 -44843 96779 -1787 -88196 43009 59114
353 59114 -70486 -17877 73728 -28785 -54455 60617 13476 -73152 29975 59225 -67685
364 -67685 -27974 88297 -14706 -87743 59044 64283 -89638 -21817 99861 -21882 -83966
$$ packed form
287H3873j9490j79818J00907J34356j61312n8135J83449l1079j57619J06082R1637
298I2851j42829q361J35415o7260q9370J19172J7544j33589O4772J03300j31119
309c9474l4936J58982m7168j43165J18869R1739j65490j8059J75463o3250j43724
320a10213J28313P6060j56217M011J40196p2147r1491J14372K2643j21201N1152
331a4522Q8712j08127k3158J29090n3318j06655J16689N2561j51354J9261J51178
342A00357r2444j13004J47635M3596j66226L5243J41622r8566q6409J31205J6105
353E9114j29600N2609R1605j02513k5670J15072m7141q6628J03127K9250j26910
364f7685L9711J16271j03003p3037J46787N239j53921O7821J21678j21743o2084
$$ plain form
375 -83966 59279 53397 -78047 -10919 78297 -29640 -55308 58803 16678 -66216 23553
386 23553 49656 -56293 -19506 69665 -21282 -65569 58311 38588 -84866 1197 87694
397 87694 -44569 -68970 76616 35146 -90285 5869 85475 -42538 -59154 68224 21162
408 21162 -69939 20172 51570 -47880 -17041 59188 -20956 -50606 54551 23337 -75976 14047
420 14047 73857 -53438 -52902 78112 15996 -86736 21557 73705 -56210 -46067 76394
431 76394 7420 -75509 31404 55483 -55744 -21706 63207 -12031 -50125 41976 24546 -55389
443 -55389 13148 51684 -47798 -27600 69984 -8294 -73847 43795 58328 -72680 -30819 85789
455 85789 -7157 -81872 40170 55440 -62383 -20598 63814 -15275 -47758 42480 19673 -54687
$$ packed form
375h3966J43245n882j31444O7128Q9216j07937k5668J14111m2125q2894Q9769
386B3553K6103j05949L6787Q9171r0947m4287J23880j9723j23454Q6063Q6497
397H7694j32263k4401J45586m1470j25431R6154P9606j28013j6616J27378m7062
408B1162r1101R0111L1398r9450L0839P6229q0144k9650J05157l1214r9313R0023
420A4047N9810j27295N36J31014o2116j02732J08293N2148j29915J0143J22461
431G6394o8974q2929J06913K4079j11227L4038Q4913p5238l8094R2101j7430p9935
443e5389O8537L8536r9482K0198R7584p8278o5553J17642J4533j31008M1861J16608
455H5789r2946p4715J22042J5270j17823M1785Q4412p9089l2483R0238k2807p4360
$$ plain form
467 -54687 15352 49056 -45803 -23908 64279 -8438 -60234 42207 41124 -63897 -9502 71827
479 71827 -26706 -61731 58706 35108 -77272 -781 74922 -33073 -58693 52871 28837
490 28837 -60542 2216 49229 -29781 -23592 43746 -10335 -39560 41166 19964 -59582 9932
502 9932 65341 -39054 -51865 65550 26311 -75817 8016 68859 -38410 -45702 57130
513 57130 14550 -61052 16965 48740 -44349 -25343 55030 -7066 -50097 32773 27810 -46787
525 -46787 977 45114 -30366 -29255 52650 1211 -61023 32978 53274 -59610 -28809 75309
537 75309 565 -73099 28062 57960 -47453 -30670 55031 -482 -45015 26383 20685 -40563
549 -40563 6929 37197 -34153 -23598 50610 -1719 -55675 28697 42693 -51717 -17870 60143
$$ packed form
467e4687P0039L3704r4859K1895Q8187p2717n1796J02441j083j05021N4395Q1329
479G1827r8533l5025J20437k3598j12380P6491P5703j07995k5620J11564k4034
490B8837q9379O2758M7013p9010O189O7338n4081k9225Q0726k1202p9546O9514
502I932N5409j04395j2811J17415l9239j02128Q3833O0843j07269p292J02832
513E7130m2580p5602P8017L1775r3089J9006Q0373o2096m3031Q2870m963p4597
525d6787M7764M4137p5480J111Q1905n1439o2234R4001K0296j12884L0801J04118
537G5309p4744p3664J01161K9898j05413J6783Q5701n5513m4533P1398n698o1248
549d0563M7492L0268p1350J0555P4208n2329n3956Q4372J3996r4410L3847P8013
$$ plain form
561 60143 -12363 -53401 40207 35408 -57416 -7651 63710 -20852 -52659 44487 30507 -52683
573 -52683 -2513 46997 -20129 -27674 33603 1223 -35332 25294 20875 -47499 2794 53915
585 53915 -31587 -46806 52915 26171 -65940 -1385 63956 -25216 -48684 45453 23342 -50935
597 -50935 6436 43546 -28824 -23410 41893 593 -40755 23379 28709 -39007 -5222 41892
609 41892 -20561 -30443 39659 8133 -48985 17053 44947 -42498 -30644 58596 5273 -63291
621 -63291 19893 51993 -39237 -31089 47129 6818 -42255 16386 26890 -30548 -1959 33512
633 33512 -22340 -20849 40900 969 -45535 22625 38952 -42035 -21415 53336 -3825 -52744
645 -52744 28482 37079 -46950 -14657 51390 -11207 -45810 30403 28801 -42551 -7144 41650
$$ packed form
561F0143p2506m1038R3608m799r2824M9765P1361q4562l1807R7146j3980q3190
573e2683N0170M9510o7126p545O1277l2380l6555O0626m419o8374N0293N1121
585E3915q5502j5219R9721k6744r2111O4555O5341q9172k3468R4137k2111p4277
597e0935N7371L7110p2370N414O5303m1300m1348O4134N330o7716L3785M7114
609D1892o2453r882P0102l1526n7118O6038K7894q7445J1854Q9240n3323o8564
621f3291Q3184L2100r1230Q148P8218m0311m9073N8641J0504n7438K8589L5471
633C3512n5852J491O1749l9931m6504O8160J6327q0987K0620P4751n7161m8919
645e2744Q1226Q597q4029L2293O6047o2597l4603P6213j602p1352L5407M8794
$$ plain form
657 41650 -15058 -28016 29566 6817 -31150 16649 22598 -33115 -3908 43060 -17713 -39844
669 -39844 40464 25557 -53475 -3080 54888 -19359 -44613 36033 25880 -45014 -3863 41227
681 41227 -18830 -27806 31566 5620 -33810 14976 23454 -30097 -6354 35764 -14206 -30184
693 -30184 33853 14687 -44063 9152 43708 -30315 -30016 45876 11662 -50842 10568 45888
705 45888 -29507 -30056 40326 8304 -39474 11358 26460 -25071 -9183 27892 -11534 -22824
717 -22824 27328 6563 -36594 13709 33412 -32506 -19464 44440 741 -45378 19776 38171
729 38171 -35722 -20716 45212 217 -41686 19723 28783 -30844 -10257 32301 -8246 -25057
741 -25057 22238 8946 -29327 9765 23750 -27975 -10360 36236 -9877 -35870 27507 25267
$$ packed form
657D1650n6708j2958N7582k2749l7967M7799N949n5713K9207M6968o0773k2131
669c9844Q0308j4907p9032N0395N7968p4247k5254Q0646j0153p0894M1151M5090
681D1227o0057q976N9372k5946l9430M8786Q478n3551K3743M2118m9970j5978
693c0184O4037j9166n8750N3215L4556p4023K99P5892l4214o2504O1410L5320
705D5888p5395n49P0382l2022m7778N0832J5102n1531J5888L7075l9426j1290
717b2824N0152k0765m3157N0303J9703o5918J3042O3904m3699m6119O5154J8395
729C8171p3893J5006O5928m4995m1903O1409R060n9627K0587M2558m0547j6811
741b5057M7295j3292l8273L9092J3985n1725J7615M6596m6113k5993O3377k240
$$ plain form
753 25267 -41096 -8299 46421 -11743 -40704 30110 26259 -38683 -6258 38334 -10530 -27556
765 -27556 24027 12816 -27846 5806 22786 -21561 -8275 28254 -10385 -25677 25577 14024
777 14024 -36909 1665 38614 -20844 -32453 35697 16059 -42935 2526 39363 -19020 -27862
789 -27862 30207 12244 -32308 6084 26666 -19188 -11248 26104 -5570 -21155 20580 9659
801 9659 -28306 6507 28694 -23040 -20268 35713 3527 -40861 14390 34495 -30396 -22002 37383
814 37383 4547 -37813 11372 29228 -23938 -14304 28376 -2926 -22291 16910 10039 -22409
826 -22409 5779 21751 -19777 -11948 30827 -2567 -32232 20136 24975 -33041 -10690 37949
838 37949 -5938 -35452 20299 25226 -31446 -10711 33041 -6986 -27266 18783 13238 -23846
$$ packed form
753B5267o6363L2797N4720n8164k8961P0814l851o4942L2425M4592m8864j7026
765b7556N1583j1211m0662L3652J6980m4347J3286L6529l8639j5292N1254j1553
777A4024n0933L8574L6949n9458j1609O8150j9638n8994M5461L6837n8383q842
789b7862N8069j7963m4552L8392K0582m5854P940L7352l1674j5585M1735j0921
801I659l7965L4813K2187n1734K772N5981l2186m4388N5251K0105o4891Q394N9385
814C7383l2836m2360M9185J7856n3166R634M2680l1302j9365L9201o871l2448
826b2409K8188J5972m1528P829M2775l3394k9665N2368M839n8016K2351M8639
838C7949m3887k9514N5751M927n6672K0735M3752m0027k0280M6049n545l7084
$$ plain form
850 -23846 1755 20350 -14472 -10323 23078 -3919 -22766 20192 15361 -30275 440 33982
862 33982 -15293 -27980 28778 17073 -36067 -1704 36067 -14408 -27706 24834 12701 -28312
874 -28312 1514 22575 -14209 -12740 20011 -1853 -19770 15425 10811 -24818 3601 25931
886 25931 -17625 -18719 28804 7451 -33236 7947 32036 -21281 -21646 31476 7588 -32246 7593
899 7593 26016 -18501 -14963 22952 1158 -21684 10845 12129 -19690 734 18713 -15190 -11437
912 -11437 23603 -990 -26766 14398 23302 -26543 -12807 34309 -1217 -33073 16044 25459
924 25459 -24675 -12241 28052 -556 -23806 12875 14550 -19441 -913 18384 -12309 -10738
936 -10738 19260 -1919 -21120 13385 15262 -24275 -5475 28320 -9235 -26350 21961 16644
$$ packed form
850b3846K5601J8595l4822M149L3401k6997j8847M2958m831m5636L0715L3542
862C3982m9275j2687N6758j1705n3140L4363L7771n0475j3298N2540j2133m1013
874b8312K9826K1061l6784J469L2751k1864j7917L5195m614l5629K8419K2330
886B5931m3556j094M7523k1353m0687M1183K4089n3317l65N3122k3888l9834L9839
899G593J8423m4517L538L7915k1794k2842L2529J284l1819K0424J7979l3903L753
912a1437L5040k4593k5776M1164Q904m9845J3736M7116l5526l1856M9117R415
924B5459n0134J2434M0293k8608k3250L6681J675l3991J8528J9297l0693J571
936a0738K9998k1179j9201L4505J877l9537J8800L3795l7555j7115M8311n317
$$ plain form
948 16644 -29572 -3372 30698 -9268 -25354 20091 15659 -24665 -2206 23390 -8939 -13586
960 -13586 16221 1831 -15238 10065 9473 -18675 888 21852 -13962 -19212 24712 8612 -30931
973 -30931 3550 28911 -16193 -22055 23932 10401 -27446 2780 23954 -14171 -13990 20825 1838
986 1838 -18891 9589 12735 -15647 -1789 18059 -8976 -13043 18731 2547 -22857 10381 19702
999 19702 -21645 -11860 27833 66 -30188 11057 24822 -21318 -15599 25305 2456 -22818
1011 -22818 7550 14274 -13532 -3915 14752 -6974 -9469 16310 656 -18871 11880 15947 -20401
1024 -20401 -6142 25332 -4193 -23830 15479 17269 -23981 -6439 26602 -6698 -23207 16279
1036 16279 13841 -21806 -4006 20563 -6354 -15218 12859 5339 -14954 6069 9896 -14478 -19
$$ packed form
948A6644m6216K6200L4070l9966j6086M5445m432m0324K2459K5596l2329m647
960a3586K9807j4390j7069K5303n92k8148J9563K0964l5814n250M3924j6100l9543
973c0931L4481K5361m5104n862M5987j3531l7847L0226K1174l8125J81L4815j8987
986A838k0729K8480L146k8382J3858J9848k7035m067L1774j6184k5404L3238R321
999A9702m1347R785L9693k7767l0254M1245J3765m6140N719M0904k2849k5274
1011b2818L0368O724k7806R617J8667k1726k495K5779j5654j9527L0751M067l6348
1024b0401J4259L1474k9525j9637L9309J790m1250J7542L3041l3300j6509L9486
1036A6279k438l5647J7800K4569k6917q864K8077p520k0293K1023L827k4374J4459
$$ plain form
1049 -19 18318 -10413 -15619 20444 9597 -26254 1147 28110 -12099 -22275 20890 12387 -23960
1062 -23960 -1029 21244 -8696 -14804 14882 4677 -16777 5505 11707 -14370 -3446 15639
1074 15639 -6942 -12697 14592 4839 -19043 5154 19003 -15605 -12301 24324 2478 -25739
1086 -25739 8972 22666 -16780 -14651 22145 5280 -21631 4757 15970 -11740 -6430 12881
1098 12881 -4398 -9228 11219 1268 -15533 7295 13899 -16983 -8365 22436 -1894 -22768 12092
1111 12092 17553 -19128 -8308 22864 -1376 -20820 11443 15501 -17237 -5393 18796 -3795
1123 -3795 -13662 10433 6007 -12469 2703 10063 -10822 -3980 15217 -6422 -15577 15617 9030
1136 9030 -22037 -891 23253 -8813 -20546 16828 13554 -21119 -3432 21202 -5980 -14720
$$ packed form
1049a9J8337k8731n206L6063j0847l5851K7401K6963m0209j0176M3165q503l6347
1062b3960K2931K2273k9940o108K9686j0205k1454K2282O202k6077J0924J9085
1074A5639k2581n755K7289r753k3882K4197J3849l4608L304L6625k1846k8217
1086b5739L4711J3694l9446K129L6796j6865k6911K6388J1213k7710N310J9311
1098A2881j7279m830K0447r951j6801K2828O604l0882Q618L0801k4330k0874L4860
1111A2092N461l6681J0820L1172k4240j9444L2263M058l2738J1844K4189k2591
1123c795r867K4095m426j8476J5172P360k0885O842J9197k1639r155L1194o587
1136I030l1067K1146K4144l2066j1733L7374l274l4673J7687K4634k7182q740
$$ plain form
1148 -14720 12660 6539 -13421 2876 11095 -9282 -4387 13435 -4175 -12085 12761 5676 -17823
1161 -17823 3310 17002 -12447 -13162 18739 5234 -22683 3827 20722 -13263 -14898 18150
1173 18150 5625 -18555 2524 14645 -8452 -7486 11832 -372 -9560 9122 4269 -12650 4943
1186 4943 12546 -12390 -7343 18023 177 -19769 8415 17176 -16891 -10257 20715 294 -20214
1199 -20214 7491 14613 -13649 -7967 15038 -434 -13158 7621 6565 -10987 2003 9753 -8871
1212 -8871 -3947 13601 -2851 -13702 11540 11012 -17693 -3259 20797 -5493 -18581 13279 12509
1225 12509 -17815 -4717 18274 -3566 -15421 9432 8231 -13046 -402 10759 -6740 -5333
1237 -5333 10099 -2098 -9602 8825 5821 -13918 1395 16485 -9573 -12906 16859 6805 -19514
$$ packed form
1148a4720K7380o121j9960J6297Q219k0377M895J7822j7610p910K4846p085k3499
1161a7823K1133J3692k9449p15L1901j3505k7917K6510J6895l3985j635L3048
1173A8150j2525k4180K1079J2121k3097R66J9318j2204r188J8682m853j6919J7593
1186D943P603k4936N047K5366j7846j9946K8184Q761l4067O634L0972k0421k0508
1199b0214K7705P122k8262N682K3005j5472j2724K0779j056j7552J2990P750j8624
1212h871M924J7548j6452j0851K5242n28k8705J4434K4056k6290j3088L1860p70
1225A2509l0324J3098K2991k1840j1855K4853j201k1277J2644J1161j7499J407
1237e333J5432j2197p504J8427l004j9739J5313J5090k6058l333K9765j0054k6319
$$ plain form
1250 -19514 1667 19114 -8655 -14517 14190 7631 -16051 451 13383 -7575 -7511 10040 -212
1263 -212 -9427 6151 4693 -10962 1478 11240 -9142 -8183 14921 1172 -16897 6803 14992
1276 14992 -13015 -9588 17903 3028 -18342 5269 15833 -11160 -8493 13712 1575 -11756
1288 -11756 4324 6777 -8356 -810 8296 -6783 -5250 11279 -1835 -13347 8747 10054 -14648
1301 -14648 -4856 17207 -2145 -16950 9672 13219 -14459 -5698 16489 -1672 -13617 7828
1313 7828 8511 -10249 -1771 10329 -4366 -6689 8409 94 -9323 6862 5546 -11813 164
1326 164 13002 -7260 -12300 12920 7267 -17806 -440 17816 -7215 -14372 12270 8234 -13615
1339 -13615 -1297 12541 -4090 -7962 8327 1964 -8300 5063 5250 -8930 1148 10144 -6848
$$ packed form
1250a9514K1181J7447k7769n862K8707o559k3682J6502J2932k0958O4J7551j0252
1263b12r215J5578j458j5655J2440R762k0382R59K3104j3749j8069K3700Q189
1276A4992k8007L427K7491j4875k1370K3611J0564k6993K667K2205j2137j3331
1288a1756J6080K453j5133P546R106j5079J533J6529j3114j1512K2094J307k4702
1301a4648R792K2063j9352j4805K6622L547k7678Q761K2187j8161j1945K1445
1313G828O83j8760Q478J2100j4695k323J5098q315r417J6185j316j7359J1977
1326A64J2838k0262n040K5220n653k5073J7366J8256k5031p157K6642m036k1849
1339a3615J2318J3838j6631l872J6289o363j0264J3363J87j4180J0078Q996j6992
$$ plain form
1352 -6848 -7908 11836 3009 -14916 3539 14197 -10802 -10085 14999 3004 -16186 3276 13732
1365 13732 -8886 -9322 11844 2865 -11530 3547 7733 -6973 -1422 7720 -4145 -4348 8742
1378 8742 123 -10411 6527 9936 -12362 -4997 15881 -1440 -15825 7553 12216 -12248 -7325
1391 -7325 13943 654 -13438 4893 8634 -9152 -2635 8646 -3151 -5863 6940 1138 -8099
1404 -8099 4821 6904 -9310 -1740 12357 -4213 -11161 10809 7508 -13976 -1515 15205 -4404
1417 -4404 -13383 9782 8693 -13032 -2696 11867 -3293 -8628 6146 3030 -7332 1842 5046
1430 5046 -6756 -713 8887 -5480 -7308 10830 3367 -13261 2732 13381 -7680 -10407 12480
1443 12480 5606 -14116 1050 13017 -6499 -8638 9346 3189 -9763 1859 7137 -6118 -3182
$$ packed form
1352f848j060J9744q827j7925J8455J0658k4999P17K5084j1995j9190J9462J0456
1365A3732k2618m36K1166q979j4395J5077M186j4706N551R142j1865k03J3090
1378H742q619j0534J6938L409k2298P365K0878j7321j4385K3378M663k4464M923
1391g325K1268j3289j4092J8331L741j7786O517J1281j1797k712J2803n802r237
1404h099J2920K083j6214P570J4097j6570o948K1970l301k1484J2461J6720j9609
1417d404q979K3165j089k1725J0336J4563j5160n335J4774l116j0362R174L204
1430E046j1802O043R600j4367j828J8138p463j6628J5993J0649k1061k727K2887
1443A2480o874j9722J5166J1967j9516k139J7984o157j2952J1622N278j3255K936
$$ plain form
1456 -3182 7038 -2839 -5993 7069 756 -9344 4210 8268 -9232 -5214 12975 280 -13886
1469 -13886 5939 12541 -10756 -7273 13314 2115 -12259 3124 9542 -6379 -4559 7707 -940
1482 -940 -5562 5295 1076 -7313 3683 5636 -8596 -2497 10480 -2660 -11192 7517 8136 -12000
1496 -12000 -3125 13534 -2758 -11871 7573 8247 -10274 -3147 11472 -1481 -8774 5999 4438
1509 4438 -6907 967 5273 -4639 -1165 6488 -3412 -6418 7908 3464 -11727 1266 12279 -7047
1523 -7047 -10431 10564 5736 -12769 -1064 11992 -4033 -9313 7384 4537 -8294 1246 6939
1536 6939 -4378 -2625 6346 -1396 -5281 5667 2349 -8025 2272 8287 -7338 -5534 10941
1549 10941 662 -12253 4137 10611 -8828 -7727 11200 2831 -11963 2026 9300 -5529 -4943
$$ packed form
1456c182J0220r877l154J3062o313j0100J3554M058j7500M018J8189j2695j4166
1469a3886J9825O602k3297L483K0587j1199j4374J5383O418j5921J820J2266q647
1482i40m622J0857m219q389J0996J953j4232O099J2977j3140q532J8709O19k0136
1496a2000Q875J6659j6292r113J9444O74j8521P127J4619j2953p293J4773j561
1509D438j1345P874M306r912L474P653r900l006J4326m444j5191J2993J1013j9326
1523g047l384K0995m828j8505J1705J3056j6025n280J6697k847j2831R540N693
1536F939j1317J753Q971p742l885J0948l318j0374J0297O015j5625J804J6475
1549A0941j0279j2915J6390O474j9439J101J8927q369j4794J3989P274j4829N86
$$ plain form
1562 -4943 6396 323 -5085 3388 2229 -5477 2433 5793 -6633 -2694 9940 -1577 -9922 6200
1576 6200 7904 -9737 -4122 11804 -801 -11571 5576 8263 -9135 -4003 9290 -1050 -8108
1589 -8108 4074 4501 -5857 -738 5282 -3605 -2284 6215 -1852 -5712 6710 3536 -9423 594
1603 594 10892 -4801 -9428 9186 6755 -11333 -1427 11323 -3031 -8670 5922 4754 -7376
1616 -7376 -964 6058 -3129 -3617 5170 -1201 -5042 4668 2204 -6999 1494 7404 -5363 -5708 9242
1631 9242 2212 -10978 2916 10339 -6914 -7199 9783 3602 -10062 814 8826 -4029 -5619
1644 -5619 5978 1169 -5534 2328 2329 -4781 1374 4472 -5355 -2968 7727 -686 -9187 4742 7796
1659 7796 -8464 -4400 10542 255 -10209 4112 8337 -6886 -4450 8665 787 -7512 3040
$$ packed form
1562d943J1339o073n408Q473j159p706P910L360j2426L939J2634j1517q345J6122
1576F200J704j7641N615J5926j2605j0770J7147K687j7398N132J3293j0340p058
1589h108J2182M27j0358N119O020q887J321Q499q067l860J2422l174j2959J0017
1603E94J0298j5693m627J8614k431j8088R906J2750j4354n639J4592j168j2130
1616g376O412P022r187m88Q787o371l841R710k464r203Q493N910j2767l45J4950
1631I242p030j3190J3894P423j7253k85J6982o181j3664J0876Q012j2855j590
1644e619J1597m809o703P862Jp110O155L098r827K387J0695q413q501J3929L054
1659G796j6260M064J4942j0287j0464J4321M225j5223K436J3115p878q299J0552
$$ plain form
1672 3040 4961 -4625 -837 4386 -2491 -2288 4776 -1227 -5671 4766 3825 -8507 -732 9306 -3905
1687 -3905 -8912 6893 6185 -9534 -2479 10211 -1480 -8573 5219 5454 -6483 -945 5875 -1812
1701 -1812 -3378 3889 500 -4038 3262 2729 -5604 620 6520 -4884 -5450 7860 2172 -9714 1278
1716 1278 9486 -5517 -7804 7899 4005 -9477 -131 7838 -3016 -5077 4561 1985 -4333 1383
1730 1383 3013 -3678 546 4817 -3808 -2653 6825 2 -7589 3646 6879 -6857 -4567 9097
1744 9097 717 -9785 2975 7894 -6463 -5095 7036 1424 -7000 1630 5061 -3584 -1864 4119
1758 4119 -1726 -2308 4267 -717 -4609 4299 3869 -6662 -1160 8641 -1867 -8567 5741 6223 -8475
1773 -8475 -2897 8793 -952 -7706 3509 5116 -5500 -2468 5428 -1333 -3956 3353 714 -3871
$$ packed form
1672C040J921r586L788N223o877K03P064o003m444J0437r41j2332P775J0038j3211
1687c905n007J5805p08j5719P055J2690j1691p093J3792K35j1937N538O820p687
1701a812j566P267l389m538P300n33q333O224N900j1404n66J3310n688j1886J0992
1716A278Q208j5003k287J5703l894j3482R346P969j0854k061R638k576o318N716
1730A383J630o691M224M271q625J155R478o823p591J1235L233j3736K290J3664
1744I097q380j0502J2760M919j4357J368J2131n612q424Q630L431q645J720N983
1758D119n845n82O575m984l892Q908m30j0531N502R801j0508o700J4308M82j4698
1773h475N578J1690r745o754J1215J607j0616L032P896o761k623P309k639m585
$$ plain form
1787 -3871 2026 2279 -4375 186 5340 -3071 -5092 6609 2921 -8392 937 8863 -4308 -6785
1801 -6785 6939 4553 -7881 -1192 7501 -1951 -5701 3865 2347 -4324 407 2436 -3076 -258
1815 -258 3639 -2983 -3126 5455 671 -6971 2575 6564 -5627 -4388 7991 1621 -8101 1939 7415
1830 7415 -4551 -4997 6661 1935 -6439 1341 4592 -3168 -2163 3232 -744 -2696 2840 267 -4344
1845 -4344 2724 3130 -5870 -1194 7386 -1868 -7293 4637 6123 -7072 -3611 8158 380 -7432
1859 -7432 2925 5551 -4231 -2296 4652 -165 -3255 2245 1346 -3287 1721 2428 -4268 -565 5145
1874 5145 -2425 -4825 4803 2566 -6977 -510 7429 -2988 -6857 5536 4252 -7068 -1183 6876
1888 6876 -1176 -5332 3308 3285 -3713 -363 3065 -2056 -559 3248 -2224 -2488 4564 746 -5894 1810
$$ packed form
1787c871N897K53o654M561N154q411k021J1701l688j1313R329P926j3171k477
1801f785J3724k386j2434O689Q693r452l750R566j518o671M731K029n512K818
1815b58L897o622j43Q581m784p642R546L989j2191J239J2379o370r722J0040N476
1830G415j1966m46J1658m726q374P780L251p760J005N395l976j952N536k573m611
1845d344P068M06r000M676Q580r254n425J1930J486j3195L461J1769p778p812
1859g432J0357K626r782J935O948m817l090N500q99m633N008P07o696L703N710
1874E145p570k400R628k237r543O467P939j0417l869J2393j284j1320N885Q059
1888F876q052m156Q640k3o998L350L428n121J497L807n472k64P052l818o640P704
$$ plain form
1904 1810 5973 -4974 -4931 6697 1958 -7989 772 6838 -3713 -5094 4975 2309 -5324 289
1918 289 4459 -2627 -2122 3386 -413 -2442 2645 484 -3144 1964 3244 -3826 -1869 6105 -477
1933 -477 -6597 3880 5633 -6130 -3351 7072 566 -7205 1621 5322 -3826 -3508 4379 295 -3434
1948 -3434 1590 1061 -2476 1082 2231 -2907 -767 4477 -1447 -4625 4336 3443 -6157 -643 6745
1963 6745 -1565 -6055 4274 4466 -5637 -1999 6035 -971 -5235 2625 2813 -3678 -684 2472 -1334
1978 -1334 -1227 2355 -1012 -2571 3274 877 -4925 1342 5300 -3905 -4193 5994 2600 -6688 91
1993 91 6843 -2320 -5201 4368 2906 -4604 -250 3842 -1659 -2428 2387 238 -2756 1574 1087 -3349
2009 -3349 907 2990 -3569 -1685 4850 -60 -5332 2571 5118 -4835 -3266 6589 986 -6566 1673
$$ packed form
1904A810M163j0947M3J1628m739r947Q761O066j0551j381J0069k666p633N613
1918B89M170p086N05N508l799k029N087k161l628N108J280p070J957P974o582
1933d77o120J0477J753j1763K779J0423o506p771Q826L701r148L18P887m084l729
1948c434N024n29l537L558J149n138K140N244n924l178Q961q93r600N514P388
1963F745q310m490J0329J92j0103L638Q034p006m264P860J88o491K994L156l806
1978a334J07L582l367j559N845k397n802O267L958r205k88J0187l394r288O779
1993I1O752r163k881R569j462p510M354M092n501p69M815k149k994M330m87m436
2009c349M256K083o559J884O535m910n272P903K547r953J569R855n603p552Q239
$$ plain form
2024 1673 5442 -2883 -3210 3747 1481 -3213 662 1991 -2177 378 1741 -2722 -690 3566 -1500
2039 -1500 -4295 3375 3190 -5116 -1669 6032 -1129 -5998 3198 4295 -4766 -2067 5233 -127 -4513
2054 -4513 2120 3326 -2779 -997 2923 -1064 -1212 2044 -417 -1955 2313 1041 -3905 522 4545
2069 4545 -2980 -4321 4918 2245 -6275 -386 5995 -1935 -5010 3180 3267 -4220 -1163 3951 -834
2084 -834 -2069 2152 455 -1707 1619 1077 -2388 751 2931 -2518 -2127 4320 403 -5265 1794 4611
2100 4611 -3979 -3444 4866 1528 -5673 288 4866 -2672 -3479 3319 1404 -2972 308 1798 -1542
2115 -1542 -70 1584 -1512 -846 3156 -597 -3517 3096 3029 -4347 -1456 5309 -518 -5232 2184 4375
2131 4375 -4035 -2525 4565 227 -4294 1278 2700 -2401 -1217 2225 -446 -1642 1507 286 -2033
$$ packed form
2024A673L769q325l27O957k266m694L875J329m168K555J363m463K032M256n066
2039a500k795P670j85q306L447P701p161m869R196J097r061K699P300n360m386
2054d513O633J206o105J782L920l987j48L256k461j538M268j272m946M427M023
2069D545p525j341R239k673q520N889O381p930l075Q190Q7p487L057N114m785
2084h34j235M221j697k162L326n42l465L139K180n449L91O447l917n668P059K817
2100D611q590N35Q310l338p201N961M578p538q07O798j915m376L280J490l340
2115a542J472J654l096O66M002l753k920O613o7p376K891O765n827m714P416K191
2131D375q410J510P090m338m521N572J422n101J184L442k671j196L149j221k319
$$ plain form
2146 -2033 2128 1394 -3342 506 3927 -2029 -3513 3932 2638 -5092 -818 5630 -1323 -4752 2818
2161 2818 3136 -3597 -1415 3079 -249 -2589 1307 837 -1957 620 1047 -2299 423 2490 -2285 -1907
2177 -1907 3525 899 -4322 1079 4784 -2915 -3382 4650 1819 -4879 163 4463 -1857 -3208 2650
2192 2650 1821 -2647 -158 2035 -1119 -414 1397 -1419 -805 2343 -619 -3015 1880 2735 -3757 -1741
2208 -1741 4720 -219 -4826 2020 3965 -3122 -2394 3879 1010 -3993 850 3267 -1820 -1527 2168
2223 2168 -8 -1266 1126 81 -1500 1359 1127 -2934 -254 3520 -1822 -3747 3296 2222 -4728
2238 -4728 -1055 4810 -624 -4302 2105 3360 -3080 -1466 3607 226 -2277 1245 999 -1280 568
2253 568 1309 -1393 -233 2317 -1667 -2002 3011 815 -3970 879 3788 -2344 -3451 3404 1821 -4779
$$ packed form
2146b033M161p34m736L848L421n956j484P445j294p730M274O448o953l429P570
2161B818L18o733K182M494l328k340L896m70k794K577M27l346K722K067m775L78
2177a907N432k626n221N401L705p699m67Q032k831o698N042M300o320j351N858
2192B650q29m468K489K193l154P05J811k816O14L148k962k396M895Q55o492K016
2208a741O461m939m607O846J945p087P28O273k869n003M843K417n087K93L695
2223B168k176j258K392j045j581K859k32m061K680L774n342j925P043j074o950
2238d728L673N865n434l678O407J255o440J614N073l381k503L522k46k279J848
2253E68P41k702J160K550l984l35N013k196m785M849K909o132j107O855j583o600
$$ plain form
2269 -4779 -487 4281 -1393 -3219 2331 1803 -2376 -600 1941 -544 -410 1005 -435 -762 2354 -210
2285 -210 -2880 1826 2605 -3104 -1601 3782 365 -4375 1008 3841 -2981 -2817 3500 910 -3550 424
2301 424 2592 -1409 -1660 1843 299 -1547 875 551 -1365 1086 1105 -2116 133 3170 -1001 -2847
2317 -2847 2696 2628 -3890 -1239 4627 -366 -4242 1734 2928 -2501 -1934 2689 283 -2544 480 1059
2333 1059 -1434 14 927 -1554 -132 1780 -1241 -1685 2406 1201 -3168 490 3736 -1816 -2990
2348 -2990 3270 2028 -3700 -409 3751 -477 -3419 1942 2276 -2487 -872 1740 -827 -794 819 -699
2364 -699 -777 1598 -67 -2325 1135 2462 -2616 -1679 3764 452 -3894 921 3799 -1933 -2835 3126
2380 3126 1734 -3156 114 2821 -1086 -1452 1457 403 -1157 474 504 -1111 499 931 -1917 -731
$$ packed form
2269d779M292M768n674j826N550n28m179J776K541k485J34J415j440l27L116k564
2285b10k670M706P79n709J503N383l417m740N383K833o822J64O317k590m460L974
2301D24K168m001k51L503j544j846K422l24j916K451J9l221K249L037m171j846
2317b847N543o8o518K651N866m993l876N976J194n429N67M623k406k827L024N79
2333A059k493J448R13k481J422J912l021m44M091j205m369L658L246n552j174
2348b990O260j242n728L291M160m228k942N361L34m763J615K612k567L3J613j518
2364f99p8K375j665k258L460J327n078R37N443l312m346M815K878n732r02N961
2380C126j392m890L270K707l907l66K909j054j560J631L0j615J610M32k848J186
$$ plain form
2396 -731 2528 -988 -2753 2032 2269 -3098 -1212 3731 95 -3637 1445 3326 -2346 -1890 2514 724
2412 724 -2184 492 1624 -706 -189 742 -851 -162 1594 -983 -1765 2236 775 -3121 -53 3238
2428 3238 -1304 -3012 2397 1906 -3495 -830 3391 -803 -2832 1547 1873 -1561 -800 1647 55 -973
2444 -973 920 113 -751 1342 146 -1923 1128 2060 -2029 -1536 2925 653 -3707 328 3434 -1959
2460 -1959 -2802 2688 1609 -2902 -757 2418 -368 -1743 1223 743 -1055 401 654 -1117 717 959
2476 959 -1378 -309 2412 -425 -2588 1602 2369 -2790 -1261 3244 -112 -3390 1084 2659 -2000
2491 -2000 -2106 2262 880 -2463 2 1460 -789 -414 651 -658 17 1039 -591 -1320 1770 1083
2507 1083 -2469 -79 3482 -783 -2814 2205 2190 -2495 -1060 3032 9 -2961 974 1985 -1736
$$ packed form
2396g31L259l516j765M785K37n367J886M943l636l732N082J881n672M56M404j790
2412G24k908K676J132k330N17R31j593O89J756k577p82M001j461l896L068L291
2428C238m542j708N409m91n401K665M221m194k029M379L26l434P61K447j592j028
2444i73J893q07q64K093j196k069L051R32m089M93M461k272m360M035L106n393
2460a959q43N490j079m511K145L175k786j375K966m80j798J456K53j771J834K42
2476I59k337J069K721k837k163M190P67n159J529M505l356l278M474J575m659
2491b000j06M368j382l343K465J458k249L75J065j309O75J022j630p29L090o87
2507A083l552K390L561m265k031N019j5m685J435M092l023k970L935J011l721
$$ plain form
2522 -1736 -966 1411 -179 -1133 481 371 -947 541 240 -1303 557 1887 -1517 -1513 2844 710 -3020
2539 -3020 512 3182 -1167 -2477 2436 1765 -2544 -717 2618 -393 -1728 679 673 -1021 16 523
2555 523 -871 61 1070 -947 -821 2003 -374 -2200 1198 1909 -2234 -1318 3085 683 -3051 664
2571 664 2961 -1441 -1816 2156 973 -1850 -283 1530 -324 -882 437 -280 -259 793 -620 -1297 1515
2588 1515 706 -2210 -345 2581 -796 -2627 1583 2200 -2496 -1253 2802 198 -2432 667 2113
2603 2113 -1153 -1271 1252 241 -1281 674 406 -564 723 131 -1305 328 1426 -995 -1482 2076
2619 2076 960 -2932 43 2879 -1110 -2362 1855 1602 -2024 -825 2383 126 -1808 575 1056
2634 1056 -882 -32 674 -454 213 860 -807 -468 1669 -41 -2157 780 2050 -1998 -1480 2585
$$ packed form
2522a736P70K377j590r54J614j10j318J488l01j543J860J330l404MM357k134l730
2539c020L532K670m349j310M913o71m309J827L335l011j335K407oj694J037N07
2555E23j394R32J009k017J26K824k377j826L398P11m143R16M403k402l734L715
2571F64K297m402l75L972j183k823J567J813j854n58J319p17K1J052j413o77K812
2588A515q09k916J865K926l377j831M210O17m696J243M055k604k630L099J446
2603B113l266j18K523j011j522J955k68r70J287n92j436J633J098k421m87L558
2619B076j116l892K975K836l989j252M217k53l626J199L208k257j934K383M81
2634A056j938Q50P06j128O67O47j667L39K137j710k116K937J270m048N18M065
$$ plain form
2650 2585 669 -2887 229 2239 -1296 -2140 1588 1239 -1853 -234 1452 -409 -485 533 -148 -153 762
2667 762 -53 -890 915 1036 -1851 -289 2498 -411 -2422 1284 2048 -1895 -1357 2474 516 -2523
2683 -2523 464 1971 -1035 -1192 1051 266 -1021 244 340 -477 386 657 -1130 80 1482 -977 -1289
2700 -1289 1939 777 -2276 1 2508 -578 -2471 1561 2107 -1973 -859 2169 118 -1667 280
2715 280 1063 -679 -435 413 -223 -158 765 -830 -774 1375 -184 -1789 848 2056 -1459 -1363 2125 925
2733 925 -2470 145 2329 -815 -1858 1467 1116 -1544 -446 1378 -121 -780 407 -167 -431 470
2749 470 -212 -912 822 574 -1550 -471 1990 -310 -2377 1097 2058 -1741 -1242 2303 555 -2100
2765 -2100 298 1915 -804 -1429 1129 657 -881 212 518 -164 249 261 -805 19 1015 -665 -1420
$$ packed form
2650B585j916l556L116K010l535q44L728l49l092J619J686j861p6J018o81nR15
2667G62q15q37J805J21k887J562K787k909k011L706P64l943N38L831j958l039
2683b523K987J507l006j57K243p85j287J265R6q17Q63K71j787J210J402k459l12
2700a289L228j162l053K277K507l086j893M032N46m080J114L028k051j785J947
2715B80P83j742K44Q48o36O5R23j595N6K149j559j605K637J208l515R6L488j200
2733I25l395K615K184l144j043L325l51k660J098J824j499o59J187n74k64R01
2749D70o82p00J734k48k124J079K461k300k067L474R61l799M99L545j748k655
2765b100K398J617k719o25K558m72j538J093L06o82M13J2j066Q24R96j680p55
$$ plain form
2782 -1420 1584 1024 -1966 -157 2186 -735 -2130 1348 1668 -1410 -1057 1955 374 -1621 272 1132
2798 1132 -768 -273 405 -106 -27 562 -339 -300 1185 447 -1614 504 1737 -1321 -1574 1719 712 -2259
2816 -2259 -40 2296 -471 -2127 1252 1108 -1383 -590 1079 -200 -779 127 292 -293 179 56 -599
2833 -599 583 893 -1333 -420 1687 -48 -1827 785 1906 -1456 -1522 1878 742 -2129 -37 1557
2849 1557 -486 -1118 562 458 -700 -216 421 -395 52 424 -692 90 1095 -545 -1110 1252 932
2866 932 -1843 -332 2086 -17 -2235 960 1890 -1405 -1069 1554 379 -1667 -33 1071 -591 -885
2882 -885 589 -174 -205 402 -527 -328 932 69 -1472 294 1728 -949 -1479 1638 1020 -1809 -195
2899 -195 2085 -271 -1828 782 1369 -992 -751 1231 143 -901 239 368 -221 11 -230 -619 681
$$ packed form
2782a420L004n60k990J809K343k921j395L478L20l078L53L012j581j995J893Q60
2798A132j900M95O78n11P9N89r01L9J485p38k061K118J233l058k53L293j007k971
2816b259K219K336k767j656L379j44k491P93J669j279n79R06J65n85M72j23o55
2833e99J182L10k226R13K107j735j779K612J121l362o6L400j136k871K092J594
2849A557k043o32J680j04j158M84O37q16M47L72j116P82J005j640n65K362l20
2866I32k775J511K418k103k218L195R30l295L36K623j175k046J634J104j662k94
2882h85J474p63l1O07r29J99J260q63j541J766J434k677n30L117o18k829J614
2899a95K280k356j557K610N87k361K41J982j088j044J140J29n89K32k41l89J300
$$ plain form
2916 681 512 -824 -545 1647 160 -1892 606 1974 -1316 -1506 1507 848 -1538 -220 2022 -131
2932 -131 -1255 674 953 -775 -164 264 -220 -13 231 -524 -212 782 -327 -1380 833 1033 -1612 -646
2950 -646 1742 -136 -1776 540 1678 -901 -1220 1742 549 -1528 35 1227 -315 -643 385 273
2966 273 -88 249 -341 -363 884 296 -1363 59 1320 -944 -1491 1386 1052 -1688 -472 2006 -62
2983 -62 -1831 851 1385 -886 -627 1167 156 -989 15 528 -264 122 184 -379 274 860 -845 -296
3001 -296 1370 134 -1582 443 1636 -990 -1435 1565 1013 -1763 -422 1594 -138 -1246 336 953
3017 953 -537 -424 666 14 -101 399 -568 -83 895 -277 -691 836 980 -1098 -570 1486 132 -1950
3035 -1950 442 1406 -958 -1234 1074 635 -1442 -283 1190 -138 -819 292 165 -264 154 -344 -210
$$ packed form
2916F81j69j336K79K192j487k052K498J368l290j90L013o59k386J318K242k153
2932a31j124J929K79j728O11M28m84K07K44p55L12R94j109j053K213K00k645R66
2950f46K388j878j640K316J138k579l19K962j193k077J563J192j542l28J028j12
2966B73l61L37n90k2J247n88j659J422J261k264n47K877l34k740J216K478k068
2983f2j769K682N34k271K59J794j011j145J004N13p92L86O2n63O53N86j705N49
3001b96J666j236j716K025J193k626m45L000n52k776J341K016j732j108J582O17
3017I53j490J13J090o52j15N00r67M85R78j172m14J527J44k078N28K056j354k082
3035a950K392R64k364k76K308m39k077J159J473j328o81J111j27m29M18m98J34
$$ plain form
3052 -210 646 92 -983 245 1450 -639 -1297 1111 1060 -1689 -711 1849 89 -1508 378 1330 -848
3069 -848 -993 1037 332 -954 -29 288 -260 11 52 -272 -62 472 -630 -712 1263 355 -1498 359 1512
3088 1512 -885 -1151 1194 1081 -1527 -412 1668 7 -1463 523 933 -633 -419 381 129 -293 33
3105 33 -285 -229 732 -189 -1013 690 751 -934 -563 1314 294 -1622 195 1511 -579 -1247 1196 726
3123 726 -1184 -225 1082 156 -641 65 233 -113 41 85 -258 563 201 -897 -264 979 -542 -991 881
3142 881 1060 -1307 -744 1683 194 -1681 482 1229 -625 -546 693 611 -560 4 736 -54 63 272
3160 272 -461 232 532 -569 -541 757 256 -1036 16 1317 -574 -1338 1082 978 -1347 -417 1311
3177 1311 54 -1281 48 990 -360 -535 408 408 -79 50 -329 -151 610 21 -798 451 1006 -1005
$$ packed form
3052b10Q56n54j075J228J205k089o58K408n1k749R78K560j760j597J886R52k178
3069h48j45K030p05j286R25L17n48K71M1l24K10N34j102q2J975r08j853J857J153
3088A512k397k66K345j13k608J115K080j661j470J986M10j566K14Q00k52m22L26
3105C3l18N6R61r21q24J703O1j685L71J877j020j916J817J316k090o68K443m70
3123G26j910R59J307r26p97P06J68l46J54M4l43Q21l62j098O33J243j521m49J872
3142H81J79k367N63K427j489j875K163P47j854P9J239q2j171N64P32p90J17K09
3160B72p33O93L00j101K8J298n01j292J052J301j891p64K420j04k325R30J728
3177A311j257j335J329R42j350j75R43%m87J29l79J78P61n89q19J249N55k011
$$ plain form
3195 -1005 -792 1323 168 -1633 222 1403 -627 -1125 880 851 -1180 -296 1078 -7 -839 213
3211 213 270 -217 74 -53 -102 447 6 -646 -53 1053 -275 -1176 793 898 -1388 -545 1365 252 -1336
3230 -1336 -56 1367 -579 -1030 690 324 -781 -171 342 -115 -138 -75 -286 -260 182 -330 -559 747 450
3249 450 -1124 -20 1310 -338 -891 759 1123 -1216 -504 1154 306 -1265 343 772 -344 -604 192
3266 192 279 -345 10 -80 -307 434 -74 -692 539 710 -862 -546 1219 293 -1082 -259 1492 -338 -1232
3285 -1232 801 976 -970 -180 1098 222 -882 -24 505 -166 -253 54 -242 286 75 -753 -88 795 -192
3304 -192 -1059 540 1023 -951 -800 1231 297 -979 32 1253 -114 -904 613 884 -478 -166 653
3321 653 235 -78 132 -70 154 352 -305 -423 351 350 -985 -205 980 -281 -1159 686 1073 -967 -632
$$ packed form
3195a005K13K115j155j801J855J181k030m98K005k9k031Q84J374j085q32J052
3211B13N7m87K91j27m9N49m41o52N93J106j328r01J969J05k286Q43J910j113j588
3230a336J280J423j946m51J720l66j105O10N13m57k3O3k11K6M42n12k29J306k97
3249D50j574J104J330j648n53J650L64k339P12J658q48j571J608M29j116k60P96
3266A92Q7o24L55r0k27P41n08o18J231J71j572L16J765r26j375Q23J751j830q94
3285a232K033J75j946P90J278q76j104Q58N29o71q7L07k96N28k11q28O65Q83r87
3304a92q67J599M83j974J51K031r34j276J011J221j367p90J517K71j362L12Q19
3321F53m18l13K10k02K24J98o57j18P74jj335P80J185j261q78J845L87k040L35
$$ plain form
3340 -632 996 281 -1217 62 1031 -197 -661 294 299 -29 55 50 -50 345 -155 -450 341 690 -593 -700
3360 -700 1033 367 -1018 -68 1316 -225 -1162 647 940 -779 -751 815 257 -665 -3 517 178 -17
3378 -17 -139 68 255 298 -559 -276 978 -29 -734 400 726 -876 -767 908 394 -1194 -112 1074
3396 1074 -301 -970 450 434 -464 -387 189 144 -164 -199 157 -78 459 53 -402 703 301 -904 -84 987
3416 987 -91 -980 613 889 -732 -862 963 305 -840 -27 545 -200 -733 122 396 -292 -233 121 -173
3435 -173 364 -124 -664 437 486 -353 -520 767 509 -1015 -167 1453 -135 -1205 613 955 -578 -554
3453 -554 599 239 -791 11 482 -266 -11 5 25 214 215 -522 -30 573 32 -674 358 845 -703 -664
3473 -664 1063 498 -1004 -126 834 -223 -891 407 799 -461 -480 561 -5 -122 -152 -4 187 87 -350
$$ packed form
3340f32J628p15j498J279R69j228m64R55Nl28Q4nj00L95n00k95P91L49j283j07
3360g00J733o66j385R50J384j541r37J809K93j719K8J566n58r22O62N20l39j95
3378a7j22K07J87M3q57K83J254j007p05J134L26j602J09J675n14j588J082J186
3396A074j375o69J420j6q98P7N76m5l08l5L56k35N37m06m55J105m02j205Q20J071
3416I87j078q89J593K76j621j30J825o58j145Q13N72p45n33Q55K74o88N9L54k94
3435a73N37m88n40J101M9q39j67J287k58j524Q48J620j588j070J818L42j533K4
3453e54J153l60j030Q02M71p48K55J6K0J89Jp37M92O03n41p06J032M87j548L9
3473f64J727n65j502Q78R60j057o68J298L92j260j9J041n66j17l0J48J91j00m37
$$ plain form
3492 -350 -309 212 352 -684 -168 844 -88 -1097 406 747 -577 -560 875 434 -969 -161 858 -132
3510 -132 -446 373 472 -171 -325 -3 180 328 -255 -407 36 583 -398 -597 682 278 -1079 -24 790
3529 790 8 -1036 240 949 -526 -333 719 285 -544 9 564 -129 -133 384 377 75 158 -377 -145 803
3549 803 -12 -892 214 789 -555 -619 536 326 -965 -254 1073 -147 -899 448 745 -557 -593 374
3567 374 161 -334 -95 185 68 362 -207 -362 475 390 -677 -164 848 131 -1031 199 871 -436 -660
3586 -660 743 336 -831 -119 682 -125 -754 217 286 -370 -175 94 -248 172 189 -394 237 652 -488 -571
3606 -571 336 469 -588 -202 880 99 -939 376 783 -549 -679 568 254 -503 -107 416 -13 -195
3624 -195 -90 -21 32 -182 -279 -60 448 -256 -583 99 756 -425 -584 685 585 -632 -118 922 152 -904
$$ packed form
3492c50M1N21J40j036N16J012r32j009J503L41j324J7J435m41j403Q08J019r90
3510a32l14Q19R9o43j54L22J83J48n83j52M43N47r81j99J279m04j357J055Q14
3529G90p82j044J276P09j475J93J052m34q29N53N55o93mN17pl02Q3n35K32R48
3549H03q15q80J106N75j344o4J155k10j291P11J327j220p52J347K97j302l6R67
3567C74k13m95K39K80j17K94n69j55Q37q5j067N13J012p17j162J230O72j307k24
3586f60J403m07j167P12Q01q07o29R71O9o56J95K69l42M20J7n83O31M15j140q3
3606e71R07J33j057L86J082p81j038J315M07j332j30J247l14p57L96N23m29j82
3624a95J05O9N3k14r7K19N08p04l27O82O57j181j59J269j00j217N14J040p70j056
$$ plain form
3644 -904 292 732 -417 -474 258 298 11 -140 117 193 -40 -248 -272 209 255 -619 -422 693 -19 -958 155
3665 155 794 -393 -719 582 624 -643 -282 775 149 -382 126 272 -120 -213 -91 -197 81 91 -396 83
3685 83 416 -265 -592 307 356 -635 -336 738 5 -860 5 727 -247 -715 513 555 -276 -199 512 149 -171
3706 -171 9 406 -172 169 -295 -129 303 -57 -471 0 549 -412 -758 511 633 -914 -475 780 126
3725 126 -509 249 599 -294 -420 192 436 -218 -56 234 54 58 -175 -194 416 288 -453 -265 709 161 -772
3746 -772 -106 747 -402 -734 520 345 -621 -132 351 248 -582 -20 398 -132 -173 228 101 149 40 -133
3766 -133 18 343 -123 -322 334 554 -491 -193 715 79 -1007 41 776 -343 -763 343 458 -539
3784 -539 -360 408 153 -287 -102 33 -27 26 -139 -97 350 152 -486 -58 708 -211 -625 533 534 -549 -392
$$ packed form
3644i04J196M40j149n7P32M0k87j51K57P6k33k08k4M81M6q74J97J115p12r39J113
3665A55O39j187l26J301M2j267L61J057o26n31N08J46l92r3J22j06K78J0m87M79
3685H3L33o81l27Q99M9r91K99J074p33q65Q65P22r74m68J228M2q31P7P11l63l20
3706a71J80L97n78L41m64J66M32l60m14M71N49r61l46J269J22j547M39J255o54
3725A26o35P58L50q93j26O12K44o54J62K90j80Mk33j9O10j28p41J88R74n48r33
3746g72O66Q53j149l32J254j75r66M89M83j03q30N62M18n30m1M01j27M8j09j73
3766a33J51L25m66j99O56K20j045K98R08o36j086J048P35j119m20J106J15r97
3784e39J79P68k55m40J85J35o0N3j65M2M47j98o38M28P66r19m14J158Jj083J57
$$ plain form
3805 -392 665 188 -677 42 720 -194 -591 217 395 -122 -344 138 106 -215 -260 -242 162 129 -625 -472 477
3826 477 245 -631 176 750 -207 -612 440 703 -536 -360 705 287 -374 -56 363 203 -290 24 -75
3845 -75 113 10 -212 -46 330 -169 -410 281 310 -358 -286 652 378 -723 -79 582 -204 -609 366 577 -232
3866 -232 -388 436 103 -158 -3 2 -102 32 -229 -71 297 -7 -439 -31 410 -69 -461 322 450 -585
3886 -585 -486 859 106 -629 -154 606 -46 -421 354 513 -120 -153 57 153 28 -5 -94 215 378 -296 -141
3907 -141 514 137 -796 -7 756 -247 -678 304 577 -421 -549 417 80 -425 -13 414 40 -270 -8 -47
3927 -47 76 48 -204 135 96 -48 -307 245 582 -336 -314 536 359 -648 41 640 -259 -662 180 508 -227
3948 -227 -456 522 85 -157 -53 245 166 -67 -9 -170 165 150 -422 -175 512 -160 -552 311 634 -330 -365
$$ packed form
3805c92J057m77q65P19O78r14l97Q08J78n17k22M82l2l21m5J8M04l3p54J53R49
3826D77k32q76Q07N74r57m05J052K63j239J76J065m18o61L18M19j60m93L14r9
3845g5J88j03k22J66L76m99k41O91K9o68P2R38k74j101O44O61p86m05R75K11q09
3866b32j56Q24l33k61J55Nj04J34k61J58L68l04m32M08M41m79l92P83J28j035
3886e85R9J345p53p35M75P60o52l75P75J59o33l3K10R6j25l3q9L09J63o74J55
3907a41O55l77r33P89P63j003m31R82K73r98j28R66l37n05M12M27l74l10K62l9
3927d7J23k8k52L39l9j44k59N52L37r18K2Q50j77j007O89N99q99m03Q42L28p35
3948b27k29R78m37k42J04K98p9k33N8j61L35j5n72K47O87o72l92Q63L23r64l5
$$ plain form
3969 -365 610 324 -466 -31 500 -249 -496 220 201 -326 -211 32 375 64 12 -142 247 353 -243 -176 501
3990 501 181 -665 -233 654 -84 -704 207 582 -373 -247 427 219 -365 -10 296 42 -12 156 101 111 75
4011 75 -136 186 173 -141 -392 204 274 -269 -342 531 184 -426 -173 661 -36 -573 153 358 -218 -332 27
4032 27 212 -344 -143 80 141 37 -136 -34 34 231 -524 -76 331 10 -538 -28 538 -407 -523 421 180
4053 180 -570 -289 671 -5 -313 271 268 -4 -119 212 -48 2 -96 -101 150 85 -140 -336 537 217 -408 -116
4075 -116 495 169 -640 92 417 -322 -584 366 251 -455 -140 42 185 -175 22 23 16 -116 -172 -45 93 150
4097 150 -405 30 350 -134 -313 270 182 -399 -86 567 132 -308 107 469 -176 -297 319 255 -121 -248 -2
4118 -2 18 26 -106 -45 150 266 -275 -42 549 -38 -387 -123 584 -71 -608 364 385 -460 -347 493 145 -381
$$ packed form
3969c65R75k86p90M35N31p49k47P16j9n27J15K43L43l11n2j54L89J06n96O7O77
3990E01l20q46M32Q87p38o20R11L75r55J26O74k08n84L55L06k54n4J68n5J0l6
4011G5k11L22j3l14k51N96P0n43p3Q73l47o10K53Q34o97n37P26K05n76j14L59
4032B7J85n56K01K23O1j04j73J02O8J97p55M48M07l21n48N10N66r45j16R44k41
4053A80p50K81R60o76l08N84lk72j15L31k60N0r8nK51o5k25j96Q73l20o25K92
4075a16O11l26q09P32L25p39k62R50j15p06L15J82J43l60J97Jpj32n6J27J38N7
4097A50n55M35L20m84j79N83q8n81L13O53m35m40M15L62o45j21O16o4l76j27K46
4118bK0Qj32O1J95J16n41K33N91n87l49K64P07o55n37R72K1q45J13Q40l48n26
$$ plain form
4140 -381 -85 267 -167 -309 193 225 -62 -101 -43 72 91 -194 -214 301 117 -166 -315 753 242 -571 124
4161 124 794 -335 -500 334 212 -116 -167 447 204 -253 -41 120 -107 -178 -293 41 198 -301 -304 -127 272
4182 272 -17 -516 271 313 -471 -161 295 66 -476 39 547 30 -385 190 331 -206 -77 24 130 -237
4202 -237 -207 -58 142 -18 -132 -119 367 172 -550 -45 266 -256 -480 289 402 -349 -211 372 113 -486 -172
4223 -172 427 109 -108 271 -16 248 16 -33 53 232 -326 -152 271 214 -450 -173 520 154 -344 -45 530
4244 530 -82 -342 257 225 -513 -63 349 -28 -43 46 241 17 -25 -35 35 -3 -111 -267 -60 478 44 -380
4266 -380 112 244 -362 -265 341 213 -690 -69 469 25 -556 178 263 -36 -304 195 -66 35 -21 -10 167
4287 167 170 -135 -5 380 -7 -210 -89 270 -219 -365 116 374 -298 -288 358 232 -424 -57 382 -28 -234
$$ packed form
4140c81K96L52m34j42N02L2k87l9N8J15J9k85k0N15j84k83j49J068n11q13O95
4161A24O70j129j65Q34j22l28n1O14k43m57K12J61k27p1j15L34J57m99lJ77L99
4182B72k89m99P87M2p84L10M56k29n42N15N08n17m15N75J41n37J29J01J06l67
4202b37L0J49K00j60j14J3M86j95p22N05L11n22k24P69J13p51J38N83k59n99L14
4223a72N99l18k17L79k87K64k32m9Q6J79n58J74M23n7o64K77O93l66m98K99N75
4244E30o12k60N99l2p38M50M12l77j5Q9J95k24m2j0P0l8j08j56K07N38m34m24
4266c80M92J32o06R7O06j28r03O21N38m44n81P34Q5k99k68M99k61J01n6J1J77
4287A67Ll05J30L85l87k03J21L59m89j46M81K58o72J0O46j26o56L67M39m10k06
$$ plain form
4308 -234 -129 269 -72 -72 -145 54 245 -112 -172 341 152 -215 -366 521 407 -465 -43 414 -216 -367 200
4329 200 457 -148 -391 197 153 -302 -66 296 16 67 -29 -83 86 -134 -29 -118 272 -236 -186 306 404 -213
4351 -213 -190 509 7 -455 57 323 21 -534 80 224 -90 -216 151 -60 -152 -302 -36 39 -118 -64 -215
4372 -215 122 -40 -323 38 213 -63 -339 191 381 -247 -224 506 256 -454 -53 257 -25 -196 55 319
4392 319 -60 44 -129 64 -98 -139 -244 142 340 -240 -232 130 276 -392 -205 476 -37 -437 94 280 -36
4413 -36 -262 95 228 -99 116 285 65 -43 -21 -165 -49 -50 -255 -63 207 -273 -212 232 264 -216 -430 349
4435 349 208 -438 116 244 37 -440 -23 402 -91 -203 349 -95 -188 -45 23 275 187 -20 119 5 266
4456 266 -218 -205 248 71 -360 172 244 -324 -268 57 120 -209 17 223 -76 -59 -46 205 8 -69 -78 158 23
$$ packed form
4308b34J05L98l41%p3J99J91l57o0N13j89l67j51Q87j14q72M22M57o30j51N67
4329B00K57o05k43N88m4m55K36L62k80N1r6n4J69k20J05q9L90n08N0M92R8o17
4351b13K3O99n02m62N12K66l02n55O14J44l14j26L67k11r2j50K66P5j57N4j51
4372b15L37j62k83L61J75k76k76N30J90o28K3P30k50p10M01L10k82j71K51K64
4392C19l79J04j73J93j62m1j05L86J98n80QL62J46o68J87O81n13m00N31J86l16
4413c6k26L57J33l27K15J69k20j08K2j44J16jk05J92K70m80O1M44L2m80k14P79
4435C49j41o46N54J28k07m77M17M25m93j12N52m44r3J43O8K52q8k07J39j14K61
4456B66m84J3M53j77m31N32P2n68N6L25O3l29K26K06k99J7J3K51j97p7rK36j35
$$ plain form
4479 23 -7 -23 100 254 -283 -236 266 227 -186 -6 413 -9 -433 213 432 -81 -323 217 66 -272 29 211
4501 211 198 -182 -39 47 104 19 -214 82 186 64 -145 136 336 -198 -205 61 228 -317 -239 417 36 -365
4523 -365 44 150 -152 -332 26 238 132 -64 157 93 -29 -202 -54 1 100 -257 -23 324 -14 -266 45
4544 45 361 -42 -261 93 237 -116 50 98 78 -273 -109 -53 -3 -341 -108 20 33 -28 -115 -130 -72 -116 -327 94
4568 94 339 -177 -114 108 -13 -398 101 448 -158 -312 210 209 -314 -372 84 -17 -348 3 30 153 -206 -103
4590 -103 18 406 121 -291 -20 214 -102 -125 160 274 -232 -243 351 161 -131 -122 278 -54 -239 174 133 74
4612 74 -48 111 194 168 -40 -97 69 181 -105 124 178 -3 -236 220 302 16 -212 187 226 -216 -251 220 -39
4635 -39 -257 -126 185 30 -19 37 -64 107 -199 -42 5 53 25 -75 290 248 -200 -102 302 -158 -216 -57 400
$$ packed form
4479B3l0j6J23J54n37M7N02l9m13J80M19m22m24O46K19n13k42N40j51l38L01J82
4501B11j3l80J43Q6N7q5k33K96J04j22k09K81K00n34pK66J67n45P8O56l81m01
4523c65M09J06l02j80L58K12j06j96K21o4j22j73J48N5R9l57K34L47l38k52L11
4544D5L16m03k19L54J44l53J66M8k0l51J64N6N0l38K33J28J3o1q7j5N8m4k11M21
4568I4K45n16O3K22j21l85M99L47o06j54N22jn23n8M56j01l31L51K7J23l59J03
4590a03J21L88k85m12K71K34l16k3K85J14n06j1N94j90k92RM00l32j85M13m1n9
4612G4j22J59Q3k6k08n7J66J12k86K29N4j81k33M56Q2k86k28L99L9m42l5M71k59
4635c9k18J31L11j55m9N6j01J71l06J57M7M8k8j00L65m2m48R8M04m60n8J59M57
$$ plain form
4658 400 -127 -243 75 50 -77 -217 17 22 -155 -113 91 20 158 113 51 65 -31 98 61 191 -141 -170 102 248
4682 248 -332 -81 150 263 -164 -94 178 19 -237 -17 274 -182 -81 103 23 0 33 -179 -145 -53 -319 26
4704 26 134 -25 -169 33 250 -220 -285 212 180 -175 -60 36 165 -96 -47 -111 128 -171 195 99 -202 -63
4726 -63 -144 201 60 -106 34 60 191 -106 -257 199 -1 -290 17 253 -100 -188 -12 144 -181 -244 267 109
4748 109 60 -87 -30 75 46 -157 117 94 4 -362 -99 292 -29 -134 -7 28 -40 -208 143 125 -222 -104 395
4771 395 -237 -282 277 155 171 -71 -37 264 -35 73 -100 64 -101 -253 -135 135 32 -282 62 145 70 -219
4793 -219 87 234 -31 -48 151 233 -146 -31 -11 -125 -236 57 35 -101 44 98 14 163 77 115 -27 172 -271
4816 -271 -106 34 184 -359 -200 39 -5 -259 180 343 -61 25 -68 118 -22 -32 32 139 -38 -97 129 69
$$ packed form
4658D00n27j16L18k5j27j40K34Nj77M2K04p1J38m5o2J4r6J29l7J30l32k9K72J46
4682B48n80K51K31J13m27P0K72j59k56K20K91m56J01J84q0k3L3k12L4R2k66L45
4704B6J08j59j44K02K17m70o5M97l2l55J15R6J29k61M9o4K39k99L66r6l01J39
4726f3q1L45j41j66J40K6J31k97j51M56k00k89L07K36l53q8J76J56l25o3N11j58
4748A09m9j47N7J05k9k03K74k3r0l66K63L91l21j05J27L5o8j68L51j8l47J18M99
4771C95o32m5N59j22J6k42L4L01k99J08j73J64j65j52J18K70j03l14L44Q3p5k89
4793b19L06J47k65j7J99Q2l79J15K0j14j11K93k2j36J45N4q4J49q6L8j42J99m43
4816b71J65J40J50n43J59K39m4k54M39J63m04Q6r3J86j40j0O4J07j77n9K26o0
$$ plain form
4838 69 48 -54 14 204 -84 -221 26 271 -281 45 236 -54 -278 -79 20 64 -326 131 33 139 -234 -64
4860 -64 135 -19 -68 77 73 195 -13 59 152 112 -77 -17 330 -120 -269 207 113 -280 -48 333 -68 -226 -14
4883 -14 31 71 -63 91 -1 -79 -59 8 -90 108 38 -167 -74 134 -101 -82 262 195 -191 -36 228 166 -250 -41
4907 -41 240 -151 -236 332 51 -288 -48 80 -34 -158 -114 153 138 -222 1 -63 103 -270 -114 113 168 -236
4929 -236 -405 185 96 -158 -17 105 175 -212 -99 92 -21 -29 -4 146 52 -15 -14 -20 -105 -46 16 148 125 -280 -130
4954 -130 -1 -22 -112 194 167 -128 -324 269 55 -125 -46 46 198 -154 111 -1 -38 -83 -111 1 112 -42 -83
4977 -83 6 216 -68 -262 205 -21 -194 -141 229 94 -25 45 199 -193 -208 -20 316 48 -83 120 -148 -106
4999 -106 14 107 37 75 -141 -99 132 -92 -7 110 65 -150 -174 254 9 -191 -137 106 73 -122 -69 258 54
$$ packed form
4838F9k1j02O8J90k88j37K47K45n52L26J91k90k24J99R9M4l90M57r8J06l73J70
4860f4J99j54m9J45mJ22k08P2R3m0j89O0L47m50j49M76r4l93K32L81m01j58K12
4883a4M5M0j34J54r2p8K0O7r8J98p0k05R3K08k35J9L44o7l86J55K64o2m16K09
4907d1K81l91q5N68k81l39K40J28j14j24M4K67j5l60K23o4J66l73J56K27N5m04
4929b36j69N90q9k54J41J22P0l87J13J91j13qK5J50r4o7Joq5N9O2J32k3m05J50
4954a30J29k1r0L06k7k95j96N93k14j80P9R2J52l52K65j12l7m5k8J12J11j54m1
4977h3Q9K10k84j94M67k26j73N3L70j35j19P0J54l92j5J88L36k68j31K03k68M2
4999a06J20R3p0L8k16M2K31k24Q5J17m5k15k4M28k45k00N4K43l3j95N3L27k04
$$ plain form
5022 54 -92 -38 185 31 -155 -98 172 201 54 -135 44 71 -132 98 129 -73 -295 134 1 -88 -203 -29
5044 -29 -2 -4 -12 -15 190 -200 -86 56 -222 -80 -48 10 6 -163 -51 -23 111 -120 -77 114 20 -341 54 250 43
5069 43 -199 8 44 40 -216 -44 121 -79 -145 130 43 97 99 152 129 -20 -148 -31 193 114 -25 -91 82 0 -55
5094 -55 163 163 -244 -173 138 -69 -141 78 68 2 73 118 109 -155 -40 -12 78 115 -120 154 109 96 -271 -47 132
5119 132 187 -30 108 139 -92 -285 178 113 -299 -231 145 83 -34 -28 161 -5 -174 -122 55 -36 -121 -122 -91 188
5143 188 -146 -321 124 124 -200 -103 74 143 -52 -59 152 -59 -77 40 215 58 55 29 64 -66 -8 73 112 -37 -229
5168 -229 223 199 -48 -83 14 209 19 -64 101 168 -283 -88 111 94 -318 112 48 -158 -181 118 -24 127 -149
5191 -149 101 107 -85 -133 -102 103 4 -158 -112 214 110 -47 -52 195 -290 -156 103 -1 -19 -128 120 248 -192
$$ packed form
5022E4j46N4K23j54j86N7K70K9j47j89J79K7k03K30L1k02k22M29j33q9j15J74
5044b9K7kqlK05l90J14J42k78J42L2N8mj69J12K8J34k31M3J91r4l61L95J96k07
5069D3k42K07L6mk56J72J65k00o6K75q7N4KN3k3j49j28J17K24p9j39o6J73q2n5
5094e5K18%m07P1L11k07p2K19j0o6P1M5rk64J15K8R0L7k35K74m5j3l67K24J79
5119A32N5k17J38L1k31j93M63o5m12O8L76o2j17OJ89j66j69N2J77r1q5jL1K79
5143A88l34j75M45%l24R7J77O9j95pK11k11j8J17J75j57lk6L5j30N8Q1L9j49j92
5168b29M52k4k47l5R7J95j90q3J65O7m51J95J99j7m12M30o4k06k3K99j42J51k76
5191a49K50Oj92m8L1K05r9j62M6L26j04j57nK47m85J34K59j04j8j09K48J28m40
$$ plain form
5214 -192 -349 57 -167 -129 1 35 217 34 63 137 116 -26 -128 110 177 -90 -65 -36 177 -264 -29 213 -79
5237 -79 -40 68 215 -45 -121 -17 143 -71 -60 -74 99 153 -132 -78 161 51 61 79 142 25 -213 14 67 -83
5261 -83 -78 252 125 -25 -84 148 115 -72 -26 43 57 2 -53 233 -26 -57 8 67 68 -44 -127 158 52 -362 84
5286 84 257 -37 2 -21 30 -72 -31 130 46 -139 -150 76 125 73 -93 124 -54 -188 -172 -19 102 -197 135
5309 135 164 224 -221 -179 233 -64 -36 68 242 2 -213 -136 28 -87 -109 4 -1 -93 -76 10 -17 35 54 -12 72
5334 72 54 -79 -109 18 -135 -217 184 266 -21 84 -101 96 -304 -64 247 46 -207 125 33 228 -61 -8
5356 -8 -41 -6 20 -19 80 110 16 125 190 -79 -26 89 -4 -177 -54 5 -36 -9 9 136 -40 -146 -109 -62 13 -207
5382 -207 -104 160 -36 -66 44 4 148 -198 137 77 9 -163 -120 63 160 -247 -270 69 -38 -160 234 10
$$ packed form
5214a92j57M06k24L8J30L4J82j83K9P4k1j42j02K38O7k67K5K9K13m41K35K42k92
5237g9L9J08J47k60p6J04J60k14J1j4J73N4k85N4K39j10J0J8O3j17k38K27N3j50
5261h3NL30j27j50n9K32l3j87M6O9J4n5n5K86k59l1O5N9Jj12q3K85j06m14M46
5286H4J73k94L9k3N1j02M1J61q4j85j1K26M9n2j66K17j78j34J6J53J21k99L32
5309A35K9O0m45M2M12k97K8J04J74k40k15P7J64j15k2J13nr2J7Q6k7N2J9o6Q4
5334G2j8j33l0J27j53q2M01Q2k87J05j85J97m00K40L11k01k53L32r2J95k89N3
5356hl3L5K6l9R9L0r4J09O5k69N3J15r3j73J23N9m1K7J8J27j76j06L7M7P5k20
5382b07J03K64j96l0J10m0J44l46L35o0o8j72M3J83R7m07k3L39j07j22L94k24
$$ plain form
5404 10 -19 -179 170 37 29 -5 116 250 -6 88 -153 115 -158 112 42 131 36 -116 -79 103 -222 -116 -102 8
5428 8 -99 -75 244 69 48 120 135 -38 -135 -110 1 63 -15 -103 -36 221 25 150 -2 -133 -125 -199 278 -181 -147
5453 -147 205 255 -69 80 -50 -86 -91 87 20 103 37 25 64 218 -104 -153 8 183 -25 -158 21 85 -126 -42
5477 -42 166 51 -101 238 102 -211 -281 118 68 -152 -127 54 130 -119 -50 -20 105 -52 -44 78 141 78 -72 40
5501 40 57 -60 -168 44 154 -158 86 115 93 -137 -72 111 -127 -285 97 63 237 -68 -2 24 45 55 -128
5524 -128 193 32 -84 -97 136 27 -142 61 13 -65 -11 -228 67 -164 -187 167 34 90 51 21 10 -95 19
5547 19 7 118 3 -133 105 78 -76 -109 85 54 -38 -93 127 -84 -134 7 -80 -72 13 21 246 -145 -122 96 56
5572 56 -10 -2 130 160 98 -244 104 213 87 -307 -167 179 49 -196 -36 165 -157 -80 119 24 -33 -18 94
$$ packed form
5404A0k9j60L49j33ql4J21J34k56R4k41K68k73K70p0Q9r5j52L7J82l25J06J4J10
5428Hj07K4L19j75k1P2J5j73r7K5J11O2p8q8O7K57j96J25j52j31Qp4M77m59L4
5453a47L52N0l24J49j30l6nJ78o7Q3o6j2L9J54l22m9J61J75k08j33J79O4k11Q4
5477d2K08j15j52L39j36l13p0L99n0k20K5J81P6k49O9L0J25j57QJ22O3o3j50J12
5501D0J7j17j08K12J10l12K44K9k2k30O5J83k38j58L82l4J74l05O6K6K1J0j83
5524a28L21j61j16j3K33j09j69K03m8p8N4k17K95k31k3L54j33N6l9l0j1j05J14
5547A9j2J11j15j36K38k7j54l3J94l1r2n5K20k11n0J41q7QQ5QK25l91K3K18m0
5572E6o6QJ32L0o2l42L48J09j26l94J40L46j30k45J60K01l22P7J99r5n7J5J12
$$ plain form
5595 94 53 -55 86 22 -120 -58 124 60 70 237 -111 199 161 -192 -152 264 -43 -129 -124 2 2 -136 12 147
5619 147 -80 -282 -1 -65 -75 -68 24 117 -152 -148 5 26 -42 -46 72 161 29 61 178 188 -136 48 -8 109 -93
5644 -93 10 33 46 -214 -159 83 -16 -227 -70 -36 -25 20 37 105 116 -194 89 59 -100 -38 -4 43 10 -123 -124 -47
5670 -47 -1 -233 38 130 -85 6 72 148 -159 81 204 -94 -305 -72 105 179 151 -70 -191 -50 -99 -36 48 176
5694 176 -19 -80 120 -179 98 18 -11 -73 -22 30 200 28 28 -78 -45 41 12 37 191 -245 -16 -96 232 -40
5718 -40 -113 -152 84 -173 -18 129 27 8 23 -103 -45 -138 -37 17 13 -97 91 -90 -21 -98 83 229 137 -179
5742 -179 109 -12 -57 -168 89 16 0 -21 -81 302 -51 -32 129 113 -33 -103 -98 280 -244 -43 158 -33 -112 -60
5766 -60 20 -99 37 -100 53 70 93 21 94 178 6 -10 181 5 -45 339 105 -83 -162 95 -5 -41 7 -132
$$ packed form
5595I4m1j08J41o4j42O2J82o4J0J67l48L10l8l53M0M16l07q6NJ26%j38J48J35
5619A47k27k02K81o4j0PR2R3k69MJ53K1o8mJ18Q9j32L2J17J0l24J84n6J17k02
5644i3J03K3J3k60N5K42r9k11J57L4J1M5J7O8J1l10K83l0j59O2L4M7l3j33jP7
5670d7M6k32K71R2k15R1O6P6l07K40J23k98k11K33J77P4k8k21j21J41m9O3Q4J28
5694A76j95o1K00k99K77q0k9o2N1N2J70j72%j06L3Q6k9K5J54m36K29q0L28k72
5718d0p3l9K36k57J55J47j02j9J5j26N8r3J01N4mj10J88j81O9p7J81J46r2l16
5742a79K88j21m5j11K57p3j6k1o0L83l53J9J61j6j46p0NL78n24K01K01j91p9N2
5766f0Q0j19J36j37J53J7K3p2P3Q4j72j6J91j76n0L84k34j88p9K57j00l6M8j39
$$ plain form
5790 -132 219 -56 -6 24 42 -150 80 191 -31 -113 1 129 64 -38 -88 191 190 -248 85 150 99 -173 136
5813 136 66 -304 -91 -37 110 -267 -54 149 -78 -10 73 -50 71 -29 -179 -241 45 -127 -80 23 102 47 37
5836 37 190 151 -36 -45 232 137 -143 -54 168 68 -246 5 18 2 -89 -15 50 83 186 -104 10 -97 -283 -145
5860 -145 131 51 -162 68 108 -89 -106 158 190 -126 14 -57 -19 -142 0 30 -15 -122 -1 23 70 -151 -36
5883 -36 88 142 -117 47 -105 36 -168 120 218 3 -241 -92 -180 34 -111 109 89 -105 -150 23 17 -23 -150
5906 -150 76 340 -57 -276 114 223 7 -148 -220 284 -208 -64 9 213 -133 62 -7 -87 -94 -18 91 130 -91
5929 -91 -21 -83 -84 -39 86 -118 156 -164 18 133 -190 -18 -91 -110 -50 -3 90 -18 -133 -129 23 151 -73 -93 145
5954 145 85 -119 -54 52 -127 -261 -100 33 38 -14 -120 -51 132 -34 -24 134 -134 -74 -127 162 87 -191 30
$$ packed form
5790a32L51k75N0L0J8j92K30J11k22q2J14J28o5j02n0K79jm38L33O5n1k72L09
5813A36p0l70K13N4J47l77K13K03k27O8Q3j23J21j00j50o2K86j72M7J03P9n5j0
5836C7J53l9j87rK77r5k80Q9K22j00l14K51J3j6r1P4O5L3J03k90J14j07j86J38
5860a45K76q0k13K30M0j97j7K64L2l16J40p1L8j23J42L0m5j07J21K4M7k21J15
5883c6J24N4k59J64j52J41k04K88R8k15k44J49q8K14j45K20k0j94m5J73om0j27
5906a50K26K64l97k19L90J09k16j55p2N04m92J44P3K04l46J95o9q0pP6J09L9k21
5929i1P0o2jM5J25k04K74l20J82J15l23J72p3j9O0M7R3j08j15MJ52J28k24k0K38
5954A45o0k04O5J06j79j34J61J33Nn2j06O9J83j66J0J58k68O0n3K89p5k78K21
$$ plain form
5977 30 130 18 -261 68 203 50 -174 203 -78 63 -27 34 229 18 30 4 113 -2 -56 -46 99 171 -148
6000 -148 8 163 -153 -82 96 307 -27 -26 25 88 -197 74 74 143 -56 -114 123 -87 -155 57 269 -24 -66 205
6024 205 191 74 -175 163 151 18 -311 161 294 -96 -45 31 163 113 45 45 -31 -21 -37 29 -22 20 -146 -6 -47
6049 -47 -101 -79 194 14 -86 -131 147 -55 -89 153 180 -137 -320 -38 102 60 -117 -49 234 -154 -94 45 195
6072 195 100 -184 68 100 -110 1 100 40 -129 -115 -45 26 -93 4 164 148 -96 -134 56 89 -171 11 111 77
6096 77 53 -160 79 -58 16 28 322 60 138 -21 -23 -115 -69 -22 224 31 -191 -53 42 -144 -158 264 45 100
6120 100 101 25 109 -12 101 190 -52 -42 -77 -26 95 244 -257 -112 -27 -130 -153 198 107 -129 56 -27 16 -181
6144 -181 -102 77 -131 -147 4 -91 42 -149 87 55 -223 -226 110 -56 -5 -264 -41 350 -151 -160 127 18 -90
$$ packed form
5977C0J00j12k79L29J35j53k24L77k81J41r0O1J95k11J2k6J09j15n4J0J45P2l19
6000a48J56J55l16P1J78K11l34JN1O3k85K71%O9j99n8K37k10o8K12K12k93m2K71
6024B05j4j17k49L38j2j33l29M72J33l90N1P6J32n0o8%p6J0j6O6n1M2j66J40m1
6049d7n4K2K73j80j00m5K78k02l4K42K7l17j83K82J40m2j77O8K83l88O0J39J50
6072A95r5k84K52L2k10J11R9o0j69J4P0P1j19R7J60j6k44l8J90L3k60J82J00l4
6096G7k4k13K39j37P4J2K94k62P8j59kr2M6M7K46j93k22J38R5j86j4M22k19N5
6120A00Jp6Q4j21J13Q9k42J0l5N1J21J49n01J45Q5j03k3L51r1k36J85q3M3j97
6144a81P9J79k08j6J51r5J33j91K36l2k78lL36j66N1k59K23L91n01rK87j09j08
$$ plain form
6167 -90 -130 244 114 -263 -89 -72 186 -29 109 48 28 -123 -80 -97 -1 -1 10 -67 -17 -193 -149 17 181 -254 -180
6192 -180 103 99 6 -206 132 -76 -171 173 32 -7 -259 46 97 46 -257 76 -16 -39 -54 55 73 -109 -76 174
6216 174 175 -217 -60 35 128 -79 19 107 -49 -46 103 -141 -34 -19 -95 85 -128 -87 -51 106 -86 -96 -53 56 -161
6241 -161 -289 41 46 -81 -88 -57 244 -70 -116 26 194 -151 63 84 -27 15 -13 38 -185 -11 9 196 -134 -235
6265 -235 148 234 -90 -24 -70 94 -6 -81 39 60 -45 -222 23 -162 -6 97 198 -11 -37 -198 -53 122
6287 122 94 -163 106 -66 -130 -177 -12 -117 -163 -38 -264 38 -164 98 -13 27 -173 104 -71 96 -72 -143
6309 -143 213 -25 -15 -12 76 -102 -83 40 -236 -8 -15 -95 191 10 -179 69 113 -181 -58 -58 -30 28 -53 161 199
6334 199 -52 -72 7 -61 2 -92 141 147 -171 -89 119 141 91 -101 123 3 37 46 127 -84 -14 -33 124 17 34 203
$$ packed form
6167i0m0L74j30l77J74J7K58k15J38o1k0j51M3j7R6%J1p7N0j76M4J66J64m35P4
6192a80K83mr3k12L38k08r5L44j41l9k52L05N1n1l03L33r2k3j5J09J8j82L3K50
6216A74Jl92J57R5R3k07R8Q8j56LJ49k44J07J5p6J80k13M1L6J57j92j0M3J09k17
6241a61j28L30Nj27pL1L01l14m6J42J68l45K14K1j11M2k8N1k23J74K0J87l30j01
6265b35L83Q6l24O6m6J64j00p5J20K1j05j77K45j85J56J03J01k09k6j61J45J75
6287A22k8k57K69j72o4m7J65j05m6J25k26L02k02K62j11M0k00K77j75J67j68p1
6309a43L56k38J0LQ8j78J9J23k76K28pq0K86j81j89K48M4k94J23%K8N8q1K14L8
6334A99k51k0P9o8O3r4K33Ol18Q2K08K2n0j92K24j20L4RQ1k11P0j9J57j07J7J69
$$ plain form
6360 203 -112 193 18 -168 166 -178 32 -18 90 -112 -78 64 137 -31 -126 -90 116 -26 -178 21 -76 -67 -10
6383 -10 129 79 -100 -71 293 -29 10 164 149 34 -143 123 104 -110 -110 77 -38 114 -126 -25 -12 9 -122
6406 -122 146 145 -34 -375 7 27 18 -76 134 75 -190 50 53 122 -93 -23 17 -43 -72 11 30 173 -185 -4 83 -36
6432 -36 36 63 76 -232 -159 -74 164 67 36 29 -151 -63 53 231 54 22 -41 -157 -37 -60 -157 83 99 -137 -180 90
6458 90 8 -52 21 17 74 -114 31 26 -21 -45 -144 -266 -7 -36 61 167 -16 94 -82 15 196 -173 -135 -75 2 -164
6484 -164 141 188 -106 102 110 57 -51 -100 -37 223 11 -250 64 173 -215 -58 -141 64 -153 154 -12 -192
6506 -192 -62 58 196 71 -89 -175 100 45 -141 32 -10 76 -140 133 161 121 -38 100 80 -52 -29 16 60
6529 60 145 -207 187 -12 -139 -4 -98 241 -113 -27 -1 149 98 -151 -29 -90 14 -181 51 -124 -58 -83 123
$$ packed form
6360B03l15L05j75j86L34l44K10n0J08k02L4J42P3j68r5L6K06j42j52J99r7RN7
6383a0J39n0j79K9L64l22L9J54j5j15j77K66j9k14%J87j15J52k40J01J3K1j31
6406a22K68jj79l41L82K0rr4K10n9k65K40LO9k15P0M0o0k9Q3J9J43l58J81Q7j19
6432c6P2K7J3l08P3Q5K38r7l1pj80Q8J16J78j77l2o3j16J20k3r7K40J6k36m3K70
6458I0q2o0P3mN7j88J45nm7k4r9j22K59k9R7J06j83J10j76R7J81l69L8O0P7j66
6484a64L05M7k94K08Qn3j08m9O3K60k12k61L14J09l88J57q3K05k17L07j66j80
6506a92J30J20J38j25j60q6K75n5j86J73m2Q6k16K73K8m0j59J38k0j32K3M5M4
6529F0Q5l52L94j99j27J35r4L39l54Q6K6J50n1k49J22o1J04j95K32j75O6k5K06
$$ plain form
6552 123 106 -69 41 107 188 21 -72 37 -52 -55 56 13 101 -38 223 56 -7 -84 -92 -48 12 -22 -75 20 -133 -220
6578 -220 34 131 129 -177 215 37 -113 -102 171 -32 -57 -96 -97 43 -49 -27 97 122 -227 167 -10 -202 -82 -11
6602 -11 -39 -225 26 256 72 58 -23 -57 68 9 6 -195 18 110 -202 70 185 -120 -14 71 -8 -174 -36 -50
6626 -50 47 144 0 120 -67 30 -74 -10 9 -70 -100 27 -105 -122 -1 169 180 -189 -234 -24 15 -58 -2 41 -21
6651 -21 -164 -131 -51 -76 -104 70 -55 -29 115 70 149 -114 -184 79 135 -298 -73 23 -123 160 70 -217 128 -49
6675 -49 16 -82 -154 -31 86 -25 262 -165 109 94 245 45 -76 136 -215 -73 -118 -25 -20 -17 46 181 -157 -200
6699 -200 -280 27 145 -118 -32 24 -151 -351 124 29 75 -61 55 127 -264 31 261 149 -77 -75 -34 63 -147
6722 -147 -29 -142 -17 -197 200 -102 12 -282 6 -113 -33 -55 -41 -41 -95 25 76 83 -70 110 18 134 43 -149
$$ packed form
6552A23j7j75J10O6Q1j67r3J09q9lJ11m3Q8j39K61j67o3p7qM4O0l4n3R5j53q7
6578b20K54R7kl06L92j78j50J1K73k03k5l9jJ40r2K2J24K5l49L94j77j92J20P1
6602a1k8j86K51K30j84j4q1l4J25n9lk01K13R2l12K72J15l05J06Q5p9j66J38j4
6626e0R7R7j44J20j87R7j04O4J9p9l0J27j32j7J21J70J1l69m5K10L9p3N6M3o2
6651b1j43L3Q0k5k8J74j25K6J44m5P9k63p0K63N6m33K25R6j46K83r0k87L45j77
6675d9O5r8p2J23J17j11K87m27K74j5J51k00j21K12l51J42m5R3NLO3J35l38m3
6699b00q0L07J18k63Q6N6j75k00M75r5M6j36J16P2l91K95K30j12k26KM1R7k10
6722a47J18j13J25j80L97l02J14k94K88j19Q0k2J4%n4J20N1Pj53J80r2J16r1j92
$$ plain form
6746 -149 153 137 39 -40 -22 2 -7 1 -192 -20 78 48 71 102 65 -2 42 31 -202 -5 -29 -17 -73 37 5 -44 -3 -62
6774 -62 116 94 -148 34 59 43 99 -204 266 -28 33 -57 34 45 -4 -135 12 6 126 150 61 -22 85 10 90 1
6800 1 -66 -25 -61 -41 -131 -31 -7 -42 -54 58 154 -25 -59 -14 40 68 -164 -95 48 -120 138 0 39 28 77 -45
6826 -45 -94 15 173 172 -155 -182 136 -143 -103 45 -87 246 -7 -64 -86 -314 10 18 44 -77 -71 -275 -43 -41 -270
6851 -270 -241 131 -155 52 -31 -40 52 -162 109 48 41 -11 -64 138 14 -46 139 56 -44 134 -37 55 -36 -122 24
6876 24 124 8 -34 93 50 -122 -108 147 30 -131 -195 -21 -166 -6 -133 -137 -110 -18 8 -48 102 -53 55 -34
6900 -34 32 -212 97 242 -60 -109 97 157 19 -158 -43 188 14 64 171 40 -77 -116 88 138 -39 -170
6922 -170 74 -56 -9 -124 12 163 -174 -62 163 55 -150 -37 -62 -15 -59 -177 -7 13 -143 5 59 136
$$ packed form
6746a49L02j6r8p9J8K4rQj93J72R8l0K3L1l7o7M4j1k33J97k4J2n6J10l2m9M1n9
6774f2J78k2k42J82K5j6N6l03M70k94O1r0R1J1m9j31J47oJ20K4q9q3J07p5Q0q9
6800Ao7M1l6K0r0J00K4l5j2J12R6j79l4M5N4K8k32O9J43j68K58j38L9j1M9j22
6826d5m9J09J58jl27k7L18k79M0J48j32L33k53n7k2k28L24QK6j21Ok04K32Kk29
6851b70K9L72k86K07q3rR2k14K71o1pn2n3K02j24o0J85q3j00J78j71R2r1q6J46
6876B4J00j16m2J27m3j72J4K55j17j61o4J74j45J60j27mK7R2K6n6J50j55J08q9
6900c4O6k44L09J45l02m9K06O0j38j77J15K31j74N0J07j31j17l9K04N0j77j31
6922a70K44j30M7j15J36J51l37J12K25j08k05J13k5M7m4j18J70K0j56J48N4P7
$$ plain form
6944 136 8 -89 -88 -155 -140 -84 90 126 -250 330 7 30 166 49 -73 18 -180 -93 112 -56 -46 19 -129 58
6968 58 -113 -38 -90 -301 9 -150 47 58 129 -22 -47 -24 -64 126 -216 -82 37 55 50 -31 109 230 200 110 -93
6993 -93 74 22 -3 26 189 -55 51 -7 -64 -76 -76 61 103 63 -37 -9 -90 -102 -97 14 -14 -220 99 144 -232 -31
7019 -31 -173 -17 -28 97 -20 263 66 133 295 26 -322 -180 126 -26 -108 -24 -135 58 -50 -193 -56 126
7041 126 -5 50 -100 185 42 121 72 0 -114 -71 -99 19 -53 163 19 147 -164 -209 1 -7 -242 -12 42 100
7065 100 81 -94 -14 93 -195 70 43 -69 15 -92 140 -254 -217 100 110 -36 -185 3 54 -105 -212 137
7087 137 -73 -64 190 131 285 -169 -33 51 -22 -152 27 -9 -236 -217 1 44 70 115 -242 -28 -12 -51 126 -124
7111 -124 64 -91 -110 -79 11 61 6 -78 -162 -89 150 -18 -111 -110 -115 51 -30 -29 76 47 -117 -251 167 135 65 35 -67
$$ packed form
6944A36j28r7Jo7J5N6J74L6l76N80l23K3J36j17j22R1j98Q7K05j68J0O5j48J87
6968E8j71P5n2k11L10j59J97J1P1j51k5K3m0J90l42J34J19J8nq1J40J21l0r0k03
6993i3J67n2k5K9J63k44J06n8n7j2%J37M2m0j00K8q1j2NJ11k8k06L19M5l76K01
7019c1j42J56j1J25j17K83j97O7J62k69l48J42L06j52q2Q4j11J93j08j43J37J82
7041A26j31N5j50K85j43P9m9p2j14M3k8J18p2K16j44J28l11m5K10qk35K30N4N8
7065A00j9j75Q0J07k88K65k7j12Q4j07K32l94L7L17J0j46j49J88N1j59j07L49
7087A37k10RK54n9J54m54J36Q4p3j30J79l6k27J9K18M3K6M5l57K14J6l9J77k50
7111a24J88j55j9L1R0N0n5q4q4P3K39j68r3JnJ66q1JJ05k9j64j34M18l2p0l0j02
$$ plain form
7138 -67 7 -55 263 -97 52 -191 -26 184 69 -160 152 -45 23 -73 -71 -24 -31 -84 -121 112 -86 -52 69 111 -246
7163 -246 -99 -27 136 29 -117 23 70 -8 122 87 -126 -194 16 151 -27 -12 28 -21 -96 -81 -28 -54 20 111 -44
7188 -44 34 -78 59 -48 -68 66 56 15 98 -105 -87 -179 -111 49 160 -69 115 -158 -53 -66 74 36 170 0
7212 0 34 97 12 122 16 -53 -113 207 -120 15 95 184 -237 37 -147 84 146 41 16 -26 88 -71 -8 49 30
7237 30 -34 13 -83 -95 -140 95 -69 54 -67 138 12 21 11 -4 33 -230 -61 200 40 23 3 -23 247 -22 -113
7262 -113 128 -11 261 2 88 241 39 -42 261 27 -47 -57 133 88 -33 69 0 39 -17 181 -13 -66 -10
7285 -10 34 116 -67 -43 112 76 39 -169 -130 13 -53 -137 165 -130 34 -43 -77 12 -200 104 75 -38 25 302 48
7310 48 -127 -147 -272 9 -19 -5 22 -89 110 -241 -66 -158 -79 -36 69 172 176 -82 -21 162 14 153 160 192 -45
$$ packed form
7138f7P4o2L18l60J49k43J65K10j15k29L12j97O8r6KM7pn3l7K33j98L4J21M2l57
7163b46J47P2J63j07j46J40M7p8J30l5k13o8K10J35j78J5M0m9p5J5N3k6P4R1j55
7188d4P8j12J37j07k0J34j0m1Q3k03J8r2O8J60J11k29J84k73J05j3J40l8J34j70
7212@L4O3q5J10j06o9o0L20l27J35Q0Q9m21K74j84K31O2j05k5m2J14j59O3N7j9
7237C0o4M7r6j2m5K35j64J23j21K05j26Rj0j5L7k63J69K61j60j7k0k6K70k69r1
7262a13K41j39K72k59Q6J53k02q1L03k34p4j0J90m5j21J02o9L9n6J98j94n3N6
7285a0M4Q2j83K4J55l6l7k08L9J43o6q4L02k95J64p7l4Q9k12L04k9j13O3K77k54
7310D8j75k0j25K81k8J4K7j11J99l51J75r2P9M3J05J03Mk58O1J83j48J39PL2k37
$$ plain form
7335 -45 -165 7 101 -46 57 -117 57 -189 -91 128 -71 104 -136 80 -178 -56 -162 -10 -22 99 -70
7356 -70 242 136 -248 36 -24 18 -4 12 93 -122 16 -35 -24 -6 70 79 50 78 177 228 -66 -185 -101 47 26 -70
7382 -70 1 320 167 50 15 -155 -14 92 14 -48 -44 -91 -6 195 -142 44 -7 -134 49 41 -136 -13 -66 -141 105
7407 105 80 -40 19 69 29 57 10 193 -64 -6 173 43 -68 38 25 -55 115 -248 141 96 -85 -102 -92 140
7431 140 -66 -119 178 227 5 52 -94 111 172 -140 104 62 50 83 -8 -11 -51 20 -47 -15 56 -174 61 42 -117
7456 -117 152 106 98 -15 -192 63 -70 -34 203 84 104 -103 -208 78 -44 -40 -15 111 148 177 -45 14 18 -164
7480 -164 -77 16 -38 -164 105 -48 -112 -17 -106 58 69 -223 -97 37 22 176 -19 -142 -141 -15 55 -168 -122 -267
7504 -267 -164 57 -8 -81 18 112 -101 53 -142 32 161 -14 17 23 33 -102 154 -5 -91 -74 -29 -167 -163 51
$$ packed form
7335d5j20J72R4j47J03j74J74k46R8K19j99J75k40K16k58J22j06J52j2J21j69
7356g0L12j06l84K84o0M2k2J6Q1k15J38n1J1J8P6Rk9K8R9N1k94j19Q4J48k1r6
7382g0P1L19j53j17l5j70J41J06p8o2Mm7Q5K01l37J86n1j27J83qj77J23n3p5K46
7407A05k5j20N9N0m0K8m7J83k57N8J79j30j11J06j3q0J70l63L89m5j81j7J0K32
7431A40k06n3K97M9k22M7j46K05O1l12K44m2j2L3r1lm0P1o7L2P1k30K35j9j59
7456a17K69m6qj13j77K55j33L6K37j19K0k07j05K86j22MK5J26L7K9k22N9Mj82
7480a64Q7R3n4j26K69j53o4R5q9J64J1k92J26J34j5J54j95j23JJ26P0k23M6j45
7504b67J03K21o5p3R9R4k13J54j95J74J29j75L1OJ0j35K56j59q6J7M5j38MK14
$$ plain form
7528 51 -153 -140 28 121 37 -112 -175 82 -65 -21 212 74 -17 -93 -32 112 17 -76 128 36 7 44 138 70 172
7553 172 101 52 121 -50 -42 -121 -161 114 -65 35 30 -46 -125 84 114 -147 136 79 13 -163 42 213 -129 -4 31
7578 31 105 81 -114 -75 88 96 -21 19 132 45 -150 32 -31 -92 30 -29 69 -73 22 69 -63 -73 -291 76 116
7603 116 31 -47 48 -79 12 -88 95 26 -102 0 -9 111 20 -137 -36 -25 -56 -54 -37 226 -169 -46 161 214 -249
7628 -249 -90 -96 97 -280 80 -47 -40 48 214 33 -6 43 84 67 -75 157 -73 27 32 -128 -18 218 -45 -140
7652 -140 41 -33 -121 -4 -81 3 -102 61 123 69 1 -161 -22 -56 -50 -271 24 -33 -130 -116 -3 158 -92 -238
7676 -238 172 -138 96 -22 10 -133 -26 -38 182 -4 -59 169 -118 129 -26 -64 58 -124 -18 33 130 56
7698 56 -123 -8 -2 42 -204 56 104 -206 -165 76 -5 -64 -49 -125 219 264 -22 10 61 -33 19 3 34 -28 95 111
$$ packed form
7528E1k04J3J68R3q4j49o3K57j47M4K33j38r1p6O1J44r5r3K04r2k9L7R4o8J02
7553A72p1m9O9j71Qp9m0K75j79J00np6p9K09L0k61K83n7o6j76K05J71l42J25L5
7578C1P4k4j95L9J63Qj17M0J13q7j95J82o3o1J22n9R8j42R5M7j32j0k18L67M0
7603A16q5p8R5j27R1j00J83o9j28J02rJ20r1j57J01J1l1KJ7K63l95J23K07N3m63
7628b49J59oJ93l77L60j27PQ8J66j81l9M9M1j7j42K32k30J00Nj60J10K36k63r5
7652a40J81p4q8J17p7Q4j05J63O2n4o8j62J39l4Ok21K95n7r7J4J13J61k50j46
7676b38M10l10K34j18L2j43J07j2K20j86n5K28k87K47j55l8J22j82J06N1R7p4
7698E6j79J15OM4k46K60M8l10M1K41q1n9J5p6L44M5k86L2N1r4N2j6L1o2J23J6
$$ plain form
7724 111 166 -167 285 -38 56 78 51 -32 -182 -2 29 13 -101 -24 144 -160 5 -275 66 56 -218 44 40 126
7748 126 -113 239 147 166 -16 30 -155 7 -188 48 91 59 -25 35 -83 -61 -34 6 118 -3 -132 127 -27
7771 -27 21 100 119 74 63 35 13 152 -49 -8 59 -7 58 -38 -25 -29 -153 -244 -52 -55 12 1 141 111 -34 -21 -147 -118
7799 -118 -239 202 108 -74 -168 171 34 177 -159 14 33 175 39 35 87 -103 -69 -84 186 -89 -100 105 216
7822 216 -244 175 29 228 -123 163 -105 -155 188 205 -14 -123 42 -79 229 166 -117 154 56 -28 220 -84
7844 -84 -298 221 -189 135 91 -256 -280 247 119 98 2 77 137 -92 60 36 39 -96 106 -102 -39 -160 -26 126
7868 126 -2 -15 -158 73 -98 -75 -256 -41 70 -121 -197 -43 50 -112 -27 58 -101 22 -46 112 31 -91 -13
7891 -13 -42 -39 -111 165 -88 29 -83 119 11 76 66 -54 -69 -89 -4 -5 211 -93 -165 -64 29 -212 -89 81 201
$$ packed form
7724A11N5l33M52l23R4K2k7q3j50J80L1j6j14P7J68l04J65k80L41j0k74K62mQ6
7748A26k39L52r2J9j82M6j85J62j95K36M3l2q4O0j18K2K7M0J12j21j29K59j54
7771b7M8P9J9m5j1k8k2J39k01M1O7o6O5r6J3mj24r1J92lO7j1J40l0j45J3j26K9
7799a18j21M41r4j82r4L39j37J43l36J73J9J42j36mN2j90L4j5K70k75j1K05J11
7822B16m60M19j46J99l51K86k68n0L43J7k19j09J65j21L08o3k83K71r8q4K48l04
7844h4k14N19m10L24m4l47k4N27j28k1r6P5O0k29J52k4Lj35K02k08O3j21J34J52
7868A26j28j3j43K31j71K3j81K15J11j91p6J54R3j62Q5Q5j59J23o8J58q1j22P8
7891a3k9Lp2K76k53J17j12K02j08O5j0j20j5k0Q5jK16l04p2J01R3k41J23J70J20
$$ plain form
7916 201 -122 49 11 47 -18 36 116 62 -12 -74 -45 -28 57 86 -63 8 143 -147 93 -147 13 -104 -34 -95 75
7941 75 -34 58 11 -135 58 82 17 133 43 1 46 -66 -7 -116 -200 -147 -202 -45 -77 -30 -36 9 -107 115 85 44
7967 44 -123 -52 22 89 119 -164 -75 150 -184 -82 129 149 -54 -37 213 -30 140 236 -68 -40 79 16 -80 -7
7991 -7 -24 40 -144 4 7 135 103 39 59 57 -85 -126 146 118 -101 -20 -45 52 -64 95 121 131 6 101 71 83 39
8018 39 -310 -107 -56 -34 -42 150 4 -26 82 -54 95 51 -220 214 121 53 -148 58 -71 -4 -33 48 -4 74 -176
8043 -176 -103 95 -67 33 76 34 3 -38 -20 87 136 -139 23 -91 -37 -92 -196 -131 -35 149 96 -169 -54 36
8067 36 2 43 11 134 186 2 116 110 -22 8 66 43 36 -56 -12 -5 -8 72 -87 153 -55 55 66 70 -46 -59 -114 308
8095 308 70 59 110 -72 -2 -1 -132 73 32 50 127 -166 -57 -44 15 76 -13 -101 -133 -37 51 -55 237 61 27 -20
$$ packed form
7916B01l23J71l8L6o5N4Q0n4p4o2K9J7Q5K9j49P1J35k90K40k40J60j17P0o1J70
7941G5j09R2m7j46J93K4o5J16r0m2M5j12N9j09q4N3n5J57l2M7oM5j16K22l0m1
7967D4j67P1P4O7L0k83Q9K25l34J02K11K0k03J7K50k43J70R6l04K8J19o3r6P3
7991gj7O4j84J48LJ28l2o4K0kj42m1K72k8k19Q1k5R7j16J59K6J0j25R5l0J2m4
8018C9l49K03N1K2qJ92j46l0J08j36J49m4k71M34r3o8k01K06j29O7k9Q1n2P8k50
8043a76P3J98j62J00M3m2l1m1J8J07M9k75J62j14N4n5j04O5R6J84n3k65J15R0
8067C6l4M1l2J23N2j84J14oj32L0N8k3pr2M4PlQ0j59K40k08J10J1Mj16j3n5M22
8095C08k38j1N1j82P0Jj31K05m1J8P7k93J09J3N9O1q9q8l2R6Q8j06K92j76l4m7
$$ plain form
8121 -20 112 69 -59 -154 102 80 -49 -130 -67 67 -172 262 182 112 128 -121 -22 113 -168 -116 266 -118 -108 -85
8145 -85 -10 -35 -164 -11 -195 -106 -90 -17 73 -18 -95 16 278 -123 -176 73 11 113 -133 -43 103 -66 -85 -18 17
8170 17 82 16 143 141 129 -36 12 -52 61 10 -113 -12 99 93 101 68 -17 19 -145 101 46
$$ packed form
8121b0J32m3j28r5K56k2j29q1O3J34k39M34q0p0J6k49R9J35k81N2L82l84J0K3
8145h5P5k5j29J53j84Q9J6P3R0r1p7J11K62m01n3K49o2J02k46R0J46j69j9O7L5
8170A7O5o6J27kj2j65M8o4J13n1j23J01J11oQl3q5L6j64K46n5
8191D6
$$ Imaginary data points
##PAGE= N=2
##DATA TABLE= (X++(I..I)), XYDATA
$$ plain form
0 0 0 0 0 0 0 0 0 0 0 0 0 0 3 -8 8 -8 8 -10 16 -16 20 -24 32 -36 40 -48 56 -66 76 -89 100 -116 132 -149 169
35 169 -189 216 -244 271 -303 338 -376 418 -464 514 -567 628 -693 763 -841 925 -1020 1125
53 1125 -1239 1366 -1510 1671 -1856 2065 -2309 2601 -2944 3365 -3895 4580 -5500 6801 -8770
68 -8770 11987 -27009 299164 90543 -304543 117094 278761 -140008 -142451 189471 -16933
79 -16933 -194468 82921 74808 -182158 33919 178787 -129129 -105738 215680 16879 -215006
90 -215006 107727 189071 -190066 -79816 244360 -49236 -250429 141488 155237 -239035
100 -239035 -66387 267138 -22755 -207043 140450 148712 -175625 -46139 140868 -80963
110 -80963 -99917 122722 -9809 -134943 121646 112687 -189862 -23353 233252 -77881 -216581
$$ packed form
0@%%%%%%%%%%%%Lj1J6j6J6j8K6l2L6m4N6o8P6q8J04j22J42j65J89k16K48k81L18
35A69l58M05m60N15n74O41p14P94q82R78j081J195j321J456j604J766j945K145
53A125k364K605k876L181l527L921m374M910n545O309p260Q475j0080J2301j5571
68h770K0757l8996L26173k08621l95086M21637J61667m18769k443L31922k06404
79a6933j77535K77389q113k56966K16077J44868l07916K3391L21418j98801k31885
90b15006L22733Q1344l79137J10250L24176k93596k01193L91917J3749l94272
100b39035J72648L33525k89893j84288L47493Q262l24337J29486J87007k21831
110h0963j8954K22639j32531j25134K56589q959l02549J66509K56605l11133j38700
$$ plain form
121 -216581 167605 146324 -217386 -43324 222858 -57229 -180669 131968 91347 -175388
131 -175388 12104 168027 -91843 -96098 151677 14170 -157008 58174 99810 -133150
141 -133150 -34179 148601 -58284 -116396 147023 54817 -185184 35999 180417 -123828
151 -123828 -140769 180370 67487 -199217 22299 178559 -92361 -110775 130286 25839
161 25839 -123611 54114 81803 -105034 -8877 124427 -70807 -103170 129402 33918 -163534
172 -163534 41143 145538 -110422 -89931 156990 15662 -165625 63784 130963 -132835
182 -132835 -67257 161983 -10158 -145850 81108 101452 -117447 -31792 122938 -37145
192 -37145 -88724 92398 26092 -111004 49184 90363 -111344 -40400 141738 -28782 -142798
$$ packed form
121b16581L84186k1281l63710J74062K66182k80087j23440L12637m0621k66735
131a75388J87492J55923k59870m255K47775j37507j71178K15182M1636k32960
141a33150R8971J82780k06885n8112K63419r2206k40001K21183J44418l04245
151a23828j6941L21139j12883k66704K21516J56260k70920j8414K41061j04447
161B5839j49450J77725K7689j86837R6157J33304j95234l2363K32572r5484j97452
172a63534K04677J04395k55960K0491K46921j41328j81287K29409O7179k63798
182a32835O5578K29240j72141j35692K26958K0344k18899Q5655J54730j60083
192c7145n1579J81122o6306j37096J60188M1179k01707P0944J82138j70520j14016
$$ plain form
203 -142798 92933 105635 -142185 -43503 156507 -29887 -134487 87237 79650 -119117 -14019
214 -14019 117936 -48111 -82772 95826 27529 -107776 39240 85925 -88399 -32720 111520
225 111520 -28313 -99945 87350 60718 -127145 626 134244 -68792 -108087 118601
235 118601 52151 -141455 9256 128549 -67419 -90827 102323 31103 -109185 30845
245 30845 81142 -76617 -27702 94181 -30286 -77808 81668 38971 -109759 18850 110768
256 110768 -75714 -77167 117864 22659 -128855 37201 109596 -86727 -67912 113508 10789
267 10789 -114863 43571 82893 -84521 -33266 92920 -23053 -74221 65038 32401 -86757
278 -86757 20233 81468 -70673 -46871 105896 -4754 -109094 61541 86217 -101547 -40068
$$ packed form
203a42798K35731J2702k47820R8682K00010j86394j04600K21724p587j98767J05098
214a4019J31955j66047l4661J78598o8297j35305J47016M6685j74324N5679J44240
225A11520j39833p1632J87295k6632j87863J27771J33618k03036l9295K26688
235A18601o6450j93606J50711J19293j95968k3408J93150p1220j40288J40030
245C0845N0297j57759M8915J21883j24467m7522J59476m2697j48730J28609R1918
256A10768j86482j453J95031r5205j51514J66056P2395j96323J8815J81420j02719
267A0789j25652J58434L9322j67414N1255J26186j15973n1168J39259l2637j19158
278h6757J06990O1235j52141K3802J52767j10650j04340J70635K4676j87764O1479
$$ plain form
289 -40068 121637 -13266 -112731 64837 78438 -98160 -26338 101901 -28246 -78668 65567
300 65567 33874 -82490 14625 70271 -60976 -36922 86956 -14440 -86515 64102 58156
311 58156 -97841 -12150 109206 -36639 -93231 81861 58617 -106151 -6637 105846 -41559
322 -41559 -77656 75456 34666 -84559 11989 70738 -51950 -37226 72537 -11007 -69650
333 -69650 54106 38594 -83863 4230 86976 -51076 -69164 87075 30903 -105633 18153
344 18153 99278 -62897 -66577 92245 22131 -94456 24862 77019 -58534 -39070 75987
355 75987 -5509 -66856 47105 35356 -70321 7910 68073 -50906 -46382 79188 6678
366 6678 -92038 36839 78199 -77604 -44971 97358 -668 -94703 42424 70541 -70777
$$ packed form
289d0068J61705j34903r9465J77568J3601j76598P1822J28239j30147n0422J44235
300F5567l1693j16364R7115N5646j31247K4054J23878j01396p2075J50617n946
311E8156j55997Q5691J21356j45845n6592J75092k3244j64768R9514J12483j47405
322d1559l6097J53112m0790j19225R6548N8749j22688J4724J09763q3544n8643
333f9650J23756j5512j22457Q8093Q2746j38052j8088J56239n6172j36536J23786
344A8153Q1125j62175l680J58822p0114j16587J19318N2157j35553J9464J15057
355G5987q1496o1347J13961j1749j05677P8231O0163j18979M524J25570p2510
366F678r8716J28877M1360j55803L2633J42329r8026r4035J37127K8117j41318
$$ plain form
377 -70777 -32482 81514 -9157 -68532 47346 38187 -64557 4840 61313 -41312 -35545 65506
389 65506 -369 -70345 40159 54166 -74241 -20396 88565 -24499 -81436 61711 52602
400 52602 -86523 -15570 89867 -25567 -74889 57506 41342 -71745 700 63557 -35299
411 -35299 -34855 56589 -1201 -56507 39577 39928 -66874 -4810 78364 -34379 -65678 68083
423 68083 35246 -85385 2565 81964 -40583 -62554 67544 26641 -79181 12082 66964
434 66964 -46313 -39793 61470 4273 -58921 28367 39322 -50217 -5804 56808 -31010 -40989
446 -40989 61747 11020 -73281 27293 68884 -59229 -45856 81746 12403 -86490 24353
457 24353 70355 -54076 -39174 64973 1004 -58508 29497 34157 -51388 -3041 53801 -32051
$$ packed form
377g0777L8295J13996r0671n9375J15878r159j02744O9397N6473j02625N767J01051
389F5506o5875o9976J10504J4007j28407N3845J08961j13064n6937J43147r109
400E2602j39125P0953J05437j15434m9322J32395j6164j13087P2445O2857r8856
411c5299M44R1444n7790n5306R6084L51j06802O2064Q3174j12743l1299J33761
423F8083l2837j20631Q7950P9399j22547k1971J30098m0903j05822R1263N4882
434F6964j13277O520J01263n7197o3194Q7288J0955q9539M4413O2612q7818r979
446d0989J02736n0727q4301J00574M1591j28113J3373J27602o9343r8893J10843
457B4353M6002j24431J4902J04147o3969n9512Q8005M660q5545M8347N6842q5852
$$ plain form
469 -32051 -38507 57289 8127 -64461 26359 53020 -53991 -25733 70544 -7746 -68147 44366
481 44366 50823 -69637 -17929 78757 -16806 -68243 44472 44455 -58726 -13520 56489 -17785
493 -17785 -39004 38104 6147 -44790 26140 30561 -52455 -5959 64250 -24792 -60783 53543
505 53543 40824 -72436 -8806 75364 -23450 -57980 50413 31297 -60250 2006 57036 -31795
517 -31795 -38139 52313 9451 -54914 21005 39977 -42592 -14372 47315 -17007 -39786 42258
529 42258 15801 -59433 15477 58812 -47898 -42717 68982 14997 -75811 14792 67588 -38577
541 -38577 -44794 53617 15904 -51170 15364 34572 -34837 -6546 41175 -20940 -31645 43607
553 43607 11683 -55322 15005 50683 -42186 -32604 57091 2090 -59208 26748 45244 -50547
$$ packed form
469c2051o456R5796m9162p2588R0820K6661j07011K8258R6277p8290o0401J12513
481D4366O457j20460N1708R6686r5563n1437J12715j7j03181M5206P0009p4274
493a7785k1219P7108l1957n0937P0930M421q3016M6496P0209q9042l5991J14326
505E3543j2719j13260O3630Q4170r8814l4530J08393j9116r1547O2256N5030q8831
517c1795o344R0452m2862o4365P5919J8972q2569K8220O1687o4322k2779Q2044
529D2258k6457p5234P4910M3335j06710N181J11699n3985r0808R0603N2796j06165
541c8577o217R8411l7713o7074O6534J9208o9409K8291M7721o2115j0705P5252
553D3607l1924o7005P0327L5678r2869R582Q9695n5001o1298Q5956J8496r5791
$$ plain form
565 -50547 -22652 62081 -7044 -59952 34396 42974 -50192 -15817 52252 -9154 -37917 28768
577 28768 15987 -35612 12772 30331 -37381 -9681 52892 -17502 -52209 43252 37337 -61380
589 -61380 -14874 66055 -12895 -58732 36090 36391 -50529 -8608 48181 -18834 -34436 36629
601 36629 12446 -42625 12428 36762 -31920 -16994 42925 -7379 -37213 31900 20800 -45336
613 -45336 4834 48684 -30314 -39069 51938 18476 -63162 7175 58656 -31486 -42906 44044
625 44044 18412 -46632 4730 35329 -24906 -15184 33832 -10495 -28667 33114 11785 -44195
637 -44195 11510 44094 -32673 -30576 49679 9925 -54172 17100 46697 -38823 -26255 50895
649 50895 1595 -49861 21021 37846 -38178 -18985 43277 -5059 -36731 23169 17433 -32453
$$ packed form
565e0547K7895Q4733o9125n2908R4348Q578r3166L4375O8069o1406k8763O6685
577B8768j2781n1599M8384J7559o7712K7700O2573p0394l4707R5461n915r8717
589f1380M6506Q0929p8950m5837R4822L01q6920M1921N6789o7015j5602P1065
601C6629k4183n5071N5053K4334o8682J4926N9919n0304k9834O9113j1100o6136
613d5336N0170M3850p8998q755R1007l3462q1638P0337N1481r0142j1420Q6950
625D4044k5632o5044N1362L0599o0235R722M9016m4327j8172O1781k1329n5980
637d4195N5705L2584p6767K097Q0255l9754o4097P1272K9597q5520J2568P7150
649E0895m9300n1456P0882J6825p6024J9193O2262m8336l1672N9900n736m9886
$$ plain form
661 -32453 4694 27852 -25782 -14301 39341 -6522 -42579 30019 34505 -47743 -14177 56418
673 56418 -8011 -50412 29244 36552 -41218 -14790 44690 -7965 -35601 26501 16923 -34820
685 -34820 4815 29412 -24333 -16186 33466 -4383 -34727 24085 23253 -40428 -3197 45303 -20315
698 -20315 -37802 39320 21693 -49129 -19 50125 -20132 -38661 36578 20221 -40970 2631
710 2631 34444 -19354 -18171 27974 -1228 -26739 19984 15260 -33743 2882 36020 -24523 -27904
723 -27904 39200 10038 -46627 9272 42761 -28447 -30295 41700 10985 -44608 10677 36631
735 36631 -26006 -19419 33536 1253 -29497 16407 18451 -26842 424 28122 -19699 -18148 33191
748 33191 120 -37556 18514 30937 -35652 -18033 44586 -2084 -45494 21232 33979 -35951
$$ packed form
661c2453L7147K3158n3634J1481N3642m5863l6057P2598M486q2248L3566P0595
673E6418o4429m2401P9656P308p7770K6428N9480n2655k7636O2102r578n1743
685c4820L9635K4597n3745Q147M9652l7849l0344N8812q32o3681L7231M8500o5618
698b0315j7487P7122j7627p0822M9110N0144p0257j8529P5239j6357o1191M3601
710B631L1813n3798J183M6145k9202k5511M6723m724m9003L6625L3138o0543l381
723b7904O7104k9162n6665N5899L3489p1208j848P1995l0715n5593N5285K5954
735C6631o2637O587N2955l2283l0750M5904K044m5293K7266K7698m7821J551N1339
748C3191l3071l7676N6070J2423o6589J7619O2619m6670m3410O6726J2747o9930
$$ plain form
760 -35951 -16718 39630 -2487 -33956 18427 21180 -26722 -3135 27088 -13860 -15884 26541
772 26541 -569 -27761 18802 20798 -32155 -6501 38834 -11446 -36972 28732 24630 -40736
784 -40736 -7450 41672 -11889 -34790 25012 20036 -32509 -3256 30286 -13637 -19775 24286
796 24286 3084 -24581 14171 16559 -25064 -1391 30084 -14405 -24771 30602 12939 -39293
808 -39293 5663 38754 -23007 -28838 34581 13126 -39105 3090 34424 -19164 -22950 26924
820 26924 5110 -26668 10274 16553 -20943 -2164 22918 -13274 -17374 26095 5487 -31960
832 -31960 12225 30366 -26689 -18108 36712 2948 -37451 13886 31407 -26580 -18317 33566
844 33566 1647 -31515 13583 20256 -22749 -6304 22415 -9194 -16456 19091 3414 -24415
$$ packed form
760c5951J9233N6348m2117l1469N2383K753m7902K3587L0223m0948k024M2425
772B6541k7110k7192M6563J996n2953K5654M5335n0280k5526O5704m102o5366
784d0736L3286M9122n3561k2901N9802m976n2545K9253L3542m3923o138M4061
796B4286k1202k7665L8752K388m1623K3673L1475m4489j0366N5373j7663n2232
808c9293M4956L3091o1761n831O3419k1455n2231M2195L1334n3588l786M9874
820B6924k1814l1778L6942O279l7496J8779K5082l6192m100M3469k0608l7447
832c1960M4185J8141n7055Q581N4820l3764m0399N1337J7521n7987Q263N1883
844C3566l1919l3162M5098O673m3005J6445K8719l1609p262L5547j5677k7829
$$ plain form
856 -24415 11901 19750 -26079 -7833 33329 -7913 -31482 23116 23830 -32678 -9399 37888 -5977
869 -5977 -32491 20890 21220 -27490 -5326 26367 -8563 -18293 17613 5463 -21196 8413 15601
882 15601 -21481 -4478 25837 -11259 -23563 23404 13569 -31923 -125 33494 -14735 -27511
894 -27511 27496 15329 -32582 760 30391 -13379 -20519 21979 8495 -22937 5442 17796
906 17796 -16026 -6059 20180 -8259 -16276 19945 5250 -26316 7232 25404 -21530 -19043 30917
919 30917 5806 -35073 8922 30050 -21279 -19022 27572 5997 -26558 7501 20288 -16516
931 -16516 -7360 20629 -5602 -14901 17124 5031 -20872 7956 18899 -19348 -10957 26793 -1916
944 -1916 -28778 15432 21646 -26950 -10469 30429 -3529 -28963 14767 20899 -23080 -9265 24911
$$ packed form
856b4415L6316P849m5829J8246M1162m1242k3569N4598P14n6508K3279M7287m3865
869e977k6514N3381L30m8710K2164L1693l4930r730L5906j2150k6659K9609P188
882A5601l7082J7003L0315l7096j2304M6967r835m5492L1798L3619m8229j2776
894b7511N5007j2167m7911L3342K9631m3770p140M2498j3484l1432K8379J2354
906A7796l3822R967K6239k8439q017L6221j4695l1566L3548J8172m6934K487M9960
919C0917k5111m0879M3995K1128n1329K257M6594k1575l2555L4059J2787l6804
931a6516R156K7989k6231r299L2025j2093k5903K8828J0943l8247Q391L7750k8709
944a916k6862M4210O214m8596J6481M0898l3958k5434M3730O132m3979J3815L4176
$$ plain form
957 24911 -3664 -18804 13653 8298 -16310 4712 13513 -14276 -4147 21501 -6936 -21095
969 -21095 19919 14735 -28857 -2653 30992 -10368 -26489 20367 16569 -26760 -4348 26072
981 26072 -9226 -19962 17807 7682 -20759 3857 16351 -12959 -7630 17791 -3197 -16077
993 -16077 14873 8731 -21407 4272 22681 -16152 -15906 25842 6559 -29312 5536 28266 -16916
1006 -16916 -20959 23947 8551 -25170 2566 18561 -11655 -9620 14589 -2118 -13314 11909
1018 11909 5516 -18605 5588 18299 -16479 -11297 23878 1572 -24734 10569 21580 -19771
1030 -19771 -11875 26308 -47 -25560 12347 19254 -19804 -8988 21613 -1789 -18777 9788
1042 9788 10193 -15112 121 12799 -11297 -5835 16757 -5551 -17783 15529 12966 -23862 -4544
$$ packed form
957B4911k8575j5140L2457n355k4608K1022Q801k7789J0129K5648k8437j4159
969b1095M1014n184m3592K6204L3645m1360j6121M6856l798m3329K2412L0420
981B6072l5298j0736L7769j0125k8441K4616J2494k9310N329K5421k0988j2880
993a6077L0950o142l0138K5679J8409l8833K46M1748j9283l5871L4848K2730m5182
1006a6916m043M4906j5396l3721K7736J5995l0216K035K4209j6707j1196K5223
1018A1909o393k4121K4193J2711l4778N182L5175k2306k6306L5303J1011m1351
1030a9771P896L8183k6355k5513L7907O907l9058J0816L0601k3402j6988K8565
1042I788M05k5305J5233J2678k4096N462K2592k2308j2232L3312k563l6828J9318
$$ plain form
1055 -4544 28161 -6565 -25513 17534 17931 -22816 -6237 23640 -3588 -18066 12483 10049 -16525
1068 -16525 738 14980 -10288 -8114 15407 -2129 -15001 10745 8947 -17858 -471 19262
1080 19262 -11126 -16671 20511 7705 -25808 3161 24778 -13293 -19003 20212 10619 -22231
1092 -22231 59 19898 -8309 -11139 13532 873 -11478 8620 5763 -13927 2880 15209
1104 15209 -12443 -12019 20161 3018 -23801 7163 20304 -16525 -13598 21426 3409 -22821
1116 -22821 6481 18834 -14722 -10519 19176 874 -16775 8137 10727 -11637 -1381 12122
1128 12122 -6570 -7117 14133 -782 -16092 11288 12700 -19644 -5310 23101 -4481 -22906
1140 -22906 12676 17038 -19785 -8881 21591 -1935 -18634 9617 10590 -13591 -1776 12794
$$ packed form
1055d544L2705l4726j8948M3047L97m0747J6579K9877k7228j4478L0549k434k6574
1068a6525J7263J4242k5268K174K3521j7536j2872K5746j798k6805J7387J9733
1080A9262l0388n545L7182j2806l3513K8969K1617l8071n710L9215r593l2850
1092b2231K2290J9839k8207k830K4671j2659j2351K0098k857j9690J6807J2329
1104A5209k7652M24L2180j7143k6819L0964J3141l6829K927L5024j8017k6230
1116b2821K9302J2353l3556M203K9695j8302j7649K4912K590k2364J0256J3503
1128A2122j8692n47K1250j4915j5310K7380J412l2344J4334K8411k7582j8425
1140b2906L5582M362l6823J0904L0472k3526j6699K8251R73k4181J1815J4570
$$ plain form
1152 12794 -6340 -8047 12131 747 -12999 9075 9760 -15472 -929 18096 -7785 -15241 15921
1165 15921 9677 -21287 -794 22385 -8935 -18673 16040 10355 -19248 -1650 16739 -6188
1177 -6188 -11626 10583 3386 -11625 5062 7386 -11376 485 13252 -8671 -10078 15985 4214
1190 4214 -18911 4427 19367 -12532 -14001 19598 5584 -21054 3753 17935 -10968 -11673 14546
1203 14546 3460 -15000 4036 10254 -10265 -2814 10665 -6161 -7330 11509 490 -14423
1215 -14423 7150 12990 -14635 -7282 19864 -864 -20003 10036 16181 -15768 -8360 18612 809
1228 809 -17164 6830 12322 -11982 -4526 12414 -3724 -8774 8713 1597 -10643 5284 7879
1241 7879 -12057 -2748 15602 -5702 -15446 13549 10192 -18525 -2410 20041 -4952 -16843 12177
$$ packed form
1152A2794j9134j707K0178j1384j3746K2074O85k5232J4543J9025k5881p456L1162
1165A5921o244l0964K0493K3179l1320r738L4713n685k9603J7598J8389k2927
1177f188n438K2209p197j5011J6687K324j8762J1861J2767k1923j407K6063j1771
1190D214k3125K3338J4940l1899j469L3599j4014k6638K4807J4182k8903p05K6219
1203A4546j1086j8460J9036O218k0519P451J3479j6826j169J8839j1019j4913
1215a4423K1573N840k7625P353K7146k0728j9139L0039O145l1949P408K6972j7803
1228H09j7973K3994N492k4304P456J6940j6138n050J7487p116j2240J5927K595
1241G879j9936R309J8350k1304r744K8995l357k8717J6115K2451k4993j1891K9020
$$ plain form
1254 12177 11781 -15504 -3288 15615 -4041 -10506 9258 3807 -10238 3233 7305 -9028 -2044
1267 -2044 11517 -5562 -10756 12176 4652 -16919 2510 16243 -10491 -12521 15706 6294 -18697
1280 -18697 1358 17895 -8518 -12357 13319 5391 -12727 1958 9881 -6399 -3506 8886 -3002
1293 -3002 -6950 9570 1876 -13027 5449 11861 -12160 -7941 16140 1109 -17972 5791 15075
1306 15075 -12729 -10045 15879 1770 -15533 5237 11410 -9476 -5042 11112 -1229 -8667 7300
1319 7300 3870 -9218 3739 8232 -9190 -2708 12955 -3572 -13033 10297 9853 -15753 -4173
1332 -4173 17905 -3768 -16709 9751 11242 -13454 -5088 13148 -1560 -10494 6627 5031 -8850
1345 -8850 1574 7362 -7234 -1895 10277 -3873 -9153 9851 5996 -13585 324 15160 -7259
$$ packed form
1254A2177l96k7285J2216J8903j9656o465J9764n451j4045J3471M072j6333O984
1267b044J3561j7079n194K2932p524k1571J9429J3733k6734k030K8227r412k4991
1280a8697K0055J6537k6413l839K5676p928j8118J4685P923j6280K893J2392j1888
1293c002l948J6520p694j4903J8476O412k4021M219K4081j5031j9081K3763R284
1306A5075k7804K684K5924j4109j7303K0770O173k0886M434J6154j2341p438J5967
1319G300l430j3088J2957M493j7422O482J5663j6527r461K3330m44k5606J1580
1332d173K2078k1673j2941K6460J491k4696Q366J8236j4708q934J7121j596j3881
1345h850J0424N788j4596N339J2172j4150n280J9004l855j9581J3909J4836k2419
$$ plain form
1358 -7259 -12482 13260 6701 -15850 7 15039 -6465 -12103 10618 5818 -12235 44 9734
1371 9734 -5917 -4851 7681 -1676 -6363 6631 2379 -10099 3290 10854 -9391 -7630 14791
1384 14791 2163 -15972 5031 14482 -9888 -9904 13601 4039 -14205 2406 11527 -7548 -6115
1397 -6115 9246 -627 -7803 4961 3315 -8011 1294 7542 -7104 -4741 11395 -1297 -12393
1410 -12393 7867 9560 -12415 -4476 15185 -1129 -14478 7749 11747 -11365 -5426 13104 -393
1423 -393 -10499 5153 5839 -7182 -823 6248 -4648 -3419 7871 -2600 -8839 8066 5233 -12514
1437 -12514 -454 13499 -5282 -12315 10487 8430 -13632 -2163 14271 -3747 -10912 8514
1449 8514 6194 -9658 -266 8929 -4021 -5194 7193 125 -7050 5151 3661 -8806 1345
$$ packed form
1358g259n223K5742o559k2551J5857J5032k1504n638K2721m800j8053J2279R690
1371I734j5651J066J2532r357m687J2994m252j2478J3389P564k0245J761K2421
1384A4791j2628j8135K1003R451k4370j6K3505r562j8244J6611R121j9075J433
1397f115J5361r873p176J2764j646j1326R305O248j4646K363J6136j2692j1096
1410a2393K0260J693k1975P939J9661j6314j3349K2227L998k3112N939J8530j3497
1423c93j0106J5652O86j3021O359P071j0896J229J1290j0471o239J6905k833j7747
1437a2514J2060J3953j8781p033K2802k057k2062J1469J6434j8018p165J9426
1449H514k320j5852R392R195j2950j173J2387p068p175J2201j490j2467J0151
$$ plain form
1462 1345 9002 -7197 -7253 11125 2831 -14145 2578 13549 -8616 -10444 12105 4781 -12931
1475 -12931 680 11096 -4770 -6819 7495 2115 -6978 3570 3981 -6438 1433 7037 -6072
1488 -6072 -4415 9892 115 -11157 5013 9811 -10243 -6233 12793 -193 -13162 5324 9981
1501 9981 -9533 -6019 10986 987 -10398 4000 6978 -6665 -1527 6548 -2797 -3120 6240 -868
1515 -868 -6660 6034 5378 -10073 -1217 12803 -4233 -11642 9019 8376 -12130 -3530 12319 -1720
1529 -1720 -11229 5776 6791 -8785 -1846 7578 -3436 -5010 5576 638 -5949 3795 4192 -7017
1543 -7017 -89 8636 -4757 -6957 9765 3388 -11555 1951 11863 -6493 -9495 10413 5237
1556 5237 -12198 -132 10782 -4279 -7510 6044 2416 -6256 1182 3604 -4757 15 5731 -4778
$$ packed form
1462A345P657j6199n6J8378q294j6976J6723J0971k2165j828K2549p324j7712
1475a2931J3611J0416j5866k049J4314n380r093J0548M11j0419P871N604j3109
1488f072J657J4307r777j1272J6170M798k0054M010J9026j2986j2969J8486M657
1501I981j9514L514J7005r999j1385J4398K978j3643N138Q075r345l23R360p108
1515h68n792J2694o56j5451Q856J4020j7036p409K0661o43k0506Q600J5849j4039
1529a720r509J7005J015j5576O939R424j1014j574J0586m938o587R744L97j1209
1543g017O928Q725j3393k200J6722o377j4943J3506R912j8356l002J9908n176
1556E237j7435J2066J0914j5061l231J3554l628q672P438K422q361M772N716j0509
$$ plain form
1570 -4778 -4451 8457 818 -10077 4212 9285 -7931 -5899 11240 2011 -11627 3362 10306
1583 10306 -7369 -6086 9541 1263 -8795 2556 6399 -5391 -2698 5681 -1992 -4333 4998
1596 4998 64 -6364 4332 4726 -8174 -1638 10479 -2457 -10512 7076 8620 -10450 -3906 11907
1610 11907 -687 -10120 4844 7223 -6615 -2768 7180 -1244 -5052 4551 1319 -5593 2966 3668
1624 3668 -6403 -642 7211 -3882 -6873 7071 3768 -10443 94 10935 -5119 -8977 8593
1637 8593 5377 -9952 -933 9938 -2278 -7146 5376 3719 -5522 857 4256 -3739 -394 4730
1651 4730 -3300 -3859 6402 1011 -8909 2666 8594 -7315 -6430 9887 2111 -10776 2048 9153
$$ packed form
1570d778L27J2908p639j0895J4289N073j7216K032J7139r229j3638J4989O944
1583A0306j7675J283J5627q278j0058J1351L843j1790K693Q379p673k341R331
1596D998m934o428J0696L94j2900O536J2117j2936q055J7588J544j9070O544J5813
1610A1907j2594r433J4964K379j3838L847R948q424l808R603l232o912Q559P02
1624C668j0071N761P853j1093k991J3944l303j4211J0537J0841j6054l858J7570
1637H593l216j5329R019J0871j2216m868J2522j657r241O379L399p995L345N124
1651D730q030n59J0261n391r920J1575N928j5909Q85J6317p776j2887J2824P105
$$ [...]
8191E5
##END NTUPLES=NMR FID
##END=
