##TITLE=1H_MTBBC 2508
 CDCl3, 8 sc, 
 26.8.2020
##JCAMPDX= 6.0         $$ Bruker NMR JCAMP-DX V2.0
##DATA TYPE= NMR FID
##DATA CLASS= NTUPLES
##ORIGIN= UXNMR, Bruker Analytische Messtechnik GmbH
##OWNER= root
$$ XWIN-NMR		Version 3.5
$$ Wed Aug 26 09:53:41 2020 Russian Standard Time (UT+4h)  she@DPX200
##.OBSERVE FREQUENCY= 200.1315066352
##.OBSERVE NUCLEUS= ^1H
##.DELAY= (6, 6)
##.ACQUISITION MODE= SIMULTANEOUS
##.ACQUISITION SCHEME= undefined
##.AVERAGES= 8
##.DIGITISER RES= 18
##SPECTROMETER/DATA SYSTEM= spect
##.PULSE SEQUENCE= zg30
##.SOLVENT NAME= CDCl3
##.SHIFT REFERENCE= (INTERNAL, CDCl3, 0, 15.7039)
##AUDIT TRAIL= $$ (NUMBER, WHEN, WHO, WHERE, WHAT)
$$ ##TITLE= Audit trail, XWIN-NMR		Version 3.5
$$ ##JCAMPDX= 5.01
$$ ##ORIGIN= Bruker BioSpin GmbH
$$ ##OWNER= she
$$ F:/spectra/data/she/nmr/H-F/1/audita.txt
$$ ##AUDIT TRAIL=  $$ (NUMBER, WHEN, WHO, WHERE, WHAT)
(   1,<2020-08-26 09:52:24.54 +0400>,<she>,<DPX200>,
      <created by zg, POWCHK disabled, PULCHK disabled
       configuration hash MD5:
       00 E9 B6 7A A2 85 ED C7 34 08 36 98 17 FE 4E 26
       data hash MD5: 16K
       15 19 DC C3 9A 5A AA E8 AD C1 A0 61 65 01 23 85>)
$$ ##END=
$$ 
$$ hash MD5
$$ C6 72 94 92 29 69 90 08 C6 5F 5F 2B FF 8A 93 FC
##$RELAX= 
##$RELAX= 
##$RELAX= 
##$RELAX= 
##$RELAX= 
##$RELAX= 
$$ Bruker specific parameters
$$ --------------------------
##$DU= <F:/spectra>
##$EXPNO= 1
##$NAME= <H-F>
##$PROCNO= 1
##$TYPE= <nmr>
##$USER= <she>
##$AMP= (0..31)
100 100 100 100 100 100 100 100 100 100 100 100 100 100 100 100 100 100 
100 100 100 100 100 100 100 100 100 100 100 100 100 100 
##$AQSEQ= 0
##$AQ_mod= 1
##$AUNM= <au_zg>
##$AUTOPOS= <>
##$BF1= 200.13
##$BF2= 200.13
##$BF3= 200.13
##$BF4= 200.13
##$BF5= 200.13
##$BF6= 200.13
##$BF7= 200.13
##$BF8= 200.13
##$BYTORDA= 1
##$CFDGTYP= 0
##$CFRGTYP= 5
##$CHEMSTR= <none>
##$CNST= (0..31)
1 1 145 1 1 1 1 1 1 1 1 1 1 1 1 1 1 1 1 1 1 1 1 1 1 1 1 1 1 1 1 1 
##$CPDPRG= <>
##$CPDPRG1= <>
##$CPDPRG2= <>
##$CPDPRG3= <>
##$CPDPRG4= <mlev>
##$CPDPRG5= <mlev>
##$CPDPRG6= <mlev>
##$CPDPRG7= <mlev>
##$CPDPRG8= <mlev>
##$CPDPRGB= <>
##$CPDPRGT= <>
##$D= (0..31)
0 1.2 0 0 0 0 0 0 0 0.06 0 0.03 0 0 0 0 0.0002 0 0 0 0 0 0 0 0 0 0 0 0 
0 0 0 
##$DATE= 1598421144
##$DBL= (0..7)
120 120 120 120 120 120 120 120 
##$DBP= (0..7)
150 150 150 150 150 150 150 150 
##$DBP07= 0
##$DBPNAM0= <>
##$DBPNAM1= <>
##$DBPNAM2= <>
##$DBPNAM3= <>
##$DBPNAM4= <>
##$DBPNAM5= <>
##$DBPNAM6= <>
##$DBPNAM7= <>
##$DBPOAL= (0..7)
0.5 0.5 0.5 0.5 0.5 0.5 0.5 0.5 
##$DBPOFFS= (0..7)
0 0 0 0 0 0 0 0 
##$DE= 6
##$DECBNUC= <off>
##$DECIM= 32
##$DECNUC= <off>
##$DECSTAT= 4
##$DIGMOD= 1
##$DIGTYP= 9
##$DL= (0..7)
0 120 120 120 120 120 120 120 
##$DP= (0..7)
150 150 150 150 150 150 150 150 
##$DP07= 0
##$DPNAME0= <>
##$DPNAME1= <>
##$DPNAME2= <>
##$DPNAME3= <>
##$DPNAME4= <>
##$DPNAME5= <>
##$DPNAME6= <>
##$DPNAME7= <>
##$DPOAL= (0..7)
0.5 0.5 0.5 0.5 0.5 0.5 0.5 0.5 
##$DPOFFS= (0..7)
0 0 0 0 0 0 0 0 
##$DQDMODE= 0
##$DR= 18
##$DS= 0
##$DSLIST= <SSSSSSSSSSSSSSS>
$$ [...]
##$SUBNAM2= <"">
##$SUBNAM3= <"">
##$SUBNAM4= <"">
##$SUBNAM5= <"">
##$SUBNAM6= <"">
##$SUBNAM7= <"">
##$SUBNAM8= <"">
##$SUBNAM9= <"">
##$SW= 16.880792210976
##$SWIBOX= (0..15)
0 0 2 0 0 0 0 0 0 0 0 0 0 0 0 0 
##$SW_h= 3378.37837837838
##$TD= 16384
##$TD0= 1
##$TE= 0
##$TE2= 300
##$TE3= 300
##$TEG= 300
##$TL= (0..7)
0 120 120 120 120 120 120 120 
##$TP= (0..7)
150 150 150 150 150 150 150 150 
##$TP07= 0
##$TPNAME0= <>
##$TPNAME1= <>
##$TPNAME2= <>
##$TPNAME3= <>
##$TPNAME4= <>
##$TPNAME5= <>
##$TPNAME6= <>
##$TPNAME7= <>
##$TPOAL= (0..7)
0.5 0.5 0.5 0.5 0.5 0.5 0.5 0.5 
##$TPOFFS= (0..7)
0 0 0 0 0 0 0 0 
##$TUNHIN= 0
##$TUNHOUT= 0
##$TUNXOUT= 0
##$USERA1= <user>
##$USERA2= <user>
##$USERA3= <user>
##$USERA4= <user>
##$USERA5= <user>
##$V9= 5
##$VALIST= <valist>
##$VCLIST= <CCCCCCCCCCCCCCC>
##$VD= 0
##$VDLIST= <DDDDDDDDDDDDDDD>
##$VPLIST= <PPPPPPPPPPPPPPP>
##$VTLIST= <TTTTTTTTTTTTTTT>
##$WBST= 1024
##$WBSW= 4
##$XGAIN= (0..3)
0 0 0 0 
##$XL= 0
##$YL= 0
##$YMAX_a= 264081
##$YMIN_a= -229113
##$ZGOPTNS= <>
##$ZL1= 120
##$ZL2= 120
##$ZL3= 120
##$ZL4= 120
##$ABSF1= 10
##$ABSF2= 0
##$ABSG= 5
##$ABSL= 3
##$ALPHA= 0
##$AQORDER= 0
##$ASSFAC= 0
##$ASSFACI= 0
##$ASSFACX= 0
##$ASSWID= 0
##$AUNMP= <proc_1d>
##$AZFE= 0.1
##$AZFW= 0.1
##$BCFW= 1
##$BC_mod= 2
##$BYTORDP= 1
##$COROFFS= 0
##$CY= 11.3945322036743
##$DATMOD= 1
##$DC= 2
##$DFILT= <>
##$DTYPP= 0
##$F1P= 16.9975609425685
##$F2P= -3.02152046262296
##$FCOR= 0.5
##$FTSIZE= 0
##$FT_mod= 4
##$GAMMA= 1
##$GB= 0.15
##$INTBC= 1
##$INTSCL= 1
##$ISEN= 128
##$LB= 0.24
##$LEV0= 0
##$LPBIN= 0
##$MAXI= 10000
##$MC2= 0
##$MEAN= 0
##$ME_mod= 0
##$MI= 1.114404
##$NCOEF= 0
##$NC_proc= 0
##$NLEV= 6
##$NOISF1= 3.799351
##$NOISF2= 2.8
##$NSP= 1
##$NTH_PI= 0
##$NZP= 0
##$OFFSET= 15.70392
##$PC= 1
##$PHC0= -9967.131
##$PHC1= 5.00092
##$PH_mod= 1
##$PKNL= yes
##$PPARMOD= 0
##$PSCAL= 0
##$PSIGN= 0
##$REVERSE= no
##$SF= 200.130013532006
##$SI= 16384
##$SIGF1= 3
##$SIGF2= 2
##$SINO= 400
##$SIOLD= 16384
##$SREGLST= <1H.CDCl3>
##$SSB= 0
##$STSI= 0
##$STSR= 0
##$SW_p= 3612.71676300578
##$SYMM= 0
##$S_DEV= 0
##$TDeff= 0
##$TDoff= 0
##$TI= <>
##$TILT= no
##$TM1= 0
##$TM2= 0
##$TOPLEV= 0
##$USERP1= <user>
##$USERP2= <user>
##$USERP3= <user>
##$USERP4= <user>
##$USERP5= <user>
##$WDW= 1
##$XDIM= 8192
##$YMAX_p= 0
##$YMIN_p= 0
$$ End of Bruker specific parameters
$$ ---------------------------------
##NTUPLES= NMR FID
##VAR_NAME=  TIME,          FID/REAL,        FID/IMAG
##SYMBOL=    X,             R,               I
##VAR_TYPE=  INDEPENDENT,   DEPENDENT,       DEPENDENT
##VAR_FORM=  AFFN,          ASDF,            ASDF
##VAR_DIM=   8192,          8192,            8192
##UNITS=     SECONDS,       ARBITRARY UNITS, ARBITRARY UNITS
##FACTOR=    0.000296,      1,               1
##FIRST=     0,             0,               0
##LAST=      2.424536,      0,               0
##MIN=       0,             -229113,         0
##MAX=       2.424536,      264081,          0
$$ Real data points
##PAGE= N=1
##DATA TABLE= (X++(R..R)), XYDATA
0 0 0 0 0 0 0 0 0 0 0 0 0 0 0 0 8 -8 8 -9 16 -16 20 -24 30 -34 41 -48 56 -65 78 -88 103 -119 135 -151 174
35 174 -196 222 -250 280 -313 350 -390 433 -481 533 -589 650 -719 791 -872 960 -1059 1165
53 1165 -1284 1416 -1559 1724 -1909 2117 -2357 2637 -2965 3356 -3828 4416 -5155 6095 -7252
68 -7252 8219 -12548 264081 -109097 -75140 220503 -203020 23893 125733 -163486 108564
79 108564 25187 -134762 164161 -74081 -62516 153981 -147015 26653 128470 -179913
89 -179913 112893 53788 -174959 172971 -31374 -138057 208411 -104616 -66263 201894
99 201894 -161690 -5282 148417 -173230 75224 81580 -145682 120424 -16175 -100143 140793
110 140793 -88406 -15396 127349 -151246 59920 79626 -177863 135382 26550 -167572
120 -167572 169617 -39780 -122128 170721 -93673 -46189 138285 -134926 30296 82701
130 82701 -144033 96021 17807 -121693 126803 -51223 -65003 131860 -106747 5588
140 5588 102924 -147321 72748 57934 -152700 125376 2264 -131279 146767 -50264 -79151
151 -79151 138694 -91107 -14888 101864 -110730 50958 47489 -106769 97010 -16924 -74142
162 -74142 121786 -74963 -23531 115131 -121045 33709 87904 -137703 86474 42273 -129245
173 -129245 115965 -13165 -93042 125471 -58993 -38014 107106 -95257 16612 69444
183 69444 -101613 65416 18433 -84692 92173 -40126 -45624 102117 -88326 3743 89317
194 89317 -119953 47999 58508 -122862 82758 16759 -100286 99202 -31016 -60716 96620
205 96620 -68412 -10949 75568 -88907 34026 36878 -86776 69547 -8458 -61224 87525
216 87525 -55276 -22775 85805 -90617 21670 68117 -105624 59754 33774 -98345 84221
227 84221 -6465 -68406 92551 -44713 -27663 80699 -71920 15864 53697 -77694 53803
238 53803 13783 -65453 77795 -30484 -37085 88539 -66014 -3329 76983 -86120 31066
249 31066 49681 -84293 61220 11174 -68514 77345 -27865 -39560 79035 -56004 -4016
260 -4016 61162 -71356 30001 29222 -67572 58563 -9424 -49110 72769 -48290 -20699 73333
272 73333 -73548 12154 57024 -83526 39638 25947 -75197 61865 -8846 -52659 68666
283 68666 -40720 -21959 60154 -59114 13303 36953 -63719 43608 3467 -54700 64895
294 64895 -29481 -32746 71372 -56621 -5974 61276 -70253 23687 39529 -68197 48449
305 48449 7385 -55389 63331 -21536 -31641 64315 -43764 -4335 47916 -53476 26142
316 26142 21323 -50219 51118 -10312 -38077 64278 -37995 -15137 63053 -57089 11177
327 11177 46133 -65899 36598 21459 -60279 55209 -6000 -44223 59557 -30255 -18797
338 -18797 51751 -45335 10027 30386 -51633 34978 3254 -44717 53611 -23699 -29453 56969
350 56969 -45492 -6255 48351 -56028 20133 28452 -58758 40304 4088 -49318 52629 -18324
362 -18324 -30363 51115 -36767 -6125 38481 -45306 20769 17949 -44700 40701 -7823 -34490
374 -34490 52410 -28954 -16154 50720 -45573 6480 37966 -52427 30122 19963 -49705 44852
386 44852 -921 -36610 47827 -20242 -13657 40282 -35797 11401 25009 -43238 33215 7155
398 7155 -39418 46400 -14000 -26665 48548 -31469 -6413 42195 -43067 13765 25866 -46913
410 -46913 30582 7688 -39916 40587 -11330 -26183 39037 -26478 -5580 29185 -34969 16138
422 16138 11196 -37808 33595 -8207 -31130 43708 -25814 -17437 42952 -40180 668 35441
434 35441 -46166 17107 20990 -43707 27169 2430 -29693 31908 -16148 -10677 29483 -31457
446 -31457 8829 21768 -36942 24562 8196 -33034 34643 -9903 -21720 38863 -25272 -5192
458 -5192 36017 -36708 10455 26468 -39760 24415 14646 -34567 30126 -378 -21232 28656
470 28656 -13958 -1687 21848 -25933 15962 10888 -30636 29920 -1356 -26140 36697 -15578
482 -15578 -16215 36531 -27029 -2039 30585 -33551 10264 17905 -32659 20923 3384 -24309 26421
495 26421 -11798 -12887 24913 -22638 1271 17729 -26974 15175 4887 -26670 26409 -9357
507 -9357 -20511 33045 -20493 -12057 31210 -27734 -1014 24299 -28143 9684 11688 -23908 16757
520 16757 -2808 -14325 21729 -14848 -2453 20341 -23371 8109 14344 -24469 18830 3745
532 3745 -21085 25233 -9649 -13741 29933 -19166 -4939 27978 -24233 3217 20175 -22464
544 -22464 11297 8470 -16129 16504 -5286 -7277 18462 -15630 3759 15625 -22145 12523
556 12523 8188 -23823 21113 -458 -20495 25200 -9242 -14575 23362 -15245 -4455 18440
568 18440 -19571 4718 10308 -20003 10720 2278 -14519 13727 -7236 -6497 12250 -14915 3128
581 3128 8809 -18392 12441 1569 -19519 19613 -5371 -16825 23260 -10364 -12391 20919 -13166
594 -13166 -4404 14750 -12634 4881 5289 -11950 11718 -2755 -7401 15767 -9101 -1768 14099
607 14099 -14385 5617 10381 -15479 12673 4389 -14450 16387 -2723 -10457 18672 -7876 -4989
620 -4989 16812 -11903 332 12167 -12113 6216 5580 -9864 9231 -1847 -5224 10955 -8788
633 -8788 1367 10294 -14524 6644 7245 -17066 11285 4005 -16452 12972 -842 -12895 11476
646 11476 -4956 -5747 9314 -8878 697 4752 -11288 6181 250 -9529 9478 -5253 -6259
659 -6259 9902 -10180 -795 9131 -13103 4749 6351 -14914 8865 2897 -13196 11651 -455
672 -455 -10330 11157 -4683 -5319 9689 -6106 387 6323 -7063 4926 1428 -5220 8534 -3724
686 -3724 -2548 10405 -8841 1099 11002 -11890 4756 9657 -12898 7568 5774 -11238 9426
699 9426 1935 -7801 9792 -2748 -4037 8704 -5989 641 6101 -7325 4252 1176 -6619 7749
713 7749 -3741 -4179 9537 -8433 -1866 9193 -11394 2264 7513 -12386 5337 3731 -12014
726 -12014 8015 -487 -9162 9347 -3742 -5943 7845 -6501 -1124 4777 -7687 4389 758
739 758 -7955 8196 -3857 -5913 11513 -7478 -3235 11380 -10439 538 9879 -10597 4832
752 4832 5571 -10104 8016 807 -7401 10692 -3361 -3639 10229 -6871 1032 7391 -8595 6681
766 6681 3413 -8786 10449 -1446 -7650 12490 -5398 -3620 12568 -9409 632 9767 -11636
779 -11636 5351 6285 -11743 8393 1121 -9478 9716 -3610 -5007 9008 -7729 696 5644
792 5644 -10954 6433 1833 -11789 10776 -3030 -10441 12197 -7739 -5673 12199 -11903 -573
805 -573 9616 -14001 4654 5348 -12968 8653 68 -9974 10462 -6168 -4528 10285 -10172
818 -10172 1753 7843 -12617 7464 2927 -11852 12216 -2415 -8802 14083 -7980 -3343 13356
831 13356 -12112 3268 10890 -14400 8288 5846 -13296 11934 549 -8579 12943 -5858 -2460
844 -2460 11963 -10850 4445 8622 -13032 9701 2997 -11774 13482 -3563 -7518 15440 -10041
857 -10041 -2234 13653 -14285 4141 9815 -15338 9415 2771 -13814 13118 -4049 -8744 14424
870 14424 -10282 -2677 12059 -14636 4015 7448 -15310 10099 912 -13212 13838 -6458 -7889
883 -7889 15299 -12533 -1779 12900 -16080 5154 8277 -16008 10598 1414 -12955 13524 -6087
896 -6087 -6872 14765 -11892 270 11963 -15144 7352 6081 -14860 14086 -1179 -11815 17653
909 17653 -8326 -6626 17906 -12844 386 13350 -14838 7791 6178 -14146 13804 -1781
921 -1781 -10475 16636 -8603 -4725 15338 -13367 3043 10464 -15207 10450 2740 -14067 16031
934 16031 -5554 -10168 18794 -13032 -4729 17778 -17398 1680 12685 -17470 7696 4871 -14717
947 -14717 12071 -3934 -8710 13929 -11741 -1298 11933 -16633 6768 6751 -17669 13856 -366
960 -366 -15362 17436 -7384 -9708 18129 -13847 -1573 14688 -17989 6839 9239 -18225 13360
973 13360 2502 -14788 15797 -4821 -7357 14766 -10943 2091 10307 -14803 11111 3436 -15433
986 -15433 18355 -3731 -12642 21347 -10772 -6667 20363 -15150 1069 14499 -16624 8727
998 8727 6340 -14992 14558 -1802 -10247 16459 -9631 -2880 14317 -14932 5580 8831 -17591
1011 -17591 13202 1464 -16140 18352 -6622 -10974 18846 -13573 -3304 16216 -17875 4524
1023 4524 10247 -18415 10617 2066 -14771 14365 -6290 -7342 14348 -14121 1723 10969 -18735
1036 -18735 10482 5220 -19440 16983 -2004 -16467 19856 -8629 -9101 18851 -14195 -726
1048 -726 14126 -17038 7406 7209 -14946 13342 -1630 -9891 15920 -10157 -1989 14925 -16288
1061 -16288 6985 10805 -19491 14670 4000 -18658 19910 -3734 -13121 20484 -10570 -5433
1073 -5433 17912 -15481 3002 12322 -16377 10058 3213 -13004 14431 -6345 -6084 15488 -14701
1086 -14701 2553 13196 -19984 10513 7721 -20928 16756 -236 -17738 20026 -7624 -11020
1098 -11020 19202 -13619 -3058 14384 -16469 5926 6841 -15325 12071 -2507 -10638 15942
1110 15942 -11439 -3170 16055 -18174 5024 12374 -20861 12533 5597 -19254 17880 -2793
1122 -2793 -13627 19792 -10590 -5651 17632 -15463 2717 11850 -16045 10282 3404 -12769 15885
1135 15885 -6139 -6503 17780 -14844 1327 16283 -19907 9118 10688 -20869 15730 3294
1147 3294 -17200 18749 -5000 -10789 18263 -11594 -1933 13832 -15425 7177 6430 -15097 14103
1160 14103 -3178 -11641 18175 -11869 -5314 18662 -18512 2145 14694 -21113 9731 7131
1172 7131 -19812 15376 -1539 -14806 17960 -9313 -7375 15425 -14612 1712 9762 -16404
1184 -16404 10496 1599 -14224 16454 -7747 -9008 19136 -15246 -1559 17574 -19941 6707
1196 6707 11921 -20695 13243 4345 -17559 17575 -3447 -11274 17771 -10268 -2261 13569 -14066
1209 -14066 6916 6204 -14730 14898 -2087 -11777 19917 -10517 -6255 19843 -16208 1313 15825
1222 15825 -19260 9081 8633 -18639 14961 466 -14203 17694 -7608 -6606 16462 -13742
1234 -13742 1866 11116 -16323 10204 2950 -15513 16357 -5740 -10708 18675 -13270 -3803 17158
1247 17158 -18469 4453 11688 -19942 11525 4322 -17658 15416 -3568 -11613 16100 -10873
1259 -10873 -2616 12868 -15579 6490 7471 -17321 14076 218 -15059 18198 -7566 -8872 18333
1272 18333 -13543 -782 14758 -17369 7425 8517 -17667 14003 986 -13721 17013 -6603
1284 -6603 -6472 15975 -13110 2186 11642 -16160 10031 5047 -15760 16166 -3003 -11667 18915
1297 18915 -11000 -4862 17432 -16043 2820 12597 -17958 9598 5613 -16040 14245 -2458
1309 -2458 -10447 15345 -10000 -2673 12971 -15563 5630 8053 -17420 12433 1224 -15370 16221
1322 16221 -6395 -9513 17058 -13164 -1789 14260 -17428 5782 8902 -17544 11699 1327
1334 1327 -14254 14768 -6090 -7804 15213 -12281 465 11490 -15360 8157 4991 -14781
1346 -14781 14421 -2469 -11254 17605 -9483 -5255 17207 -14797 2011 13480 -16547 8615
1358 8615 6817 -15084 13584 -990 -10283 15441 -8163 -2962 13845 -13593 4392 9610 -15304
1371 -15304 10943 3033 -13347 15457 -4921 -8415 16766 -11648 -2150 14736 -15929 4806
1383 4806 9816 -16255 10402 2625 -13295 13658 -5222 -7687 14118 -11585 -789 11078 -14683
1396 -14683 6607 5233 -14778 12469 -2047 -11615 15777 -9189 -6137 15764 -14189 214
1408 214 12355 -16346 6461 6448 -15028 11383 -769 -10206 13204 -8110 -3689 12567 -12670
1421 -12670 3677 8491 -14807 10302 2463 -13412 15039 -4129 -9306 16780 -10000 -3323 14701
1434 14701 -13255 3164 9689 -14296 9464 3216 -12090 12964 -3363 -7020 13426 -9121
1446 -9121 -394 10597 -12938 6926 5242 -13621 13069 -1456 -11957 16462 -7524 -7522 16228
1459 16228 -11869 -1580 12662 -14023 4442 6644 -13224 9560 -514 -9465 11843 -7195
1471 -7195 -3924 11449 -11940 2911 8008 -14528 8982 2562 -13662 13654 -3676 -10365 15582
1484 15582 -9084 -4980 13873 -12702 1593 9763 -13708 7310 3925 -11633 10913 -2582
1496 -2582 -6585 11763 -8474 -115 9728 -12758 6793 5854 -13756 12275 352 -12392 15475
1509 15475 -4673 -8357 15384 -9260 -2296 11956 -11503 4183 6662 -11261 9094 200 -8460
1522 -8460 12240 -5953 -3525 11909 -11389 2237 9172 -14065 8058 4347 -13927 12206 -1456
1535 -1456 -10816 14102 -6717 -5577 12665 -11005 64 8990 -12276 5508 3321 -10735 9409
1548 9409 -3027 -6696 10729 -9081 -865 9917 -13455 5121 6774 -15028 9730 2097 -13643
1561 -13643 12404 -2732 -9241 13108 -6999 -3631 10593 -9833 2489 6388 -10254 7522
1573 7522 418 -7880 10556 -5486 -3745 11609 -10362 1835 10108 -13166 6723 6369 -13215
1586 -13215 10500 1350 -10509 12613 -3650 -5955 12181 -7735 -388 8964 -9705 4482 4137
1599 4137 -9102 8751 -1875 -6117 10801 -7277 -1651 10858 -11541 3176 8273 -13487 7508
1612 7508 3940 -12623 10220 -828 -9264 10992 -5374 -4078 9374 -8782 1195 5406 -9795
1625 -9795 6053 586 -8261 9934 -4703 -5059 10932 -9193 -1030 10069 -11606 3534 6847
1638 6847 -12068 7420 2123 -10042 10164 -2668 -6371 10308 -6397 -1764 8171 -8379 3489
1651 3489 3965 -8331 7795 -874 -6496 10655 -5717 -3083 10814 -9620 850 9434 -11008
1664 -11008 4866 5814 -10566 7914 858 -8132 9305 -3271 -3798 8428 -6554 943 5454
1677 5454 -8082 5721 1759 -7918 8934 -2974 -5705 10153 -6968 -2527 9489 -9594 1444
1690 1444 6767 -10475 5135 2917 -9685 7579 -1239 -6657 8096 -4717 -2600 6561 -7241
1703 -7241 2148 3374 -7943 5943 -672 -6870 8729 -4127 -4578 9472 -7403 -800 8162 -9083
1717 -9083 2948 5581 -9108 5784 1905 -7317 7519 -1723 -4032 7444 -4710 111 5653
1730 5653 -6610 4329 2640 -7157 7717 -914 -5800 9148 -3861 -2950 8529 -6357 389
1743 389 6878 -7856 3781 3688 -7634 6289 106 -5638 7011 -3295 -2489 6578 -5924 1631
1757 1631 4443 -7200 4825 1209 -6895 6872 -2409 -4823 7894 -5267 -1965 7093 -7085
1770 -7085 886 4927 -7956 3869 2177 -6775 5228 -1427 -4188 5759 -4473 -504 5056 -6384
1784 -6384 2599 2787 -7431 5547 340 -6473 7165 -2528 -3993 7500 -4908 -806 6006 -6346
1798 -6346 2042 3830 -6365 4256 1291 -4724 5902 -2055 -2211 5763 -4340 846 4576 -5731
1812 -5731 3517 2153 -5768 5956 -827 -4613 7231 -3729 -2450 7295 -5527 120 5757 -5803
1826 -5803 2308 2831 -5440 3781 -313 -3674 5040 -3261 -1019 4851 -5275 1482 3544 -6415 3630
1841 3630 1344 -5790 5144 -1341 -4212 5758 -3766 -1794 5661 -5741 489 3894 -6019 3043
1855 3043 1659 -5337 4279 -828 -3486 4658 -3427 -887 4112 -4619 1987 2516 -5162 4298 343
1870 343 -4912 6064 -1722 -3492 6014 -3366 -926 5057 -4438 1449 3271 -4515 3372 773 -3590
1885 -3590 4781 -1657 -2063 5113 -3787 49 4405 -4971 2356 2271 -4806 4094 205 -3940 5334 -1908
1901 -1908 -2275 5210 -3892 -284 4130 -4911 1530 2207 -4730 3449 -15 -3675 4204 -2247 -1637 4100
1917 4100 -4198 540 2599 -5098 2743 753 -5263 3960 -914 -4393 5052 -2795 -2341 4534 -3828
1932 -3828 -153 3133 -4496 2056 1545 -4206 3562 -652 -2987 4419 -2645 -1268 4147 -3996 1012
1947 1012 2540 -4428 2970 1017 -4169 4590 -825 -2749 5034 -2502 -1140 4699 -3673 822 3401
1962 3401 -4063 2634 1746 -3734 3764 -11 -2266 4036 -2265 -205 3568 -4026 1662 2582 -4508
1977 -4508 3485 649 -4094 4377 -1258 -3130 4371 -2795 -1061 3728 -3730 820 2307 -4220 2646
1992 2646 299 -3587 3616 -1473 -2257 3670 -2850 -325 2749 -4133 1519 1441 -4345 3238 -248 -3833
2008 -3833 4245 -1886 -2380 4590 -3403 -773 4039 -3939 1018 2410 -3659 2665 500 -2442 3507
2023 3507 -1649 -1131 3626 -3403 687 3213 -4210 2355 2070 -4297 3528 44 -3261 4213 -1465
2038 -1465 -1614 4424 -3128 184 3606 -3874 1881 1702 -3482 2950 -229 -2582 3571 -2226 -875
2053 -875 3663 -3607 802 2491 -4569 2487 952 -4758 4006 -429 -3554 4272 -2103 -2719 3688
2068 3688 -3067 -567 2517 -3511 1419 686 -3339 3136 -1447 -1989 3601 -3202 -520 3436 -4405
2083 -4405 1103 2576 -4902 2809 1076 -4490 3925 -654 -3093 4455 -2102 -1326 3694 -3188 755
2098 755 2580 -3372 2277 478 -2489 3537 -1580 -1117 4218 -3025 403 3604 -4154 2267 2187 -4675
2114 -4675 3757 892 -4086 4580 -784 -2665 4605 -2226 -917 3547 -3118 1170 1895 -3284 2808
2129 2808 -450 -2629 3862 -2325 -1110 4110 -4088 277 3221 -4979 1945 1899 -4899 3415 -15
2144 -15 -3938 3796 -1805 -2266 3604 -3029 -173 2529 -3763 2013 872 -3699 3393 -1029 -2603 4028
2160 4028 -2995 -1008 3819 -4362 1188 3030 -4951 2902 1660 -4512 3708 -147 -3604 4123 -1622
2175 -1622 -1502 3458 -2951 1116 2063 -3576 2952 190 -3139 4930 -1572 -2213 5146 -3460 -338 4488
2191 4488 -4478 1567 3067 -4583 3080 1421 -3692 3762 -1158 -2188 3979 -2746 -353 3263 -3431
2206 -3431 1602 1505 -3743 3352 -611 -3210 4571 -2809 -1617 4639 -4313 -24 3780 -5168 1764
2221 1764 2434 -4994 3167 602 -3945 3779 -1917 -1857 3445 -3245 629 2570 -4229 2869 796 -4224
2237 -4224 4527 -1083 -3092 5049 -3096 -1396 4786 -4006 716 3818 -4963 2433 1615 -4242 4017
2252 4017 -623 -2790 4493 -2520 -349 3975 -3742 1639 2587 -4378 3490 609 -3906 4932 -1561
2267 -1561 -2281 5226 -3574 -470 4488 -4714 1466 2809 -4762 3189 705 -3859 3993 -1644 -2258
2282 -2258 4115 -3576 18 3236 -4725 2289 1446 -4852 3996 -768 -4219 4824 -2663 -2777 4822
2297 4822 -3965 -293 3703 -5009 1593 1919 -4786 3516 -924 -3649 4601 -2918 -1611 4292 -4148
2312 -4148 763 3198 -4888 3073 1274 -4478 4440 -1267 -3072 5333 -3241 -1124 5080 -4553 1087
2327 1087 3540 -4944 3264 1504 -3893 4769 -848 -2308 4920 -2990 -328 4077 -4624 2486 2639
2342 2639 -5053 4315 441 -4397 5247 -1848 -2841 5299 -3789 -438 4263 -4925 2127 2553 -5170
2357 -5170 3863 355 -4373 4804 -2193 -2364 4681 -3865 -137 3420 -5064 2438 1423 -4976 4217
2372 4217 -1048 -3959 5194 -2993 -1972 5241 -4720 239 3725 -5275 2812 1644 -5066 4043 -492
2387 -492 -3456 4741 -2842 -1251 4596 -4259 1418 3171 -4918 3624 1180 -4713 5170 -1520 -2976
2402 -2976 5387 -3184 -648 4790 -4875 1970 3409 -5456 3994 1468 -4522 4961 -1108 -2673 4863
2417 4863 -3346 -264 3647 -4642 2324 2055 -5076 4546 -331 -4397 5772 -2540 -2653 5562 -4396
2432 -4396 -336 4509 -5312 1783 2514 -5008 3715 -254 -4061 4549 -2354 -1962 4583 -4517 453
2447 453 3276 -5425 3029 1681 -5138 4879 -1223 -3870 5656 -3572 -1636 5215 -4685 585 3819
2462 3819 -5411 2625 2030 -4592 4264 -606 -3076 4785 -2832 -204 3990 -4543 1953 2535 -4934
2477 -4934 4361 338 -4452 6017 -1597 -3215 6032 -3581 -1003 5304 -4777 1325 3272 -4677
2491 -4677 3181 722 -3434 4437 -1906 -1628 4633 -4109 802 3737 -5214 3044 1827 -5196 4516
2506 4516 -686 -4222 5470 -2689 -2341 5188 -4389 -381 3980 -4757 1806 1860 -4653 3312 -676 -3184
2522 -3184 4033 -3242 -699 3869 -5172 1526 2805 -5701 3791 829 -5304 5231 -1253 -3899 5621
2537 5621 -2945 -1924 4802 -4061 341 2917 -4243 2900 681 -3428 4491 -1823 -1947 4811 -4010
2552 -4010 347 4264 -5053 2500 2571 -5276 4488 438 -4485 5445 -1558 -2913 5329 -3271 -734
2567 -734 4089 -4142 1417 1829 -3801 3600 -639 -2670 4359 -2923 -902 4278 -4950 1462 3644
2582 3644 -6122 3195 1654 -5522 4761 -458 -4470 4971 -2136 -2061 4016 -3509 266 2395 -3997
2597 -3997 2864 294 -3678 3930 -2256 -2408 4923 -4055 -126 4378 -5491 1798 3079 -5696 3684
2612 3684 824 -4731 4764 -981 -2982 4866 -2519 -1030 3607 -3517 1599 1836 -3827 3747 -398
2627 -398 -2685 4824 -2795 -1226 5213 -4688 1074 4151 -5399 2829 2458 -5148 4261 591 -3777
2642 -3777 4805 -1797 -1775 3794 -3135 757 2536 -4117 2768 492 -3877 4261 -1658 -3008 4927
2657 4927 -3473 -1098 4663 -5177 942 3316 -5383 2692 1346 -4938 3570 -952 -3099 4101 -2621
2672 -2621 -887 3182 -4096 1304 1664 -4424 3374 -364 -3570 4662 -2454 -2122 5099 -4231 -222
2687 -222 4352 -5240 1813 2838 -4871 3422 959 -3644 3922 -1181 -1677 3599 -3046 722 2911
2702 2911 -3985 2949 1107 -3945 4358 -819 -3130 5289 -2877 -1578 5030 -3927 582 3860 -4425
2717 -4425 2421 1935 -4117 3646 -304 -2773 4108 -2462 -807 3560 -3708 1123 2233 -4264 2931
2732 2931 248 -3871 4570 -1953 -2674 5000 -3658 -1002 4063 -4657 920 2655 -4654 2395 683
2747 683 -3558 3375 -1324 -1668 3495 -3386 179 3014 -4217 2030 1458 -3965 3791 -411 -3642 4364
2763 4364 -2413 -2131 4403 -3554 66 3728 -4358 1807 1991 -4132 3295 -26 -2687 3917 -2154
2778 -2154 -1448 3989 -3264 905 2607 -3793 2922 669 -3786 4031 -1080 -2808 4677 -2719 -1293
2793 -1293 4270 -3861 558 2730 -4156 2107 684 -3387 3358 -1163 -1700 3585 -2998 -325 3007
2808 3007 -4154 1556 1880 -4045 3029 -26 -3624 3896 -1758 -2545 4187 -2995 -713 3005 -3886
2823 -3886 1174 1909 -3779 2745 119 -2948 3760 -1877 -1431 3245 -2957 250 2433 -3736 2129
2838 2129 821 -3606 3653 -613 -2787 4435 -1836 -1520 4100 -3036 236 2955 -3365 1801 1364
2853 1364 -3248 3096 -264 -1836 3580 -2097 -466 3169 -3303 1278 2029 -3706 2932 510 -3388
2868 -3388 3583 -1115 -2064 3840 -2468 -645 3049 -3224 1026 2125 -3650 2487 409 -2851 2944
2883 2944 -1376 -1787 2760 -2659 211 2188 -3453 1863 1251 -3738 2914 -307 -3328 3871 -1700
2898 -1700 -1933 3366 -2822 -461 2650 -3194 1511 1294 -2977 2467 -532 -2221 3002 -2243 -906
2913 -906 3002 -2995 771 2429 -3459 2388 1159 -3294 3252 -732 -2124 3954 -1946 -1080 3196
2928 3196 -2904 624 2357 -3165 1952 950 -2703 2680 -773 -1604 3076 -2242 -14 2586 -3136
2943 -3136 1721 1572 -3616 2848 94 -3190 3254 -1069 -2055 3292 -2243 -532 2685 -2755 975
2958 975 1565 -2997 1855 -80 -2327 2781 -1680 -1204 2733 -2959 189 2144 -3391 1719 1047 -3377
2974 -3377 2554 -251 -2476 3156 -1548 -1290 3233 -2681 49 2286 -2613 1286 1299 -2392 1999 -340
2990 -340 -1746 2553 -1889 4 2482 -2772 959 1934 -3216 2477 848 -2687 3395 -419 -2110
3005 -2110 3137 -1543 -732 2807 -2319 879 1691 -2620 1912 102 -2054 2726 -1082 -1277 2865 -2489
3021 -2489 -78 2399 -3050 1316 1554 -3296 2112 92 -2880 2761 -1148 -1800 2806 -2057 -731
3036 -731 2183 -2707 846 898 -2522 1516 -290 -1794 2446 -1640 -837 2517 -2622 98 1924 -3141
3052 -3141 1488 1110 -3170 2224 -55 -2092 2529 -887 -1111 2567 -2242 225 1518 -2016 1543
3067 1543 467 -2164 2681 -518 -1186 2767 -1747 -200 2783 -2437 884 1831 -2714 1889 1048 -2376
3083 -2376 2587 -329 -1497 2848 -1298 -664 2260 -1786 632 1337 -2014 1856 -146 -1787 2265
3098 2265 -1277 -932 2610 -2323 -168 2396 -3053 1114 1627 -3078 1791 561 -2437 2141 -855
3113 -855 -1316 1989 -1639 -100 1643 -2471 981 686 -2330 2033 -256 -1771 2451 -1613 -771 2501
3129 2501 -2521 228 1806 -2765 1405 1249 -2703 2064 311 -1814 2519 -745 -812 2314 -1671 193
3145 193 1399 -1940 1243 559 -1844 2310 -601 -1333 2796 -1522 -491 2581 -2023 462 1928 -2373
3161 -2373 1312 846 -2160 1790 -268 -1402 2109 -994 -344 1811 -1708 893 962 -2133 1630 -114
3177 -114 -1912 2116 -934 -1382 2506 -1758 -515 2131 -2388 427 1263 -2417 1142 246 -2054 1678
3193 1678 -453 -1177 1909 -1364 65 1419 -1716 827 579 -2221 1940 -322 -1538 2576 -1121
3208 -1121 -1061 2634 -1879 -93 2148 -2274 531 1204 -1859 1341 429 -1631 1955 -862 -384 1884
3224 1884 -1501 563 1240 -2247 1414 553 -1879 1992 -142 -1488 2477 -1191 -725 2283 -1732 438
3240 438 1867 -1957 1068 815 -2076 1609 -189 -1217 1714 -997 -487 1592 -1853 660 1119 -2143
3256 -2143 1394 -210 -1891 2318 -716 -1437 2215 -1602 -836 2117 -1957 174 1049 -1998 1250 102
3272 102 -1630 1728 -652 -1135 1747 -1637 -53 1540 -2315 797 952 -2164 1420 23 -1847 2008
3288 2008 -737 -1091 2289 -1592 -358 1751 -1759 746 1190 -1634 1235 105 -1385 1770 -734
3303 -734 -502 1597 -1607 314 1101 -1969 1249 711 -2265 1964 -276 -1655 2229 -828 -950 2028
3319 2028 -1414 -120 1507 -1635 827 504 -1756 1461 -281 -1214 1684 -1216 -532 1678 -1895 338
3335 338 1624 -1973 928 508 -1908 1428 -359 -1384 2092 -1251 -639 1618 -1740 226 1179 -1827
3351 -1827 988 484 -1348 1588 -289 -908 1676 -1244 -171 1691 -1688 877 1193 -1846 1295 371
3367 371 -1721 2046 -487 -1215 1874 -1093 -103 1520 -1628 666 1160 -1548 1567 176 -1210 1853
3383 1853 -694 -786 1878 -1482 66 1519 -1976 1054 815 -1999 1607 -216 -1437 1800 -1078 -912
3399 -912 1718 -1748 -392 1240 -2145 862 545 -1931 1393 -313 -1438 1941 -1244 -583 1549 -1663
3415 -1663 230 1168 -1991 856 627 -1888 1616 -676 -1608 1863 -1107 -646 1742 -1702 461 1210
3431 1210 -1960 1063 402 -1710 1780 -329 -1061 1854 -942 -470 1874 -1674 848 1210 -1756 1453
3447 1453 321 -1272 1952 -488 -1058 2316 -1527 -226 1969 -1731 577 1249 -1867 1286 411 -1356
3463 -1356 1815 -679 -657 1734 -1566 120 1503 -2000 857 726 -1970 1413 -77 -1579 1910 -1016
3479 -1016 -715 1801 -1545 123 1646 -2052 558 793 -1712 1256 75 -1374 1522 -933 -461 1356
3495 1356 -1410 182 1056 -2009 1311 408 -1961 1840 -378 -1368 1980 -1002 -892 1837 -1645 27
3511 27 1555 -1735 922 299 -1280 1902 -454 -751 1982 -1460 -145 1737 -1882 794 1298 -1964
3527 -1964 1488 212 -1664 1881 -615 -1215 1930 -1191 -347 1809 -1635 423 1034 -1616 1242 250
3543 250 -1283 1761 -765 -754 1739 -1360 -71 1375 -1918 937 887 -2313 1657 -32 -2036 1956
3559 1956 -840 -1037 1805 -1442 -298 1386 -1549 686 680 -1751 1446 -734 -1176 1762 -1278 -534
3575 -534 1704 -1812 303 1154 -2253 1271 458 -2018 1678 -344 -1357 1953 -864 -607 1783 -1212
3591 -1212 167 969 -1531 1112 448 -1293 1792 -732 -674 1969 -1345 -156 1536 -1858 868 1475
3607 1475 -2065 1526 381 -2043 1750 -224 -1096 1762 -1021 -539 1234 -1615 625 395 -1404 1383
3623 1383 -548 -1333 1972 -1276 -934 1939 -2074 -4 1444 -2388 900 1033 -2189 1265 329 -1691
3639 -1691 1792 -675 -852 1440 -1500 -37 976 -1797 812 294 -1504 1645 -694 -1290 1918 -1289
3655 -1289 -538 1706 -1922 520 1584 -2216 993 865 -1857 1394 117 -1274 1532 -820 -476 1366
3671 1366 -1275 637 853 -1571 1101 -97 -1566 2057 -910 -1044 2151 -1602 -399 1783 -1531
3686 -1531 460 1133 -1857 1226 316 -1487 1596 -599 -609 1585 -1358 49 1253 -1672 1007 410
3702 410 -1695 1667 -435 -1252 2145 -1344 -661 2096 -2029 -62 1573 -1965 675 762 -1783 825
3718 825 -25 -1293 1253 -995 -509 1324 -1671 288 1045 -1904 1282 -34 -1741 1802 -366 -1260
3734 -1260 2112 -1206 -504 2228 -1964 541 1278 -1557 1016 554 -1360 1541 -343 -792 1829 -1196
3750 -1196 -22 1609 -1449 796 642 -1665 1812 -7 -1512 2049 -974 -797 2149 -1481 -198
3765 -198 1610 -1447 649 1028 -1662 1427 38 -1176 1563 -836 -444 1388 -1587 540 1321 -1941
3781 -1941 1052 390 -1943 1665 -572 -1370 1882 -929 -742 1742 -1558 0 999 -1766 769 359
3797 359 -1709 1210 -590 -1058 1596 -1006 -466 1513 -1550 337 999 -1669 1274 243 -1662 1796
3813 1796 -431 -1060 2119 -1244 -461 1581 -1413 489 1090 -1448 1244 356 -1043 1590 -540 -519
3829 -519 1801 -1427 324 1442 -1887 979 735 -1886 1410 92 -1174 1737 -542 -806 1551 -1318
3845 -1318 248 1208 -1629 766 594 -1689 1313 -267 -1242 1601 -692 -287 1331 -1514 521 1062
3861 1062 -1725 1032 373 -1584 1648 -497 -1490 1898 -1265 -356 1708 -1538 160 1099 -2030 1150
3877 1150 252 -1605 1471 -534 -925 1591 -1220 -66 1550 -1714 732 990 -1848 1495 99 -1334
3893 -1334 1761 -318 -847 1858 -1184 -176 1637 -1520 698 943 -1519 1577 91 -1096 1542
3908 1542 -717 -405 1705 -1293 -22 1248 -1623 810 626 -1691 1639 -225 -1393 1896 -1061
3923 -1061 -1001 1638 -1502 7 1132 -1877 774 386 -1498 1237 -277 -1124 1594 -1077 -590 1358
3939 1358 -1747 630 937 -1660 1181 432 -1298 1636 -655 -912 1885 -1077 -346 1416 -1514 534
3955 534 968 -1562 1047 91 -1247 1384 -549 -667 1414 -1044 121 1428 -1734 833 793 -1575
3971 -1575 1454 250 -1446 1616 -696 -938 1660 -1091 42 1308 -1389 637 655 -1184 1143 -498
3987 -498 -1086 1571 -937 -421 1498 -1363 140 880 -1732 900 413 -1670 1271 -306 -1124 1521
4003 1521 -912 -840 1466 -1295 -109 876 -1381 830 269 -1080 1261 -455 -805 1483 -1213 -105
4019 -105 1191 -1810 486 879 -1831 1218 147 -1352 1331 -466 -793 1563 -955 -384 1159 -1064
4035 -1064 848 667 -1340 1309 -44 -1322 1323 -770 -148 1558 -1495 124 1284 -1666 713
4050 713 702 -1589 1444 236 -1052 1689 -642 -689 1359 -1202 31 774 -1176 756 439 -1058 1239
4067 1239 -426 -826 1536 -1037 -272 1320 -1331 187 1301 -1668 935 460 -1585 1163 -26 -1259
4083 -1259 1290 -869 -654 1242 -1119 196 397 -1262 870 39 -906 1397 -764 -920 1596 -1205
4099 -1205 -202 1539 -1630 563 789 -1642 800 194 -1242 1242 -414 -851 1170 -1038 127 875
4115 875 -1023 460 217 -1075 1117 -186 -965 1575 -779 -412 1585 -1297 228 1609 -1262 730
4131 730 683 -1237 1096 363 -774 1099 -538 -323 1102 -837 237 498 -1381 1067 124 -1241 1365
4148 1365 -610 -827 1320 -1074 -425 1285 -1324 78 901 -1347 571 392 -1341 1002 -245 -805
4164 -805 1090 -805 22 915 -1486 546 623 -1324 1009 -119 -908 1647 -677 -630 1254 -1077 -75
4181 -75 1070 -965 307 950 -1170 744 216 -957 984 -328 -384 901 -1116 401 898 -1128 857
4198 857 643 -1381 1188 -100 -1074 1583 -601 -637 1320 -1003 -123 1015 -1056 489 758 -1056 1076
4215 1076 74 -864 1012 -500 -28 883 -1004 547 619 -1078 786 -66 -1458 1219 -546 -950 1501
4232 1501 -940 -537 953 -1280 16 781 -1167 400 197 -831 961 -525 -602 1093 -914 53
4248 53 751 -1211 421 600 -1237 1035 71 -911 1268 -440 -372 1171 -812 65 1100 -1275 426
4265 426 389 -1094 749 140 -699 893 -701 -282 969 -706 236 789 -844 824 382 -1207 1072
4282 1072 -173 -836 1189 -513 -442 1146 -1116 -76 702 -906 530 246 -890 594 -142 -404 1071
4299 1071 -754 -45 982 -1437 423 618 -1253 559 5 -892 1010 -402 -755 1189 -710 -360
4315 -360 853 -1156 26 414 -964 847 130 -787 974 -470 -416 973 -756 11 1187 -1105 375
4332 375 518 -1328 1085 -128 -1093 1062 -208 -414 1319 -625 -70 864 -443 155 358 -756 843
4349 843 -13 -483 1003 -361 -234 1258 -996 -16 946 -1210 421 641 -925 890 10 -868 1064
4366 1064 -351 -399 916 -1073 59 842 -1029 600 380 -900 665 -304 -414 896 -814 -140 766
4383 766 -988 306 487 -1136 617 365 -1008 765 -267 -591 850 -831 -253 680 -640 267 466
4400 466 -1017 677 -113 -751 1065 -515 -564 1012 -657 -95 993 -867 507 596 -1000 805 111
4417 111 -857 977 -476 -352 1098 -702 169 610 -425 436 326 -1089 657 -119 -573 987 -651
4434 -651 -129 832 -771 93 668 -1037 509 310 -1146 923 -66 -887 652 -278 -223 665 -841 82
4452 82 541 -715 649 -79 -1001 672 -384 -527 858 -767 16 799 -1035 252 489 -686 550
4469 550 88 -872 742 -114 -566 876 -478 -195 859 -879 297 267 -890 711 292 -730 1095
4486 1095 -298 -269 815 -571 -61 926 -683 331 566 -742 1007 206 -731 907 -152 -185 526
4503 526 -704 48 680 -895 587 414 -1189 729 -114 -435 927 -341 -424 770 -790 167 668
4520 668 -738 370 430 -1059 633 -263 -756 759 -486 -352 731 -548 -87 604 -656 378 293
4537 293 -833 667 -146 -404 799 -589 -206 825 -892 -3 557 -983 618 306 -565 815 -13
4554 -13 -853 711 -555 28 386 -724 258 581 -612 670 -53 -906 696 -240 -184 935 -681 -73
4572 -73 736 -771 635 480 -732 559 244 -562 965 -347 -217 919 -572 11 622 -870 255
4589 255 315 -604 584 -45 -438 983 -457 -390 804 -882 14 646 -1097 431 525 -982 665 -115
4607 -115 -547 450 -425 -168 473 -570 90 627 -916 513 108 -742 776 -85 -557 571 -705 -262
4625 -262 804 -695 236 649 -1100 518 109 -848 742 -111 -540 699 -298 145 630 -448 310 386
4643 386 -911 717 200 -864 1072 -151 -511 979 -381 -29 766 -1007 212 510 -733 556
4659 556 198 -720 644 -434 -382 922 -709 286 690 -838 556 432 -757 704 -79 -375 808
4676 808 -488 -148 733 -755 -74 814 -870 292 317 -696 422 -131 -866 591 -278 -126 459 -402
4694 -402 -2 182 -661 732 97 -753 937 -264 -840 874 -577 -343 823 -842 426 555 -1014
4711 -1014 521 378 -441 802 -103 -285 1002 -510 118 606 -390 157 617 -792 760 -24 -532 712
4729 712 -210 -555 955 -482 -101 695 -839 181 654 -578 464 -130 -704 576 -423 -209 579 -703
4747 -703 63 498 -1187 820 294 -842 775 -280 -680 810 -430 -506 779 -593 -86 573 -665
4764 -665 557 136 -594 641 43 -352 616 -326 -185 752 -843 312 438 -880 237 215 -837 787
4782 787 -392 -570 865 -429 33 846 -795 116 553 -506 415 244 -446 749 -227 -539 809 -485
4800 -485 110 447 -689 358 239 -801 545 221 -618 828 -350 -627 619 -586 -32 570 -636
4817 -636 310 314 -739 586 -113 -474 705 -252 -188 921 -729 -114 627 -691 425 388 -656 529
4835 529 -28 -755 711 -256 -322 708 -671 -78 364 -865 231 129 -773 601 -169 -195 593 -607
4853 -607 104 702 -549 217 466 -901 393 188 -687 600 -255 -460 824 -372 -150 649 -607 305
4871 305 338 -428 497 371 -693 604 -272 -298 624 -290 41 746 -778 310 462 -689 532 2 -887
4890 -887 659 -364 -227 637 -542 2 504 -702 369 200 -714 295 -17 -269 769 -499 -479 756
4908 756 -669 85 702 -825 211 527 -568 688 -276 -281 668 -466 -341 735 -592 93 498 -959
4926 -959 441 -17 -648 616 -95 -850 749 -750 -246 506 -596 30 429 -565 462 289 -544 673
4944 673 -258 -267 728 -531 -88 907 -562 220 496 -546 161 116 -396 936 -107 -252 708 -525 -137
4963 -137 631 -530 259 348 -777 516 159 -747 660 -423 -478 619 -304 -73 550 -656 348 323
4981 323 -986 320 -333 -297 371 -371 -316 631 -574 321 544 -609 515 478 -612 538 -182 -492 880
5000 880 -217 -306 622 -625 73 293 -451 583 195 -370 765 -344 -405 818 -719 -83 658 -748
5018 -748 117 443 -643 575 165 -826 708 -307 -553 511 -291 37 569 -643 332 322 -449 403
5036 403 -94 -417 773 -211 -350 744 -395 54 261 -591 316 313 -742 512 150 -465 571 -73 -285
5055 -285 443 -458 -93 554 -499 252 15 -486 542 -313 -62 594 -534 -296 660 -723 109 378 -887
5074 -887 485 325 -802 372 36 -672 619 -522 -318 830 -634 274 398 -720 305 25 -528
5091 -528 769 -371 -460 518 -562 -147 589 -723 194 439 -547 677 104 -481 431 -391 -346 599 -330
5110 -330 -36 532 -539 122 265 -585 532 22 -566 635 -296 -287 696 -663 -20 618 -714 117 191
5129 191 -728 615 -60 -621 832 -377 -126 309 -617 128 322 -669 110 -95 -525 485 -246 -622 790
5148 790 -429 -489 680 -569 190 650 -584 237 169 -553 231 -53 -323 298 -268 48 434 -206 253
5167 253 279 -451 620 103 -497 806 -110 -283 791 -324 -307 579 -472 123 522 -428 300 135 -412
5186 -412 455 -127 -277 749 -508 -59 423 -705 291 243 -344 457 -119 -599 589 -518 -377 753
5204 753 -285 -120 564 -377 408 325 -479 275 -107 -216 493 -438 -150 518 -702 244 439 -909 194
5223 194 174 -765 832 -52 -548 701 -265 -5 649 -360 43 508 -389 308 211 -516 406 -192 -102 327
5243 327 -524 1 463 -535 153 395 -752 576 -111 -420 702 -55 -579 705 -422 -258 585 -438
5261 -438 160 498 -723 241 88 -405 514 -443 -191 447 -476 79 511 -943 129 272 -669 384 212
5280 212 -325 446 -326 -341 642 -473 20 462 -421 420 -76 -581 613 -244 -237 490 -642 -261 689 -411
5300 -411 94 394 -829 275 211 -369 461 -106 -318 519 -438 64 648 -441 138 142 -467 308 102 -436
5320 -436 690 -477 -384 675 -282 -125 458 -468 273 304 -595 436 20 -450 589 -346 -277 522 -305
5339 -305 71 351 -421 298 158 -294 688 93 -449 530 -393 -98 317 -569 71 251 -666 449 153 -509
5359 -509 647 -107 -248 631 -244 -35 521 -375 -22 405 -111 408 -36 -481 668 -374 -438 391 -533
5378 -533 -96 464 -600 232 330 -572 428 -96 -665 430 -231 -256 712 -289 -13 693 -201 213 317
5397 317 -498 269 119 -397 548 -180 -269 480 -353 95 248 -581 94 149 -559 494 249 -658 434 -146
5417 -146 -508 468 -404 74 194 -553 145 94 -684 359 -356 -425 577 -214 -38 494 -759 -18 508 -352
5437 -352 264 208 -582 243 201 -388 451 -236 -239 610 -475 71 168 -576 511 120 -358 468 -277 -225 670
5458 670 -500 24 362 -450 313 317 -508 265 85 -508 440 -176 -601 708 -333 -95 343 -615 55 215
5478 215 -588 249 215 -381 555 -228 -375 597 -189 -299 544 -362 137 121 -615 266 211 -433 306 -260 -214
5499 -214 461 -334 32 189 -435 28 426 -576 208 -90 -479 235 -261 -46 454 -539 160 401 -312 475
5519 475 126 -370 344 -214 -274 287 -208 -107 542 -85 227 62 -285 463 -134 -273 358 159 -140 567
5539 567 -302 164 216 -547 247 172 -246 228 276 -392 90 -513 -114 698 -282 -137 206 -408 104 174 -586
5560 -586 497 -241 -480 123 -123 -79 831 -363 33 603 -303 172 273 -564 270 201 -435 360 -368 -231
5580 -231 261 -486 11 208 -577 202 126 -577 384 -18 -131 536 69 -120 487 -215 -154 393 -762 234
5600 234 180 -415 499 87 -343 20 -247 -7 348 -334 128 208 -266 383 80 -459 683 -65 -342 509
5620 509 -277 -17 484 -247 163 81 -262 200 125 -525 230 -1 -249 127 -272 12 213 -142 155 168 -454
5641 -454 212 22 -185 497 -292 -406 388 -96 46 456 -352 135 128 -411 322 154 -488 359 3 -321 439
5662 439 -407 52 144 -675 118 15 -528 569 -239 -246 362 -122 -351 523 -210 152 477 -315 215 197 -365
5683 -365 199 -110 -299 654 -306 7 321 -342 11 521 -369 549 142 -472 463 28 -300 484 -154 -23
5703 -23 388 -353 -29 211 -287 146 120 -265 273 -67 -138 209 -587 -201 279 -432 94 -113 -414 252 -125
5724 -125 -305 466 -43 -196 277 -319 -123 254 -286 178 100 -92 429 158 -256 311 -20 -284 202 -265
5744 -265 -101 371 -577 309 278 -398 433 -228 -226 322 -158 -92 421 -197 51 383 -343 311 78 -286 464
5765 464 41 -77 283 -367 26 461 -232 96 242 -324 217 173 -111 184 -118 -447 187 -239 -258 251 -511
5786 -511 113 144 -420 0 177 -360 312 -225 17 312 -244 -124 436 -299 -7 187 -590 317 52 -23 283
5807 283 -156 -321 371 -238 122 336 -541 15 168 -471 253 -65 -338 493 -309 -150 294 -340 69 373
5827 373 -382 269 169 -598 377 182 -240 473 -170 54 300 -270 43 165 -173 405 97 -333 369 -52
5847 -52 122 360 77 -257 288 -472 -101 188 -524 100 15 -601 92 191 -401 127 -222 -198 267 -413 258
5868 258 312 -404 283 223 -404 355 -272 -99 511 -400 -26 468 29 -50 194 -342 225 -89 -24 303 -93
5889 -93 2 112 -60 -48 53 -178 13 120 -307 124 35 -388 341 -128 -349 402 -260 -142 76 -260 115
5910 115 250 -475 390 -9 -103 162 -195 -214 426 -234 -35 129 -95 244 53 -243 253 -248 -201 205 -245
5931 -245 -175 268 -325 11 238 -351 346 -45 -377 224 -6 -141 301 -323 28 193 -510 -21 303 -606
5951 -606 245 -65 -434 330 -23 -13 195 -88 -212 208 -497 -41 34 -347 114 8 -213 257 -224 -282 340
5972 340 -95 24 135 -142 42 260 -436 569 277 -120 391 -174 -113 311 -90 -140 107 -269 116 21 -190
5993 -190 469 146 -128 294 -100 -33 135 -472 -209 389 -328 35 129 -176 134 36 -195 447 -74 234 230 -451
6015 -451 99 208 -317 149 -108 -427 216 -47 -290 453 -228 -180 278 -402 75 122 -421 141 32 -169 208
6036 208 -145 -82 327 -398 -394 517 -310 270 -15 -393 99 107 -117 412 -54 120 32 -244 12 236 -242 58
6058 58 192 -271 461 11 -33 136 -133 -18 347 -335 -123 405 -328 123 150 -210 308 -20 -153 107 -156
6079 -156 46 66 -275 25 209 -263 240 -112 -247 391 -308 -294 491 -294 -276 541 -309 92 16 -215 26
6100 26 -107 -299 162 -123 -45 335 -253 -141 24 -546 17 140 -117 -72 -102 -444 217 -152 -24 382 -157
6121 -157 47 437 -179 104 396 -275 87 393 -162 263 -311 -323 165 -62 113 345 -482 105 158 -335 336
6142 336 -222 -414 307 -169 -299 110 -293 26 319 -498 29 104 -464 252 -116 -340 134 31 -309 541
6162 541 -486 -237 118 -387 266 90 -539 345 -83 -181 360 -133 -233 201 -207 -11 111 -494 -20 17
6182 17 -10 211 -63 -437 429 -160 -345 310 -348 122 136 -224 300 176 -28 149 -154 -98 363 -97 101
6203 101 365 -405 70 238 -344 221 -52 -242 183 -103 15 258 -289 -92 146 -484 293 27 -227 129
6223 129 99 -272 394 -129 -262 400 -253 -8 262 -85 191 29 -287 91 -285 -21 168 -150 -38 242
6243 242 -230 95 -10 -338 261 88 -469 314 125 -125 227 -224 -240 241 -7 100 383 -383 324 22
6263 22 -404 361 -60 116 241 -207 -134 201 -231 210 215 -400 43 -77 -348 163 -235 -198 155 -169 -70 193
6285 193 -120 277 119 -318 201 38 -243 265 -216 -32 258 -348 46 185 -382 207 -36 -273 128 29
6305 29 -75 78 -298 -181 129 -453 84 241 -254 175 251 -421 148 66 -180 299 -236 48 88 -155 -134 142
6327 142 -38 143 22 -132 371 -262 -334 319 -110 -202 345 -261 49 9 -146 415 122 -322 260 -108 -5
6348 -5 183 -241 -42 270 -228 41 141 -349 251 176 -292 364 64 -61 -1 -369 239 350 -221 263 245 -384
6370 -384 121 97 -55 474 -52 -107 365 -285 -16 335 -441 29 -51 -617 155 7 -260 341 -18 -339 104
6391 104 -332 -37 368 131 204 80 -52 425 2 -365 254 -292 -33 482 87 132 478 -317 100 103 -309
6412 -309 254 133 -294 73 88 -119 6 -447 -16 211 -254 298 220 -344 307 144 -72 644 47 26 421
6433 421 -293 211 230 -342 270 -3 -35 393 -212 -377 109 -224 -80 172 -122 59 324 -176 274 -4 -204
6454 -204 180 -164 -172 436 -212 -78 7 -565 -31 136 -271 101 417 -199 0 -158 11 206 -54 36 190
6475 190 -436 322 -116 -214 449 -263 -182 328 -241 38 605 -392 -225 149 -70 94 191 -459 99 -111 -270
6496 -270 161 -7 -33 172 -172 48 -45 -393 416 306 -212 300 13 -121 254 -160 31 177 -266 362 43
6517 43 -140 342 -5 -257 -4 -279 127 373 -178 145 247 -100 152 212 -422 71 -61 -301 456 -310 -372
6538 -372 205 -374 114 126 -250 261 207 -166 15 -127 -212 187 -243 -190 106 -218 241 285 -214 97 -87 -345
6560 -345 151 -51 -259 244 -168 -106 184 -295 281 55 -75 325 -17 -290 296 -148 -235 305 -210 -220 1
6581 1 -468 53 231 -130 253 -213 -192 267 -143 -106 360 -199 276 147 -80 186 126 -248 327 63 -252 150
6603 150 -191 -58 93 -154 -15 50 -166 196 35 -325 46 109 -286 91 -177 -195 -54 -98 -44 53 -313 6
6625 6 238 -79 101 -31 -383 129 -134 -38 169 -17 93 -142 -239 -25 -14 -260 417 -19 -341 87 -142 -222
6647 -222 277 -238 107 407 -337 -54 -28 -175 19 -210 -104 -11 -45 -55 58 68 103 329 -53 425 208 -113
6669 -113 393 95 -90 169 -317 -324 66 -214 -221 189 -15 227 -141 -234 1 -144 -152 241 -242 -34 61 -212 211
6692 211 -46 -185 424 205 -344 278 -40 75 200 -329 54 132 -174 159 -85 -267 129 179 -31 162 -332
6713 -332 190 -37 -282 146 370 -222 91 125 -342 150 -65 -166 202 -131 -160 146 -141 -39 77 -200 320
6734 320 136 -222 59 110 24 375 -70 14 100 -301 176 174 -325 22 141 -360 125 -129 -43 121 -151 88
6756 88 -11 -295 260 260 -232 46 -60 -157 243 25 -86 419 -433 122 147 -85 229 193 -180 -49 -96 -115 103
6779 103 -270 -279 192 -51 -102 72 -266 -32 144 54 161 -140 -243 175 101 57 341 -164 55 118 -100 42
6801 42 156 -206 224 63 -237 66 -118 146 271 74 -134 135 -43 199 167 -241 138 -240 69 160 73
6822 73 -221 95 -255 -173 -20 -496 108 -16 -172 105 5 -170 176 -287 331 139 -290 224 112 -198 197
6843 197 43 -189 255 -6 -88 183 -324 -212 106 -328 338 57 -133 274 6 -180 262 -64 -109 132 -229
6864 -229 121 -181 -345 -4 -44 -303 175 245 -107 -19 -112 -116 103 49 -49 53 -123 -19 -57 -181 -102 -85 -201 226
6888 226 -329 -27 40 -205 100 69 -233 -32 -2 -157 247 -142 -262 -111 -102 -69 336 -479 232 189 -213 149
6910 149 22 26 161 -58 -273 48 -212 208 3 -346 328 76 46 110 14 -78 -75 -3 -115 39 -122 211 368
6933 368 -272 40 181 -9 -143 45 -82 -21 -101 63 379 -107 -114 90 14 32 -44 -34 172 -30 -212 93 36
6956 36 -168 92 -46 58 12 -161 199 253 -40 125 -84 28 -160 -280 14 108 113 54 94 -384 451 216 -53
6979 -53 65 57 175 -35 -161 28 203 -289 191 159 -314 -130 -21 -163 326 187 -5 272 8 6 125 -221
7001 -221 80 309 -203 324 -109 -228 -189 -176 -131 166 -176 195 223 -319 91 93 -58 -23 -83 -92 262 141 38
7024 38 270 -286 117 215 -213 192 30 -139 96 -237 -130 126 -123 262 65 79 62 465 -108 162 -77
7045 -77 -144 81 -159 -201 54 -132 53 150 -302 117 306 -202 249 96 5 386 -138 -73 29 -171 104 237
7067 237 -350 150 -78 -229 -67 65 60 292 -92 -48 295 -123 260 178 -115 -28 100 -302 14 -105 169 293
7089 293 37 53 181 53 -59 122 -127 238 22 -38 198 -18 -115 97 2 62 40 189 140 -23 82 111 242
7112 242 1 343 77 -219 274 -57 -151 -21 -157 242 226 -55 207 51 -135 102 127 -20 340 -286 142
7133 142 202 -47 -60 -11 -343 -367 -37 -202 -75 -108 -220 -43 69 -115 112 -303 -104 19 -264 102 -52 -24
7155 -24 446 -47 80 172 -178 86 -11 -295 158 296 -157 244 90 -92 349 52 -189 31 -316 191 -9
7176 -9 99 -2 -6 -127 188 32 149 121 -50 33 74 -170 121 257 -400 -15 182 -127 185 89 -5 236 -5
7199 -5 79 296 -72 128 -104 -117 291 82 -2 -102 -82 -153 75 -322 62 329 -57 315 142 -1 334 65
7221 65 -97 62 -19 -1 236 -169 -76 293 -376 129 -82 -16 57 -275 -133 174 136 -131 285 -179 70 225
7243 225 -129 123 199 -234 195 44 -220 193 138 -31 173 -215 -24 104 -117 154 73 -88 234 -13 -57
7264 -57 132 -12 22 66 -380 -142 82 0 -66 191 150 217 -207 -161 41 116 77 -93 2 201 203 -52 -46 -241 -109
7289 -109 135 -66 -59 -25 167 -390 21 1 47 -49 -132 76 81 41 100 231 -145 150 -140 19 116 -366 -87 220
7313 220 44 -34 -286 238 202 -191 -38 -13 -196 52 98 -47 21 336 -95 253 -169 -342 341 -86 -91 141
7335 141 -80 29 52 -134 -291 184 -159 79 -85 -63 49 30 1 4 -166 35 -197 21 109 -165 -67 65 -11
7358 -11 -161 101 -281 201 32 -128 -208 4 -8 378 22 -88 129 -124 -167 376 50 -65 8 -305 -38 9
7380 9 -127 53 15 -60 221 -279 -9 -35 -252 180 230 -58 -289 28 -258 82 192 -83 204 -48 112 117 -224
7403 -224 5 188 -154 -39 -59 -106 235 -34 -34 73 -77 -156 107 -11 -223 -100 -54 16 126 -11 187 131 -57
7426 -57 60 66 88 1 -118 103 100 -174 227 -23 -244 180 224 -43 163 102 5 -95 -195 -37 144 -116 53
7449 53 -141 -70 85 -16 131 168 -9 38 75 -168 -42 18 -176 270 186 -55 -129 11 -27 341 7 196 349
7472 349 -207 -72 74 -95 -82 67 -55 -28 -119 95 129 -267 -97 -64 -353 -40 124 34 -20 -46 -64 190 -143
7495 -143 45 123 -141 -253 -98 -271 110 102 -122 161 -103 180 -147 -200 -14 109 -187 127 -75 -295 39
7516 39 76 -121 95 -97 0 239 -200 89 -205 -204 -176 -44 -12 356 -104 -268 127 -30 -10 139 16 -79 174
7539 174 29 -34 121 -113 325 56 -105 193 210 -79 126 77 -86 -19 -66 63 303 -12 144 -386 19 131
7561 131 -7 72 94 -1 -43 233 -102 104 52 -130 -70 38 -189 24 -46 86 212 -140 -163 300 25 177 56
7584 56 -25 -85 34 66 86 17 -241 135 -141 198 70 -93 73 30 -120 -127 1 -38 31 -1 -80 20 28 -89 -71
7609 -71 -108 102 115 -78 81 -82 133 120 140 42 210 -223 -52 159 -198 105 66 26 81 76 73 242 -253 -186 330
7634 330 65 217 -19 -63 -73 -77 -12 248 -118 -125 274 -60 -116 278 -123 35 -8 -34 4 -119 15 329 -183 10
7658 10 -67 151 28 -108 -55 206 51 -48 355 202 -387 -16 385 -140 -22 -2 28 130 -284 167 155 -51
7680 -51 21 13 4 -87 -222 26 159 -36 79 -217 23 125 172 -26 356 114 -197 79 -102 0 283 -138 -154
7703 -154 -36 -220 23 -93 -38 109 89 24 -37 -85 -164 98 -65 161 128 4 9 -12 13 56 27 10 158 -332 108
7728 108 -7 55 174 -66 -207 340 -13 133 206 -76 96 42 -15 -60 69 -78 73 241 -67 -29 216 130
7750 130 -167 -36 -88 36 -170 -166 151 -204 -129 245 -86 208 93 -63 -271 -167 140 94 -46 63 296 -128
7772 -128 98 -87 -64 32 279 138 270 -153 -72 -154 -226 240 -94 -48 52 209 -193 117 15 -41 370 -128
7794 -128 3 67 -68 143 -53 -233 -120 96 -64 -90 -287 -124 61 -296 1 -16 46 84 -275 -131 295 -265
7816 -265 -24 -17 -396 9 127 18 -105 186 -6 137 -40 -99 53 108 59 -53 33 -16 243 -18 -170 -86 5
7839 5 54 107 342 -47 94 40 -96 -111 -291 154 150 44 116 -108 -142 76 -170 238 83 -25 -36 -171 85 270
7863 270 184 -109 125 -93 51 -161 256 254 114 28 -89 -160 -33 40 -76 -8 -112 -10 -169 15 125 -29
7885 -29 -284 3 180 -293 -113 42 121 11 290 101 32 136 -248 152 -68 27 265 40 65 0 -78 28
7907 28 47 91 190 106 -143 85 66 13 85 -105 -160 -93 -91 -16 -100 90 103 -218 -5 -110 -249 -32 151 -160 101
7932 101 30 -48 27 -106 -103 137 -178 -36 163 -26 64 64 -122 63 38 74 55 112 -75 77 167 -22 155 -166
7956 -166 154 -41 -59 44 -163 -142 141 204 103 12 -124 196 46 -114 -131 81 -31 182 70 28 128 -39
7978 -39 -100 214 -108 21 0 -106 -91 85 -62 -29 -33 -137 11 -106 -52 151 -97 -32 -63 -93 304 41 -138 91
8002 91 31 8 159 163 0 415 16 -72 -161 45 -116 -9 36 63 -170 -14 -143 -80 189 172 -261 -34 137 42
8026 42 214 -133 -139 -42 -74 -34 303 42 73 165 -101 -11 87 -119 35 87 -158 70 -34 -55 131 -384 -183 154
8050 154 -26 -94 190 -26 -11 -149 -23 5 119 47 113 73 -170 95 -122 51 -33 -77 49 62 41 81 -65 129
8074 129 262 30 11 -125 -195 -146 -47 89 68 158 137 -13 -116 57 98 -9 31 1 -78 167 72 59 136 144 102 9
8100 9 161 -41 278 38 96 87 -232 38 144 8 11 -15 49 105 64 -147 -68 47 -115 61 24 103 -4 -180 104
8125 104 -22 -143 128 1 -64 11 -125 246 118 -148 92 -34 60 88 35 -227 -13 -181 -42 180 48 153
8147 153 13 -166 101 91 -13 71 47 -167 -76 188 105 -75 32 0 -106 -198 -3 -71 -328 124 -260 137 36
8170 36 -162 -360 -158 -129 81 -53 -84 -10 -234 -345 -61 -232 66 132 -28 161 213 -198 119 -49 -248
8191b48
$$ Imaginary data points
##PAGE= N=2
##DATA TABLE= (X++(I..I)), XYDATA
0 0 0 0 0 0 0 0 0 0 0 6 -8 8 -8 8 -16 16 -24 24 -32 40 -48 56 -72 80 -96 112 -128 148 -170 196 -224 256
32 256 -288 328 -370 417 -466 522 -582 649 -721 801 -887 982 -1087 1200 -1323 1459 -1607
49 -1607 1771 -1951 2149 -2369 2614 -2888 3200 -3554 3962 -4437 4999 -5675 6506 -7555 8932
64 8932 -10813 13544 -17875 25758 -44533 178138 59501 -229113 233180 -104010 -105077 203271
76 203271 -117222 -6526 130536 -168840 95197 35186 -145073 150025 -47151 -86203
86 -86203 181599 -132862 -9471 151620 -179310 75440 96830 -198469 151163 19783
96 19783 -172951 192024 -60880 -128425 194315 -114421 -43710 158771 -146672 29820 81316
107 81316 -148780 102044 3292 -108047 140837 -85255 -47925 149078 -151604 27886
117 27886 127405 -190608 89469 79202 -182683 133808 10298 -139463 148461 -61404
127 -61404 -67288 141857 -114865 8149 102111 -142560 72237 46479 -122127 121642 -26313
138 -26313 -83960 136023 -95984 -20048 134723 -139524 42468 97961 -161017 92280 50280
149 50280 -138555 125123 -9621 -95258 125875 -65473 -29386 106355 -102593 34541
159 34541 60232 -113305 88823 1722 -93753 124312 -58785 -53537 131932 -109251 -2564
170 -2564 113543 -135648 48302 71532 -133896 87733 16521 -104392 107905 -38931 -57324
181 -57324 105468 -80793 -3556 76111 -99739 48923 29267 -92779 89814 -27798 -67377
192 -67377 112368 -76715 -27299 111658 -108810 13873 84999 -116279 54789 42796 -101141
203 -101141 83076 -8454 -69641 93619 -50804 -24093 83210 -78688 21611 50854 -85488
214 -85488 64127 7556 -70114 92893 -40704 -42348 101273 -78701 -3154 90848 -97344
225 -97344 34629 57537 -96788 65930 14893 -74450 84392 -28520 -40728 81435 -61652
236 -61652 1884 61524 -77121 42354 23675 -76105 74844 -17274 -58328 91183 -52197
247 -52197 -29599 84097 -76038 6897 59954 -83401 43067 24138 -77323 66490 -13779
258 -13779 -54162 74983 -44794 -20567 62872 -67141 16421 36787 -71139 52854 1719
269 1719 -62296 75189 -34685 -40589 82066 -60258 -9792 68754 -74962 22614 40670
280 40670 -73735 51538 7714 -57775 65638 -25907 -30013 63438 -49359 6379 46067
291 46067 -63099 39299 17360 -62396 65742 -12090 -46896 76379 -40113 -22485 69994
302 69994 -57973 9144 50294 -65181 37256 20790 -60829 55791 -7232 -41690 60674
313 60674 -32740 -13850 48877 -50727 19617 28244 -56936 47498 393 -52687 63061 -26710
325 -26710 -33068 65745 -49819 -7177 53555 -63865 20704 33668 -63413 42351 7148 -51299
337 -51299 51455 -19979 -27428 49922 -40882 2321 35058 -54179 30272 13738 -52858 51693
349 51693 -9804 -40846 58376 -33196 -18442 54658 -48965 8606 39935 -57579 30571 18863
361 18863 -51487 46541 -3784 -34907 49587 -26091 -10900 42453 -41255 16359 26513 -48030
373 -48030 38179 4268 -43204 52219 -16857 -26534 54473 -37318 -4842 46263 -49860 17576
385 17576 31476 -50961 32057 8383 -40111 40350 -14810 -18418 40703 -36138 3498 31568
397 31568 -47263 24427 16743 -46511 39214 -5098 -37124 45543 -24761 -18323 43597 -39857
409 -39857 1817 32315 -46779 20087 16753 -42715 32813 -2464 -30025 34996 -21505 -8877
421 -8877 31202 -35214 13165 19280 -42738 31450 3776 -38096 44125 -13654 -26792 47598
433 47598 -29874 -10679 42976 -37433 6411 29455 -36620 20615 8547 -26880 32402 -11437
445 -11437 -12690 35524 -28582 2076 30383 -35414 18836 16459 -35565 31417 -1612 -27500
457 -27500 40431 -18254 -14953 40738 -31574 -1183 33791 -36473 11745 21296 -32650 19831
469 19831 2411 -21139 24610 -15750 -4771 24552 -30212 9682 17892 -36535 23046 6885
481 6885 -33635 32121 -8255 -25922 35079 -20859 -12940 31944 -28659 1177 21180 -30674
493 -30674 14307 7311 -25376 23803 -7375 -16635 25305 -19304 -2007 21287 -26805 13257
505 13257 11347 -30601 26027 678 -27158 33292 -9608 -19386 32463 -17996 -7471 26240
517 26240 -21311 5784 14121 -20840 16291 454 -15264 23871 -11650 -7316 24712 -20655
529 -20655 3179 18859 -24709 14855 8711 -24952 24369 -2921 -21746 29495 -11495 -14296
541 -14296 27573 -17603 -5118 18915 -18620 6929 7153 -16515 15063 -6557 -11520 19709 -16688
554 -16688 -2760 19089 -23817 6509 13712 -27028 15510 6975 -24992 19794 -2463 -18643
566 -18643 20839 -10588 -8454 19020 -16441 205 12831 -17617 8060 4774 -13203 13832
578 13832 -5410 -6857 15563 -13475 2153 14300 -19050 10924 9628 -22202 18024 4586
590 4586 -20314 20742 -399 -14610 18207 -5926 -4765 13806 -10266 5366 7151 -12514 12130
603 12130 -188 -10157 16418 -6708 -5047 15910 -13307 1381 13170 -16293 8204 7671 -17226
616 -17226 12882 1050 -14832 15692 -4656 -10189 14805 -9613 -4221 10252 -11232 2729
628 2729 4702 -10724 7509 -3508 -7991 11507 -10223 -3436 12909 -15816 840 11654 -18293
641 -18293 5524 9049 -16309 7722 3219 -12166 9001 -3074 -5684 9035 -8231 144 6747
654 6747 -10792 5850 3199 -9685 10137 -1939 -6982 12182 -7401 -2488 13083 -11214 2220
667 2220 11577 -13208 5903 8357 -12510 8716 4241 -9819 9757 -610 -5073 9089 -4086
680 -4086 220 6390 -6730 4814 1641 -6936 9826 -2755 -6139 12201 -7669 -4109 13296
693 13296 -10245 -866 11472 -12083 1956 7263 -11351 5148 2756 -9252 7141 -2386 -6166
706 -6166 7019 -5820 -1072 5312 -7943 3136 1204 -8515 7629 -2280 -7471 10504 -6558
719 -6558 -5321 10922 -9506 -1159 9842 -10806 2495 7090 -11009 5997 3335 -9057 8208
732 8208 -751 -5676 7709 -4479 -181 6255 -6956 5347 3503 -8801 9673 308 -8266 12623
746 12623 -3328 -6160 12841 -6928 -2581 10648 -8687 2497 7423 -9898 6420 2625 -8688
759 -8688 9371 -1514 -5654 9081 -6407 -1209 7733 -9699 4285 4996 -11573 8324 740
772 740 -10835 10917 -3813 -7803 11819 -8624 -3724 10279 -11213 1039 7505 -12240 4712
785 4712 2753 -10375 7440 -2169 -5439 8328 -8060 -572 7324 -12162 4991 5492 -13420 9331
799 9331 1415 -12057 12237 -3811 -7611 13801 -8471 -2989 12327 -11472 2501 8764 -11407
812 -11407 7747 3248 -9404 10901 -3550 -5037 12731 -8198 549 10923 -11657 6145 6861
825 6861 -12354 11530 1135 -10419 14071 -5162 -6239 15352 -10269 -644 13329 -13654 3749
838 3749 8656 -13258 8542 2037 -10337 11519 -5658 -5638 12278 -11110 171 9962 -14219
851 -14219 6219 4751 -14316 11340 -1684 -11675 14525 -8307 -7036 14367 -12948 -444 11076
864 11076 -15440 6060 5365 -15072 11571 -1510 -11416 14464 -7977 -5838 13753 -12553 1308
877 1308 10476 -14905 8617 4202 -14385 13751 -2328 -10279 16713 -8544 -4614 15592 -13339
890 -13339 2131 11524 -14545 8929 5127 -13439 13713 -2686 -8816 16088 -8991 -2456 14042
903 14042 -14107 5233 9428 -16178 12443 3184 -15219 16349 -4017 -10615 16697 -9933 -3203
916 -3203 13669 -14479 4551 7971 -16016 11601 986 -13830 15069 -6266 -8517 15084 -12164
929 -12164 -321 11483 -16356 7693 4962 -17391 15069 -2002 -15220 18953 -8531 -10335
941 -10335 18265 -12830 -2930 14239 -15116 5206 6800 -14211 11813 -1690 -10014 15366 -9356
954 -9356 -3900 15273 -15394 4326 11938 -17818 11830 5490 -16968 16820 -1831 -11734 18939
967 18939 -9968 -4602 18016 -15500 2986 13852 -17168 9610 6562 -14335 13434 -2217
979 -2217 -8020 14960 -10539 379 12517 -16773 8942 8045 -19153 15795 1607 -17578 18874
992 18874 -5647 -11808 18706 -11885 -3705 14531 -15965 4895 7932 -16668 11553 20 -13120
1005 -13120 14951 -8634 -6320 15221 -15674 2061 11892 -19335 9803 5821 -19125 15562
1017 15562 -1942 -14739 18417 -9582 -7860 17381 -14818 480 12936 -16467 8061 5197
1029 5197 -14531 14003 -3998 -8481 16811 -12497 -686 15912 -18464 7450 11768 -20189
1041 -20189 14090 4800 -17915 18392 -3228 -11899 18953 -10024 -3453 15761 -14455 4918
1053 4918 9630 -15010 11772 378 -11700 16526 -8688 -5615 17534 -16219 2439 15246
1065 15246 -20929 9557 9270 -20812 15499 1174 -16614 18085 -7327 -9648 17418 -13227
1077 -13227 -906 12671 -15611 6918 3948 -14159 14009 -5413 -9554 17532 -14031 -2736
1089 -2736 17248 -19893 5186 12993 -21827 12379 6048 -19807 17171 -1997 -13579 18107
1101 18107 -9232 -5423 15091 -13919 3961 8911 -14781 11907 -16 -12504 17748 -8685
1113 -8685 -6770 19970 -15742 249 17007 -19361 8458 10543 -19428 15163 2183 -15821
1125 -15821 18614 -6157 -8988 18089 -12146 -602 12864 -15272 8429 4412 -14427 15717
1137 15717 -4513 -11013 19684 -13078 -4729 19087 -19232 3009 14620 -21038 9835 7050
1149 7050 -19032 14941 -1663 -13420 16213 -9535 -5136 13950 -14980 4779 7931 -17329
1161 -17329 12997 -397 -15750 18975 -8446 -10650 20302 -14995 -3204 17501 -19071 5302
1173 5302 11203 -19452 12366 3166 -16035 16385 -4812 -8901 16268 -11804 533 12195 -15824
1186 -15824 9910 4897 -16097 17431 -3337 -13170 21233 -11222 -6595 20550 -16677 1642
1198 1642 15893 -19218 9083 9146 -17887 14121 671 -12711 16191 -7757 -4018 14028 -13891
1211 -13891 5517 8289 -17198 13982 1567 -16539 18807 -6408 -11909 20147 -13108 -4151
1223 -4151 17413 -17905 3971 11405 -18917 11011 3448 -16009 15364 -5318 -9742 15663 -12300
1236 -12300 -1183 12482 -16895 8053 6319 -18122 15111 -1649 -14571 19234 -9162 -8393
1248 -8393 19046 -15568 -281 15389 -18341 7320 8734 -17111 13070 236 -12289 15771
1260 15771 -8425 -4105 15335 -15085 4248 11626 -18156 11943 5142 -16812 16819 -2550
1272 -2550 -11788 18725 -10322 -4503 16865 -15842 3511 11816 -17546 10735 4759 -15015 15066
1285 15066 -4312 -9154 16275 -11957 -1091 13561 -16748 6994 8032 -17790 13846 304
1297 304 -15169 17570 -7449 -9457 17734 -13808 -2333 14462 -16777 5485 8081 -16243 11606
1310 11606 -363 -12128 14987 -8521 -5559 15141 -15071 2427 11898 -17926 9448 5330
1322 5330 -16616 14912 -2511 -12218 17751 -9759 -5405 16618 -14627 2108 12346 -16546
1334 -16546 9186 5422 -14137 14187 -2805 -9289 15945 -9746 -1976 13815 -14666 6326
1346 6326 8580 -16172 13167 1536 -14012 17440 -5751 -9337 18149 -11651 -2486 15097 -15378
1359 -15378 4491 9038 -14978 10804 965 -12182 14510 -6678 -6583 14784 -12976 591 11514
1372 11514 -16030 7653 5085 -15537 13451 -2231 -12561 16321 -9143 -6879 15689 -14169
1384 -14169 398 11675 -15613 7131 4796 -14477 12321 -3005 -9838 14288 -9735 -3375
1396 -3375 12989 -14159 4093 8440 -15760 11451 2017 -14416 15576 -4841 -9615 16940 -10262
1409 -10262 -3383 14434 -13401 3706 9182 -13733 9665 1910 -10816 13822 -5596 -5491 14286
1422 14286 -11584 1231 11525 -14599 8281 6283 -15231 13391 24 -12465 15928 -6522
1434 -6522 -7089 15384 -11364 -251 11282 -13719 6354 5411 -13214 11104 -1349 -9193 13139
1447 13139 -8372 -3058 11987 -13400 4535 7980 -16102 10645 2685 -15312 14690 -3224
1459 -3224 -11437 15347 -8502 -5158 12949 -11818 1813 8082 -12648 8078 1505 -10564 12058
1472 12058 -5248 -5701 13068 -10866 444 11151 -14528 6535 6754 -15057 12186 1045 -12485
1485 -12485 14954 -5078 -7389 14611 -9798 -895 11534 -12002 5289 5955 -11311 9968 -508
1498 -508 -7595 12320 -7621 -2137 12112 -12858 4078 9588 -15531 9359 4734 -15065 12980
1511 12980 -767 -11039 13626 -6494 -4958 11398 -10485 1610 7333 -11729 7330 1291
1523 1291 -10691 11450 -5318 -6612 12777 -10592 -1055 11294 -14232 4436 7407 -14985 9583
1536 9583 2139 -12882 12420 -3614 -8285 12472 -8168 -2267 10015 -10828 3825 4914 -10397
1549 -10397 8841 -1435 -8132 12081 -7370 -3226 13199 -11983 1881 10846 -14190 7045
1561 7045 6853 -13549 10518 1345 -9751 11656 -4019 -4620 11004 -8248 1576 7444 -10229
1574 -10229 6740 2394 -9094 11328 -3639 -6353 13336 -9062 -2050 12364 -12415 2907
1586 2907 8955 -13241 7174 3820 -11810 10088 -1533 -8011 10715 -6286 -2807 8708 -9404
1599 -9404 2985 4472 -9893 7936 -970 -8501 11430 -6421 -5277 12113 -10864 -645 10786
1612 10786 -12940 3835 6843 -12509 7635 1821 -9659 9552 -3283 -5075 9462 -7308
1624 -7308 349 6565 -9558 6034 2555 -9698 10184 -2135 -7574 11860 -6578 -3904 11788
1637 11788 -9637 974 9118 -10945 5301 5037 -10142 8429 -8 -7223 9653 -4465 -2689
1650 -2689 8517 -7475 2659 5034 -9119 7202 782 -8849 10897 -3953 -6211 11769 -7403
1663 -7403 -2464 10328 -9845 1519 7136 -10491 5036 2626 -8443 7361 -1885 -5049 7919
1676 7919 -6362 -397 6211 -8845 4004 3238 -9613 7650 -894 -8288 9865 -4545 -5071 9994
1690 9994 -7730 -1127 8190 -9623 2799 4970 -9004 6042 1147 -6768 7750 -3010 -2916 7278
1704 7278 -6462 1773 5278 -8367 6154 2155 -8127 9140 -1580 -6197 10106 -4850 -3086
1717 -3086 9353 -7417 620 7346 -8348 4349 3568 -7328 6580 -327 -4549 7172 -4349
1730 -4349 -936 6493 -7079 3022 4014 -8458 6222 1160 -7827 8236 -2518 -5087 8360
1743 8360 -5668 -1939 7324 -7452 1635 4816 -7845 4123 1249 -6342 5933 -2721 -3542 6441
1757 6441 -6055 -157 5213 -7372 3421 3071 -7770 6007 -550 -6612 7704 -3417 -4035 7666
1771 7666 -5831 -872 6130 -6678 2282 3329 -5893 4679 -186 -4288 6064 -3385 -1218 6125
1785 6125 -6256 1738 4905 -7183 4435 2443 -7040 6249 -562 -4909 7345 -3312 -2287
1798 -2287 6762 -5102 786 5029 -5736 3739 1932 -5126 5235 -1148 -3087 5828 -4137 -702
1812 -702 5034 -5772 2452 3213 -6876 5043 592 -6300 6525 -1897 -4607 6722 -3844 -2334
1826 -2334 5366 -5193 348 2942 -5270 3257 -12 -4335 4867 -3167 -2592 5556 -5025 -175 4557
1841 4557 -6118 2456 2724 -6018 4418 395 -4764 6075 -2302 -2920 6304 -4261 -655 4984
1855 4984 -5167 1777 2858 -4677 3941 41 -3514 5216 -2157 -1123 4791 -4459 1205 3915 -5501
1870 -5501 3553 2175 -5508 5350 74 -4583 5586 -1845 -2097 5148 -3807 284 3472 -4704 2859
1885 2859 1129 -4186 4285 -1325 -3466 4872 -3056 -1160 4517 -4693 1132 3145 -5599 3077 926
1900 926 -5115 4318 -1331 -3796 4858 -3173 -1931 4002 -4378 695 2785 -4826 2534 578 -4320
1915 -4320 3946 -1312 -2516 4329 -3749 -340 4098 -4637 1886 2639 -5359 3565 1204 -4509 4454
1930 4454 -830 -2706 4652 -2488 -678 3978 -3587 1749 2668 -4072 3284 508 -3220 4439 -1889
1945 -1889 -1642 4443 -3288 247 3956 -4441 2150 2414 -4810 3969 373 -3766 4481 -1392 -2356 4831
1961 4831 -3331 -574 3677 -4144 1224 2237 -3794 2927 -103 -2969 3520 -2358 -1290 3679 -4159
1976 -4159 469 3050 -5152 2196 1533 -4768 3623 -56 -3933 3857 -1843 -2136 3800 -3471 -110
1991 -110 2808 -4032 1676 1308 -3662 2966 -485 -2628 3786 -2188 -925 3709 -3679 1220 2912
2006 2912 -4410 2828 1156 -4016 4097 -63 -3044 4818 -1910 -1800 3990 -2818 217 3072 -3184
2021 -3184 2330 906 -2943 3615 -1490 -1882 4511 -3150 -693 4256 -4137 917 2946 -4123 2388
2036 2388 1079 -3829 3921 -673 -2652 4178 -2421 -1036 3235 -3669 595 1976 -3921 2162 -3
2051 -3 -3080 3381 -1595 -2027 3967 -3795 -265 3334 -4517 1617 2424 -4895 2929 772 -4415 3817
2067 3817 -579 -2707 3487 -1958 -436 2777 -3029 1328 1448 -3128 3228 -563 -2535 4474 -2282
2082 -2282 -1326 4477 -3725 391 4061 -4387 2401 2430 -4342 3399 1006 -3274 4079 -928 -1642 3797
2098 3797 -2259 -19 2571 -3128 2121 773 -3296 3483 -852 -2315 4574 -2862 -1121 4123 -4483
2113 -4483 726 3279 -4873 2436 1705 -4878 3105 31 -3592 3607 -1862 -1478 2811 -2923 757
2128 757 1658 -3764 2327 -190 -3577 3948 -1838 -2559 4334 -3496 -824 4167 -4624 572 2972 -4804
2144 -4804 2426 1374 -4099 3546 -861 -2385 3824 -2571 -468 2943 -3222 1844 1687 -3679 3631
2159 3631 -151 -3322 4566 -1743 -1894 4748 -3673 12 4337 -4440 1450 2813 -4397 2811 1053
2174 1053 -3161 3312 -1213 -1238 3487 -3015 759 2765 -4077 2755 1187 -4070 4358 -663 -3293
2189 -3293 4850 -2751 -1918 4702 -3983 -288 3453 -4445 1602 1681 -4309 2922 -399 -2937 3650 -2445
2205 -2445 -1100 3365 -3807 960 1991 -4248 3363 104 -3934 4895 -1534 -2883 5285 -3189 -1226
2220 -1226 4808 -4380 419 3645 -4344 2534 1432 -3480 3501 -843 -1914 4109 -2942 244 3554
2235 3554 -4283 2346 2337 -4396 4020 459 -3833 5066 -1585 -2298 5513 -3473 -487 4514 -4326 1495
2251 1495 2229 -4586 3436 223 -3288 4271 -1927 -1581 4092 -3595 342 3179 -4885 2602 1394
2266 1394 -4887 4145 -889 -3821 5140 -2874 -2007 4605 -4151 176 3344 -5100 1891 1238 -4438
2281 -4438 3519 -1162 -2534 4167 -3124 -917 4126 -4943 1380 2637 -5378 3383 749 -4791 4827
2296 4827 -901 -3247 4982 -2873 -1131 4397 -3997 1244 2642 -4663 3513 529 -3718 4883 -1589
2311 -1589 -2279 5161 -3395 161 3896 -4554 2450 2462 -4557 4340 -3 -4164 5376 -2169 -2211 5284
2327 5284 -3734 -176 4105 -4691 1976 2118 -4326 3843 -288 -3381 4710 -2746 -1351 4682 -4558
2342 -4558 740 3468 -5617 2665 1631 -5502 4622 -902 -3950 4819 -3129 -1808 4525 -4692 780
2357 780 3323 -5241 2933 1248 -4855 4397 -1104 -3109 4698 -3405 -944 3964 -4506 1601 2510
2372 2510 -5220 4133 452 -4626 5315 -1655 -3086 6001 -3463 -795 4960 -4622 1697 2975 -4775
2387 -4775 3710 470 -3809 5009 -1968 -1991 4936 -3794 227 4265 -5093 2434 2243 -5073 4458 -200
2403 -200 -3767 5502 -2647 -1959 5269 -4435 129 4204 -5600 2407 2031 -5113 3994 -651 -3517 4481
2419 4481 -3089 -1210 4037 -4814 1317 3133 -5858 3668 867 -5213 5019 -1134 -3814 5657 -3308
2434 -3308 -1961 4924 -4605 707 3201 -4940 3024 974 -3917 4594 -1489 -2370 4967 -3796 -140
2449 -140 4787 -4948 2133 2655 -5340 4120 333 -4350 5753 -1807 -2787 5636 -3751 -319 4936
2464 4936 -4735 1902 2732 -4442 3695 -61 -3220 4892 -2362 -1132 4730 -4450 1193 3971 -5554
2479 -5554 3126 1909 -5583 4889 -553 -4432 5529 -2396 -2419 4926 -3978 6 3287 -4588 2120
2494 2120 918 -4200 4018 -1552 -2862 5029 -3916 -709 4434 -5252 1569 2920 -5844 3658 802
2509 802 -5267 4910 -1381 -3562 5459 -3209 -1542 4260 -4310 1215 2410 -4433 3284 -136 -3523
2524 -3523 4846 -2572 -1611 5103 -4439 794 4290 -5547 2933 2950 -5874 4429 727 -4564 5248
2539 5248 -1511 -2216 4612 -3235 78 3482 -4046 2635 1226 -3810 4416 -1207 -2929 5193 -3425
2554 -3425 -1036 5003 -5009 1118 3883 -5854 3061 1749 -5279 4564 -453 -3715 4434 -2369 -1634
2569 -1634 3879 -3815 978 1960 -4296 3209 -199 -3584 4463 -2901 -2408 5395 -4687 -389 4631
2584 4631 -5779 1928 2791 -5544 3424 1203 -4574 4077 -1097 -2326 4105 -2942 105 2857 -4054
2599 -4054 2713 1381 -4289 4474 -830 -3459 5404 -3007 -1472 5470 -4812 587 4390 -5153 2716
2614 2716 2564 -4849 3897 194 -3400 4293 -1879 -1194 3698 -3499 1491 2266 -4422 3310 310 -3906
2630 -3906 4959 -2228 -2770 5461 -4241 -1170 4937 -5167 917 3452 -5190 2577 1147 -4208 3578
2645 3578 -1045 -2594 3619 -3077 148 2943 -4325 2303 1524 -4927 4166 -606 -4196 5087 -2675
2660 -2675 -2474 5250 -4244 -439 4256 -4802 1671 2386 -4357 3182 128 -3077 3797 -1790 -976 3850
2676 3850 -3570 1050 2903 -4368 3384 1032 -4249 4962 -1061 -3056 5514 -3024 -1524 4878 -4252
2691 -4252 381 3470 -4294 2367 1607 -3507 3385 -829 -1814 4293 -2948 -52 3290 -4533 2210
2706 2210 1851 -4990 3681 -46 -4237 4786 -1680 -2733 4778 -3348 -820 4102 -4051 1229 2499
2721 2499 -4184 2688 81 -3231 3812 -2152 -1753 4024 -3773 592 2768 -4763 2573 974 -4617
2736 -4617 4161 -826 -3858 4809 -2395 -2109 4603 -3399 -24 3650 -3942 1926 1308 -3530 3436
2751 3436 -699 -2145 4112 -2574 -403 3781 -4097 1543 2614 -4565 3322 1173 -3946 4332 -954
2766 -954 -2472 4457 -2516 -767 3981 -3363 923 2567 -3771 2682 469 -3258 3835 -1656 -1992
2781 -1992 3651 -3147 114 3073 -4156 2002 1680 -4565 3458 -304 -3586 4168 -2017 -2422 3995
2796 3995 -2945 -644 3046 -3754 1679 1178 -3600 3002 -880 -2442 3941 -2797 -1188 3772 -3657
2811 -3657 850 2591 -4467 2209 1038 -4214 3716 -563 -2884 3870 -2062 -1082 3569 -3077 732
2826 732 2674 -3577 2471 747 -3298 3593 -1015 -1736 3865 -2590 43 3238 -3687 1748 1985 -4101
2842 -4101 3205 371 -3320 4044 -949 -2118 3892 -2379 -642 3138 -3309 1224 1776 -3314 2617
2857 2617 -308 -2728 3381 -1851 -1423 3462 -3343 430 2671 -3883 1744 1063 -3867 2756 -497
2872 -497 -2967 3525 -1973 -1428 3287 -2856 483 2440 -3665 1721 943 -3237 2922 -631 -1804 3260
2888 3260 -2344 -395 3228 -3506 1209 2183 -3809 2824 1002 -3667 3368 -435 -2234 3690 -1998
2903 -1998 -729 2924 -3002 907 1889 -2989 2276 100 -2505 3451 -1391 -1371 3557 -2727 305 2948
2919 2948 -3340 1567 1930 -3364 2685 138 -2782 3318 -1256 -1436 3336 -2275 10 2709 -3102
2934 -3102 1354 1041 -2918 2392 -625 -2088 2866 -2131 -648 2724 -3258 588 2249 -4000 1822
2949 1822 1293 -3408 2530 -200 -2614 2980 -1601 -1129 2582 -2418 417 1554 -2943 1847 409
2964 409 -2789 3030 -1082 -1589 3322 -2251 -271 3036 -2918 981 1851 -3081 2013 721 -3008 2966
2980 2966 -572 -1702 3310 -1816 -408 2516 -2445 922 1546 -2527 2064 -53 -1811 2936 -1372
2995 -1372 -1028 3125 -2653 91 2643 -3265 1444 1653 -3252 2261 56 -2717 2593 -957 -1678 2545
3011 2545 -2034 -12 1866 -2882 1307 644 -2291 2582 -930 -1982 2865 -2095 -853 2614 -2938
3026 -2938 381 2039 -3229 1504 786 -2922 2394 -411 -2227 2623 -1324 -753 2379 -2075 610
3041 610 1372 -2352 1772 144 -2096 2693 -1083 -1430 3001 -2224 -350 2774 -2754 860 1997 -2976
3057 -2976 1792 601 -2163 2286 -307 -1206 2429 -1326 11 1881 -2272 1524 1089 -2341 2498
3072 2498 -17 -1982 2925 -1321 -1242 3071 -2222 4 2012 -2872 1022 1485 -2835 1825 278 -2121
3088 -2121 2293 -1099 -1044 2067 -1825 78 1198 -2592 1333 114 -2314 2439 -801 -1800 2531 -1806
3104 -1806 -1055 2684 -2455 -250 1984 -2627 1278 903 -2204 1669 -277 -1506 1807 -1328 -266
3119 -266 2173 -2097 660 1269 -2310 1890 324 -2272 2596 -747 -1442 2656 -1606 -221 2556 -2113
3135 -2113 564 1583 -2183 1729 719 -1826 1925 -313 -1059 2148 -1357 157 1653 -1956 859
3150 859 849 -2375 2131 -127 -1947 2576 -1295 -1213 2649 -1901 -603 2340 -2293 408 1354 -2109
3166 -2109 1299 106 -1692 1905 -1343 -708 1873 -1877 348 1321 -2531 1594 609 -2207 2160 -489
3182 -489 -1942 2116 -1203 -1058 2404 -2077 -32 1894 -2123 740 699 -2100 1691 -41 -1316 1676
3198 1676 -1255 -180 1870 -1843 1056 1233 -2270 1807 531 -2214 2517 -520 -1540 2720 -1230
3213 -1230 -833 2259 -1554 377 1527 -1697 1150 544 -1636 2036 -570 -779 2044 -1626 35 1738
3229 1738 -2178 997 1090 -2210 1616 107 -2025 2082 -904 -1275 2198 -1544 -894 1850 -1986 570
3245 570 1222 -2113 1169 221 -1345 1642 -990 -674 1624 -1932 88 1120 -2376 988 779 -2382
3261 -2382 1945 -64 -1805 2142 -677 -1205 2165 -1309 -202 1433 -1830 962 598 -1667 1582
3276 1582 -169 -1247 2043 -1197 -297 1922 -1765 587 1471 -2034 1180 826 -1879 1795 -153 -1153
3292 -1153 2021 -881 -638 1779 -1497 75 1103 -1776 1156 260 -1382 1532 -512 -774 1655 -1281
3308 -1281 -91 1534 -1942 579 1229 -2343 1467 419 -2018 1581 -514 -1307 1737 -1125 -509 1705
3324 1705 -1652 400 685 -1876 1324 25 -1691 1787 -878 -1141 1989 -1768 144 1522 -1734
3339 -1734 871 989 -1893 1469 338 -1424 1993 -472 -688 1870 -960 4 1566 -1646 1092 722
3355 722 -1625 1501 -203 -1177 1983 -1033 -304 2038 -1412 276 1499 -1985 1030 838 -1749 1614
3371 1614 -49 -1316 1691 -833 -399 1617 -1615 388 1164 -1828 1140 345 -1885 1728 -465 -1164
3387 -1164 1585 -1151 -699 1543 -1988 382 1024 -1705 1250 230 -1706 1564 -711 -1210 1659 -1464
3403 -1464 -488 1528 -2001 385 1087 -1813 1294 -4 -1565 1759 -680 -1053 2009 -1574 -128 1740
3419 1740 -1667 699 1240 -1778 1365 361 -1328 1923 -760 -755 2052 -1387 215 1505 -1875 999
3435 999 936 -1790 1453 5 -1018 2192 -885 -531 1883 -1337 273 1140 -1859 1070 602 -1700
3451 -1700 1843 -318 -1484 1975 -754 -843 1754 -1472 114 1235 -1800 838 499 -1743 1483 -556
3467 -556 -1225 1789 -1587 -601 1482 -1822 261 1030 -2024 1183 656 -1736 1493 -211 -1332 1836
3483 1836 -1415 -373 1658 -1678 583 1129 -1719 1177 409 -1217 1594 -668 -537 1795 -1555 71
3499 71 1610 -2009 1107 907 -2118 1654 385 -1681 2068 -451 -1161 1852 -947 -18 1504 -1552
3515 -1552 714 661 -1681 1678 -364 -1187 1971 -992 -675 1879 -1629 177 1406 -2036 960 857
3531 857 -2171 1383 -198 -1536 1635 -985 -839 1477 -1483 -323 1182 -1687 587 240 -1424 1377
3547 1377 -454 -1148 1788 -1478 -77 1728 -2010 488 1361 -2050 1218 905 -2051 1482 -189 -1482
3563 -1482 1709 -638 -214 1572 -1490 585 666 -1435 1607 13 -1459 1836 -991 -788 2188 -1372
3579 -1372 90 1870 -1974 774 1390 -1850 1366 462 -1651 1562 -273 -759 1795 -1119 311 1382
3595 1382 -1554 832 578 -1359 1646 -398 -1076 1938 -1159 -380 1955 -1872 176 1582 -2005 808
3611 808 1037 -1912 1089 121 -1475 1682 -1068 -506 1227 -1516 360 696 -2098 1126 149 -1915
3627 -1915 1766 -652 -1374 2074 -1708 -424 1853 -2043 487 1480 -1983 755 566 -1655 1414 -484
3643 -484 -867 1548 -1031 -4 1439 -1464 1164 778 -1735 1647 31 -1171 2050 -978 -746 2618
3659 2618 -1198 -258 2113 -1623 587 1375 -1668 1126 223 -1215 1507 -715 -694 1747 -1470 404
3675 404 1089 -1656 1422 338 -1894 1873 -222 -1593 1950 -1034 -783 2019 -1489 -60 1093 -1866
3691 -1866 679 335 -1444 1353 -402 -1074 1452 -1218 -383 1197 -1638 575 744 -1882 1181 90
3707 90 -1713 1954 -583 -1412 2077 -1298 -470 1806 -1605 567 1189 -1832 1036 375 -1247 1478
3723 1478 -800 -453 1787 -1317 509 1352 -1970 1028 776 -1808 2075 -70 -1401 1966 -490 -760
3739 -760 2204 -992 66 1343 -1607 589 896 -1487 1393 -249 -874 1553 -1087 -391 1455 -1684
3755 -1684 415 1103 -2153 1016 262 -1992 1607 -327 -1319 1933 -1104 -713 1964 -1294 -52 900
3771 900 -1685 775 213 -1434 1492 -478 -968 1466 -1547 -121 1478 -1755 907 894 -2156 1382
3787 1382 431 -1724 1671 -581 -955 1746 -1154 -425 1553 -1657 813 949 -1299 1367 98 -1337
3803 -1337 1596 -431 -424 1890 -1388 213 1337 -1547 1138 713 -1801 1682 -112 -1466 1894 -653
3819 -653 -693 1795 -1277 16 1054 -1340 898 444 -1359 1592 -544 -1105 1635 -1261 -632 1748
3835 1748 -1800 370 1315 -1912 1074 270 -1804 1617 -449 -1034 1673 -1262 -171 1359 -1634 593
3851 593 694 -1877 1096 104 -1122 1581 -541 -583 1550 -1283 93 1386 -1794 926 849 -1957 1806
3868 1806 197 -1589 1900 -639 -710 1829 -1279 118 1318 -1464 788 822 -1560 1477 -119 -1068
3884 -1068 1818 -930 -347 1802 -1353 303 1099 -1770 809 800 -1674 1635 -313 -900 1670 -913
3900 -913 -584 1535 -1554 -35 1394 -1720 922 394 -1565 1312 -643 -1029 1323 -1366 -197 1314
3916 1314 -1718 541 728 -1890 1069 337 -1731 1484 -288 -1038 1830 -1152 -331 1335 -1435 612
3932 612 687 -1221 1250 -36 -1480 1563 -916 -629 1567 -1565 -21 1391 -1638 759 731 -1778
3948 -1778 1488 1 -1235 1677 -586 -666 1558 -1026 24 1171 -1331 946 496 -1039 1446 -180
3964 -180 -1155 1578 -949 -254 1669 -1904 416 1305 -1748 1069 527 -1595 1493 -289 -1091 1434
3980 1434 -929 -302 1292 -1136 347 891 -1631 1187 28 -1416 1380 -767 -856 1579 -1515 -79
3996 -79 1395 -1829 492 716 -1780 1163 291 -1445 1519 -722 -900 1256 -1259 -167 1175 -1386
4012 -1386 637 363 -1111 1284 -307 -821 1680 -1007 -452 1680 -1446 217 1128 -1625 749 817
4028 817 -1502 1230 -100 -1017 1441 -456 -354 1162 -1003 655 842 -1391 1281 309 -1307 1376
4044 1376 -409 -924 1825 -1089 -474 1382 -1526 467 1065 -1348 786 435 -1603 1471 -193 -761
4060 -761 955 -1056 -222 1110 -1282 562 460 -1435 1250 -203 -1213 1407 -845 -884 1633 -1051
4076 -1051 -28 1325 -1353 376 791 -1531 676 292 -1138 1351 -526 -386 1220 -1174 294 843
4092 843 -1341 951 307 -1159 1361 -395 -985 1519 -611 -316 1494 -1008 208 909 -1535 458
4108 458 568 -1157 1077 -20 -799 1143 -652 -280 1229 -751 534 991 -1428 1188 240 -1315
4124 -1315 1487 -509 -1027 1443 -920 -400 1562 -1126 -9 975 -1024 758 359 -1182 985 -398
4140 -398 -545 914 -1244 146 645 -1683 480 438 -1413 1249 -52 -970 1363 -642 -477 1464 -1003
4157 -1003 -216 964 -1192 788 606 -1134 928 -24 -801 1284 -731 -385 1088 -893 449 1076
4173 1076 -1222 967 530 -1039 1236 -311 -1117 1345 -730 -662 1407 -1060 461 1103 -874 789
4189 789 244 -946 1061 -292 -498 1336 -643 33 1212 -1523 469 869 -1361 1226 217 -1354
4205 -1354 1335 -518 -921 1354 -680 -264 892 -1190 270 720 -953 631 61 -706 948 -479
4221 -479 -302 1019 -1147 227 979 -1390 757 359 -1292 1015 -199 -960 1252 -324 -622 1090
4237 1090 -755 -100 894 -981 514 137 -907 1085 -473 -822 1308 -740 -55 1070 -1288 262
4253 262 851 -1119 800 451 -1161 1192 64 -636 975 -573 -338 1255 -834 392 596 -890
4269 -890 740 262 -868 1010 -644 -394 1212 -788 139 921 -1263 411 688 -1797 866 -213
4285 -213 -1042 1011 -574 -715 996 -873 -339 1003 -870 132 176 -945 963 132 -778 975 -706
4302 -706 -406 1126 -959 113 1169 -1094 575 505 -1076 952 -38 -751 1042 -414 -350 1089 -721
4319 -721 169 916 -828 633 338 -768 930 -285 -784 1244 -826 26 1094 -933 268 911 -1159
4336 -1159 584 546 -1152 888 257 -721 1095 -484 -137 729 -858 394 468 -885 756 -23 -893
4353 -893 1387 -482 -553 951 -663 -86 1045 -1158 435 353 -950 673 -61 -838 919 -399 -597
4370 -597 890 -783 -46 839 -996 315 603 -901 615 -146 -837 931 -724 -255 913 -794 212
4387 212 983 -1055 604 661 -1187 794 335 -806 773 -416 -322 796 -710 256 576 -908 658
4404 658 465 -890 911 -137 -810 1146 -464 -321 1047 -744 49 589 -942 606 259 -782 763
4421 763 -175 -761 879 -767 -260 718 -1017 166 565 -819 562 61 -1037 911 -326 -552 859
4438 859 -910 -26 595 -1118 243 618 -890 641 79 -914 714 -320 -403 738 -669 -15 725
4455 725 -946 365 236 -940 853 209 -802 973 -312 -581 1022 -551 -256 602 -1078 513
4471 513 521 -904 762 -18 -332 955 -343 -308 930 -577 183 590 -966 591 268 -786 900 -234
4489 -234 -510 1087 -611 -466 768 -811 285 473 -1300 464 164 -832 581 28 -640 969 -528
4506 -528 -173 950 -748 62 489 -824 356 -76 -694 662 -133 -486 727 -848 -151 716 -906
4523 -906 259 342 -812 540 423 -868 544 -271 -427 1017 -883 -129 750 -677 403 344 -704
4540 -704 705 51 -645 950 -390 -354 1037 -573 -55 780 -1129 333 415 -512 760 37 -513 924
4558 924 -230 -62 983 -706 141 520 -752 517 358 -687 795 -122 -351 802 -589 -225 655
4575 655 -709 109 675 -940 489 149 -901 717 -53 -433 577 -461 -301 707 -820 212 302
4592 302 -823 675 -91 -696 1046 -314 -550 888 -673 -145 819 -782 235 427 -389 591 -141
4609 -141 -298 629 -149 -314 726 -669 263 689 -716 439 437 -646 955 89 -780 954 -324 -247
4627 -247 993 -659 62 722 -872 234 341 -944 587 -205 -631 794 -168 -260 563 -458 -191 457
4645 457 -821 600 316 -607 1027 -236 -534 981 -557 -271 882 -558 -59 714 -804 240 146
4662 146 -659 638 -208 -506 652 -479 81 673 -955 147 532 -1030 492 327 -738 919 -142
4679 -142 -543 839 -665 -269 583 -502 112 508 -744 534 79 -559 837 -117 -344 729 -638
4696 -638 31 621 -893 656 400 -944 678 79 -519 1126 -204 -399 920 -554 -143 714 -569
4713 -569 159 218 -648 631 -265 -440 557 -258 -62 836 -646 -68 620 -763 737 295 -834 729
4731 729 -176 -325 730 -351 -220 647 -457 -221 451 -617 631 -51 -488 596 -386 -135 722 -717
4749 -717 -142 534 -803 237 541 -980 421 138 -799 640 -69 -614 730 -541 5 454 -608
4766 -608 201 453 -741 458 116 -679 777 -291 -282 729 -635 10 423 -614 421 299 -671 557
4784 557 183 -496 767 -334 -386 894 -409 91 582 -855 356 193 -757 522 1 -392 822 -700
4802 -700 -216 791 -805 294 672 -801 123 268 -761 645 -81 -616 818 -311 -148 645 -788
4819 -788 353 388 -838 615 -125 -549 788 -150 -655 762 -415 -75 848 -575 314 579 -757 462
4837 462 19 -689 737 -325 -627 763 -483 -184 573 -590 264 106 -498 1020 11 -505 728
4854 728 -276 -461 762 -588 348 571 -579 316 507 -716 381 79 -414 448 -516 201 682 -732
4872 -732 -1 495 -773 463 194 -726 754 -246 -546 652 -375 -187 627 -430 130 340 -912
4889 -912 154 311 -773 647 -175 -585 548 -377 -137 533 -450 60 419 -866 630 305 -527 699
4907 699 -4 -465 885 -156 -152 376 -420 15 565 -656 579 167 -631 709 59 -200 849 -541
4925 -541 -12 592 -510 281 285 -493 698 76 -507 768 -274 -411 593 -484 101 551 -733 622
4943 622 450 -607 423 158 -418 846 -390 -167 829 -618 -61 573 -717 350 273 -473 742 -55
4961 -55 -359 536 -402 -235 534 -600 99 273 -380 394 217 -637 480 -85 -435 841 -305 -369 544
4980 544 -633 143 478 -855 620 206 -397 354 -404 -364 576 -905 37 633 -862 218 419 -641
4998 -641 504 104 -741 770 -69 -307 672 -387 90 477 -586 214 106 -515 719 -43 -252 621
5016 621 -316 -93 441 -682 -65 552 -596 554 356 -727 372 130 -721 553 -319 -514 579 -562
5034 -562 88 551 -696 459 -151 -309 514 -325 -395 747 -591 -189 591 -797 137 427 -614 686
5052 686 314 -798 431 -183 -260 571 -308 199 651 -661 222 387 -679 530 -139 -427 716 -417
5070 -417 -164 723 -679 -26 684 -736 272 352 -585 445 161 -228 590 -20 -314 713 -567 55
5088 55 508 -808 166 246 -698 652 -8 -659 732 -153 -397 678 -539 -115 371 -725 261 98 -383
5107 -383 577 -5 -215 308 -250 -57 397 -585 50 235 -613 498 216 -718 819 -476 -405 601 -485
5126 -485 -145 734 -526 -107 333 -516 249 282 -230 469 47 -435 460 -384 -68 432 -579 207 366 -668
5146 -668 788 12 -614 632 -106 -320 1065 -372 123 586 -333 323 510 -792 207 73 -584 566
5164 566 -585 -193 476 -614 102 429 -828 227 218 -636 704 -95 -445 915 -517 -185 622 -450
5182 -450 -33 321 -690 162 185 -528 363 -134 -433 663 -260 -25 446 -666 -106 184 -744 674 122
5201 122 -570 626 -317 -302 727 -293 -165 712 -426 91 346 -256 190 -71 -296 816 -197 -220 662
5220 662 -367 102 442 -496 238 363 -481 605 39 -740 657 -235 -299 500 -692 -65 267 -588 159
5239 159 79 -201 520 -173 -265 825 -444 -294 493 -476 154 480 -969 614 207 -713 421 -50 -257
5258 -257 406 -151 -371 398 -605 69 398 -404 441 11 -442 499 -301 -146 566 -395 -30 480 -357 161
5278 161 80 -372 313 48 -364 654 -182 -392 483 -368 -150 315 -502 167 135 -464 553 30 -452 361
5298 361 -53 -478 577 -577 -54 414 -807 420 305 -588 435 84 -477 503 -72 -366 593 -644
5316 -644 -136 351 -600 147 184 -606 478 -213 -153 613 -546 -135 518 -672 -184 387 -356 374 134 -712
5336 -712 600 -228 -258 358 -616 10 400 -647 26 310 -500 400 333 -271 536 -227 -354 643 -169 -58
5356 -58 400 -472 140 265 -720 403 81 -272 585 -96 -434 608 -343 -53 241 -323 530 281 -264 444
5376 444 -110 -380 805 -43 -278 607 -246 -79 410 -371 431 398 -552 350 16 -403 682 -390 -21
5395 -21 601 -381 92 262 -507 328 23 -452 489 -381 -420 429 -296 106 584 -467 -33 514 -540 98
5415 98 256 -246 454 42 -425 401 -306 -311 362 -327 209 213 -450 469 140 -701 474 -281 7 620 -584
5436 -584 53 371 -278 109 440 -402 495 95 -244 383 -172 -443 265 -93 -34 328 -501 263 263 -291 424
5457 424 -43 -453 537 -295 -93 439 -502 106 370 -742 -29 391 -591 125 -164 -298 396 -268 -175 553
5477 553 -480 79 240 -502 303 123 -166 424 -231 -312 470 -578 25 271 -467 92 346 -586 232 393
5497 393 -373 406 7 -192 681 -267 -139 591 -423 262 379 -343 337 70 -402 345 -339 -436 745 -68
5517 -68 -41 446 -409 161 232 -424 152 102 -78 728 44 -328 553 -432 -94 471 -546 276 192 -510 385
5538 385 -79 -354 713 -318 -204 432 -322 206 373 -447 258 186 -583 297 -129 -392 139 -298 -399 560
5558 560 -607 31 182 -706 138 266 -352 368 -237 -467 363 -313 -187 430 -423 202 384 -419 324 158
5578 158 -186 347 -30 -284 266 -134 4 244 -237 275 310 -552 396 201 -342 448 -44 -200 493 -274
5598 -274 -11 500 -334 242 189 -563 92 274 -194 520 -382 -321 296 -373 -59 286 -466 125 69 -350 512
5619 512 60 -471 572 -229 -366 393 -203 2 76 -456 -218 149 -414 205 -296 -392 375 -218 -242 293 -208
5640 -208 293 254 -452 75 37 -589 162 -223 -387 321 -154 -327 346 -551 -68 287 -380 302 72 -362 286
5661 286 -307 -195 284 -218 -74 469 -409 227 130 -395 442 139 -338 579 -134 -314 133 -327 41 248
5681 248 -286 215 269 -15 480 -44 -217 185 -190 -126 137 -410 86 464 -406 -49 442 -561 305 101
5701 101 -221 444 -378 -131 721 -301 -201 188 -450 166 292 -337 155 -1 -342 417 -311 -122 134 -438
5721 -438 57 166 -352 228 81 -231 387 42 -516 141 -160 92 463 -343 269 156 -299 257 -60 -448
5741 -448 441 137 -391 428 -282 -207 580 -264 323 335 -526 352 183 -393 320 -73 -325 95 -303 -159 246
5762 246 -174 17 126 -352 412 -57 -469 343 -283 -55 282 -237 19 455 -513 122 301 -291 454 -91
5782 -91 -333 302 -77 -83 347 -260 -72 112 -317 438 98 -283 327 173 -200 510 -219 -259 313 -328 191
5803 191 371 -346 204 -151 -341 385 -204 -151 143 -184 109 198 -346 308 444 -478 407 -78 -496 533
5823 533 -12 -259 746 -218 -152 476 -427 100 272 -400 27 94 -426 427 -50 -250 268 -405 32 317
5843 317 -564 46 117 -451 572 -66 -204 165 -253 -319 359 -198 156 669 -230 256 262 -107 121 -136 -372
5864 -372 167 -329 -30 212 -395 -71 352 -556 246 220 -632 350 -28 -228 170 -218 -142 462 -209 178 186
5885 186 -358 81 334 -360 130 -110 -289 459 -402 -145 300 -341 130 210 -431 84 -25 2 390 -42 -100
5906 -100 97 -159 -173 79 -163 28 199 -285 163 23 -221 259 29 -109 344 -391 90 167 -276 5 170
5927 170 -320 155 -50 -258 231 -302 -207 424 -275 -55 327 -380 -32 183 -279 194 -99 -317 511 -46
5947 -46 -33 423 -417 116 282 -317 -72 199 -228 175 -185 -210 292 -106 90 237 -195 119 448 -209 193
5968 193 -16 -461 279 -50 -74 413 -242 141 255 -474 66 148 -373 211 98 -443 243 -117 12 477 -196
5989 -196 -128 156 -135 95 30 -414 208 55 -214 282 -39 -193 421 -397 -42 255 -416 33 255 -256 153
6010 153 79 -499 209 -123 -128 253 -158 158 444 -321 138 102 -410 413 78 -331 267 -180 -96 99 -249 4
6032 4 113 -492 257 330 -265 298 -293 -116 304 -223 -123 399 -276 -243 423 -311 145 194 -286 284 42 -87
6054 -87 286 -9 23 291 -6 233 -38 -173 415 133 -251 297 -148 -289 340 -127 -66 174 -310 -38 262
6075 262 -355 271 22 -398 254 -42 -56 329 -237 -70 532 -382 197 80 -362 489 39 -281 244 -142
6095 -142 86 462 -314 -205 301 -427 116 226 -234 183 171 85 387 -135 -184 428 -315 45 157 -177 129
6116 129 190 -275 462 -175 -282 267 11 -189 341 -300 -95 361 -383 154 84 -313 183 -25 -131 166 -93
6137 -93 -120 117 -82 93 102 -345 389 7 -253 336 -183 -129 262 -320 67 363 -399 244 238 -152 115 -40
6159 -40 -290 273 -114 -107 339 -482 -152 262 -128 213 -109 -430 231 -88 -191 388 -231 -139 545 -186 -16
6180 -16 180 -398 47 135 -345 46 -172 -257 384 -91 118 282 -183 39 162 -294 15 67 -492 73 -41
6201 -41 42 295 105 32 -69 -207 109 127 -425 130 166 -184 364 -41 -18 148 -66 -146 521 -162 154 194 -301
6224 -301 247 203 -225 382 70 -195 128 -200 -77 298 -236 234 203 -390 183 -135 -227 188 -10 -235 146
6245 146 -265 -36 292 -394 46 -147 -476 188 -123 -284 205 -275 78 194 -205 51 153 -260 436 -31
6265 -31 -332 90 -163 -262 236 -69 -103 259 -344 -133 323 -137 137 -182 -351 264 149 -246 318 -218 -349
6286 -349 217 -229 211 232 -279 127 83 -217 261 -171 -354 320 -236 -295 308 -444 81 205 -494 131 81
6307 81 -217 190 8 -75 131 -340 -39 376 -268 126 -21 -407 162 -86 -151 320 -237 4 233 -275 -30
6328 -30 -71 -79 -7 75 -215 158 -135 -268 338 2 -112 -76 -242 -73 344 -213 147 155 -332 182 -144 -339 177
6351 177 -108 117 67 -130 -16 381 -132 112 494 -205 -7 44 -268 226 -12 42 227 -299 -99 49 -349
6372 -349 158 101 -434 226 -34 -76 108 -182 -26 528 -307 194 180 -404 300 75 -260 108 -289 -64 224
6393 224 -171 -29 319 -157 33 156 -285 216 -232 -288 176 -13 -85 256 -134 -55 204 -406 -23 56 -141
6414 -141 109 -28 -205 176 44 -5 372 -114 -7 334 -203 -102 139 -370 330 120 -80 238 -194 -196 195
6435 195 -257 96 7 -386 18 72 -399 488 -184 22 55 -122 135 182 -299 -54 194 -284 116 -110 -146 51
6457 51 -51 -200 253 -164 132 188 -352 139 496 -297 334 102 -209 321 -161 -109 516 -92 202 226 -250
6478 -250 68 232 -428 251 103 -43 388 -77 127 277 -427 11 296 -174 251 154 -441 234 99 -312
6498 -312 177 -446 -316 131 -161 15 34 -458 247 -50 -227 140 228 -135 237 -240 -300 289 -164 -139 242
6519 242 -273 123 209 -368 97 143 -335 318 -85 93 182 -289 -13 -41 -313 169 -49 -480 61 -183 -286
6540 -286 122 -338 -57 297 -270 67 -19 -369 275 35 -89 234 -62 0 34 -345 169 150 -372 -130 62
6561 62 -232 127 -64 -279 331 -132 -233 290 -247 119 -1 -238 188 -29 -384 232 94 -457 232 18
6581 18 58 459 -283 113 155 -527 206 112 -172 -159 -49 -146 456 -71 -140 265 -217 86 127 -338 244 98 -387
6604 -387 232 -58 -105 390 -265 209 360 -330 210 154 -359 93 96 -273 209 -103 -100 206 -182 -158 130 -516
6626 -516 119 -13 -529 -93 127 -168 235 -39 110 -4 -144 76 277 -340 190 148 -206 325 -268 -156
6646 -156 369 -220 -153 121 -320 26 220 -91 -109 77 -255 2 -153 -140 411 -168 -68 360 -389 -118 169
6667 169 -39 218 162 -169 35 97 -222 287 -35 -53 102 -320 -39 -49 -420 42 -99 -195 152 -275 50 390
6689 390 -354 210 296 -155 42 116 -264 92 14 -29 308 -72 -187 219 -190 200 -36 -200 436 -19 -283
6710 -283 133 172 -93 284 -219 -59 62 -271 -23 339 -364 118 4 -249 3 -62 -16 36 -173 85 49 -206
6732 -206 -97 -29 66 -98 -6 -300 240 -12 61 340 -222 -37 419 -148 -63 185 -100 -3 59 -251 42 -104
6754 -104 -311 318 -267 -175 62 45 293 40 -209 203 -19 -130 224 -173 2 176 -188 103 228 -5 -137
6775 -137 37 -75 170 -104 -91 103 -423 -35 75 -243 28 134 -52 207 37 -311 363 -252 -180 50 -37
6796 -37 -84 148 -78 -10 369 -206 36 215 -223 121 199 -81 345 -6 140 153 -430 -122 125 -157 99 -83
6818 -83 -163 371 -230 -187 143 -309 -300 -257 -332 -211 -148 -12 128 74 -210 174 33 -124 215 -29 28 238 -210
6841 -210 114 376 -109 459 -2 -73 211 -73 102 -53 -49 -133 199 -185 219 391 -238 141 79 -89 201 119
6863 119 -187 250 -29 -223 72 -418 -50 52 -150 49 157 -102 78 -79 -42 157 0 -40 97 135 -12
6884 -12 40 79 343 140 -99 144 -273 -44 324 -56 121 -95 -342 27 189 -446 299 -16 -130 338 -174
6905 -174 -32 162 -18 -86 200 -401 162 57 -186 123 197 -78 -123 -415 249 263 -111 51 154 -264 168
6926 168 127 -147 204 -111 -50 -69 -17 -96 125 -276 228 295 -92 45 180 -31 9 15 -86 93 -117 -13 63
6949 63 -283 51 -60 -107 184 -177 -158 97 -242 -364 147 -157 -100 98 -134 -27 164 -195 154 -157 -255 446
6971 446 -218 -203 285 -102 22 230 -138 75 237 -189 45 -78 -309 139 74 120 429 -297 -143 223 -2
6992 -2 119 -82 -166 124 -60 12 63 -169 -56 97 -189 238 -11 -272 199 -91 -257 234 -303 -173 122 -183
7014 -183 229 184 -244 162 231 -133 3 -210 -48 202 56 75 -55 20 123 52 -165 45 180 -53 54 -50
7036 -50 228 190 -170 -90 23 -163 -130 76 -190 421 257 -136 191 -52 -136 88 -176 47 142 -182 105 267
7058 267 -254 -3 -18 -85 165 91 88 194 -200 -159 75 -13 59 197 -200 126 -64 -356 60 -40 -81 245 -357
7081 -357 21 209 -258 130 206 -143 331 87 -55 202 243 -57 66 10 98 83 -239 5 133 -152 -70 40
7103 40 -82 -127 -172 -12 265 -149 -34 89 -162 194 403 -234 28 14 -124 -7 -123 -92 261 10 -253 78
7125 78 8 113 -12 -24 -138 -235 -59 247 -144 195 298 -15 -119 194 -143 171 68 -44 49 76 33 192
7147 192 73 180 206 -149 112 -94 -281 232 151 -130 64 33 108 -28 -125 -10 -17 -69 -58 77 -155 56 -39
7170 -39 -78 231 -150 -360 175 34 -71 -28 -380 1 62 -349 64 180 -190 122 -55 -143 98 -23 93 65
7192 65 -82 193 -117 -214 -92 45 -152 -81 -28 -53 210 -94 339 166 -186 -20 -47 -27 74 -239 -270 150 83
7215 83 -47 223 -108 -90 -6 -272 158 81 -218 218 -102 37 96 -271 -20 -88 -211 118 -59 -134 -16 70 -434
7238 -434 23 -163 -215 283 -277 -161 236 -38 274 -150 -34 -51 -223 -99 213 58 30 -63 -67 136 35 -8
7260 -8 53 39 8 358 37 140 84 -116 -122 127 -286 -136 67 -81 -44 98 -255 129 -112 154 151 -75 -54 18
7284 18 -104 41 154 -124 189 225 -423 297 -93 -256 199 -223 0 -30 -54 -130 118 -482 -192 -11 -134 -62
7306 -62 -28 -103 52 -246 27 11 -98 -99 71 -85 98 107 -200 152 126 -36 290 -30 -123 114 -67 -113 -59 -237
7330 -237 147 69 -162 66 -198 -244 81 -60 -121 176 -187 239 -5 -68 146 120 -23 -256 -55 -65 -60 -140 34
7353 34 74 -167 87 -114 -33 -120 -70 -39 110 -45 -36 20 -73 -7 59 -255 -65 281 53 -16 39 132 183 -55 -102 218
7379 218 135 103 286 -91 -63 -10 -543 37 14 -132 124 -148 87 346 -167 96 156 127 -7 137 -83 20
7401 20 -156 -54 220 -257 -62 86 -23 14 151 -261 91 15 -85 14 77 -105 28 194 109 8 -111 120
7423 120 53 -455 63 262 36 228 -13 -31 -13 -199 131 163 -131 9 -156 -191 186 -78 -232 278 -144 -357
7445 -357 144 -99 24 30 -137 -149 3 110 216 -54 204 64 -171 5 214 -270 -125 -27 35 -13 -3 -43 50
7468 50 61 -269 323 -239 4 48 -83 -74 128 13 34 -49 -125 227 58 -15 243 36 -112 158 -65 -45 162
7491 162 -144 218 27 -11 137 33 -133 10 18 28 -23 104 164 111 -236 -45 64 -146 187 -76 -95 -19 -37
7514 -37 -51 221 -115 70 94 -133 222 -16 -12 283 -23 49 77 -107 -118 68 -147 73 43 -227 -171 -59 40 -4
7538 -4 -4 133 88 12 83 143 -82 155 181 -20 220 38 -63 402 -76 -53 -15 -48 -119 -79 115 -144 45 -211 259
7563 259 -130 -226 149 52 -194 -141 -217 -359 -9 -239 60 126 -138 -125 -117 -269 231 -127 -164 152 -110 80 151
7586 151 -109 26 -152 -52 -12 137 -242 240 10 49 -74 -109 -116 -5 161 185 -91 19 27 -10 -4 162 -49 110
7610 110 72 -109 -38 -158 170 300 -78 65 193 17 -95 -175 -47 110 84 -258 42 -29 -181 37 -45 -176
7632 -176 -17 -83 -100 34 30 68 -67 -186 -127 226 -102 39 48 -281 248 122 -15 -106 -130 -55 16 -7 194 -31
7656 -31 -12 304 -74 -160 206 217 -104 -83 -136 40 20 -261 240 -80 -15 96 -61 -30 128 -347 -174 186 -330
7679 -330 2 -223 -141 56 101 20 -5 -283 12 155 -131 -106 -14 -217 43 28 -167 -36 -93 -104 -11 -207 11
7702 11 140 -42 136 218 -228 -100 239 41 28 -103 -77 -133 -96 -244 41 -95 86 59 -93 -46 -114 42 267
7725 267 -121 -142 194 -82 -38 1 -130 216 -263 -69 11 -149 -13 -93 -234 -162 323 181 89 184 -112 189 -163
7748 -163 -52 45 122 -141 -5 168 47 -237 167 8 -6 -109 274 71 -224 138 15 12 44 -73 -377 154
7770 154 -78 -47 94 -55 -147 2 -113 -35 -68 -324 -16 134 -132 162 -152 -27 133 -78 74 73 -89 41
7792 41 -59 125 340 47 101 76 -53 -126 116 -200 163 -247 -22 326 -175 -130 2 -67 -202 -202 297 -50 185
7815 185 -77 -42 -53 -264 194 -89 152 85 -217 24 251 -204 120 60 90 16 164 -40 64 -266 -187 35
7837 35 -74 115 102 -47 -38 -63 -51 170 -81 -17 25 -16 136 49 -53 20 137 -59 0 133 -143 -224 42 254
7861 254 26 -37 208 -92 -103 -329 -66 55 -69 137 46 146 -2 -168 59 166 -83 105 -62 -10 -93 -85
7883 -85 313 140 -64 5 -134 187 350 -23 56 211 64 122 132 7 162 -32 50 197 110 -101 181 -63
7905 -63 48 127 -2 -178 -32 -210 76 -8 -224 -3 -159 -68 -140 144 -76 288 -32 -4 90 -14 113 116 -125
7928 -125 119 -56 -86 -151 -47 -22 141 132 9 250 -5 166 -159 -175 85 -30 -105 24 -176 201 -47 78
7950 78 213 -95 48 114 -207 -78 90 -8 -153 -89 -123 145 -125 -162 -54 -90 -150 -85 -46 -249 118 -43 82
7973 82 230 -349 -42 -45 -85 -14 104 -76 60 1 -14 280 70 -113 299 -293 -79 -92 52 55 52 -84 87 136
7997 136 6 -199 -296 143 -143 -4 -76 -92 131 39 243 5 110 127 37 -75 35 143 136 84 313 -83 -286
8020 -286 -121 -90 123 232 -97 -48 -27 -26 -17 -10 -97 117 9 -373 -2 140 8 56 10 15 -44 -136 9 44 -79 -75
8046 -75 -109 -321 103 -107 172 -78 -159 -16 169 -312 -312 76 62 8 -30 -231 84 17 94 39 203 -61 53 111
8070 111 16 -58 105 -25 -88 -136 112 -30 -103 -103 -274 -60 -103 3 81 102 -135 102 -200 74 -14 -190 -160 216
8094 216 -216 131 -100 33 87 -152 24 121 -42 10 151 82 -58 -16 124 46 114 -170 274 -87 -60 173 128
8117 128 -114 -74 -11 14 24 25 117 -49 27 -46 -205 76 195 -177 -40 -221 -107 -145 152 -32 -34 123 132 142 100
8142 100 -58 -32 -66 101 112 136 -101 76 -32 119 24 -117 56 29 109 -130 -25 32 108 138 -145 -40 194
8165 194 -88 135 -310 78 -119 -155 70 168 -85 100 156 -28 169 147 -52 -13 -91 -30 -20 139 -1 -29 -60
8188 -60 -9 83 81
8191H1
##END NTUPLES=NMR FID
##END=
