##TITLE=1H_MTA2309
 CDCl3, 8 sc, 
 23.9.2020
##JCAMPDX= 6.0         $$ Bruker NMR JCAMP-DX V2.0
##DATA TYPE= NMR FID
##DATA CLASS= NTUPLES
##ORIGIN= UXNMR, Bruker Analytische Messtechnik GmbH
##OWNER= root
$$ XWIN-NMR		Version 3.5
$$ Wed Sep 23 12:42:09 2020 Russian Standard Time (UT+4h)  she@DPX200
##.OBSERVE FREQUENCY= 200.1315066352
##.OBSERVE NUCLEUS= ^1H
##.DELAY= (6, 6)
##.ACQUISITION MODE= SIMULTANEOUS
##.ACQUISITION SCHEME= undefined
##.AVERAGES= 8
##.DIGITISER RES= 18
##SPECTROMETER/DATA SYSTEM= spect
##.PULSE SEQUENCE= zg30
##.SOLVENT NAME= CDCl3
##.SHIFT REFERENCE= (INTERNAL, CDCl3, 0, 15.7039)
##AUDIT TRAIL= $$ (NUMBER, WHEN, WHO, WHERE, WHAT)
$$ ##TITLE= Audit trail, XWIN-NMR		Version 3.5
$$ ##JCAMPDX= 5.01
$$ ##ORIGIN= Bruker BioSpin GmbH
$$ ##OWNER= she
$$ F:/spectra/data/she/nmr/H-F/1/audita.txt
$$ ##AUDIT TRAIL=  $$ (NUMBER, WHEN, WHO, WHERE, WHAT)
(   1,<2020-09-23 12:41:13.50 +0400>,<she>,<DPX200>,
      <created by zg, POWCHK disabled, PULCHK disabled
       configuration hash MD5:
       00 E9 B6 7A A2 85 ED C7 34 08 36 98 17 FE 4E 26
       data hash MD5: 16K
       67 F5 40 97 F9 5A 52 35 42 B4 A5 6E 91 95 94 86>)
$$ ##END=
$$ 
$$ hash MD5
$$ 87 AA E3 66 E7 C5 0F 6D BB 5E 52 C0 EC E4 9B 62
##$RELAX= 
##$RELAX= 
##$RELAX= 
##$RELAX= 
##$RELAX= 
##$RELAX= 
$$ Bruker specific parameters
$$ --------------------------
##$DU= <F:/spectra>
##$EXPNO= 1
##$NAME= <H-F>
##$PROCNO= 1
##$TYPE= <nmr>
##$USER= <she>
##$AMP= (0..31)
100 100 100 100 100 100 100 100 100 100 100 100 100 100 100 100 100 100 
100 100 100 100 100 100 100 100 100 100 100 100 100 100 
##$AQSEQ= 0
##$AQ_mod= 1
##$AUNM= <au_zg>
##$AUTOPOS= <>
##$BF1= 200.13
##$BF2= 200.13
##$BF3= 200.13
##$BF4= 200.13
##$BF5= 200.13
##$BF6= 200.13
##$BF7= 200.13
##$BF8= 200.13
##$BYTORDA= 1
##$CFDGTYP= 0
##$CFRGTYP= 5
##$CHEMSTR= <none>
##$CNST= (0..31)
1 1 145 1 1 1 1 1 1 1 1 1 1 1 1 1 1 1 1 1 1 1 1 1 1 1 1 1 1 1 1 1 
##$CPDPRG= <>
##$CPDPRG1= <>
##$CPDPRG2= <>
##$CPDPRG3= <>
##$CPDPRG4= <mlev>
##$CPDPRG5= <mlev>
##$CPDPRG6= <mlev>
##$CPDPRG7= <mlev>
##$CPDPRG8= <mlev>
##$CPDPRGB= <>
##$CPDPRGT= <>
##$D= (0..31)
0 1.2 0 0 0 0 0 0 0 0.06 0 0.03 0 0 0 0 0.0002 0 0 0 0 0 0 0 0 0 0 0 0 
0 0 0 
##$DATE= 1600850472
##$DBL= (0..7)
120 120 120 120 120 120 120 120 
##$DBP= (0..7)
150 150 150 150 150 150 150 150 
##$DBP07= 0
##$DBPNAM0= <>
##$DBPNAM1= <>
##$DBPNAM2= <>
##$DBPNAM3= <>
##$DBPNAM4= <>
##$DBPNAM5= <>
##$DBPNAM6= <>
##$DBPNAM7= <>
##$DBPOAL= (0..7)
0.5 0.5 0.5 0.5 0.5 0.5 0.5 0.5 
##$DBPOFFS= (0..7)
0 0 0 0 0 0 0 0 
##$DE= 6
##$DECBNUC= <off>
##$DECIM= 32
##$DECNUC= <off>
##$DECSTAT= 4
##$DIGMOD= 1
##$DIGTYP= 9
##$DL= (0..7)
0 120 120 120 120 120 120 120 
##$DP= (0..7)
150 150 150 150 150 150 150 150 
##$DP07= 0
##$DPNAME0= <>
##$DPNAME1= <>
##$DPNAME2= <>
##$DPNAME3= <>
##$DPNAME4= <>
##$DPNAME5= <>
##$DPNAME6= <>
##$DPNAME7= <>
##$DPOAL= (0..7)
0.5 0.5 0.5 0.5 0.5 0.5 0.5 0.5 
##$DPOFFS= (0..7)
0 0 0 0 0 0 0 0 
##$DQDMODE= 0
##$DR= 18
##$DS= 0
##$DSLIST= <SSSSSSSSSSSSSSS>
$$ [...]
##$SUBNAM2= <"">
##$SUBNAM3= <"">
##$SUBNAM4= <"">
##$SUBNAM5= <"">
##$SUBNAM6= <"">
##$SUBNAM7= <"">
##$SUBNAM8= <"">
##$SUBNAM9= <"">
##$SW= 16.880792210976
##$SWIBOX= (0..15)
0 0 2 0 0 0 0 0 0 0 0 0 0 0 0 0 
##$SW_h= 3378.37837837838
##$TD= 16384
##$TD0= 1
##$TE= 0
##$TE2= 300
##$TE3= 300
##$TEG= 300
##$TL= (0..7)
0 120 120 120 120 120 120 120 
##$TP= (0..7)
150 150 150 150 150 150 150 150 
##$TP07= 0
##$TPNAME0= <>
##$TPNAME1= <>
##$TPNAME2= <>
##$TPNAME3= <>
##$TPNAME4= <>
##$TPNAME5= <>
##$TPNAME6= <>
##$TPNAME7= <>
##$TPOAL= (0..7)
0.5 0.5 0.5 0.5 0.5 0.5 0.5 0.5 
##$TPOFFS= (0..7)
0 0 0 0 0 0 0 0 
##$TUNHIN= 0
##$TUNHOUT= 0
##$TUNXOUT= 0
##$USERA1= <user>
##$USERA2= <user>
##$USERA3= <user>
##$USERA4= <user>
##$USERA5= <user>
##$V9= 5
##$VALIST= <valist>
##$VCLIST= <CCCCCCCCCCCCCCC>
##$VD= 0
##$VDLIST= <DDDDDDDDDDDDDDD>
##$VPLIST= <PPPPPPPPPPPPPPP>
##$VTLIST= <TTTTTTTTTTTTTTT>
##$WBST= 1024
##$WBSW= 4
##$XGAIN= (0..3)
0 0 0 0 
##$XL= 0
##$YL= 0
##$YMAX_a= 1062837
##$YMIN_a= -913792
##$ZGOPTNS= <>
##$ZL1= 120
##$ZL2= 120
##$ZL3= 120
##$ZL4= 120
##$ABSF1= 10
##$ABSF2= 0
##$ABSG= 5
##$ABSL= 3
##$ALPHA= 0
##$AQORDER= 0
##$ASSFAC= 0
##$ASSFACI= 0
##$ASSFACX= 0
##$ASSWID= 0
##$AUNMP= <proc_1d>
##$AZFE= 0.1
##$AZFW= 0.1
##$BCFW= 1
##$BC_mod= 2
##$BYTORDP= 1
##$COROFFS= 0
##$CY= 11.3945322036743
##$DATMOD= 1
##$DC= 2
##$DFILT= <>
##$DTYPP= 0
##$F1P= 16.9975609425685
##$F2P= -3.02152046262296
##$FCOR= 0.5
##$FTSIZE= 0
##$FT_mod= 4
##$GAMMA= 1
##$GB= 0.15
##$INTBC= 1
##$INTSCL= 1
##$ISEN= 128
##$LB= 0.24
##$LEV0= 0
##$LPBIN= 0
##$MAXI= 10000
##$MC2= 0
##$MEAN= 0
##$ME_mod= 0
##$MI= 1.114404
##$NCOEF= 0
##$NC_proc= 0
##$NLEV= 6
##$NOISF1= 3.799351
##$NOISF2= 2.8
##$NSP= 1
##$NTH_PI= 0
##$NZP= 0
##$OFFSET= 15.70392
##$PC= 1
##$PHC0= -10127.94
##$PHC1= 11.4009
##$PH_mod= 1
##$PKNL= yes
##$PPARMOD= 0
##$PSCAL= 0
##$PSIGN= 0
##$REVERSE= no
##$SF= 200.130013532006
##$SI= 16384
##$SIGF1= 3
##$SIGF2= 2
##$SINO= 400
##$SIOLD= 16384
##$SREGLST= <1H.CDCl3>
##$SSB= 0
##$STSI= 0
##$STSR= 0
##$SW_p= 3612.71676300578
##$SYMM= 0
##$S_DEV= 0
##$TDeff= 0
##$TDoff= 0
##$TI= <>
##$TILT= no
##$TM1= 0
##$TM2= 0
##$TOPLEV= 0
##$USERP1= <user>
##$USERP2= <user>
##$USERP3= <user>
##$USERP4= <user>
##$USERP5= <user>
##$WDW= 1
##$XDIM= 8192
##$YMAX_p= 0
##$YMIN_p= 0
$$ End of Bruker specific parameters
$$ ---------------------------------
##NTUPLES= NMR FID
##VAR_NAME=  TIME,          FID/REAL,        FID/IMAG
##SYMBOL=    X,             R,               I
##VAR_TYPE=  INDEPENDENT,   DEPENDENT,       DEPENDENT
##VAR_FORM=  AFFN,          ASDF,            ASDF
##VAR_DIM=   8192,          8192,            8192
##UNITS=     SECONDS,       ARBITRARY UNITS, ARBITRARY UNITS
##FACTOR=    0.000296,      1,               1
##FIRST=     0,             0,               0
##LAST=      2.424536,      0,               0
##MIN=       0,             -913792,         0
##MAX=       2.424536,      1062837,         0
$$ Real data points
##PAGE= N=1
##DATA TABLE= (X++(R..R)), XYDATA
$$ [...]
$$ plain form
2440 2224 2293 -4462 1835 2736 -4578 1614 3050 -4692 1591 3196 -4770 1486 3193 -4601 1256 3254
2456 3254 -4175 795 3283 -3803 300 3509 -3513 -206 3765 -3272 -788 4081 -3102 -1271 4358
2471 4358 -3026 -1404 4482 -2967 -1538 4487 -2776 -1690 4313 -2299 -2072 4121 -1791 -2497 4099
2486 4099 -1298 -2977 4198 -1054 -3499 4502 -913 -3739 4637 -873 -3731 4549 -799 -3554 4183
2501 4183 -454 -3565 3789 58 -3784 3375 761 -4122 3137 1273 -4474 3156 1573 -4670 3154
2516 3154 1660 -4736 2977 1716 -4573 2545 1905 -4264 2171 2200 -4039 1572 2570 -3993 1056 3089
2532 3089 -4108 692 3540 -4176 459 3786 -4188 392 3819 -4120 295 3782 -3896 1 3843
2547 3843 -3511 -520 3923 -3030 -1084 4186 -2884 -1621 4623 -2769 -1968 4905 -2898 -2100 4943
$$ packed form
2440B224O9o755O297R01p314O192J436p742O283J605p966O256J707p794N857J998
2456C254p429M970K488p086M103L209p022L307L971p037K484M869p183J831N629
2471D358p384J622N886p449J429O025p263J086O003o612K27O193n912p06O596
2486D099n397j679P175n252k445Q001n415k826Q376n510k858Q280n348k755P737
2501D183m637l111P354l731l842P159k614m883P259j864n747P630j583o243P824
2516C154j494o396P713j261o289P118o40o169O435K9o239N611R98o563N049K033
2532C089p197M800K848p716M635L327p974M580L427p939M415L487p678L897L842
2547C843p354K991M443o953J946N270p070J263O244p392Q01O873p803P98P043
$$ plain form
2562 4943 -2810 -2033 4736 -2558 -2118 4454 -2114 -2290 4163 -1518 -2756 4062 -1037 -3239 4143 -679
2578 -679 -3572 4266 -563 -3716 4258 -508 -3713 4140 -330 -3551 3769 8 -3482 3302 365
2593 365 -3491 2855 926 -3674 2542 1460 -4037 2310 1872 -4255 2230 2082 -4325 2185 2157 -4244
2609 -4244 1949 2264 -4024 1543 2544 -3784 958 2885 -3618 373 3410 -3682 16 3854 -3914
2624 -3914 -220 4207 -4058 -158 4206 -3965 -190 3999 -3641 -334 3901 -3204 -762 3774 -2726
2639 -2726 -1310 3991 -2380 -1866 4282 -2286 -2160 4494 -2306 -2289 4534 -2275 -2245 4440 -2063 -2293 4134
2656 4134 -1635 -2426 3776 -1081 -2765 3584 -450 -3220 3471 -25 -3631 3592 258 -3943 3633
2671 3633 408 -3944 3510 455 -3854 3177 759 -3690 2680 1136 -3705 2232 1713 -3880 1867
$$ packed form
2562D943p753P77O769p294M40O572o568j76O453n681j238O818n099k202P382m822
2578f79k893P838m829l153P974m766l205P853m470l221P320l761l490O784k937
2593C65l856O346j929m600O216j082n497O347m38o127O485j48o407O510k8o401
2609d244O193L15o288N567J001o328M742J927o503L991L037p092L698L838p768
2624c914L694M427q265L900M364q171L775M189p640L307M235p105K442M536o500
2639b726J416N301o371N14O148o568J26O654o800J7O823o809L0O685o503k30O427
2656D134n769p91O202m857j684O349m034k770O691l496l606P223l334m201P576
2671C633l225m352P454l055m309P031k418m449O370j544m841N937n19n593N747
$$ plain form
2686 1867 2197 -4115 1688 2484 -4389 1770 2655 -4458 1778 2583 -4290 1684 2563 -4023 1380 2532
2702 2532 -3608 847 2713 -3359 314 3120 -3225 -167 3533 -3254 -483 3731 -3270 -486 3775
2717 3775 -3192 -567 3648 -2833 -795 3413 -2365 -1180 3271 -1837 -1691 3323 -1409 -2196 3540
2732 3540 -1127 -2607 3731 -1097 -2800 3805 -983 -2750 3660 -874 -2668 3343 -512 -2716 2904
2747 2904 -33 -2944 2642 551 -3328 2602 935 -3739 2656 1143 -3946 2837 1115 -3948 2788
2762 2788 1059 -3776 2494 1141 -3502 2121 1375 -3312 1621 1788 -3341 1146 2253 -3455 1009
2777 1009 2603 -3595 993 2659 -3568 894 2603 -3377 785 2477 -3028 390 2474 -2613 23
2792 23 2569 -2326 -492 2849 -2180 -824 3097 -2229 -1105 3346 -2249 -1134 3314 -2224 -1112
$$ packed form
2686A867L30o312N803P96o873O159Q85p113O236Q05o873N974Q79o586N403J152
2702B532o140M455J866o072L673K806o345L058L700o787K771M214p001K784M261
2717C775o967K625M215o481K038M208n778J185M451n108J46N014m732p87N736
2732C540m667j480O338m828j703O605m788j767O410m534j794O011l855k204N620
2747B904k937k911N586k091l879N930j667m674O395j513n089O783j722n063O736
2762B788j729m835O270j353m643N623p46m687M933J67n129M487J107n708M464
2777A009J594o198M588J666o227M462J709n980M162J692n505L418K084n087K636
2792B3K546m895J834L341n029J356L921n326J124M451n595J115M448n538J112
$$ plain form
2807 -1112 3099 -1920 -1176 2875 -1564 -1346 2634 -1066 -1780 2663 -606 -2204 2833 -411 -2596 3040
2823 3040 -372 -2759 3200 -387 -2647 3068 -426 -2557 2727 -198 -2386 2389 244 -2451 1978
2838 1978 587 -2662 1853 1002 -2925 1810 1156 -3066 1837 1158 -2999 1856 1146 -2827 1640 1051
2854 1051 -2526 1249 1287 -2322 807 1589 -2257 478 2044 -2421 202 2349 -2521 201 2487 -2677
2870 -2677 199 2501 -2582 153 2313 -2319 -24 2179 -1922 -393 2261 -1566 -873 2471 -1378
2885 -1378 -1346 2735 -1363 -1565 3061 -1515 -1494 3068 -1638 -1278 2951 -1483 -1252 2576 -1168 -1344 2340
2902 2340 -760 -1595 2286 -405 -1934 2298 -265 -2167 2417 -96 -2280 2462 -209 -2176 2339
2917 2339 -199 -2083 2097 -2 -1973 1744 328 -2032 1329 729 -2096 1084 1170 -2405 1105 1431
$$ packed form
2807a112M211n019P44M051m439K18L980l700p14M443l269j598N037l244k185N636
2823C040l412k387N959l587k260N715l494k131N284k925k188M775k145k695M429
2838A978j391l249M515q51l927M735o54m222M903o79m157M855p10l973M467n89
2854A051l577L775L8l609L129P82l846K735J566m465K623K147m870K722K286n164
2870b677K876K302n083K735K160m632K295K203m101J529K654l827O93L344l849
2885a378L2M081m098k02M626m576K1M562m706L60M229m434K31L828l744j76L684
2902B340l100q35L881k691j529M232k563j902M584k513k184M742k671j967M515
2917B339k538j884M180k099j971L717j416k360L361o00k825L180Q6l575L510L26
$$ plain form
2933 1431 -2647 1132 1497 -2670 1161 1496 -2544 1042 1375 -2262 782 1448 -1982 392 1745 -1808
2949 -1808 -19 1976 -1863 -284 2270 -2000 -393 2478 -2161 -284 2422 -2143 -238 2244 -1886
2964 -1886 -401 2083 -1546 -645 1959 -1197 -906 2094 -1002 -1329 2343 -874 -1513 2422 -897 -1511
2980 -1511 2443 -843 -1435 2218 -758 -1366 2025 -488 -1483 1717 -83 -1578 1454 320 -1859 1463
2996 1463 616 -2154 1546 702 -2319 1596 702 -2277 1587 609 -2124 1432 647 -1857 1092 810
3012 810 -1788 791 1150 -1821 444 1510 -1964 381 1719 -2115 372 1718 -2128 515 1660
3027 1660 -2055 400 1608 -1759 184 1531 -1500 -170 1621 -1350 -460 1771 -1273 -652 1974
3042 1974 -1292 -792 2038 -1300 -709 2010 -1226 -708 1793 -1127 -702 1590 -767 -840 1455 -380
$$ packed form
2933A431m078L779L65m167L831L35m040L586L33l637L044O66l430K374J353l553
2949a808J789J995l839J579K554m270J607K871m639J877K706m565J905K482m130
2964a886J485K484l629R01K604l156K91L000l096l27L672l217o39L935l319o14
2980a511L954l286n92L653k976o08L391k513r95L200j800j495L032j134k179L322
2996A463q47k770L700q44l021L915q94k979L864r78k733L556p85k504K949k82
3012H10k598K579L59k971K265J066l474K345J338l834K487J346l846K643J145
3027A660l715K455J208l367J943J347l031J330J791k971Q90K231l044O21K626
3042A974l266N00K830l338N91K719l236N18K501k920M25K292k357p3K295j835
$$ plain form
3058 -380 -1140 1411 -132 -1383 1552 26 -1605 1634 23 -1690 1706 37 -1653 1608 3
3073 3 -1506 1382 128 -1430 1114 439 -1458 858 763 -1641 801 1014 -1834 778 1147 -1930 862
3090 862 1075 -1951 798 995 -1712 726 1020 -1535 435 1070 -1349 173 1193 -1320 -42 1480
3106 1480 -1369 -157 1665 -1471 -140 1574 -1522 -60 1494 -1356 -59 1378 -1134 -209 1232
3121 1232 -853 -443 1182 -610 -761 1362 -524 -972 1564 -471 -1077 1673 -525 -1120 1618 -516
3137 -516 -1108 1565 -434 -1021 1289 -239 -1071 1165 55 -1236 1092 220 -1437 1087 356 -1532
3153 -1532 1184 375 -1587 1217 325 -1500 1179 351 -1355 1002 388 -1235 774 586 -1233 503
3169 503 779 -1263 432 959 -1404 390 1040 -1503 442 1041 -1472 458 1004 -1357 347 934 -1168
$$ packed form
3058c80p60K551j543j251K935j526j631L239j611j713L396j669j690L261j605
3073Cj509K888j254j558K544o75j897K316r5k404K442K13k848K612L69l077K792
3090H62K13l026K749J97k707K438K94k555J970O35k419J522J020k513J278J522
3106A480k849J212J822l136J331J714l096J462J554k850J297J437k512R25J441
3121A232k085M10J625j792j51K123j886m48K536k035o06K750k198n95K738k134
3137e16n92K673j999n87K310j528q32K236j110j291K328q72j657K524p31j888
3153a532K716q09j962K804q92j825K679q28j706K357o14j623K009j88j819J736
3169E03K76k042J695N27k363J794O50k543J945N99k513J930N46k361J704N87k102
$$ plain form
3186 -1168 185 914 -969 -152 1042 -798 -390 1251 -798 -538 1414 -895 -557 1502 -949 -578
3202 -578 1456 -885 -534 1356 -766 -551 1235 -540 -689 1168 -349 -901 1229 -194 -1097 1304
3218 1304 -193 -1169 1434 -239 -1157 1405 -301 -1074 1275 -212 -982 1074 -42 -978 948 155
3234 155 -1046 788 421 -1221 723 493 -1367 860 556 -1452 809 526 -1347 829 489 -1257
3250 -1257 732 550 -1056 465 668 -1000 251 818 -960 163 942 -1045 43 1127 -1169 39
3266 39 1145 -1160 28 1097 -1046 -1 990 -961 -106 982 -821 -274 1104 -634 -482 1166
3282 1166 -662 -643 1298 -602 -687 1338 -711 -673 1388 -687 -628 1218 -572 -654 1137 -400 -756 1030
3300 1030 -197 -817 1006 -78 -973 1059 48 -1086 1109 69 -1133 1106 78 -1125 1062
$$ packed form
3186a168J353P29j883Q17J194j840M08J641k049K60J952k309L38K059k451L71
3202e78K034k341L51J890k122K15J786j775j49J857j517n52K130j423r03K401
3218A304j497r76K603j673r18K562j706p73K349j487p70K056j116r36J926p93
3234A55j201J834l67j642J944k30j860K227l04k008K261k83j873K176l40j746
3250a257J989j82j606J521K03j668J251N67j778J123P79j987J088J084k296J208
3266C9J106k305J188J069k143J045R91j951Q55J088j803N47J378j738J52J648
3282A166j828J9J941j900q5K025k049L8K061k075N9J846j790q2J791j537l56J786
3300A030j227o20J823j084q95K032j011j134K195j040j202K239j028j203K187
$$ plain form
3315 1062 34 -1024 920 85 -1012 715 298 -1008 603 457 -1013 505 661 -1202 493 723
3331 723 -1212 490 757 -1224 495 724 -1202 454 750 -1086 288 863 -903 84 947 -908 -102
3348 -102 1096 -954 -117 1225 -1061 -219 1242 -1101 -132 1200 -1063 -131 1127 -922 -246 1044
3364 1044 -709 -411 1039 -615 -545 1054 -527 -632 1177 -477 -717 1237 -426 -769 1241 -422
3380 -422 -773 1175 -356 -736 1033 -206 -708 892 -36 -911 827 103 -1049 827 243 -1124 782
3397 782 348 -1185 836 359 -1165 826 369 -1169 713 467 -1053 541 543 -1029 407 708 -1023
3414 -1023 285 894 -1161 270 949 -1241 322 911 -1257 345 865 -1167 252 863 -1019 149
3430 149 882 -893 -63 957 -822 -198 1019 -786 -310 1176 -824 -377 1208 -772 -393 1170 -768
$$ packed form
3315A062j028j058J944q35j097J727m17j306J611j46j470J518J56j863J695K30
3331G23j935J702K67j981J719K29j926J656K96j836J374N75j766R87Q63j855Q06
3348a02J198k050Q37J342k286Q42J461k343R69J332k263R32J258k049O76J290
3364A044j753K98J450j654P0J599j581j05J809j654k40J954j663l43K010j663
3380d22l51J948j531l80J769j239n02J600r28q75J738p24j152J876n84j367J906
3397G82m34j533K021m77j524J991m57j538J882k46j520J594Kj572J436L01j731
3414a023J308O09k055J431O79k190J563N89k168J602N20k032J419O11j882J168
3430A49P33j775Q30J020j779O24J217j805M76J486k000M47J585j980L79J563j938
$$ plain form
3447 -768 -413 1118 -681 -458 1017 -527 -588 999 -352 -684 1040 -208 -761 1044 -197 -943 1117
3464 1117 -170 -944 1186 -197 -947 1101 -183 -933 939 -20 -956 788 168 -968 683 377 -1071
3481 -1071 689 374 -1245 721 454 -1289 752 494 -1154 724 438 -1145 592 480 -1048 541
3497 541 598 -1006 315 695 -1023 195 860 -1019 108 921 -1064 95 1011 -1028 44 960 -954
3514 -954 48 875 -897 -59 873 -779 -229 977 -660 -409 1020 -570 -510 1070 -549 -573 1143
3531 1143 -594 -625 1222 -564 -600 1143 -488 -634 1025 -348 -701 928 -117 -886 1000 -56 -1012
3548 -1012 1009 91 -1125 1057 126 -1112 1094 25 -1143 974 157 -1078 893 127 -1066 769
3564 769 294 -1032 633 428 -1087 539 628 -1167 523 624 -1176 516 703 -1148 521 669 -1120
$$ packed form
3447g68L55J531j799K23J475j544o1J587j351l32J724j248n53J805j241p46K060
3464A117j287p74K130j383p50K048j284p50J872r59r36J744o20j136J651l06j448
3481a071J760l15j619J966k67j743K041k58j648J878k86j583J737j12j528J589
3497E41N7j604J321L80j718J218O65j879J127Q13j985J159R16k039J072R16j914
3514i54J002Q27j772Q38R32j652N50J206j637K51J429j590O0J580j619k4J716
3531A143j737l1J847j786l6J743j631j46J659j373l53J629j045p69J886j056r56
3548a012K021r18j216K182r31j238K206j069j168K117q17j235J971p66j193J835
3564G69m75j326J665k05j515J626Q9j795J690J01j800J692J87j851J669J48j789
$$ plain form
3581 -1120 423 722 -969 295 678 -917 102 822 -903 -103 972 -853 -134 1045 -896 -172
3597 -172 1098 -834 -260 1074 -868 -304 1033 -754 -307 1037 -614 -478 1039 -425 -654 1099
3613 1099 -385 -732 1138 -338 -807 1210 -355 -777 1246 -323 -827 1072 -300 -814 1066 -169
3629 -169 -851 915 -11 -909 856 101 -1013 843 215 -1057 803 310 -1100 811 342 -1045 738
3646 738 289 -1012 645 493 -993 518 537 -983 350 704 -1012 261 831 -1034 221 893 -1067
3663 -1067 215 938 -1060 145 928 -1022 24 894 -919 -30 873 -820 -241 993 -780 -383 1021
3680 1021 -710 -493 1140 -705 -536 1200 -767 -443 1124 -694 -467 1122 -575 -504 1062 -404
3696 -404 -621 1021 -269 -736 1002 -192 -849 1055 -80 -945 1057 -118 -966 1005 -68 -926 934
$$ packed form
3581a120J543K99j691J264L83j595J019P20j725Q00J075j825P19J179j941P24
3597a72J270j932N74J334j942N64J337j787M47J344j651J36J517j464k29J753
3613A099j484l47J870j476m69K017j565m22K023j569n04J899j372n14J880j235
3629a69o82J766r26q98J765p55j114J856o28j272J860m93j410J911m69j387J783
3646G38m49j301J657j52j486J511J9j520J333L54j716J273N70j865J255O72j960
3663a067J282P23j998J205P83j950J046Q70j813Q89R03j693N79J234j773L97J404
3680A021j731K17J633j845J69J736j967L24J567j818K27J589j697P1J566j466
3696d04k17J642j290m67J738j194o57J904j135q65K002j175q48J971j073q58J860
$$ plain form
3713 934 -10 -944 821 91 -920 653 289 -997 543 396 -1001 512 562 -1139 488 593 -1136
3730 -1136 473 616 -1047 435 660 -1025 342 653 -975 200 778 -847 48 871 -888 -140 993
3747 993 -884 -114 1036 -909 -170 1100 -878 -239 1071 -838 -252 992 -683 -324 985 -605
3763 -605 -524 955 -397 -612 1033 -388 -695 1112 -319 -769 1095 -335 -744 1090 -258 -766 927
3780 927 -185 -733 809 -11 -839 763 114 -900 744 242 -1062 673 308 -1117 723 376 -1132
3797 -1132 751 435 -1083 623 418 -1034 523 550 -1030 383 655 -1028 294 829 -1017 213
3813 213 891 -996 155 947 -1060 125 934 -1040 137 958 -964 -2 885 -813 -110 896 -762
3830 -762 -265 989 -719 -374 1003 -605 -465 1071 -642 -494 1115 -620 -457 1006 -524 -514 969
$$ packed form
3713I34r44r34J765p30j011J573l64j286J540j47j397J513N0j701J627J05j729
3730a136J609J43j663J482K25j685J367L11j628J175N78j625Q95Q23j759P48J133
3747I93j877P70J150j945P39J270j978O39J310j909N86J244j675L59J309j590
3763f05Q1J479j352k15J645j421l07J807j431m50J864j430m09J834j348n08J693
3780I27j112n48J542q20q28J602o49j014J644n02j304J735l65j425J840l47j508
3797a132J883l16j518J706k05j452J557K7j580J413K72j683J322N35j846J230
3813B13O78j887J151P92k007J185Q09j974J177Q21j922R62Q87j698P03J006j658
3830g62M97J254j708L45J377j608J40J536j713J48J609j735J63J463j530J0J483
$$ plain form
3847 969 -402 -584 868 -226 -649 864 -89 -792 834 55 -905 892 146 -1053 884 163 -1015
3864 -1015 871 168 -1004 749 256 -941 658 390 -963 531 485 -1056 441 639 -1054 380
3880 380 775 -1148 419 769 -1141 328 740 -1113 297 767 -987 240 749 -901 34 851 -861
3897 -861 -43 997 -834 -141 1059 -841 -320 1107 -799 -319 1064 -729 -336 1040 -624 -453 966
3914 966 -500 -520 956 -383 -666 982 -239 -813 1001 -184 -882 1013 -118 -1002 1022 -2 -926
3931 -926 1033 11 -932 894 84 -972 798 222 -999 751 352 -1048 682 453 -1095 712
3947 712 512 -1193 669 458 -1165 633 500 -1071 478 545 -983 350 656 -1049 257 814 -1013
3964 -1013 117 843 -987 81 956 -963 -12 960 -918 -98 1020 -899 -130 1001 -770 -258 972
$$ packed form
3847I69j371j82J452j094m23J513r53p03J626p79r60J797p46j199J937p21j178
3864a015J886p03j172J753m93j197J599k68j353J494m6j541J497J98j693J434
3880C80L95j923J567L50j910J469M12j853J410M70j754J227N09j650R35Q17j712
3897h61Q18J040j831O93J200j900N21J427j906M80J383j793L93J376j664J71J419
3914I66j466k0J476j339k83J648j221n74J814j185o98J895j131q84K024j024r24
3931i26J959j022r43J826q10j056J770n76j221J750l99j400J730k29j548J807
3947G12k00j705J862k11j623J798j33j571J549O7j528J333L06j705J306N57j827
3964a013J130P26j830J068Q75j919R51R72j878Q20J118j919P69J131j771N12J230
$$ plain form
3981 972 -578 -378 1010 -496 -500 1034 -437 -651 1112 -448 -716 1144 -396 -762 1144 -400 -788
3998 -788 1100 -291 -808 1050 -167 -839 1010 -41 -971 972 133 -1107 977 170 -1194 1006
4014 1006 250 -1188 986 293 -1130 859 287 -1122 794 393 -1095 646 534 -1090 540 576 -1158
4031 -1158 471 735 -1201 356 793 -1120 327 813 -1099 267 842 -1032 152 856 -985 41
4047 41 918 -824 -27 996 -819 -241 1081 -765 -355 1172 -767 -445 1213 -747 -551 1140 -674
4064 -674 -542 1176 -550 -639 1149 -428 -757 1089 -304 -856 1109 -225 -1007 1150 -157 -1043 1100
4081 1100 -78 -1084 1109 -118 -1025 1028 -31 -993 919 130 -1007 881 222 -1055 718 400
4097 400 -1113 748 528 -1166 689 586 -1201 600 593 -1133 505 651 -1124 442 672 -1115 324
$$ packed form
3981I72j550K00J388j506mJ534j471k14J763j560k68J860j540l66J906j544l88
3998g88J888j391n17J858j217o72J849j051r30J943q39j240K084q07j364K200
4014A006p56j438K174o93j423J989n72j409J916m01j488J741j12j624J630L6j734
4031a158J629K64j936J557M37j913J447M86j912J366N75j874J184P04j841J026
4047D1Q77j742P97J023j815N78J322j846M10J527j939L22J658j960J96J691j814
4064f74J32J718j726q9J788j577l29J846j393n52J965j334p82K157j307q86K143
4081A100j178j006K193j227r07K053j059r62J912p89j137J888o59j277J773l18
4097D00j513J861k20j694J855j03j787J801pj726J638J46j775J566K30j787J439
$$ plain form
4114 324 772 -1015 57 909 -1038 -9 1058 -1036 -129 1138 -999 -158 1131 -1017 -209 1223
4130 1223 -935 -220 1111 -833 -338 1153 -717 -432 1162 -650 -585 1274 -572 -695 1293 -572
4146 -572 -712 1315 -498 -811 1259 -520 -780 1194 -414 -751 1090 -289 -848 1014 -124 -948 995
4163 995 54 -1036 987 145 -1074 981 171 -1142 903 245 -1067 870 259 -1128 783 441 -1095
4180 -1095 604 577 -1030 443 718 -1110 349 813 -1222 329 905 -1125 252 911 -1220 216
4196 216 916 -1148 113 937 -1030 31 972 -933 -97 1021 -906 -261 1185 -891 -263 1258 -888
4213 -888 -363 1322 -851 -405 1242 -787 -439 1199 -671 -528 1156 -529 -679 1184 -394 -736 1094
4230 1094 -331 -865 1168 -285 -926 1175 -202 -1021 1126 -154 -944 1025 -51 -874 914 61
$$ packed form
4114C24M48j787J072Q52j947J029J067k094R07J267k137Q41J289k148Q08J432
4130A223k158P15J331j944M95J491j870K85J594j812O5J859j846j23J988j865
4146e72j40K027j813l13K070j779k60J974j608l37J841j379n59J862j138q24J943
4163I95r41j090K023q42j219K055q10j313K045o58j312J937o11j387J911l42j536
4180a095J699k7j607J473K75j828J459M64k035J551N76k030J377O59k131J436
4196B16P00k064J261Q24j967J061R41j905Q36J118j927O45J446k076O28J521k146
4213h88N25J685k173M46J647k029L48J638j870J43J684j685j50J863j578l42J830
4230A094j425n34K033j453o41K101j377q19K147j280p90J969j076q23J788q53
$$ plain form
4246 61 -959 832 209 -1037 774 339 -1083 693 470 -1176 703 532 -1281 718 538 -1222 612
4263 612 559 -1252 524 685 -1148 383 737 -1112 242 857 -1121 150 966 -1122 97 994 -1197
4280 -1197 128 1051 -1116 71 1037 -1083 24 1009 -965 -104 1030 -849 -198 1032 -751 -313
4296 -313 1100 -669 -417 1109 -653 -502 1154 -581 -550 1141 -552 -592 1055 -429 -588 1004 -306
4313 -306 -695 936 -165 -805 974 -92 -932 980 68 -1037 1029 40 -1084 1011 115 -1058 952
4330 952 132 -1059 825 215 -1025 762 337 -1046 629 487 -1102 569 600 -1183 556 656 -1183
4347 -1183 589 598 -1221 493 626 -1068 436 637 -982 292 788 -963 133 762 -855 44 862
4364 862 -868 2 916 -909 -20 976 -875 -122 997 -765 -150 934 -695 -211 972 -559 -365
$$ packed form
4246F1j020J791o23j246J811m35j422J776k23j646J879j71j813J999j80j760J834
4263F12n3j811J776J61j833J531L54j849J354O15j978J271Q16k088J219Q97k191
4280a197J325R23k167J187R66k120J107R85j974Q61J134j879O51J230j783M38
4296c13J413j769K52J526j762J51J656j735L1J691j693m0J647j484j59J592j310
4313c06l89J631j101o40J779j066q40J912r12j105K066r89j124K095q96j173K010
4330I52q20j191J884o10j240J787m25j383J675j42j589J671L1j783J739J00j839
4347a183J772Rj819J714J33j694J504K01j619J274M96j751J096O29j617Q99Q18
4364H62j730Q70R14j825Q89R96j851P53J119j762O15J084j629M84J183j531J94
$$ plain form
4381 -365 956 -490 -512 936 -431 -603 1062 -400 -711 1088 -401 -690 1064 -344 -690 990 -293
4398 -293 -704 876 -129 -684 819 -31 -822 828 62 -921 783 97 -967 833 137 -986 818
4415 818 145 -901 729 189 -902 622 209 -846 501 329 -820 407 459 -822 399 503 -902
4432 -902 323 607 -923 287 574 -938 271 573 -839 290 611 -761 86 609 -698 19 726
4449 726 -651 -149 822 -568 -198 891 -667 -195 938 -642 -221 890 -590 -242 787 -500 -296
4466 -296 764 -438 -316 760 -403 -497 797 -280 -565 814 -244 -604 873 -310 -579 841 -265
4483 -265 -557 832 -254 -605 741 -110 -619 637 -23 -597 655 79 -658 551 202 -777 603 169
4501 169 -778 618 187 -749 524 243 -694 441 196 -612 325 300 -576 219 416 -657 173 486 -725
$$ packed form
4381c65J321j446k2J448j367j72J665j462l11J799j489k89J754j408l46J680j283
4398b93m11J580j005n55J503q50p91J650p66r83J704o86j064J800o96j123J804
4415H18o73j046J630n40j091J524m13j055J347j72j149J227N2j281J221J04j405
4432i02J225K84j530J210K87j512J209L02j412J129L21j372Q47N23j307P17P07
4449G26j377N02R71j390L70J089j558M72J133j580M21J111j480L48J029j287K04
4466b96J060j202J22J076j163r4J294j077k85J379j058l60J477j183k69J420j106
4483b65k92J389j086l51J346q51n09J256o60n74J252n76p37J209l49r79J380m34
4501A69r47J396m31r36J273k81r37J135k45q08R37k5q76P95J97j073Q30L13j211
$$ plain form
4520 -725 165 557 -702 175 612 -750 191 520 -630 132 513 -589 78 545 -507 -10 547 -474
4538 -474 -117 597 -504 -213 691 -490 -223 724 -531 -184 679 -552 -177 613 -404 -194 540 -307
4556 -307 -251 497 -246 -340 566 -138 -416 543 -109 -415 608 -107 -440 641 -129 -402 582 -98 -400 536
4576 536 -70 -366 381 62 -415 397 165 -509 339 167 -570 406 235 -649 374 209 -610 392 206
4595 206 -501 352 248 -494 241 227 -471 130 274 -451 191 396 -532 96 442 -585 176 419 -517 168
4615 168 369 -481 170 354 -417 126 295 -318 37 357 -331 -109 398 -309 -142 465 -340 -178 495 -357
4635 -357 -142 402 -327 -99 424 -302 -106 390 -197 -181 367 -101 -275 323 -105 -267 408 -54 -304 397
4655 397 -113 -350 429 -96 -305 467 -95 -314 341 -143 -229 348 -19 -233 279 35 -301 241 109 -401
$$ packed form
4520g25Q90L92j259Q77M37j362R41L29j150P62L81j102O67M67j052M97N57j021
4538d74L57P14j101K91R04j181K67R47j255L47Q63j231L75P90j017K10P34q47
4556c07N6P48p43r4R06p04k78R59o52l06J023p15l33J081p70k73R84o80l02R36
4576E36o06k96P47l19m77Q12k32o74Q48j72p37R76j71q84J023j65q19J002j86
4595B06p07Q53j04p42P35j4o98O01J44p25O42K05r28O28L46j027P61K43r36O85
4615A68K01q50O51J84p71N43J69o13L55L20o88K22N07p07J67O07q05J62O73q52
4635c57K15N44p29K28N23p26J96M96n87J6N48m68j74N98m28j62O75m62k50P01
4655C97n10k37P79n25k09P72n62k19O55m84q6N77l67k14N12k44l36N42j32n10
$$ plain form
4675 -401 303 47 -455 325 67 -347 312 42 -390 345 52 -328 195 105 -271 202 170 -261 122 258 -305
4696 -305 70 265 -342 134 272 -383 148 261 -344 138 181 -365 26 153 -239 -13 154 -248 -43 251
4716 251 -215 -26 321 -238 -124 338 -239 -101 327 -241 -54 354 -223 -21 293 -258 -32 226 -141 -73
4736 -73 250 -124 -239 292 -37 -170 307 -60 -188 350 -129 -232 335 -170 -186 316 -153 -163 278 -121 -190
4757 -190 176 -12 -170 200 43 -243 218 34 -281 219 41 -256 264 29 -249 254 -21 -166 213 6
4777 6 -165 111 83 -155 119 164 -174 48 158 -179 107 188 -275 104 145 -274 146 78 -241 63 22 -221 48
4800 48 121 -179 2 183 -93 6 128 -147 -92 194 -180 -37 176 -126 -6 176 -207 26 157 -143 6
4821 6 130 -80 -40 107 -36 -57 174 -117 -141 187 -65 -112 203 -72 -96 175 -126 -98 144 -85 -96 118 -74
$$ packed form
4675d01P04k56n02P80k58m14O59k70m32P35k93l80N23r0l76M73l2m31L83J36n63
4696c05L75J95o07M76J38o55N31J13o05M82M3n46L91J27l92K26J67m02K05K94
4716B51m66J89L47n59J14M62n77J38M28n68J87M08n77K02L14n51K26K58l67O8
4736g3L23l74j15N31l29j33M77l67j28N38m79j03N67n05j6N02m69j0M41l99o9
4757a90L66j88j58L70j57k86M61j84l15N00j78k97N20k35k78N03k75j45L79k07
4777Fj71K76k8k38K74M5l38K22J10l37K86Q1m63L79M1m19M20o8l19L04m1k43K69
4800D8P3l00J81J81k76R9J22k75N5K86l74J43K13l02J20J82l83K33J31l00J49
4821FJ24k10M0J47j43k1K31k91k4L28k52m7L15k75k4K71l01K8K42k29j1K14j92
$$ plain form
4844 -74 -45 89 54 -29 37 0 -106 153 63 -117 172 52 -140 117 18 -76 147 -21 -85 68 -68 -81 36 -13
4868 -13 -80 33 63 -102 30 32 -103 41 62 -141 36 18 -111 60 -25 -56 129 -4 -70 56 -55 -54 -4 17 -27
4893 -27 -26 25 -5 -32 96 -41 -28 0 -66 28 -19 -20 -11 -1 -7 74 -65 -15 44 -44 -2 -12 -17 -20 11 7 -30 19 40 37 9 4 16
4926 16 56 4 -16 113 -32 -8 91 -24 54 115 -83 66 73 -46 25 5 -45 16 -27 -78 -37 66 -31 -89 90 -85
4952 -85 -4 88 -72 -64 40 -53 -45 56 -73 0 80 -25 -5 84 3 -47 38 36 -114 118 -6 -148 129 121 -93 70
4978 70 33 -139 136 6 -142 91 28 -188 82 70 -99 67 107 -212 78 147 -216 113 106 -189 127 77 -206
5001 -206 83 49 -191 121 80 -148 98 102 -220 30 168 -183 69 172 -159 51 147 -228 3 179 -189 0
5023 0 234 -144 10 204 -208 -31 275 -164 -42 200 -136 -96 210 -126 -109 275 -159 -185 264 -101 -170 281
$$ packed form
4844g4K9J34l5q3O6l7j06K59r0j80K89j20j92K57r9r4K23j68o4J53j36j3J17m9
4868a3o7J13L0j65J32Kj35J44K1k03J77j8j29J71q5l1J85j33o6J26j11JN0K1m4
4893b7JN1l0k7J28j37J3K8o6R4m7jRJ0oQ1j39N0N9q8M2j0nlL1ml7M9K1lk8nJ2
4926A6M0n2k0J29j45K4R9j15P8O1j98J49Pj19P1k0n0O1m3n1M1J03r7n8J79j75
4952h5Q1R2j60QJ04r3QJ01j29P3Q0j05K0Q9q1n0Q5kj50K32j24j42K77qk14J63
4978G0l7j72K75j30j48K33o3k16K70j2j69J66M0l19K90O9l63L29pk95L16n0k83
5001b06K89l4k40L12m1k28K46Ml22K50J38l51K52J03l31K10R6l75K31J76l68J89
5023@K34l78J54J94m12J77L06m39J22K42l36M0L06l36J7L84m34k6M49l65o9M51
$$ plain form
5045 281 -118 -179 314 -96 -163 245 -65 -172 287 -97 -181 307 -32 -303 266 7 -308 263 -10 -309 240
5066 240 -14 -294 270 -3 -262 260 5 -259 183 46 -277 183 120 -241 198 89 -302 154 134 -320 137
5087 137 166 -300 195 221 -284 95 203 -305 114 243 -251 14 223 -281 37 317 -284 -46 316 -282 -31
5108 -31 364 -304 -25 287 -284 -126 325 -248 -143 356 -260 -182 397 -170 -187 411 -196 -221 421 -155 -213 413
5130 413 -113 -222 406 -120 -238 377 -86 -307 387 -53 -322 356 -56 -344 271 9 -355 313 31 -360
5150 -360 342 52 -418 285 71 -383 255 111 -356 250 134 -368 215 146 -435 241 167 -394 168 243 -400
5171 -400 144 242 -386 94 286 -324 79 303 -399 -5 306 -383 16 289 -391 -3 361 -398 -26 426
5191 426 -306 -100 394 -293 -48 469 -258 -153 447 -234 -130 431 -263 -212 443 -249 -191 467 -209 -196 369
$$ packed form
5045B81l99o1M93m10o7M08l10j07M59l84q4M88l39k71N69k59l15N71k73k99N49
5066B40k54k80N64k73k59N22k55k64M42j37l23M60o3l61M39j09l91M56k0m54M57
5087A37K9m66M95K6n05L79J08n08M19J29m94K65K09n04L18K80o01K38L62n98K51
5108c1L95o68K79L12n71J58M51n73J05M99o16P8N79n67j7N98o07k5O42n76n8O26
5130D13n26j09O28n26j18O15m63k21O94m40k69O78m12k88O15k62l64O68k82l91
5150c60P02k90m70P03k14m54O38j44m67O06j16n02N83o9n81O76p4n61N62P5o43
5171d00N44R8o28M80J92o10M03K24p02L94L11o89L99K73o80L88L64p59L72M52
5191D26p32K06M94o87K45N17p27J05O00o81J04N61o94N1O55o92N8O58o76J3N65
$$ plain form
5212 369 -169 -211 399 -164 -248 390 -128 -352 355 -79 -264 403 -43 -265 340 -9 -356 353 38 -344 317
5233 317 55 -363 288 105 -397 325 152 -367 243 191 -407 201 218 -417 241 251 -458 188 272 -483 225
5254 225 273 -412 75 336 -433 92 324 -390 50 356 -405 42 399 -391 31 377 -352 -18 408 -393
5274 -393 -42 363 -374 -12 337 -281 -82 366 -265 -149 366 -257 -151 413 -218 -170 429 -174 -221 361 -137
5295 -137 -247 407 -99 -279 401 -103 -270 367 -82 -285 346 -19 -341 387 87 -350 365 79 -395 308
5315 308 75 -453 321 82 -439 321 159 -352 296 192 -370 272 161 -370 187 151 -397 225 246 -411 188
5336 188 246 -428 181 254 -391 177 282 -402 128 309 -382 16 298 -270 -5 270 -361 -42 386 -307 -42
5357 -42 385 -246 -136 381 -268 -131 375 -249 -123 377 -222 -172 330 -163 -125 353 -113 -219 353 -133 -293
$$ packed form
5212C69n38m2O10n63q4O38n18k24P07m34j85O67m46k22O05l49l47P09l15l82O61
5233C17k62m18O51j83n02P22j73n19O10n2n98O08J7o35O58J0p09O46Q4p55P08
5254B25M8o85M87K61p69N25K32p14M40L06p61M47L57p90M22L46p29L34M26q01
5274c93L51M05p37L62L49o18J99M48o31J16N15o23J06N64o31M8N99o03m7N82m98
5295a37j10O54n06j80O80n04j67O37m49k03O31l65l22P28l00m37P15k86m74P03
5315C08k33n28P74k39n21P60j62n11O48j04n62O42j11n31N57l6n48O22K1o57N99
5336A88N8o74O09P3o45N68J05o84N30J81o91L98K82n68K65K75o31L19M28o93K65
5357d2M27o31J10N17o49J37N06o24J26N00n99N0N02m93L8M78m66j06N72m86j60
$$ plain form
5378 -293 374 -36 -267 321 -45 -345 356 -31 -296 371 -33 -277 311 -21 -351 345 89 -359 247 89
5398 89 -347 248 87 -381 248 144 -418 258 198 -308 214 175 -322 179 233 -367 122 216 -278 83 252 -257
5420 -257 109 185 -266 29 326 -329 11 299 -347 -23 243 -260 -80 282 -239 -70 271 -180 -160 327 -119
5441 -119 -118 280 -118 -177 338 -79 -166 376 -136 -188 342 -133 -213 277 -149 -247 320 -54 -229 319 50 -292
5463 -292 234 39 -320 264 24 -347 212 71 -285 220 50 -299 273 87 -253 203 56 -239 97 180
5483 180 -271 117 173 -321 62 232 -270 54 235 -263 51 192 -202 61 233 -204 -7 222 -188 -26
5503 -26 231 -174 -118 258 -170 -116 290 -150 -140 290 -176 -96 321 -166 -84 297 -127 -98 265 -115 -137 237 -41
5526 -41 -140 240 -2 -245 217 13 -212 248 54 -193 219 48 -258 219 0 -232 162 33 -165 143 69
$$ packed form
5378b93O67m10k31N88l66l00P01l87k65O67m04k44N88l32l30O96k56m48O06j58
5398H9m36N95j61m68O29j04n62O76o0n06N22l9m97N01N4o00M89R4m94L61J69n09
5420b57L66P6m51K95K97o55L40K88o46L24K66n03J80L62n21J69L41m51K0M87m46
5441a19JL98l98n9N15m17q7N42n12n2N30m75q0M90m26r8N67l74j75N48k69l42
5463b92N26j95l59N84k40l71N59j41l56N05j70l49N72j86l40M56j47k95L36Q3
5483A80m51L88N6m94L83J70n02L24J81m98L14J41l94K63J72m37J97K29m10J62
5503b6K57m05N6L76m28N4M06m40J0M30m66Q0M17m87Q2L81m24K9L63l80k2L74k78
5526d1r9L80k42k43M62k04k25M60j94k47M12j71l06M77k19k32L94j29j98L08p4
$$ plain form
5547 69 -152 19 99 -192 38 180 -244 89 150 -237 40 134 -249 34 171 -177 59 195 -196 6 177
5568 177 -124 -82 221 -173 -112 193 -124 -81 223 -148 -91 246 -97 -84 214 -144 -127 190 -150 -130 186 -37
5590 -37 -177 167 -4 -136 169 -51 -167 172 22 -247 162 -1 -209 187 -12 -195 148 28 -161 112
5610 112 53 -122 119 118 -208 64 125 -198 57 107 -193 92 123 -191 99 81 -173 60 147 -119 31 148 -142
5633 -142 -31 198 -158 -34 146 -112 -41 221 -117 -3 182 -141 -3 227 -127 -67 168 -71 -99 194 -28
5654 -28 -155 186 -31 -101 159 -44 -130 165 -27 -162 168 18 -146 140 -22 -134 171 -3 -175 173 19
5675 19 -118 139 30 -96 73 52 -140 66 91 -183 61 110 -171 96 138 -221 105 180 -167 59 115 -130
5697 -130 21 122 -130 -5 147 -132 -54 143 -134 46 269 -190 -36 203 -156 -86 181 -159 -67 201 -121
$$ packed form
5547F9k21J71Q0k91K30J42m24L33O1l87K77R4l83K83J37l48K36J36l91K02J71
5568A77l01M2L03l94O1L05l17M3L04l71N7L37l43J3K98l58J7L17l40K0L16k23
5590c7j40L44j71j32L05k20j16L39j50k69M09j63k08L96j99j83L43j20j89K73
5610A12n9j75K41jl26K72O1l23K55N0l00K85L1l14K90j8k54K33Q7k66J50J17k90
5633a42J11K29l56J24J80k58P1K62l38J14J85l23J38K30l54O0K35k39k8K93k22
5654b8j27L41k17p0K60k03q6K95j92j35L30j50j64K86j62j12L05j74j72L48j54
5675A9j37K57j09j26J69k1j92K06K5k74K44M9k81K67M2l59L26P5l47K26N6k45
5697a30J51J01k52J25J52k79P8J97k77J80K23m59J54K39l59P0K67l40R2K68l22
$$ plain form
5718 -121 -79 212 -96 -125 174 -55 -98 208 -46 -172 217 -40 -151 209 -39 -155 178 -93 -182 163 -42
5739 -42 -133 136 -9 -106 125 35 -183 103 107 -231 129 115 -214 74 139 -206 98 131 -236 110 108 -180 93 151
5763 151 -163 132 147 -172 17 135 -205 -6 154 -202 -11 223 -152 -42 238 -184 -36 221 -180 -12
5783 -12 221 -200 -78 152 -96 -122 209 -47 -142 235 -66 -162 163 -73 -189 245 -3 -152 225 -38 -143
5804 -143 139 -46 -195 189 10 -165 187 36 -168 116 47 -272 150 65 -194 176 88 -272 157 81 -212
5825 -212 113 113 -195 126 133 -171 93 110 -198 26 211 -131 -5 222 -188 3 183 -176 -30 188 -212 18
5847 18 204 -184 24 257 -121 -92 194 -132 -71 255 -152 -104 180 -139 -72 240 -66 -112 256 -100 -124 188
5869 188 -45 -138 205 -99 -102 203 -21 -175 208 -8 -206 166 34 -177 136 53 -245 184 4 -273 125
$$ packed form
5718a21M2K91l08k9K99k29m3L06k54j26L89k57j11L60k48j16L33k71q9L45k05
5739d2r1K69j45r7K31r0k18K86Ml38L60j4l29K88O5l45L04L3l67L46kk88K73N8
5763A51l14K95J5l19J89J18l40J99J60l56J91K34l75J10K80m22J48K57m01J68
5783a2K33m21J22K30k48k6L31k56r5L77l01r6L25k36j16M34k48j49L77k63j05
5804a43K82j85j49L84j79j75L52j51k04K84o9l19M22q5k59L70q8l60M29p6k93
5825b12L25%l08L21Pl04K64J7l08K24J85l42J26K27m10J91J80l59J46K18m00K30
5847A8J86l88K08K33l78K9K86l26O1L26m07M8K84l19O7L12l06m6L68l56k4L12
5869A88k33r3L43l04lL05k24j54L83k16j98L72j32k11L13q3k98M29j80k77L98
$$ plain form
5890 125 42 -202 134 65 -196 147 73 -165 148 94 -136 46 109 -213 3 154 -244 59 177 -210 43 120
5912 120 -147 30 155 -174 96 150 -126 12 224 -140 -19 210 -102 -25 228 -127 -106 229 -150 -81 174
5933 174 -127 -35 232 -165 -47 186 -92 -31 174 -66 -59 121 -48 -137 147 -2 -139 165 -20 -149 206 -1
5955 -1 -141 169 -32 -131 137 8 -150 105 18 -149 90 35 -122 52 76 -137 98 74 -160 84 61 -149 110
5978 110 15 -149 100 77 -130 60 81 -100 86 89 -92 11 82 -74 9 136 -126 11 190 -115 -52 146 -124
6001 -124 -71 136 -114 38 129 -104 -71 82 -64 -36 101 -54 -67 153 -38 -108 111 -28 -53 114 -103 -85 172
6024 172 -60 -65 119 -94 -49 133 3 -105 115 43 -19 55 26 -130 75 60 -92 91 31 -132 92 30 -81
6047 -81 63 -11 -92 78 51 -24 68 19 -77 -30 36 -112 21 107 -109 18 113 -163 22 90 -122 -36 77 -110 -23
$$ packed form
5890A25q3k44L36o9k61L43p4k38L13n4k30J82O3l22K16J51l98L03J18l87K53P7
5912A20k67J77J25l29K70N4k76J38K12l64J21K29l12P7K53l55K1L35l79O9K55
5933A74l01R2K67l97J18K33k78O1K05k40PJ80j69q9K84j49j37L04j85j29L55k07
5955aj40L10k01r9K68j29j58K55q7j67K39n5j57J74K4k13K35k4k34K44k3k10K59
5978A10r5j64K49k3k07J90K1j81J86Lj81J03P1j56Q3J27k62J37J79l05O3J98k70
6001a24N3K07k50J52R1k33L3J53j46K8J37j55j3K20j91p0K19j39k5J67k17J8K57
6024A72k32nJ84k13M5J82j30j08K20p2o2P4k9j56K05j5j52J83o0j63K24o2j11
6047h1J44p4q1J70k7p5R2m9r6M7O6j48J33Q6k16J27R5k76J85O8k12Q6J13j87Q7
$$ plain form
6072 -23 42 -91 9 9 -38 -40 96 -55 -19 98 -34 -49 123 -124 -35 96 -114 9 108 -39 -20 80 -58 -5
6096 -5 59 -24 -54 42 14 -29 91 -23 -107 60 1 -44 118 -27 -109 105 -54 -60 91 -43 -58 32 -31 -35 55 23 -81
6123 -81 -30 54 -52 52 33 -27 56 51 -123 31 33 -114 -15 39 -97 -3 28 -99 27 26 -68 -3 90 -94 -13 45 -69
6150 -69 31 68 -85 10 57 -72 0 64 -25 8 74 10 29 82 -5 11 23 -17 -19 29 -42 -78 119 -17 -43 24 23 -58 47
6179 47 -42 -16 64 -85 28 39 -13 -30 43 5 -35 14 28 -72 -3 -11 -104 50 -44 -96 25 43 -35 35 32 -23 34 33 -31
6208 -31 -7 51 -12 -14 79 -64 1 16 -111 6 56 -65 -1 31 -72 29 -40 -36 50 -64 -68 -28 55 -30 0 19 -24 -25 -1
6237 -1 8 -26 71 -50 -34 40 -32 -19 55 5 -32 17 -36 -5 -10 -35 -38 -11 20 -57 38 22 -91 17 58 -65 34 -4 -20 35
6267 35 -72 -45 37 -26 -20 -15 28 -38 2 71 -63 -41 23 -63 39 7 -63 15 25 -42 -20 18 -42 1 14 17 -34 -27 -46 -59 61
$$ packed form
6072b3O5j33J00%m7kJ36j51L6J17j32j5J72k47Q9J31k10J23R9j47J9J00j38N3
6096eO4q3l0R6k8m3J20j14q4J67n9m5J62j45q2K14j59oJ51j34j5R0o3mR0l2j04
6123h1N1Q4j06J04j9o0Q3nj74J54Kj47R9N4j36R4L1j27J26jr4O5R3j84Q1N8j14
6150f9J00L7j53R5M7j29P2O4q9L3O6o4J9N3q7J6J2m0kM8p1l6J97j36k6O7jq1J05
6179D7q9K6Q0j49J13J1n2j7P3l8m0M9J4j00O9qr3J54r4n2J21J8p8P0ln5N7jo4
6208c1K4N8o3kR3j43O5J5j27J17N0j21O4L2j03J01o9MQ6j14mM0Q3q5L0J9m3jK4
6237aRl4R7j21J6P4p2J3P4n0l7M9n3L1nk5lK7L1p7R5j6j13J08M1j23R9l8j6N5
6267C5j07K7Q2o3ONM3o6M0O9j34K2O4q6J02l2p0P8J0o7K2L8o0M3J3Ln1Pj9j3J20
$$ plain form
6298 61 6 -54 71 -33 -34 79 10 -2 57 -90 -28 15 -8 -44 61 -67 -67 36 -4 -29 -3 44 -31 31 -14 -46 67
6325 67 41 -50 63 58 -43 1 -13 -7 64 36 -77 85 50 -20 64 6 -35 34 17 -45 19 85 -127 42 70 -82 70
6352 70 30 -31 9 7 -3 -4 62 -40 -38 38 -37 -17 64 -74 37 27 -77 -29 57 -36 -29 88 -44 10 39 -36 -50 73 -19
6381 -19 -52 83 7 -75 69 -54 -67 73 5 -64 100 18 -77 87 19 -64 82 -29 -64 75 2 -66 61 29 -89
6406 -89 29 27 -61 76 51 -85 79 50 -96 63 77 -82 64 74 -55 53 32 -79 66 27 -81 18 82 -95
6430 -95 5 68 -88 33 73 -71 -73 140 -76 -40 136 -124 -26 128 -76 -11 153 -73 -1 119 23 -18 144 -62
6454 -62 -54 125 -9 -71 89 -37 -33 106 -55 -73 64 -34 -74 98 -7 -98 61 -25 -81 88 13 -71 116 74 -103
6479 -103 103 42 -106 27 20 -74 22 -3 -201 93 66 -70 97 77 -114 6 134 -95 -6 86 -136 21 120 -85
$$ packed form
6298F1n5o0J25j04jJ13o9j2N9j47O2M3k3l6J05j28%J03m0k5K6M7p5O2m5l2J13
6325F7k6r1J13nj01M4j4OP1k8j13J62l5p0Q4n8m1O9j7o2O4O6k12J69K8j52J52
6352G0m0o1M0kj0jO6j02KP6p5K0Q1j38J11j0j04M8Q6r3PJ17j32N4K9p5j4J23r2
6381a9l3J35p6q2J44j23j3J40o8o9J64q2r5J64o8q3J46j11l5J39p3o8J27l2j18
6406h9J18kq8J37k5j36J64k9j46J59J4j59J46J0j29J08k1j11J45l9j08R9O4j77
6430i5J00O3j56J21M0j44kK13k16L6J76k60R8J54k04O5J64k26P2J20r6m1J62k06
6454f2QJ79j34o2J60j26MJ39j61j8J37r8m0J72j05r1J59q6n6J69p5q4J87m2j77
6479a03K06o1j48J33pr4R6k5j98K94k7j36J67k0j91J20J28k29Q9R2k22J57R9k05
$$ plain form
6503 -85 -14 121 -142 12 67 -132 14 55 -106 -30 128 -88 -24 168 -45 -51 110 -18 -61 89 -71 -70 150 -63
6527 -63 -33 149 -85 -57 131 -81 -9 102 5 -64 72 -26 -6 67 -9 -67 99 -20 -128 101 33 -144 120 36
6551 36 -134 99 -9 -103 117 35 -125 89 49 -65 77 25 -69 73 90 -114 24 25 -111 110 61 -175 24
6574 24 74 -112 130 77 -139 0 56 -100 32 105 -73 44 130 -107 -7 83 -128 -11 104 -77 42 8 -139
6597 -139 -27 114 -87 -8 86 -132 -37 46 -120 -1 142 -82 -94 130 -67 -34 103 -52 -129 155 -43 -105 135
6620 135 -65 -30 119 -66 -73 103 -84 -73 71 1 -85 62 16 -57 83 46 -64 60 8 -93 89 -5 -83 91
6644 91 -2 -142 122 34 -78 70 -9 -126 44 0 -144 66 35 -138 99 30 -144 48 55 -55 83 45 -165
6667 -165 72 110 -110 47 88 -57 16 36 -68 -2 141 -101 1 89 -135 -24 102 -104 -12 101 -74 13 142
$$ packed form
6503h5P1J35k63J54N5j99J46M1j61P6J58k16O4J92k13oJ61j28m3J50j60JK20k13
6527f3L0J82k34K8J88k12P2J11r7o9J36r8K0P3p6n8J66j19j08K29o8j77K64q4
6551C6j70K33j08r4K20q2j60K14m0j14J42n2r4J42J7k04J38Jj36K21m9k36J99
6574B4N0j86K42n3k16J39N6j56J32P3j78J17Q6k37J00R0k11J17J15j81J19l4j47
6597a39J12J41k01P9R4k18R5Q3j66J19J43k24j2K24j97L3J37j55p7K84j98o2K40
6620A35k00L5J49j85pJ76j87J1J44p0q6J47m6p3J40l7j10J24n2j01J82r4p8J74
6644I1r3j40K64q8j12J48p9j17J70m4j44K10l1j73K37o9j74J92Pj10J38l8k10
6667a65K37L8k20J57M1j45P3K0j04O6J43k42J02Q8k24J11J26k06R2J13j75Q7J29
$$ plain form
6690 142 -112 -36 89 -103 -66 136 -20 -88 132 -91 -70 131 -53 -159 144 -63 -104 155 3 -59 167 -77
6712 -77 -96 89 -12 -107 96 -33 -89 58 -21 -127 46 26 -75 130 22 -66 93 33 -50 75 10 -130 131
6735 131 25 -35 73 33 -60 59 32 -130 59 78 -140 87 28 -91 20 51 -26 55 62 -110 59 20 -83 54
6759 54 54 -71 -7 32 -14 -16 61 -95 -4 95 -87 32 77 -73 -30 62 -50 5 78 -103 -19 10 -45 -5 46 -43 -22 86
6787 86 -16 -44 80 24 -15 85 1 -82 67 -69 -2 76 -58 -9 28 -64 -56 19 -82 -4 82 -59 -45 23 24 -36 18
6814 18 -32 15 53 23 -55 23 -17 -47 49 -38 -33 67 -44 -31 40 9 -62 23 -2 -17 11 68 -38 79 19 -7 50 0 -47
6843 -47 42 -40 -65 69 -33 -44 96 -26 -47 -40 -20 -60 57 28 -16 32 4 -57 49 10 -58 17 -14 -42 74 -11 -90
6870 -90 60 15 -50 63 -9 -43 38 10 -25 14 58 -70 19 10 -32 23 112 -114 39 67 -118 32 21 -53 21 -11 -121
$$ packed form
6690A42k54P6J25j92L7K02j56o8K20k23K1K01j84j06L03k07m1K59j52o2K26k44
6712g7j9J85j01r5K03j29n6J47p9j06J73k0j01K05j08q8J59o0q3J25o5j40K61
6735A31j06o0J08m0r3J19k7j62J89J9k18K27n9j19J11L1p7Q1Pj72J69l9j03J37
6759E4%j25O4L9m6kP7j56R1R9j82J19M5j50M3R2j12N5P3j81Q4K9n5M0N1q9K1J08
6787H6j02k8J24n6l9J00q4q3J49j36O7P8j34M9L7r2QP5j01P8Q6j41J4O8Jo0N4
6814A8n0M7L8l0p8P8m0l0R6q7NJ00j11J3P1l1p1Q5k5j5K8N7j06J17o0k6N7n0m7
6843d7Q9q2k5J34j02j1J40j22k1PK0m0J17k9m4M8k8o1J06l9o8P5l1k8J16q5p9
6870i0J50m5o5J13p2l4Q1k8l5L9M4j28Q9rm2N5Q9k26J53K8j85J50j1p4P4l2j10
$$ plain form
6897 -121 32 34 -54 12 64 -41 -43 81 -74 0 80 -16 22 46 -104 31 66 -117 29 44 -101 8 83 -46 8
6922 8 47 -44 5 57 3 -26 82 -67 -29 109 -84 -82 124 -28 -25 137 -130 8 32 -89 -29 85 -51 -33 90
6947 90 -22 -39 75 -12 -51 110 -59 -73 100 11 -85 157 -37 -59 140 -60 -19 97 -39 -64 64 -64 -84 40
6971 40 -31 -144 100 39 -106 86 -5 -141 127 -35 -141 73 14 -102 77 -19 -92 139 -10 -91 24 27 -91
6994 -91 50 45 -66 65 61 -173 31 139 -138 76 79 -142 35 130 -127 27 42 -169 18 60 -111 4 118
7017 118 -111 -3 127 -169 -40 160 -70 -12 135 -143 -27 135 -147 -25 167 -98 -90 196 -67 -35 154
7038 154 -67 -69 189 -91 -109 170 -120 -78 248 -50 -113 165 -40 -120 208 -28 -112 143 -68 -121 165 44 -153
7061 -153 188 -3 -124 182 11 -189 124 60 -171 179 -33 -187 187 26 -153 100 36 -178 98 96 -173
$$ packed form
6897a21J53Kq8O6N2j05kJ24j55P4Q0r6L8K4j50J35L5j83J46J5j45J09P5j29N4
6922HL9r1M9N2n4k9J08j49L8J38j93KK06j52LJ62k67J38K4j21O0J14j36J8J23
6947I0j12j7J14q7l9J61j69j4J73q9r6K42j94k2J99k00M1J16j36k5J28j28k0J24
6971D0p1j13K44o1j45J92r1j36K68j62j06K14n9j16J79r6p3K31j49q1J15Lj18
6994i1J41nj11J31mk34K04J08k77K14Lk21J77R5k57J54J5k11J87M2j71J15J14
7017A18k29J08J30k96J29K00k30N8J47k78J16J62k82J22J92k65QK86k63L2J89
7038A54k21kK58k80j8K79k90M2L26k98o3K78k05q0L28k36q4K55k11n3K86j21j97
7061a53L41j91j21L06j71k00L13o4k31L50k12j54L74j61j79K53o4k14K76kk69
$$ plain form
7082 -173 104 68 -196 53 167 -220 44 139 -197 61 87 -238 39 108 -233 0 191 -188 -23 225 -115
7103 -115 3 159 -126 -50 260 -156 9 181 -171 -54 242 -138 -36 211 -169 -66 212 -161 -50 199
7123 199 -128 -45 192 -66 -120 226 -94 -119 224 -64 -148 257 -28 -165 221 -11 -147 184 -27 -179 169
7144 169 -46 -175 170 17 -188 131 64 -202 157 70 -244 126 113 -194 88 112 -195 135 82 -262 144 91
7166 91 -244 116 128 -210 67 113 -211 76 204 -254 44 209 -272 38 184 -272 -3 187 -199 65 233
7187 233 -208 2 227 -152 -34 168 -174 -55 235 -215 -50 257 -164 -90 266 -119 -111 248 -87 -86 195 -76
7209 -76 -133 196 -67 -153 211 -34 -169 199 -86 -202 203 -30 -235 209 2 -244 256 -61 -207 254 37
7230 37 -221 182 57 -192 164 68 -219 186 87 -205 90 91 -224 207 109 -279 115 109 -262 176 149 -236 97
$$ packed form
7082a73K77l6k64K49J14l87K64R5l36K58K6l25K77O9l41K33J91l79J65K48l40
7103a15J18J56k85P6L10m16J65J72l52J17K96l80J02K47l80J03K78l73J11K49
7123A99l27Q3K37k58n4L46l20k5L43k88q4M05k85j37L86k32j36L31k11j52L48
7144A69k15j29L45j53k05L19o7k66L59q7l14L70j3l07K82K4l07L30n3l44M06n3
7166I1l35L60J2l38K77M6l24K87J28m58K98J65m81L10J46m56K69J90l86K64J68
7187B33m41K10K25l79J18K02l42J19K90m50J65L07m21P4L56l85QL59l35JK81k71
7209g6n7L29k63q6L64k45j35L68k85j16M05k33k05M44k07k46N00l17j46M61k17
7230C7k58M03j25k49L56r6k87M05r9k92K95Jl15M31r8l88L94ol71M38k7l85L33
$$ plain form
7253 97 111 -215 62 145 -245 59 129 -198 46 157 -225 41 183 -195 0 239 -193 5 188 -230 -19
7274 -19 208 -141 -95 214 -127 -50 149 -191 -137 219 -167 -148 266 -147 -95 209 -139 -137 279 -122 -164 290 -79
7297 -79 -215 244 -80 -130 239 -66 -169 173 56 -219 275 -22 -227 230 34 -226 252 38 -292 173 47
7318 47 -180 136 52 -203 119 57 -227 36 91 -253 78 182 -238 67 141 -193 124 171 -208 83 153 -220
7340 -220 32 147 -222 61 194 -237 17 241 -233 -2 192 -160 5 230 -198 -42 248 -150 -102 238
7360 238 -133 -87 199 -154 -122 244 -138 -147 177 -156 -132 250 -72 -113 261 -19 -128 185 -96 -120 224 -21
7382 -21 -141 224 -39 -177 180 -30 -140 172 62 -203 143 9 -207 168 41 -196 172 18 -186 129
7402 129 74 -177 90 61 -149 155 158 -140 99 123 -137 88 91 -163 55 163 -240 30 115 -248 33 188 -204
$$ packed form
7253I7J4l26K77Q3l90L04P0l27K44J11l82K66J42l78J95K39m32J98J83m18K11
7274a9K27l49M6L09l41P7J99l40N4L56l86J9M14m13N2L04l48KM16m01m2M54l69
7297g9j36M59l24n0L69l05j03L42j17k75M94k97k05M57j96k60M78k14l30M65j26
7318D7k27L16q4k55L22o2k84K63N5l44L31J04m20L05P4l34L17M7l79K91P0l73
7340b20K52J15l69K83J33m31K54K24m74K31J94l52J65K25m28J56K90l98M8L40
7360B38l71M6K86l53L2L66l82rL24l33K4L82l22m1L74k80j09L13k81k4L44k45
7382b1j20L65k63j38L57k10j10L12j10k65L46j34k16L75j27k37L68j54k04L15
7402A29n5k51K67k9k10L04Lk98K39K4k60K25Lk54K18J08m03K70Q5l63K81J55l92
$$ plain form
7425 -204 25 185 -177 8 184 -114 -32 194 -144 -74 214 -192 -7 181 -159 -76 224 -168 -140 166 -153
7446 -153 -83 158 -107 -61 185 -64 -67 194 -82 -122 142 -81 -141 217 -34 -187 199 -48 -109 140 -36 -182
7468 -182 138 -50 -134 98 31 -171 155 -72 -123 152 75 -134 102 55 -168 58 31 -190 77 76 -160 86 119
7491 119 -191 96 144 -145 50 116 -96 68 101 -118 38 140 -159 63 168 -171 4 190 -150 -34 173
7512 173 -82 -30 101 -87 -56 147 -113 -23 143 -112 -65 237 -98 -50 181 -134 -102 160 -69 -90 131 -65
7534 -65 -59 158 29 -131 155 -5 -109 145 -13 -122 116 15 -125 105 -30 -146 99 18 -116 98 12 -176
7556 -176 86 42 -140 94 100 -137 118 55 -159 39 51 -105 70 36 -118 37 77 -89 55 101 -96 72 64
7579 64 -102 59 116 -92 3 80 -91 3 117 -123 26 121 -132 -39 92 -89 13 139 -67 -12 122 -43 -25
$$ packed form
7425b04K29J60l62J85J76k98Q2K26l38P0K88m06J85J88l40Q3L00l92K8L06l19
7446a53P0K41k65M6K46k49lK61k76m0K64k23o0L58k51j53L86k47o1K49j76j46
7468a82L20j88q4K32o7k02L26k27n1K75p7k09K36m7k23K26k7k21K67jk36K46L3
7491A19l10K87M8k89J95O6k12J64L3k19J56J02k99K22J05l39J75J86l40J16K07
7512A73k55N2J31j88L1K03k60R0J66k55M7L02l35M8K31l15L2K62k29k1K21j96
7534f5OK17j29j60K86j60j04K54j58j09K38j01j40K30j35j16K45q1j34K14q6j88
7556a76K62m4j82K34Ok37K55o3k14J98J2j56J75l4j54J55M0j66J44M6j97J68q
7579F4j66J61N7k08R5P7j71R4J14k40J49R5k53R3J31j81J02J26k06N5J34j65J8
$$ plain form
7602 -25 104 -43 -72 137 -44 -61 80 -36 -75 107 -76 -62 61 -70 2 156 -20 -49 102 -7 -52 147 -18
7625 -18 -82 111 -34 -47 106 2 -140 40 21 -120 77 34 -80 89 14 -101 59 38 -124 101 -21 -90 34
7648 34 47 -83 133 77 -101 80 60 -82 36 31 -137 72 15 -99 49 57 -78 36 48 -91 -10 92 -107 21
7672 21 97 -97 -7 142 -66 -4 -12 -95 -5 69 -69 6 43 -41 -14 71 -43 -41 37 -45 17 56 -66 -17 108 -66 -31
7699 -31 77 -83 -43 132 -35 -77 108 -53 -64 60 -25 -74 119 -29 -1 68 -47 -58 86 -1 -66 101 -7 -44
7723 -44 42 -17 -38 44 -19 -32 67 -64 -60 66 35 -61 29 77 -76 46 44 -77 -1 59 -72 45 -14 -73 69 39 -50
7750 -50 42 -46 -73 39 40 -2 15 -4 -89 39 55 -69 52 -18 -74 39 91 -119 28 50 -52 14 62 -71 10 -1
7776 -1 -30 44 37 -79 23 101 -56 12 64 -5 -3 88 -118 -70 116 -74 -3 16 -33 -2 52 -32 -25 10 16 -46 38 41 -29 68
$$ packed form
7602b5J29j47k9K09j81j7J41j16l9J82j83J4J23j31P2J54j76k9J51j09m5J99j65
7625a8o4J93j45j3J53j04j42J80j9j41J97m3j14J69p5j15J60k1j62K25j22o9J24
7648C4J3j30K16n6j78J81k0j42J18nj68K09n7j14J48Qj35J14J2j39Q1J02j99J28
7672B1P6j94R0J49k08O2qq3R0P4j38P5L7q4K7Q5j14KP8q2O2L9j22M9J25j74L5
7699c1J08j60M0J75j67m2J85j61j1J24q5m9J93j48K8O9j15j1J44q7o5J67j08l7
7723d4Q6n9k1Q2o3j3R9j31MJ26l1r6R0M8j53J22kj21P6O0j31J17n9n9J42l0q9
7750e0R2q8k7J12Jm2J7j9q5J28J6j24J21p0n6J13N2k10J47K2j02O6M8j33Q1j1
7776ak9P4pj16J02P8j57O8N2o9KR1k06M8J86j90P1J9m9L1N4q4PL5Oo2Q4Lp0R7
$$ plain form
7806 68 -14 -48 44 8 -1 63 -37 -27 74 -64 -44 32 -31 -33 82 10 -39 61 -4 -73 67 -14 -48 44 19 9 22 -24
7834 -24 -13 82 -4 -22 45 -19 7 110 3 -7 -14 1 -70 61 9 -52 63 41 -96 8 56 -99 70 48 -79 3
7860 3 -6 -79 13 29 -60 37 37 -38 -9 60 -72 33 56 -67 -3 38 -72 45 60 -64 30 57 -42 -27 7 -65 -44 43 -57
7889 -57 16 40 -41 50 37 -43 -7 107 -20 1 129 -60 19 81 -41 -19 64 -64 -15 102 -17 -20 40 -42 -33 76 -31
7916 -31 6 46 -7 -24 45 5 -81 101 -47 -27 50 -6 -71 16 23 -71 62 -42 -57 41 -7 -31 34 31 -51 56 24 -60 75
7945 75 6 -47 103 49 -100 -6 -15 -76 40 56 -89 79 26 -85 38 49 -50 74 47 -113 42 11 -92 36 47
7970 47 -37 -5 69 -31 15 11 -12 -14 29 -62 2 19 -103 -11 42 -67 -17 85 -68 -6 80 -90 -35 12 -80 -27 40 7
7998 7 -31 48 -73 -23 81 -78 -60 63 -21 -20 117 -35 -57 123 -16 11 70 -30 -42 94 -50 -33 104 20 -49
$$ packed form
7806F8q2l4R2l6rO4j00J0J01j38K0P6o3kJ15p2m9J00o5o9J40q1l4R2k5j0J3m6
7834b4J1R5q6j8O7o4K6J03j07j0pJ5p1J31n2o1J15k2j37J04M8j55J69k2j27Q2
7860Crp3R2J6q9R7%p5K9O9j32J05K3j23O4M1j10J17J5j24R4K7r9J5L4p2K1Q7j00
7889e7P3K4q1R1j3q0L6J14j27K1J28j89P9O2j22K2Q3j28M9J17j19lO0q2RJ09j07
7916c1L7M0n3j7O9m0q6J82j48K0P7n6o5Q7Pr4J33j04j5R8m8k4O5lq2J07l2q4J35
7945G5o9n3J50n4j49R4ro1J16J6j45J68n3j11J23J1r9J24k7j60J55l1j03J28J1
7970D7q4L2P4j00M6mk3kM3r1O4J7j22R2N3j09N0J02j53O2Q6j70N5M7r2N3O7l3
7998Gl8P9j21N0J04j59J8J23q4JJ37j52k2J80j39K7N9j00j2J36j44J7J37q4o9
$$ plain form
8023 -49 14 3 -114 41 -12 -30 103 4 -37 46 -54 -44 78 -12 -98 83 -8 -55 50 -4 -105 85 -2 -71 85
8048 85 66 -51 34 -6 -60 69 25 8 70 55 -75 34 -30 -65 26 40 -89 34 61 -71 94 109 -56 -8 102
8073 102 -98 47 106 -121 4 110 -77 -35 57 -89 -19 24 -63 21 47 -52 -14 73 -58 -83 49 -84 4 92 4
8098 4 26 95 -135 -2 136 -75 -20 80 -75 3 128 9 15 60 -98 -58 45 -12 -59 75 -30 -47 114 -2
8122 -2 -55 70 -11 -60 86 25 -65 74 15 -91 122 3 -59 33 29 -72 87 49 -91 68 54 -103 45 23 -96
8147 -96 19 9 -194 55 79 -95 7 49 -48 33 52 -59 31 31 -52 29 66 -124 49 49 -85 3 82 -117 17 103
8173 103 -75 30 117 -32 -4 108 -19 -40 124 -35 -75 79 -14 -69 95 -90 -10 77
$$ packed form
8023d9O3j1j17J55n3j8J33r9m1Q3j00J0J22r0q6J81r1m7J05n4j01J90q7o9J56
8048H5j9j17Q5m0n4J29m4j7O2j5j30J09o4l5R1J4j29J23K7j32J65J5j65M8J10
8073A02k00J45N9k27J25J06j87M2R2j46P0M3q7Q4K6r9L8Q7j31k5J32j33Q8Q8q8
8098DK2O9k30J33J38k11N5J00j55P8J25j19OM5j58M0J03n7m7J34j05j7J61j16
8122bn3J25q1m9J46o1r0J39n9j06K13j19o2R2mj01J59l8j40J59j4j57J48k2j19
8147i6J15j0k03K49K4j74J02M2r7Q1J9j11R0%q3Q1L7j90J73%j34Q8P9j99J34Q6
8173A03j78J05Q7j49K8J12j27k1J64j59m0J54r3n5J64j85Q0Q7
8191G7
$$ Imaginary data points
##PAGE= N=2
##DATA TABLE= (X++(I..I)), XYDATA
$$ plain form
0 0 0 0 0 0 0 0 8 -8 8 -8 8 -16 24 -32 32 -40 48 -64 80 -96 112 -132 157 -185 218 -253 292 -333 384 -441
30 -441 504 -574 648 -729 822 -926 1039 -1160 1293 -1437 1598 -1774 1965 -2173 2398 -2646
46 -2646 2919 -3216 3544 -3902 4294 -4731 5219 -5765 6379 -7072 7867 -8786 9868 -11156
60 -11156 12721 -14664 17152 -20462 25077 -31942 43159 -64397 117552 -494637 -486925 1062837
72 1062837 -597365 -418235 891369 -467901 -383193 822961 -411395 -416959 763244
81 763244 -235308 -524877 709075 -157388 -557722 719986 -132239 -637398 746652 -97477
91 -97477 -615520 697860 -121817 -566665 690339 -93812 -557670 571669 -7402 -492400
101 -492400 469679 35087 -506504 414193 154721 -552758 335888 231469 -568603 328459
$$ packed form
0@%%%%%%Qj6J6j6J6k4M0n6O4p2Q8j12J44j76K08k44K89l42M03m71N45o25P17q25
30d41R45j078J222j377J551j748J965k199K453k730L035l372L739m138M571n044
46b646N565o135O760p446Q196r025R950j0984J2144j3451J4939j6653J8654k1024
60a1156K3877k7385L1816l7614M5539n7019P5101j07556J81949o12189P712J549762
72A062837j660202J79130J309604j359270Q4708J206154j234356n564J180203
81G63244r98552k89569J233952q66463m00334J277708q52225n05159J384050q44129
91i7477n18043J313380q19677m44848J257004p84151m63858J129339n79071m84998
101d92400R62079m34592n41591R20697k59472p07479Q88646j04419q00072Q97062
$$ plain form
111 328459 269092 -612926 320809 301658 -594423 286948 278547 -541117 258293 277189 -498280
122 -498280 165950 323741 -423522 53610 361537 -389336 -11958 438182 -410667 -75238
132 -75238 500734 -413482 -85336 503293 -430672 -73953 499103 -398165 -94987 446993
142 446993 -325053 -111466 414457 -266594 -177960 424106 -192349 -257470 433410 -152346
152 -152346 -305800 466717 -147144 -341097 488891 -141479 -345409 478682 -136362 -332933
162 -332933 455407 -108100 -338200 409186 -45889 -347446 361359 9599 -378631 349215
172 349215 69678 -433317 341054 113345 -461346 351246 116706 -478128 361156 118052
182 118052 -461789 338753 107537 -424362 304170 120183 -397453 242837 161547 -377358
$$ packed form
111C28459n9367q82018R33735j9151q96081Q81371q401q19664P99410J8896p75469
122d98280O64230J57791p47263M77132L07927p50873L77378M50140q48849L35429
132g5238N75972r14216L28146N88629r33965L56719N73056q97268L03178N41980
142D46993p72046K13587N25923o81051Q8634O02066o16455o5121O90880n85756
152a52346j53454P72517o13861j93953Q29988o30370k03930Q24091o15044j96571
162c32933P88340n63507k30100P47386m55075l01557P08805l51760l88230P27846
172C49215k79537n02995P74371k27709n74691Q12592k34540n94834Q39284k43104
182A18052n79841Q00542k31216n31899P28532j83987n17636O40290q1290n38905
$$ plain form
192 -377358 185105 206313 -383965 153741 251217 -406450 142596 275930 -420005 145274
202 145274 270040 -413189 149271 252503 -385451 129486 235722 -336728 92963 229541
212 229541 -298122 44557 252481 -268766 -7875 275602 -254679 -35503 298272 -256547
222 -256547 -52579 306684 -246691 -55492 291202 -227960 -60766 269582 -189000 -80946
232 -80946 244940 -139261 -112701 233146 -93825 -154434 237684 -61489 -193028 251411
242 251411 -43785 -216955 260032 -40551 -221321 259550 -35958 -216482 238248 -18565
252 -18565 -206158 207658 9594 -210890 177675 53264 -227020 155571 90371 -252810
262 -252810 154022 117628 -279537 158448 127468 -289752 165724 123554 -285595 160253
$$ packed form
192c77358N62463K1208n90278N37706R7476o57667N49046J33334o95935N65279
202A45274J24766o83229N62460J03232o37954N14937J06236n72450M29691J36578
212B29541n27663L42679K07924n21247K60891K83477n30281K19176L33775n54819
222b56547K03968L59263n53375J91199L46694n19162J67194L30348m58582J08054
232h0946L25886l84201K6560L45847l26971o0609L92118k99173j31539M44439
242B51411k95196j73170M76987l00583j80770M80871k95508j80524M54730k56813
252a8565j87593M13816j98064k20484L88565j24411k80284L82591o5200l43181
262b52810M06832l6394l97165M37985l0980m17220M55476m2170m09149M45848
$$ plain form
272 160253 119413 -266296 138654 123533 -245825 105949 141959 -232621 72425 168519 -234133
283 -234133 48488 195681 -242120 39065 208676 -250268 40368 209243 -246325 39151
293 39151 195992 -226240 31299 183591 -198117 6129 180529 -166890 -25684 189092
303 189092 -148510 -57651 209336 -141696 -79392 226068 -146451 -85214 234417 -149926
313 -149926 -81771 226299 -144309 -75624 208061 -124922 -78984 186824 -94345 -92771 173815
324 173815 -63756 -117258 171453 -39535 -139519 177885 -30156 -154299 185027 -28197
334 -28197 -154593 181538 -29761 -144426 167621 -22846 -132462 141477 -5665 -125185
344 -125185 115486 19863 -130089 95065 46844 -140881 85649 65484 -153982 84203
$$ packed form
272A60253m0840l85709M04950j5121l69358L51774L6010l74580L05046R6094m02652
283b34133K82621J47193m37801K81185J69611m58944K90636J68875m55568K85476
293C9151J56841m22232K57539J52292l81708K04246J74400l47419J41206K14776
303A89092l37602R0859K66987l51032O2304L05460l72519O1237L19631l84343
313a49926O8155L08070l70608O8685K83685l32983M5938K65808k81169J574K66586
324A73815k37571n3502K88711k10988r9984L17404k08041j24143L39326k13224
334b8197j26396L36131k11299j14665L12047j90467j09616K73939j47142j19520
344a25185K40671r5623j49952K25154m8221j87725K26530k0165k19466K38185
$$ plain form
354 84203 74149 -158427 83648 72903 -152682 77272 71018 -138030 60165 73357 -121584
365 -121584 36278 86570 -110950 9289 106403 -109126 -10044 127783 -116591 -20281 143266
376 143266 -124816 -19949 146877 -129093 -16695 141630 -121423 -17606 130475 -105406
386 -105406 -26322 124017 -85519 -44602 125000 -69980 -64050 134835 -63575 -79418 145701
397 145701 -65089 -83558 151580 -70511 -79258 148074 -70090 -71622 135211 -61806 -68218
408 -68218 120230 -44708 -72369 107921 -26693 -83278 105172 -12739 -96571 107859 -6356
419 -6356 -104387 112361 -6662 -105059 111379 -8623 -96957 103085 -8133 -87802 88343
430 88343 707 -80925 70112 14940 -80425 55112 32026 -85609 46552 44578 -93137
$$ packed form
354H4203j0054k32576K42075j0745k25585K29954o254k09048J98195J3192j94941
365a21584J57862N0292j97520J20239R7114k15529R9082J37827k44374R6310J63547
376A43266k68082J04867J66826k75970J12398J58325k63053J03817J48081k35881
386a05406P9084J50339k09536M0917J69602j94980N930J98885j98410j5843K25119
397A45701k10790j8469K35138k22091q747K27332k18164j532K06833j97017o412
408f8218J88448j64938k7661J80290j34614n6585J88450j17911q3832K04430j14215
419f356r8031K16748j19023r8397K16438j20002q8334K00042j11218p9669J76145
430H8343q7636q1632J51037n5172r5365J35537k3086j17635J32161j974j37715
$$ plain form
441 -93137 45957 50886 -98895 47600 50286 -97046 47468 45519 -88310 40697 42265
452 42265 -75446 28725 44278 -66064 13644 53965 -61783 -176 65252 -63444 -6917
463 -6917 73857 -67405 -7350 75450 -69347 -4405 71902 -65659 -5200 65517 -54739
474 -54739 -10976 60536 -42348 -21229 60293 -32312 -32337 64894 -28176 -41663 71559 -27254
486 -27254 -46211 73998 -27757 -44949 72007 -27157 -41646 65556 -22709 -39531 57497
497 57497 -13821 -42238 49966 -1943 -47692 45409 7625 -55115 45994 13060 -61829 49721
509 49721 13500 -65330 52737 12169 -63600 50849 10168 -57548 45148 11047 -52706
520 -52706 36944 16743 -51615 29600 25436 -54882 25092 32892 -58928 25004 34836 -61581 27806
$$ packed form
441i3137J39094M929j49781J46495K686j47332J44514j949j33829J29007J568
452D2265j17711J04171J5553j10342P9708M0321j15748O1607O5428j28696N6527
463f917Q0774j41262O0055Q2800j44797O4942P6307j37561O0459P0717j20256
474e4739M3763P1512j02884K1119Q1522r2605k5R7231r3070j3487J13222r8813
486b7254j8957J20209j01755j7192J16956r9164j4489J07202q8265j6822R7028
497E7497p1318k8417R2204n1909m5749R3101l7784o2740J01109l2934p4889J11550
509D9721l6221p8830J18067m0568p5769J14449m0681o7716J02696l4101o3753
520e2706Q9650k0201o8358Q1215m164q0318P9974P800r1820Q3932R832r6417Q9387
$$ plain form
533 27806 32472 -60073 28619 28437 -54415 25030 26170 -45835 16991 26318 -38622 9083 29909
546 29909 -36019 2614 35007 -36356 -698 38486 -37484 -1354 38321 -36572 42 34528
558 34528 -33762 760 30370 -28429 -1777 27131 -21380 -7105 26113 -14463 -13773 27310
570 27310 -10586 -19005 30639 -10202 -22532 34088 -11185 -23060 34666 -11882 -21366 31728
582 31728 -10144 -19167 26718 -6342 -19366 22704 -348 -22942 20642 5379 -27629 21253
594 21253 8161 -30918 23049 7485 -31176 24565 5164 -29069 23316 4232 -25274 18865
606 18865 5466 -22007 13476 8916 -20813 9251 13053 -22413 7573 16775 -25165 7592 18454
619 18454 -26612 8711 17600 -26358 9592 15465 -24030 9030 13690 -20667 6113 13688 -17215
$$ packed form
533B7806M666r2545Q8692j82q2852P9445J140p2005O2826R327o4940M7705K0826
546B9909o5928L8633L2393p1363L5658L9184p5970L6130L9675p4893L6614L4486
558C4528o8290L4522K9610n8799K6652K8908m8511J4275L3218m0576O90M1083
570B7310l7896q419M9644m0841j2330N6620m5273j1875N7726m6548r484N3094
582C1728m1872r023M5885l3060j3024M2070k3052k2594M3584j5263l3008M8882
594B1253j3092l9079N3967j5564l8661N5741j9401l4233N2385j9084k9506M4139
606A8865j3399k7473L5483m560k9729L0064L802l5466K9986R202m1940L2757J0862
619A8454m5066L5323Q889m3958L5950N873l9495L3060M660l4357K6780P575l0903
$$ plain form
632 -17215 1892 15141 -14969 -2017 17859 -14851 -4311 20364 -16199 -4430 21523 -17436
644 -17436 -3403 20341 -16944 -1893 17304 -14582 -1805 14386 -10859 -3499 13119 -7512
656 -7512 -6635 13669 -5503 -9317 15166 -5697 -10044 16441 -7041 -9017 16147 -8084 -7009
669 -7009 14233 -7618 -5257 11033 -5373 -4722 8164 -2406 -5851 6805 310 -7842 6858
682 6858 1742 -9643 7812 1837 -10118 8447 895 -9195 8235 -14 -7334 6778 5
695 5 -5415 4346 1286 -4500 1932 3275 -4607 451 5151 -5683 369 6231 -6860 1085 6019
710 6019 -7215 1903 4926 -6443 2103 3638 -4821 1280 3151 -3300 -311 3630 -2431 -1837 4751
725 4751 -2664 -2618 5993 -3625 -2332 6400 -4644 -1278 5827 -4908 -189 4474 -4285 353 3101
$$ packed form
632a7215J9107J3249l0110J2952J9876l2710J0540K4675l6563J1769K5953l8959
644a7436J4033K3744l7285J5051J9197l1886J2777J6191k5245P360J6618k0631
656g512Q77K0304j9172l814K4483k0863m347K6485k3482j976K5164k4231J075
669g009K1242k1851K361J6290j6406O51J2886j0570l445J2656o495q152J4700
682F858n116j1385J7455n975j1955J8565p552j0090J7430q249p320J4112o773
695En420R761l060n786O432J343p882N058M700j0834O052N862j3091P945M934
710F019j3234R118L023j1369Q546J535q459O101J871o451K989L941o061N94O588
725D751p415M6Q611r618J293Q732j1044L366P105j0735M719M663q759M638K748
$$ plain form
740 3101 -2965 -22 2168 -1433 -1082 2127 -506 -2226 2734 -467 -2760 3429 -1053 -2455 3562
755 3562 -1764 -1501 3021 -2049 -436 1860 -1692 245 635 -698 243 -190 329 -322 -262 917 -1006
772 -1006 198 885 -1249 787 376 -932 1120 -384 -168 768 -752 680 1 -673 1276 -768 -153
789 -153 1287 -1288 397 980 -1285 626 553 -877 351 391 -313 -365 690 34 -1168 1352 29 -1828
807 -1828 2122 -317 -2094 2696 -794 -2062 2833 -1037 -1763 2701 -923 -1715 2274 -457 -1967 2136
823 2136 150 -2572 2114 683 -3206 2459 890 -3776 2874 894 -4028 3213 815 -4033 3254
838 3254 709 -4012 3022 932 -3880 2703 1367 -4058 2406 1999 -4363 2173 2532 -4791 2195 2981
854 2981 -5202 2282 3126 -5441 2413 3234 -5421 2282 3258 -5190 1959 3384 -4879 1363 3766 -4720
$$ packed form
740C101o066K943K190l601L51L209k633j720M960l201k293O189m482j402O017
755C562n326K63M522n070J613K296l552J937L90j333R41m33N19o51O0J179j923
772a006J204O87k134K036m11j308K052j504K16R36j520J432o79o74J949k044O15
789a53J440k575J685N83k265J911p3j430J228M0p04n2J055o56j202K520j323j857
807a828L950k439j777M790l490j268M895l870p26M464l624p92L989k731j510M103
823B136j986k722M686j431l889N665j569m666O650j980m922P241k398m848P287
838C254k545m721P034k090m812O583j336n425O464m07o362O536L59p323O986P86
854B981q183P484Q44q567P854Q21q655P703R76q448P149J425q263O242K403q486
$$ plain form
870 -4720 759 4242 -4735 198 4835 -4839 -193 5280 -4983 -489 5508 -5024 -681 5560 -4849
885 -4849 -878 5583 -4580 -1425 5689 -4089 -1995 5857 -3531 -2752 6162 -3147 -3441 6483 -2816
900 -2816 -4148 6938 -2626 -4749 7225 -2378 -5047 7223 -2074 -5318 7076 -1615 -5577 6816
914 6816 -864 -6117 6574 60 -6838 6398 930 -7641 6556 1485 -8385 6871 1849 -8899
928 -8899 7000 2070 -8924 6705 2388 -8889 6106 3064 -8816 5366 3929 -9130 4681
941 4681 5120 -9650 4146 6104 -10137 3777 6785 -10508 3515 7312 -10704 3178 7717
954 7717 -10598 2508 8106 -10196 1585 8533 -9700 453 9240 -9369 -711 10217 -9185
967 -9185 -1859 11310 -9274 -2718 12045 -9382 -3023 12385 -9438 -3131 12398 -9077 -3531
$$ packed form
870d720N479L483q977M933M637r674M646N473j0263M494N997j0532M343O241j0409
885d849L971O461j0163L155P114r778K094P852r388P79Q914r309k94R924r299
900b816j332J1086r564k123J1974r603k669J2270r297l244J2394q691l962J2393
914F816p680n253J2691o514o898J3236n468q571J4197n071r870J5256n022j0748
928h899J5899m930j0994J5629m317j1277J4995l042j1880J4182j437j3059J3811
941D681M39j4770J3796J958j6241J3914L008j7293J4023L797j8016J3882M539
954G717j8315J3106N598j8302J1781O948j8233J0153Q787j8609Q658J0928j9402
967i185P326J3169k0584O556J4763k1427O359J5408k1823O307J5529k1475N546
$$ plain form
980 -3531 12061 -8070 -4420 12027 -6792 -5702 12214 -5865 -7050 12989 -5486 -8143 13770
993 13770 -5389 -8731 14088 -5212 -8775 13555 -4608 -8545 12592 -3608 -8855 11600 -1979
1006 -1979 -9682 10865 -271 -10635 10311 1166 -11560 10095 2072 -12230 9879 2753 -12529
1019 -12529 9394 3456 -12499 8467 4229 -12123 7085 5285 -11838 5744 6703 -12099 4378
1032 4378 8526 -12747 3197 10291 -13488 2706 11299 -14113 2589 11595 -14329 2380 11779
1045 11779 -13794 1432 11958 -12601 -263 12740 -11539 -2201 13868 -11225 -3756 15451
1057 15451 -11427 -4758 16568 -11685 -5205 16835 -11324 -5382 16200 -10376 -5745 15573 -9000
1070 -9000 -6777 15163 -7209 -8367 15184 -5683 -9989 15461 -4604 -11243 15930 -4089 -12102
$$ packed form
980c531J5592k0131L650J6447j8819J090J7916j8079j185K0039j8475k657K1913
993A3770j9159l342K2819j9300l563K2330j8163l937K1137j6200n247K0455j3579
1006a979p703K0547j1136j0364K0946r145j2726K1655q023j4302K2109p126j5282
1019a2529K1923n938j5955K0966m238j6352J9208j800j7123J7582R59j8802J6477
1032D378M148k1273J5944P094k3779J6194Q593k5412J6702R006k5924J6709R399
1045A1779k5573J5226J0526k4559J2338J3003k4279R338J6069k5093P469J9207
1057A5451k6878O669K1326k8253O480K2040k8159N942K1582k6576M631K1318k4573
1070i000K223K1940k2372j158K3551k0867m306K5450k0065o639K7173k0019q013
$$ plain form
1083 -12102 16191 -3753 -12574 16009 -3019 -12724 15146 -2013 -12731 13934 -540 -13119
1095 -13119 12796 1399 -14271 11962 3439 -15749 11660 4981 -16946 11808 5575 -17476
1107 -17476 11933 5638 -17222 11254 5859 -16406 9612 6711 -15463 7423 8278 -15046 5546
1120 5546 10125 -15485 4377 11871 -16303 3808 12687 -16556 3563 12741 -15964 3132 12319
1133 12319 -14687 1982 12222 -13212 117 12829 -11788 -2080 13909 -10818 -4082 15132
1145 15132 -10467 -5397 16186 -10333 -6234 16750 -10066 -6692 16402 -8984 -7418 15784 -7323
1158 -7323 -8512 15178 -5353 -10233 14818 -3228 -12350 15175 -1641 -14412 15924 -725 -15677
1171 -15677 16388 -490 -16106 16384 -151 -15927 15447 674 -15686 13906 2387 -15943
$$ packed form
1083a2102K8293j9944q821K8583j9028r705K7870j7159j0718K6665j4474j2579
1095a3119K5915j1397j5670K6233q523j9188K7409o679k1927K8754o233k3051
1107a7476K9409o295k2860K8476n395k2265K6018k901k2174K2886Q55k3324K0592
1120E546M579k5610J9862P494k8174K0111Q879k9243K0119R178k8705J9096R187
1133A2319k7006J6669J0240k5434J3329J2712k4617R708J5989k4727O736J9214
1145A5132k5599N070K1583k6519M099K2984k6816L374K3094k5386J566K3202k3107
1158g323j189K3690k0531m880K5051j8046r122K7525j6816j2771L0336j6649j4952
1171a5677L2065j6878j5616L2490j6535j5776L1374j4773j6360K9592j1519j8330
$$ plain form
1183 -15943 12445 4493 -16900 11469 6430 -18276 11304 7755 -19408 11478 8239 -19834 11416
1196 11416 8214 -19340 10677 8278 -18213 9083 8950 -17070 6915 10277 -16394 4702 12144
1209 12144 -16335 3028 13817 -16637 2086 14935 -16746 1593 15079 -16248 1025 14673
1221 14673 -14767 -97 14137 -12751 -1987 14121 -10760 -4347 14901 -9230 -6756 16196
1233 16196 -8608 -8441 17380 -8554 -9152 17917 -8519 -9228 17453 -7820 -9258 16249 -6378
1246 -6378 -9760 15066 -4126 -11064 14333 -1986 -12939 14387 -352 -14695 14886 395
1258 395 -15775 15252 632 -15860 14864 891 -15238 13527 1783 -14496 11517 3483
1270 3483 -14254 9337 5748 -14718 7677 7999 -15677 6858 9740 -16669 6518 10498 -17048
$$ packed form
1183a5943K8388p952k1393K8369n039k4706K9580l549k7163L0886l239k8073L1250
1196A1416l202k7554L0017k399k6491K7296j33k6020K3985L362k6671K1096P442
1209A2144k8479J9363J0789l0454J8723J2849l1681J8339J3486l1327J7273J3648
1221A4673k9440J4670J4234k6888J0764J6108k4881O413J9248k4131K474K2952
1233A6196k4804J67K5821k5934n98K7069k6436p09K6681k5273j438K5507k2627
1246f378l382K4826j9192o938K5397j6319j0953K7326j4739j4343K9581j4491
1258C95j6170L1027j4620j6492L0724j3973j6129K8765j1744j6279K6013q034
1270C483j7737K3591l589k0466K2395L22k3676K2535K882k6409K3187L980k7546
$$ plain form
1283 -17048 6334 10580 -16511 5561 10547 -15275 4031 10983 -14080 1943 12104 -13011
1295 -13011 -296 13927 -13195 -2005 15552 -13760 -2729 16948 -14093 -2805 17127 -14241
1307 -14241 -2739 16572 -13349 -3071 15789 -11718 -4338 15303 -9778 -6223 15602 -8226
1319 -8226 -8181 16456 -7536 -9595 17316 -7490 -10111 17601 -7485 -9825 16872 -7010 -9325
1332 -9325 15377 -5579 -9285 13600 -3464 -10030 12306 -1178 -11498 11868 594 -12998
1344 -12998 12031 1513 -14038 12347 1768 -14119 12200 1864 -13579 11195 2399 -12791
1356 -12791 9285 3728 -12284 7214 5774 -12534 5532 7978 -13445 4635 9756 -14640 4395
1369 4395 10631 -15194 4483 10679 -14785 4131 10276 -13578 2949 10227 -12094 996 11049
$$ packed form
1283a7048K3382M246k7091K2072M986k5822J9306O952k5063J6023J0161k5115
1295a3011J2715J4223k7122J1190J7557k9312J1031J9677l1041J1288J9932l1368
1307a4241J1502J9311k9921J0278J8860k7507P380J9641k5081L555K1825k3828
1319h226M5K4637k3992k059K6911k4806k621K7712k5086k340K6697k3882k315
1332i325K4702k0956l706K2885j7064o566K2336j3484j0320K3366j1274j3592
1344a2998K5029j0518j5551K6385j0579j5887K6319j0336j5443K4774q796j5190
1356a2791K2076n557j6012J9498j440j8308J8066K446k1423J8080N121k4396J9035
1369D395O236k5825J9677O196k5464J8916O145k3854J6527P278k2321J3090J0053
$$ plain form
1382 11049 -10945 -1167 12462 -10645 -2831 13927 -10940 -3524 14863 -11484 -3432 15008 -11424
1395 -11424 -3301 14244 -10436 -3696 13296 -8713 -4698 12739 -7017 -6321 12788 -5543 -8058
1408 -8058 13471 -4750 -9491 14189 -4354 -10183 14399 -4233 -10114 14123 -3865 -9948 13084
1421 13084 -2811 -9914 11720 -1036 -10437 10352 994 -11379 9691 2659 -12815 9802 3735
1434 3735 -14008 10279 4022 -14331 10407 3804 -13686 9634 3638 -12567 8216 4432 -11846
1447 -11846 6363 6023 -11859 4812 7824 -12525 4090 8984 -13304 4146 9345 -13686 4471
1460 4471 9090 -13169 4066 8633 -11755 2809 8422 -10122 1019 8765 -8832 -882 9841
1473 9841 -8251 -2537 11045 -7999 -3624 11686 -7829 -4028 11716 -7539 -4089 11197 -6835
$$ packed form
1382A1049k1994R778J3629k3107P814J6758k4867P416J8387k6347Q052J8440k6432
1395a1424Q123J7545k4680O740J6992k2009M015J7437j9756O96J9109j8331k515
1408h058K1529j8221m741K3680j8543n829K4582j8632n881K4237j7988o083K3032
1421A3084j5895p103K1634j2756r401K0789r358j2373K1070p032j5474K2617o067
1434C735j7743K4287o257j8353K4738o603j7490K3320n996j6205K0783l784j6278
1447a1846J8209l40j7882J6671L012k0349J6615M894k2288J7450N199k3031J8157
1460D471M619k2259J7235M567k0388J4564N613j8544J1141P746j7597P950J0723
1473I841j8092N714J3582j9044M375J5310j9515L801J5744j9255L450J5286j8032
$$ plain form
1486 -6835 -4358 10464 -5393 -5252 9765 -3516 -6601 9527 -1966 -8172 9963 -1090 -9678
1499 -9678 10984 -957 -10524 11625 -1060 -10506 11424 -1067 -9839 10385 -520 -9372 9092
1512 9092 873 -9757 7962 2717 -10775 7366 4219 -11831 7378 4805 -12491 7745 4680
1525 4680 -12442 7712 4509 -11647 6809 4651 -10499 5198 5169 -9494 3661 6146 -9243
1538 -9243 2326 7425 -9492 1389 8518 -9756 990 8921 -9806 911 8712 -9477 827
1551 827 8257 -8664 237 7972 -7383 -1048 7958 -6088 -2579 8427 -5314 -3877 9411 -5243
1565 -5243 -4815 10349 -5546 -5025 10607 -5700 -4682 9924 -5176 -4340 8850 -4045 -4555 7842
1579 7842 -2448 -5607 7439 -857 -7021 7575 -15 -7882 8012 30 -8216 8302 -274 -7825
$$ packed form
1486f835K477J4822j5857J41J5017j3281l085J6128j1493o206J8135j1053q588
1499i678K0662j1941r567K2149j2685r446K1930j2491q772K0224j0905q852J8464
1512I092q219j0630J7719n245j3492J8141l147j6050J9209k573j7296K0236l065
1525D680j7122K0154l203j6156J8456k158j5150J5697k9j4663J3155K485j5389
1538i243J1569N099j6917J0881P129j8274J0746P931j8727J0717P801j8189J0304
1551H27P430j6921Q901P735j5355O335R006j4046L509J1006j3741J437J3288j4654
1565e243M28J5164j5895N21J5632j6307J018J4606j5100Q36J3190j2895n10J2397
1579G842j0290l159J3046q296o164J4596p590p867J5894p982q246J6518q576p551
$$ plain form
1593 -7825 7914 -264 -7189 6872 364 -6588 5513 1414 -6465 4384 2723 -7009 3792 3857
1607 3857 -7843 3597 4714 -8421 3697 4812 -8480 3656 4518 -7944 3383 4363 -7151
1620 -7151 2353 4608 -6336 1043 5427 -5894 -276 6447 -5987 -1083 7401 -6424 -1262 8012
1634 8012 -6859 -1127 7832 -6701 -982 7160 -5965 -1112 6495 -4901 -1891 6331 -3808 -3021
1648 -3021 6692 -3108 -4074 7220 -3020 -4634 7784 -3250 -4551 7880 -3459 -4149 7387 -3216
1662 -3216 -3773 6463 -2423 -3744 5556 -1280 -4200 4986 -104 -4981 4808 692 -5762 4930 1052
1677 1052 -6174 5177 997 -6031 4992 925 -5477 4311 1105 -4865 3216 1845 -4528 2105
1691 2105 2782 -4634 1347 3753 -5185 1073 4473 -5748 1226 4543 -5894 1445 4170 -5509 1393
$$ packed form
1593g825J5739q178o925J4061o508o952J2101m099p879J0849j661r732J0801O5
1607C857j1700J1440J117j3135J2118J115j3292J2136Q62j2462J1327R80j1514
1620g151R504K255j0944P379M384j1321N618O723j2434M904Q484j3825N162R274
1634H012j4871N732Q959j4533N719Q142j3125M853P607j1396L010Q222j0139P87
1648c021R713r800r66J1294j0240j614J2418j1034j301J2431j1339o90J1536j0603
1662c216n57J0236q886j321R300o836k920R186n090m877R789m116o454J0692l878
1677A052p226J1351m180p028J1023m067o402R788l206n970Q081j371o373O633
1691B105O77p416N981K406q938O258L400j0221O974L317j0437P339K725r679O902
$$ plain form
1706 1393 3825 -4795 899 3641 -3986 -58 3978 -3533 -1021 4650 -3373 -1705 5219 -3641 -1921
1721 -1921 5564 -3928 -1576 5403 -3842 -1328 4865 -3334 -1355 4200 -2397 -1767 3838 -1436 -2521
1736 -2521 3738 -781 -3345 4060 -386 -3803 4401 -511 -4011 4468 -579 -3679 4102 -502 -3227
1751 -3227 3454 -38 -3075 2728 663 -3258 2146 1497 -3748 2025 2035 -4264 2132 2211 -4557 2450
1767 2450 2036 -4458 2473 1825 -4074 2157 1679 -3438 1526 1851 -3004 782 2421 -2892 180 2944
1783 2944 -3047 -110 3304 -3288 -38 3313 -3296 93 2991 -3041 108 2524 -2492 -218 2276
1798 2276 -1661 -761 2161 -1111 -1354 2422 -805 -1884 2714 -811 -2041 2919 -907 -1863 2859 -951
1814 -951 -1597 2422 -649 -1453 1840 -146 -1572 1480 468 -1954 1252 1056 -2417 1398 1286 -2746
$$ packed form
1706A393K432q620N694K742p627L928M036p511K512N671q023J668O924q860J720
1721a921P485r492K352O979r245K514O193q199J979N555o597O30N605n274j085
1736b521O259m519k564P405m446l417Q204m912l500Q479n047l100P781m604k725
1751c227O681l492l037N803k065l921N404o49n245N773J0o299O396P9o768P007
1767B450m14o494O931o48n899O231m78n117M964L25m855L786J639n313L072K764
1783B944n991K937L414o592L250L351o609L389K898o032L149K416n016K274K494
1798B276l937R00K922l272k43L776l227j079M598l525j230M960l826r56M722l810
1814i51o46M019l071q04L293j986j426L052j012k422L206j96l473L815j12m032
$$ plain form
1830 -2746 1532 1112 -2710 1642 981 -2433 1426 910 -1981 962 955 -1634 336 1368 -1520 -119
1846 -119 1804 -1634 -362 2168 -1893 -285 2160 -1936 -128 1937 -1770 -78 1575 -1346 -201
1861 -201 1348 -888 -518 1296 -484 -982 1413 -207 -1388 1613 -227 -1468 1784 -309 -1373 1716
1877 1716 -411 -1219 1442 -224 -1009 1068 116 -1043 721 599 -1169 505 988 -1486 579 1223
1893 1223 -1689 641 1157 -1731 724 983 -1536 666 858 -1241 328 836 -931 -39 1012 -730
1909 -730 -429 1290 -709 -647 1513 -870 -678 1674 -991 -612 1524 -864 -473 1183 -670 -525 931
1926 931 -289 -693 775 99 -987 844 362 -1332 964 447 -1454 1055 479 -1420 1038 418 -1291
1943 -1291 818 493 -1148 489 721 -1130 245 1051 -1167 -29 1359 -1276 -117 1537 -1495 -144
$$ packed form
1830b746M278m20l822M352o61l414L859n16k891K943pk589J970J032k888J401
1846a19J923l438J272K530m061J608K445m096J808K065l707J692J653k921J145
1861b01J549k236L70J814j780m98K395j620j181L001j840j241L252k093j064L089
1877A716k127q08K661j666p85K077r52j159J764j22j768J674M83k474K065O44
1893A223k912K330N16k888K455K59k519K202J92k099J569N08j767Q92J051j742
1909g30L01J719j999O2K160k383J92K352k665L79K136k388L91J656j853J45J456
1926I31j220m04J468o76j086J831m82j694K296n17j901K509n76j899K458o20j709
1943a291K109l25j641J637K32j851J375Q06k218J138J388k635J159J654l032J351
$$ plain form
1959 -144 1602 -1493 -129 1583 -1407 -180 1460 -1203 -348 1472 -914 -621 1553 -729 -947 1664
1975 1664 -564 -1191 1888 -582 -1359 1965 -637 -1334 2011 -595 -1289 1832 -412 -1264 1545 -157
1991 -157 -1454 1398 143 -1680 1374 434 -1905 1380 606 -2064 1406 673 -2065 1353 720 -2057
2007 -2057 1174 848 -1961 1007 1048 -1926 737 1303 -1870 495 1578 -1933 317 1660 -2032 219
2023 219 1795 -2043 138 2028 -2011 -75 2021 -1902 -142 2025 -1788 -324 2079 -1610 -651
2038 -651 2127 -1384 -900 2252 -1225 -1112 2368 -1130 -1275 2457 -1054 -1449 2419 -960 -1494 2336
2054 2336 -739 -1592 2304 -420 -1825 2128 -181 -1986 2147 105 -2209 2076 326 -2440 1970
2069 1970 477 -2468 1893 623 -2523 1797 804 -2544 1646 1031 -2639 1408 1265 -2625 1211 1517
$$ packed form
1959a44J746l095J364J712k990J227J640k663Q55J820k386K93K174k282k18K611
1975A664k228o27L079k470p77L324k602o97L345k606o94L121k244q52K809j702
1991a57j297K852j255j823L054r40k339L285p74k670L470p33k738L418o33k777
2007b057L231l26k809K968M1k974K663N66l173K365J083l511K250J343l692K251
2023B19J576l838K181J890m039J936K096l923J760K167l813J464K403l689R59
2038f51K778l511M84L152l477J13L480l498j45L732l511l95L868l379n34L830
2054B336l075q53L896k724j405L953k309j805M133k042k314M285j750k766M410
2069A970j493k945M361j270l146M320r93l348M190o15l670M047j43l890L836L06
$$ plain form
2085 1517 -2744 1009 1760 -2732 864 2041 -2832 703 2190 -2813 560 2360 -2736 397 2468
2100 2468 -2641 224 2466 -2534 -57 2590 -2438 -355 2678 -2293 -558 2885 -2156 -814 2954
2115 2954 -2082 -896 2993 -1996 -1048 2903 -1786 -1184 2863 -1551 -1386 2851 -1299 -1555 2740 -1071
2131 -1071 -1860 2723 -732 -2059 2750 -520 -2158 2687 -351 -2386 2667 -128 -2472 2483 41
2146 41 -2595 2336 356 -2637 2117 619 -2751 1894 995 -2981 1776 1253 -3091 1689 1485 -3210
2162 -3210 1561 1642 -3232 1547 1699 -3174 1357 1891 -3121 1116 2002 -2986 848 2271 -2958 554
2178 554 2523 -2980 353 2752 -3052 263 2911 -2997 73 2863 -2857 -88 2910 -2670 -357
2193 -357 2934 -2418 -696 3019 -2159 -1029 3198 -1971 -1359 3339 -1843 -1636 3493 -1706 -1803 3510
$$ packed form
2085A517m261L753P51m492L596J177m873L535J487n003L373J800n096L133K071
2100B468n109K865K242n000K477K647n028K083L033m971J735L443n041J342L768
2115B954n036J186L889m989R48L951m689O02M047m414J65M237m150k56M295l811
2131a071p89M583l455j327M809l270j638M845l038k035N053k795k344M955k442
2146D1k636M931j980k993M754j498l370M645q99l976M757n23m344M780k04m695
2162c210M771Q1m874M779J52m873M531N34n012M237Q86m988L834J423n229L512
2178E54J969n503L333K399n804L315K648n908L070K790n720K769K998n580K313
2193c57L291n352J722L715n178J130M227n169O12M698n182K07N129n199r7N313
$$ plain form
2209 3510 -1549 -1934 3476 -1406 -2084 3381 -1041 -2340 3251 -703 -2579 3181 -403 -2850 3209
2224 3209 -151 -3142 3303 -20 -3305 3231 59 -3424 3199 255 -3375 3065 443 -3430 2721
2239 2721 707 -3407 2460 1104 -3562 2248 1464 -3662 2067 1706 -3739 1956 1918 -3816 1834 2074
2255 2074 -3736 1560 2099 -3459 1199 2351 -3292 729 2625 -3075 277 2939 -3045 -147 3250
2270 3250 -3052 -349 3459 -3072 -522 3553 -2957 -683 3559 -2761 -924 3523 -2405 -1203 3589
2285 3589 -2091 -1690 3741 -1798 -2119 3963 -1586 -2486 4136 -1592 -2651 4217 -1523 -2727 4210 -1332
2301 -1332 -2810 3996 -1044 -2952 3719 -593 -3207 3565 -103 -3540 3533 195 -3824 3536 403
2316 403 -3983 3538 497 -4095 3431 609 -3960 3160 857 -3830 2739 1172 -3803 2384 1636
$$ packed form
2209C510n059l85N410m882o78N465m422j299N591l954j876N760l584k447O059
2224C209l360k991O445l323l285O536l172l483O623k944l630O440k622l873O151
2239B721k014m114N867j356m666N810p84n126N729l61n445N695l8n734N650K40
2255B074n810N296N39n558M658J152n643M021J896n700L352K662n984K898L397
2270C250o302K703L808o531K550M075o510K274M242o320J837M447n928J202M792
2285C589n680M01N431n539l21O082n549r00O622n728j059O868n740j204O937n542
2301a332j478O806n040j908O671m312k614O772l668l437P073l338m019P360l133
2316D03m386P521l041m592P526k822m569P120k303m687O569j567m975O187p48
$$ plain form
2331 1636 -3877 2078 2049 -4018 1772 2376 -4187 1624 2592 -4257 1538 2758 -4143 1311 2802 -3973
2347 -3973 963 2930 -3682 516 3206 -3502 -40 3549 -3320 -492 3919 -3354 -782 4175 -3374
2362 -3374 -924 4315 -3317 -984 4209 -3025 -1197 4083 -2679 -1528 4022 -2223 -1900 4041 -1825
2377 -1825 -2377 4205 -1595 -2709 4334 -1570 -2843 4370 -1402 -2945 4208 -1185 -2877 3907 -783
2392 -783 -3007 3547 -336 -3236 3297 210 -3569 3152 683 -3971 3032 1095 -4153 3011 1300
2407 1300 -4333 2961 1462 -4327 2738 1706 -4143 2353 2019 -4101 1788 2451 -4138 1434 2927
2422 2927 -4346 1205 3382 -4620 1135 3564 -4754 1104 3581 -4590 978 3442 -4361 705 3492
2437 3492 -4034 244 3712 -3702 -254 4042 -3622 -659 4383 -3608 -890 4538 -3688 -923 4575
$$ packed form
2331A636n513N955k9o067N790O04o563N811R68o849N795J220o901N454J491o775
2347c973M936J967o612M198K690o708L462L589o869K828M411p273K572M957p549
2362c374K450N239p632K333N193p234J828N280o762J151N550o245L23N941n866
2377a825n52O582n800j114P043n904j273P213n772j543P153n393j692O784m690
2392g83k224O554l883k900O533l087l779O721k469m654P003j937n248P164j711
2407A300n633P294j499n789P065j032n849O496l34o120N889O63o589N572J493
2422B927p273N551K177q002N755K429q318N858K477q171N568K464p803N066K787
2437C492p526M278L468p414L448M296p664K963N042p991K718N428q226K765N498
$$ plain form
2452 4575 -3506 -1015 4450 -3157 -1253 4207 -2653 -1637 4108 -2177 -2060 4077 -1733 -2563 4157
2467 4157 -1271 -3077 4259 -1063 -3385 4315 -895 -3508 4253 -750 -3551 4082 -425 -3565 3656
2482 3656 112 -3694 3312 634 -3997 3080 1182 -4491 3179 1581 -4769 3156 1603 -4841 3221
2497 3221 1697 -4666 2923 1725 -4375 2443 2045 -4249 1830 2632 -4158 1326 3145 -4361 996
2512 996 3545 -4495 936 3673 -4527 819 3732 -4365 566 3672 -3949 183 3630 -3547 -298
2527 -298 3735 -3179 -841 4021 -2873 -1384 4318 -2682 -1778 4529 -2726 -1989 4623 -2609 -1950 4626
2543 4626 -2399 -2131 4350 -2022 -2396 4119 -1410 -2813 4069 -884 -3329 4234 -619 -3802 4418
2558 4418 -488 -4056 4570 -513 -4059 4368 -331 -3863 4105 -113 -3802 3595 423 -3834 3154
$$ packed form
2452D575q081K491N465p607J904N460o860J016N745o285J17O137n810q30O720
2467D157n428j806P336n322k322P700n210k613P761n003k801P633m507l140P221
2482C656l544l806P006k678m631P077j898n673P670j598o350P925j553o444Q062
2497C221j524o363P589j198o100O818l98o294O079Q02o790N484J819p506N357
2512I96K549q040N431K737q200N346K913q097M931L106p621M132L447p177L249
2527b98M033o914K338M862o894J489N702p000R04O307p255P37O612p232O59O576
2543D626p025K68O481o372l74O515n529j403O882m953k445P563m853l183Q220
2558D418m906l568Q626n083l546Q427m699l532P968m218l689P397l172m257O988
$$ plain form
2573 3154 1016 -4071 2840 1520 -4365 2796 1794 -4570 2798 1850 -4622 2664 1869 -4381 2412
2588 2412 1938 -4067 1967 2150 -3803 1446 2506 -3639 840 2944 -3631 400 3371 -3731 179
2603 179 3679 -3819 60 3792 -3741 -98 3687 -3425 -321 3682 -2965 -841 3745 -2487 -1458
2618 -1458 3951 -2272 -2038 4316 -2140 -2407 4606 -2218 -2538 4780 -2233 -2497 4666 -2096 -2436 4284
2634 4284 -1697 -2560 3922 -1115 -2888 3759 -565 -3344 3794 -179 -3766 3901 -53 -3940 3971
2649 3971 -24 -3973 3897 70 -3803 3566 326 -3645 3072 722 -3588 2542 1281 -3843 2216
2664 2216 1867 -4042 1924 2286 -4323 1858 2473 -4366 1794 2509 -4188 1603 2560 -3922 1125 2712
2680 2712 -3567 608 3023 -3349 37 3432 -3335 -355 3898 -3513 -497 4099 -3562 -494 4118
$$ packed form
2573C154k138n087O911j320n885P161j002o364P368r48o472P286p95o250O793
2588B412m74o005O034J83n953N249J060o145M479K104o575M031K971p102L910
2603A79L500p498L879L732p533L643L785p112L104M003o647K124M586o232J029
2618a458N409o223K34O354o456k67P013o824l20P318p013k64P163o762l40O720
2634D284n981q63O482n037j773O647m324k779P138l973l587P667l954l887P911
2649C971l995l949P870l827l873P369l240l971O717k350m310O130j261n124O059
2664B216l49n909N966L62o609O181O15o839O160P15o697N791R57o482N047J587
2680B712o279M175K415o372L386L395o767K980M253p411L016M596p661L068M612
$$ plain form
2695 4118 -3510 -470 3878 -3249 -626 3686 -2863 -897 3613 -2348 -1427 3670 -1923 -1885 3831 -1759
2711 -1759 -2287 4003 -1634 -2435 4073 -1575 -2487 3883 -1345 -2421 3551 -911 -2533 3169 -366 -2734
2727 -2734 2878 228 -3127 2758 669 -3527 2740 988 -3744 2790 1055 -3809 2743 1051 -3582
2742 -3582 2421 1180 -3362 1982 1494 -3229 1459 1958 -3372 1074 2392 -3569 938 2779 -3832
2757 -3832 966 2933 -3900 987 2806 -3829 953 2717 -3456 594 2696 -3053 129 2880 -2760
2772 -2760 -349 3163 -2559 -762 3428 -2561 -962 3606 -2614 -1040 3550 -2502 -1010 3341 -2246
2787 -2246 -1046 3091 -1750 -1345 2931 -1315 -1752 2928 -886 -2127 3025 -706 -2476 3176 -696
2802 -696 -2566 3214 -587 -2526 3125 -559 -2414 2765 -305 -2297 2403 111 -2490 2054 675
$$ packed form
2695D118p628L040M348p127K623M312o549J966M510n961R21N097n593L8N716n590
2711a759n28O290n637q01O508n648r12O370n228j076N972m462j622N702l535k368
2727b734N612k650l355N885k089m196O267j752m732O534j735m864O552j692m633
2742c582O003j241m542N344m88m723M688M99n330M446J318n961M507J841o611
2757c832M798J967o833M887J819o635M782J764o173M050K102n749L182K751n640
2772b760K411L512n722J797M190n989J599M568o220J574M590o052J492M351n587
2787b246J200M137m841M05M276m246m37M680l814j241N152l731j770N652l872
2802f96j870N780l801j939N651l684j855N179l070j992M700k292k601M544j379
$$ plain form
2817 675 -2752 1946 1126 -3152 1935 1382 -3334 2003 1300 -3398 2069 1249 -3222 1802 1239 -2948
2833 -2948 1454 1410 -2648 1038 1685 -2594 646 2139 -2708 403 2387 -2818 392 2427 -2829 398
2849 398 2368 -2702 389 2171 -2390 176 2139 -2017 -238 2177 -1698 -638 2374 -1456 -1079
2864 -1079 2693 -1551 -1293 2916 -1603 -1345 2984 -1625 -1281 2812 -1445 -1293 2523 -1092 -1362 2310
2880 2310 -607 -1720 2208 -218 -2199 2321 26 -2462 2517 41 -2642 2683 -117 -2540 2660
2895 2660 -188 -2390 2358 35 -2171 1999 313 -2143 1705 681 -2392 1520 1009 -2640 1507
2910 1507 1213 -2719 1553 1207 -2703 1537 1103 -2567 1394 1171 -2287 1075 1240 -2042 545 1539
2926 1539 -1889 188 1870 -1903 -92 2233 -2114 -231 2473 -2168 -195 2395 -2191 -218 2228
$$ packed form
2817F75l427M698q20m278N087n53m716N337p03m698N467q20m471N024n63m187
2833b948M402m4m058L686O47m279L240J493m847L111J984n205L210K035n256L227
2849C98J970n070L091J782m561K566J963m156J779K415l875J060L012l830L77
2864a079L772m244K58M209m519K58M329m609L44M093m257J52L816l615k70L672
2880B310k917j113L928k426j981M520k295k488M979k476k683N325k800k423N200
2895B660k848k202M748k323k206M170j686k456L848j024l073L912n11l649M147
2910A507k94l932M272l46l910M240m34l670L961k23l458L362J65l282K587R94
2926A539l428K077J682l773J811K325m347J883K704m641J973K590m586J973K446
$$ plain form
2941 2228 -1904 -279 2043 -1650 -508 2065 -1260 -990 2143 -968 -1367 2351 -977 -1586 2561 -1002
2957 -1002 -1582 2631 -1078 -1488 2499 -951 -1492 2287 -692 -1478 1982 -381 -1667 1835 -16 -1944
2973 -1944 1824 273 -2213 1941 386 -2321 1923 345 -2291 1819 390 -2061 1614 530 -1929
2988 -1929 1219 750 -1834 795 1124 -1894 601 1412 -1968 540 1685 -2259 540 1763 -2320 578
3004 578 1684 -2114 483 1508 -1912 338 1510 -1605 -31 1642 -1434 -451 1914 -1296 -671 2073
3020 2073 -1397 -779 2226 -1481 -722 2187 -1452 -663 2056 -1243 -725 1856 -914 -883 1777 -631
3036 -631 -1180 1799 -388 -1425 1861 -323 -1582 1954 -292 -1550 1888 -304 -1523 1784 -202
3051 -202 -1393 1506 -68 -1310 1239 231 -1419 999 555 -1581 899 827 -1783 876 956 -1916
$$ packed form
2941B228m132J625K322l693J142K573l325K70L133l111l99L718l328o09M147l563
2957a002n80M213l709m10L987l450n41L779k979p86L460k363j286L502j851j928
2973a944L768j551k486M154j555k707M244j578k636M110j429k451L675j084k459
2988a929L148m69k584K629L29l018K495Q11l380K508J145l944K799J223m083K898
3004E78J106l798K597J025l420K250J172l115J574J673l076R83K365l210O25K744
3020B073l470O18L005l707P59K909l639P89K719l299N18K581k770L1K660k408
3036f31n49K979k187j037L286k184j259L536k246j258L438k192j219L307j986
3051b02j191K899j574j242K549j008j650K418m44k136K480p2k610K659Q0k872
$$ plain form
3067 -1916 970 957 -1976 908 981 -1783 806 914 -1579 564 1016 -1424 206 1233 -1376 -75
3083 -75 1537 -1486 -192 1778 -1507 -147 1751 -1571 -59 1708 -1479 -140 1559 -1338 -208
3098 -208 1426 -993 -500 1497 -787 -760 1621 -731 -946 1741 -761 -976 1801 -821 -1010 1737 -797
3115 -797 -864 1513 -638 -799 1355 -329 -892 1174 -50 -1085 1111 149 -1311 1158 290 -1528 1223
3132 1223 359 -1633 1315 319 -1530 1160 372 -1402 1042 347 -1326 816 594 -1321 580 907
3148 907 -1419 448 1019 -1518 440 1200 -1635 507 1182 -1576 537 1069 -1495 443 1006 -1231
3164 -1231 241 1020 -1102 -32 1200 -970 -207 1301 -1037 -370 1498 -1062 -386 1473 -1083 -352
3180 -352 1454 -1050 -363 1308 -880 -396 1152 -655 -652 1099 -348 -798 1162 -253 -1051 1232 -169
$$ packed form
3067a916K886j3k933K884P3k764K589J08k493K143M52k440J630J027k609J301
3083g5J612l023J294J970l285J360J898l322J512J767l187J339J699k897J130
3098b08J634k419M93J997k284K7K381k352k15K687k502k15K777k622j89K747k534
3115g97o7K377k151j61K154j684n63K066j224j035K196r62j460K469q68j818K751
3132A223q64j992K948r96j849K690p88j774K444o95j673K142k22j915J901L27
3148I07k326J867N71k537J958P60k835K142O75k758K113N32k564J938N63k237
3164a231J472P79k122J070J232k170P63J508k338O67J868k560O76J859k556P31
3180c52J806k504O87J671k188M84J548j807LJ751j447m50J960j415p98K283j401
$$ plain form
3197 -169 -1173 1367 -222 -1186 1426 -159 -1092 1277 -138 -1058 1147 -11 -1014 1002 216 -1191
3213 -1191 872 408 -1256 844 538 -1426 897 558 -1490 975 563 -1454 903 462 -1344 760
3229 760 524 -1208 572 645 -1113 397 867 -1176 228 1026 -1240 174 1178 -1306 179 1143 -1276
3246 -1276 178 1074 -1163 161 1064 -962 16 950 -805 -195 977 -672 -397 1095 -652 -558 1230
3263 1230 -599 -627 1296 -687 -607 1364 -707 -600 1237 -562 -614 1072 -386 -661 1021 -188 -870
3280 -870 1002 -13 -1031 1091 35 -1137 1219 15 -1165 1203 -3 -1136 1135 8 -1001
3295 -1001 947 135 -1001 798 272 -1035 650 525 -1105 569 638 -1186 577 717 -1280 644
3311 644 633 -1272 630 649 -1181 464 633 -1087 397 692 -940 170 808 -894 3 975 -936
$$ packed form
3197a69j004K540j589r64K612j585r33K369j415r20K205j158j003K016p86j407
3213a191K063m64j664K100l06j964K323l39k048K465m12k017K357m41j806K104
3229G60k36j732J780P3j758J510M70k043J404P98k266J414J004k484J485R64k419
3246a276J454Q96k237J324R03k026R78R34j755O10J172j649K75J492j747R4J788
3263A230j829k8J923j983Q0J971k071J07J837j799n2J686j458k75J682j209o82
3280h70J872j015j018K122j056j172K356j204j180K368j206j133K271j127j009
3295a001J948q12j136J799n26j307J685j25j630J674O9j824J763J40j997J924
3311F44j1j905J902J9j830J645J69j720J484K95j632J110O38j702Q97R72j911
$$ plain form
3328 -936 -105 1124 -979 -198 1174 -1033 -145 1225 -926 -102 1110 -852 -265 1041 -715 -368 1050
3345 1050 -573 -577 1173 -516 -738 1270 -500 -784 1358 -508 -779 1291 -534 -774 1223 -441 -711
3362 -711 1114 -302 -785 997 -99 -910 946 34 -965 956 144 -1102 954 154 -1137 967 183
3379 183 -1164 918 189 -1034 814 233 -982 647 410 -994 537 586 -1069 392 786 -1115 272
3396 272 845 -1127 282 877 -1198 287 870 -1138 219 861 -988 96 861 -869 -48 995 -835
3413 -835 -290 1125 -845 -403 1220 -873 -395 1248 -881 -358 1210 -818 -313 1115 -721 -379 1037
3430 1037 -624 -530 991 -449 -666 1063 -274 -773 1173 -281 -884 1182 -225 -913 1173 -225
3446 -225 -819 1066 -154 -904 1004 -7 -885 814 46 -960 770 317 -1080 725 373 -1107 746
$$ packed form
3328i36Q31J229k103P81J372k207Q88J370k151Q24J212j962N87J306j756L47J418
3345A050j623mJ750j689k22K008j770k84K142j866k71K070j825k40J997j664k70
3362g11J825j416m83J782j096q11J856r12r99J921q12j246K056q00j291K104p84
3379A83j347K082p29j223J848n81j215J629k37j404J531M9j655J461L94j901J387
3396B72N73j972J409N95k075J485N83k008J357O42j849J084P65j730Q21J043j830
3413h35N45J415j970M42J623k093M78J643k129N23J568k028N05J428j836L42J416
3430A037j661R4J521j440k17J729j337m99J946j454o03K066j407o88K086j398
3446b25n94J885j220p50J908j011q78J699p68j006J730m53j397J805l52j480J853
$$ plain form
3463 746 468 -1185 704 442 -1154 723 478 -1120 611 496 -1032 480 603 -1024 346 741 -1028
3480 -1028 220 899 -1043 148 985 -1165 150 1006 -1146 192 969 -1123 103 927 -955 19
3496 19 900 -818 -135 953 -735 -310 983 -692 -406 1133 -674 -511 1166 -671 -504 1136 -606
3513 -606 -525 1107 -494 -541 1015 -360 -616 921 -208 -751 945 -75 -863 944 -1 -984 983
3530 983 61 -961 1011 22 -1003 982 56 -1012 886 141 -1010 722 365 -1045 643 487 -1063
3547 -1063 573 634 -1218 556 750 -1296 578 714 -1222 546 698 -1159 548 679 -1055 332
3563 332 751 -976 168 844 -920 66 970 -929 0 1023 -1010 -37 1069 -940 -80 1024 -930
3580 -930 -160 996 -776 -166 921 -664 -329 982 -512 -505 998 -484 -592 1070 -406 -744 1170
$$ packed form
3463G46k78j653J889k62j596J877k45j598J731j15j528J512J23j627J370L95j769
3480a028J248O79j942J191Q37k150J315Q56k152J338P77k092J226Q24j882R74
3496A9Q81j718O83J088j688M25J293j675K86J539j807J63J677j837J67J640j742
3513f06Q1J632j601m7J556j375k56J537j129n43J696j020p88J807r45r83J967
3530I83r22j022J972r89j025J985r26j068J898p45j151J732l57j410J688j56j550
3547a063J636O1j852J774J94k046J874J36j936J768J52j857J707J31j734J387
3563C32M19j727J144O76j764R86R04j899R29J023k033R73J106k009Q60J104j954
3580i30P70J156j772O10J087j585L35J311j494PJ503j482j08J662j476l38J914
$$ plain form
3597 1170 -437 -743 1188 -360 -785 1055 -287 -750 1008 -95 -834 891 -5 -970 892 124 -1087
3614 -1087 892 245 -1176 920 267 -1120 873 244 -1158 845 340 -1101 767 394 -1001 589
3630 589 410 -1019 491 603 -1015 385 697 -1085 312 767 -1072 329 798 -1147 238 795 -1009
3647 -1009 155 822 -955 26 869 -802 -133 925 -717 -338 1065 -712 -359 1144 -702 -395 1172
3664 1172 -738 -476 1174 -676 -474 1090 -583 -552 1039 -404 -654 977 -267 -755 1037 -171
3680 -171 -853 1079 -197 -963 1092 -140 -974 1109 -120 -950 1003 -75 -906 937 58 -909 781
3697 781 164 -1003 707 308 -1047 695 426 -1115 649 486 -1189 659 484 -1065 541 576 -1056
3714 -1056 412 626 -966 379 675 -979 101 815 -884 31 919 -885 -17 959 -945 -68 994
$$ packed form
3597A170j607l06J931j548m25J840j342m63J758j103p39J725q96r65J862p68j211
3614a087J979o47j421K096o53j387J993o29j402K003n05j441J868l73j395J590
3630E89j79j429J510J12j618J400L12j782J397M55j839J401M69j945J385N57j804
3647a009J164O67j777R81Q43j671O69J058j642L79J403j777L53J503j846L07J567
3664A172j910K62J650j850K02J564j673L1J591j443k50J631j244m88J792j208
3680a71o82J932j276p66K055j232q34K083j229q30J953j078q31J843q79r67J690
3697G81o17j167J710l99j355J742k69j541J764j63j675J848j75j549J606L5j632
3714a056J468K14j592J345K96j654J080P14j699R15Q88j804Q68R76j904Q77J062
$$ plain form
3731 994 -933 -83 1005 -817 -228 952 -724 -260 966 -590 -450 1009 -507 -554 1058 -454 -669
3748 -669 1134 -426 -678 1172 -411 -706 1162 -345 -683 1082 -262 -730 962 -113 -839 881
3764 881 55 -947 847 119 -1004 846 237 -1105 815 215 -1060 811 283 -980 725 304 -1020
3781 -1020 565 419 -908 444 514 -932 315 685 -958 205 818 -1037 172 831 -1082 208
3797 208 868 -1036 137 878 -916 76 888 -878 -61 941 -774 -233 1049 -680 -366 1129 -724
3814 -724 -465 1209 -703 -451 1193 -650 -422 1137 -629 -503 976 -478 -571 986 -320 -635 972
3831 972 -277 -761 1039 -198 -800 1013 -156 -840 947 -119 -861 916 -94 -881 909 90 -826
3848 -826 709 178 -903 546 332 -926 521 542 -978 476 562 -1038 421 654 -1110 382 670
$$ packed form
3731I94j927Q50J088j822N89J180j676M64J226j556J40J459j516m7J612j512k15
3748f69J803j560k52J850j583k95J868j507l38J765j344m68J692j075p26J720
3764H81q26j002J794p28j123J850o09j342J920o00j275J871n28j263J705m21j324
3781a020J585j46j327J352P0j446J247L70j643J163O13j855J209O59j913J290
3797B08O60j904J173P41j794R92Q12j766Q17J002j715N41J282j729L14J495j853
3814g24K59J674j912K52J644j843K28J559j766J26J479j454r3J557j306l15J607
3831I72j249m84J800j237o02J813j169o84J787j066p42J777j010p87J790q19r16
3848h26J535n31j081J449k14j258J447K1j520J454Q6j600J459K33j764J492K88
$$ plain form
3865 670 -1065 299 659 -985 222 763 -919 44 838 -809 -62 1009 -923 -134 1041 -875 -177
3882 -177 1072 -857 -146 1053 -884 -177 1021 -753 -275 974 -618 -411 991 -491 -527 1012 -448
3899 -448 -621 1058 -342 -766 1120 -322 -781 1037 -270 -742 1000 -167 -834 854 -47 -820 867
3916 867 116 -813 767 234 -988 682 364 -1048 726 393 -1119 663 480 -1143 625 481 -1129
3933 -1129 522 563 -1071 445 610 -987 258 765 -983 160 883 -1005 110 994 -1040 128
3949 128 977 -1058 71 997 -948 38 936 -825 -70 936 -776 -247 1035 -642 -400 1027 -668
3966 -668 -459 1100 -609 -547 1135 -521 -597 1075 -470 -697 1082 -425 -693 1014 -212 -759 887
3983 887 -48 -835 881 72 -924 894 107 -1008 904 152 -1057 848 232 -1097 857 262 -1090
$$ packed form
3865F70j735J364L60j644J207N41j682R63P94j647P47J071j932P89J175j916O98
3882a77J249j929P11J199j937P07J198j774M78J249j592K07J402j482l6J539j460
3899d48j73J679j400m24J886j442m59J818j307m72J742j167o67J688r01p73J687
3916H67p51r29J580n33j222J670l18j412J774l33j512J782j83j623J768j44j610
3933a129J651M1j634J516J65j597J245N07j748J143P23j888J115Q84k034J168
3949A28Q49k035J129R26j945R86Q98j761P55J006j712N29J282j677K42J427j695
3966f68K09J559j709O2J682j656p6J672j545k27J779j507k68J707j226n47J646
3983H87r35p87J716q09r96J818p87j115J912p52j209J905o16j329J954n95j352
$$ plain form
4000 -1090 755 345 -1082 670 483 -1082 574 632 -1125 447 722 -1212 418 764 -1263 429
4016 429 864 -1214 447 808 -1204 239 845 -1099 128 906 -1027 -12 956 -921 -116 1089 -941
4033 -941 -222 1181 -846 -239 1087 -858 -279 1114 -749 -344 1076 -597 -501 1061 -498 -600 1051
4050 1051 -350 -745 1025 -330 -794 1045 -215 -936 1101 -114 -1005 1048 -143 -999 1050 -64
4066 -64 -1002 942 59 -1001 841 249 -1085 814 420 -1160 769 446 -1253 779 538 -1250 744
4083 744 559 -1220 708 620 -1156 573 633 -1101 395 711 -1110 270 774 -1078 184 891 -1081
4100 -1081 78 1017 -1044 16 1025 -1016 -44 1032 -922 -105 1027 -829 -231 1088 -710 -385
4116 -385 1126 -610 -535 1168 -547 -688 1254 -566 -739 1285 -520 -797 1269 -433 -826 1196 -325
$$ packed form
4000a090J845m10j427J752j87j565J656N8j757J572K75j934J630L46k027J692
4016D29M35k078J661L61k012J443O06j944J227P78j933J015R68j877Q05J205k030
4033i41P19J403k027O07J326j945N79J393j863M05J420j673R6J562j559j02J651
4050A051j401l95J770j355m64J839j260p21K037j215q91K053j191q56K049j114
4066f4r38J944q83j060J842n92j334J899l94j580J929l23j699K032k41j788J994
4083G44j85j779J928q8j776J729O0j734J496L16j821J380N04j852J262P07j972
4100a081J159R39k061J060J009k041R72J076j954Q17J132j856N98J319j798L25
4116c85J511j736P5J703j715j41J942j820j73K024j805k77K066j702l93K022j521
$$ plain form
4133 -325 -832 1107 -188 -884 1061 -103 -1059 1009 50 -1135 1047 99 -1191 1081 121 -1200 1064
4150 1064 165 -1159 988 235 -1114 832 308 -1097 715 423 -1150 659 561 -1102 544 627 -1197
4167 -1197 475 712 -1201 487 852 -1142 336 785 -1122 213 878 -1019 84 876 -928 -73
4183 -73 1024 -896 -198 1129 -860 -320 1117 -830 -375 1222 -830 -376 1232 -793 -418 1163 -678
4200 -678 -482 1141 -564 -623 1133 -498 -773 1124 -333 -825 1210 -314 -952 1225 -245 -980 1223
4217 1223 -270 -955 1138 -203 -912 1062 -34 -977 958 158 -1100 876 226 -1136 889 383
4233 383 -1207 887 442 -1232 753 459 -1145 673 444 -1064 581 562 -1027 409 662 -1086 285
4250 285 790 -1052 174 893 -1099 125 983 -1081 114 1017 -1095 88 1017 -1090 -7 1000
$$ packed form
4133c25n07J939j295o96J945j164r56K068r59j185K182r48j290K272r60j321K264
4150A064q99j324K147p53j349J946n24j405J812k92j573J809r8j663J646Q3j824
4167a197J672K37j913J688L65j994J478M49j907J335O65j897J103P92j804Q55
4183g3J097j920O98J327j989N40J437j947M55J597k052M54J608k025L75J581j841
4200f78J96J623j705n9J756j631k75J897j457m92K035j524o38K177j470p35K203
4217A223j493o85K093j341p09J974j096r43J935q00j258J976o50j362K025n06
4233C83j590K094m45j674J985k94j604J818k29j508J645j9j589J436K53j748J371
4250B85N05j842J226P19j992J224Q58k064J195R03k112J183R29k107J083J007
$$ plain form
4266 1000 -925 -132 978 -899 -245 1110 -770 -358 1250 -730 -478 1250 -724 -544 1309 -718
4282 -718 -537 1293 -678 -566 1150 -546 -619 1096 -447 -674 1018 -259 -746 1040 -176 -871 996
4299 996 -63 -915 1041 -47 -927 1023 8 -947 931 49 -908 836 146 -985 709 291 -956
4316 -956 661 406 -1055 578 632 -1134 593 636 -1146 557 711 -1191 487 685 -1143 405 739
4333 739 -1032 262 812 -1015 169 860 -1022 114 945 -1042 4 1102 -1034 -50 1077 -979
$$ packed form
4266A000j925P93J110j877O54J355j880M12J608j980K52J728j974J80J853k027
4282g18J81J830j971J12J716j696p3J715j543k27J692j277m87J786j216o95J867
4299I96j059q52J956j088q80J950j015r55J878q82r57J744o90j131J694m18j247
4316i56J617k55j461J633N4j766J727M3j782J703J54j902J678J98j828J548L34
4333G39j771J294N50j827J184O91j882J136Q31j987J046J098k136R84J127k056
$$ [...]
8191A0
##END NTUPLES=NMR FID
##END=
