##TITLE=1H_MB1211
 CDCl3, 8 sc, 
 12.11.2019
##JCAMPDX= 6.0         $$ Bruker NMR JCAMP-DX V2.0
##DATA TYPE= NMR FID
##DATA CLASS= NTUPLES
##ORIGIN= UXNMR, Bruker Analytische Messtechnik GmbH
##OWNER= root
$$ XWIN-NMR		Version 3.5
$$ Tue Nov 12 14:46:03 2019 Russian Standard Time (UT+4h)  she@DPX200
##.OBSERVE FREQUENCY= 200.1315
##.OBSERVE NUCLEUS= ^1H
##.DELAY= (6, 6)
##.ACQUISITION MODE= SIMULTANEOUS
##.ACQUISITION SCHEME= undefined
##.AVERAGES= 8
##.DIGITISER RES= 18
##SPECTROMETER/DATA SYSTEM= spect
##.PULSE SEQUENCE= zg30
##.SOLVENT NAME= DMSO
##.SHIFT REFERENCE= (INTERNAL, DMSO, 0, 15.7039)
##AUDIT TRAIL= $$ (NUMBER, WHEN, WHO, WHERE, WHAT)
$$ ##TITLE= Audit trail, XWIN-NMR		Version 3.5
$$ ##JCAMPDX= 5.01
$$ ##ORIGIN= Bruker BioSpin GmbH
$$ ##OWNER= she
$$ F:/spectra/data/she/nmr/H-F/1/audita.txt
$$ ##AUDIT TRAIL=  $$ (NUMBER, WHEN, WHO, WHERE, WHAT)
(   1,<2019-11-12 14:45:12.40 +0400>,<she>,<DPX200>,
      <created by zg, POWCHK disabled, PULCHK disabled
       configuration hash MD5:
       00 E9 B6 7A A2 85 ED C7 34 08 36 98 17 FE 4E 26
       data hash MD5: 16K
       73 AB E8 DC 2D B8 28 77 08 77 67 3F 17 57 4F 6A>)
$$ ##END=
$$ 
$$ hash MD5
$$ D0 CA 5B 1A 4E F5 6A 17 C5 5F 49 C9 07 BD 89 71
##$RELAX= 
##$RELAX= 
##$RELAX= 
##$RELAX= 
##$RELAX= 
##$RELAX= 
$$ Bruker specific parameters
$$ --------------------------
##$DU= <F:/spectra>
##$EXPNO= 1
##$NAME= <H-F>
##$PROCNO= 1
##$TYPE= <nmr>
##$USER= <she>
##$AMP= (0..31)
100 100 100 100 100 100 100 100 100 100 100 100 100 100 100 100 100 100 
100 100 100 100 100 100 100 100 100 100 100 100 100 100 
##$AQSEQ= 0
##$AQ_mod= 1
##$AUNM= <au_zg>
##$AUTOPOS= <>
##$BF1= 200.13
##$BF2= 200.13
##$BF3= 200.13
##$BF4= 200.13
##$BF5= 200.13
##$BF6= 200.13
##$BF7= 200.13
##$BF8= 200.13
##$BYTORDA= 1
##$CFDGTYP= 0
##$CFRGTYP= 5
##$CHEMSTR= <none>
##$CNST= (0..31)
1 1 145 1 1 1 1 1 1 1 1 1 1 1 1 1 1 1 1 1 1 1 1 1 1 1 1 1 1 1 1 1 
##$CPDPRG= <>
##$CPDPRG1= <>
##$CPDPRG2= <>
##$CPDPRG3= <>
##$CPDPRG4= <mlev>
##$CPDPRG5= <mlev>
##$CPDPRG6= <mlev>
##$CPDPRG7= <mlev>
##$CPDPRG8= <mlev>
##$CPDPRGB= <>
##$CPDPRGT= <>
##$D= (0..31)
0 1.2 0 0 0 0 0 0 0 0.06 0 0.03 0 0 0 0 0.0002 0 0 0 0 0 0 0 0 0 0 0 0 
0 0 0 
##$DATE= 1573555511
##$DBL= (0..7)
120 120 120 120 120 120 120 120 
##$DBP= (0..7)
150 150 150 150 150 150 150 150 
##$DBP07= 0
##$DBPNAM0= <>
##$DBPNAM1= <>
##$DBPNAM2= <>
##$DBPNAM3= <>
##$DBPNAM4= <>
##$DBPNAM5= <>
##$DBPNAM6= <>
##$DBPNAM7= <>
##$DBPOAL= (0..7)
0.5 0.5 0.5 0.5 0.5 0.5 0.5 0.5 
##$DBPOFFS= (0..7)
0 0 0 0 0 0 0 0 
##$DE= 6
##$DECBNUC= <off>
##$DECIM= 24
##$DECNUC= <off>
##$DECSTAT= 4
##$DIGMOD= 1
##$DIGTYP= 9
##$DL= (0..7)
0 120 120 120 120 120 120 120 
##$DP= (0..7)
150 150 150 150 150 150 150 150 
##$DP07= 0
##$DPNAME0= <>
##$DPNAME1= <>
##$DPNAME2= <>
##$DPNAME3= <>
##$DPNAME4= <>
##$DPNAME5= <>
##$DPNAME6= <>
##$DPNAME7= <>
##$DPOAL= (0..7)
0.5 0.5 0.5 0.5 0.5 0.5 0.5 0.5 
##$DPOFFS= (0..7)
0 0 0 0 0 0 0 0 
##$DQDMODE= 0
##$DR= 18
##$DS= 0
##$DSLIST= <SSSSSSSSSSSSSSS>
$$ [...]
##$SUBNAM2= <"">
##$SUBNAM3= <"">
##$SUBNAM4= <"">
##$SUBNAM5= <"">
##$SUBNAM6= <"">
##$SUBNAM7= <"">
##$SUBNAM8= <"">
##$SUBNAM9= <"">
##$SW= 24.0689530833862
##$SWIBOX= (0..15)
0 0 2 0 0 0 0 0 0 0 0 0 0 0 0 0 
##$SW_h= 4816.95568400771
##$TD= 16384
##$TD0= 1
##$TE= 0
##$TE2= 300
##$TE3= 300
##$TEG= 300
##$TL= (0..7)
0 120 120 120 120 120 120 120 
##$TP= (0..7)
150 150 150 150 150 150 150 150 
##$TP07= 0
##$TPNAME0= <>
##$TPNAME1= <>
##$TPNAME2= <>
##$TPNAME3= <>
##$TPNAME4= <>
##$TPNAME5= <>
##$TPNAME6= <>
##$TPNAME7= <>
##$TPOAL= (0..7)
0.5 0.5 0.5 0.5 0.5 0.5 0.5 0.5 
##$TPOFFS= (0..7)
0 0 0 0 0 0 0 0 
##$TUNHIN= 0
##$TUNHOUT= 0
##$TUNXOUT= 0
##$USERA1= <user>
##$USERA2= <user>
##$USERA3= <user>
##$USERA4= <user>
##$USERA5= <user>
##$V9= 5
##$VALIST= <valist>
##$VCLIST= <CCCCCCCCCCCCCCC>
##$VD= 0
##$VDLIST= <DDDDDDDDDDDDDDD>
##$VPLIST= <PPPPPPPPPPPPPPP>
##$VTLIST= <TTTTTTTTTTTTTTT>
##$WBST= 1024
##$WBSW= 4
##$XGAIN= (0..3)
0 0 0 0 
##$XL= 0
##$YL= 0
##$YMAX_a= 93074
##$YMIN_a= -104278
##$ZGOPTNS= <>
##$ZL1= 120
##$ZL2= 120
##$ZL3= 120
##$ZL4= 120
##$ABSF1= 10
##$ABSF2= 0
##$ABSG= 5
##$ABSL= 3
##$ALPHA= 0
##$AQORDER= 0
##$ASSFAC= 0
##$ASSFACI= 0
##$ASSFACX= 0
##$ASSWID= 0
##$AUNMP= <proc_1d>
##$AZFE= 0.1
##$AZFW= 0.1
##$BCFW= 1
##$BC_mod= 2
##$BYTORDP= 1
##$COROFFS= 0
##$CY= 11.3945322036743
##$DATMOD= 1
##$DC= 2
##$DFILT= <>
##$DTYPP= 0
##$F1P= 16.9975609425685
##$F2P= -3.02152046262296
##$FCOR= 0.5
##$FTSIZE= 0
##$FT_mod= 4
##$GAMMA= 1
##$GB= 0.15
##$INTBC= 1
##$INTSCL= 1
##$ISEN= 128
##$LB= 0.24
##$LEV0= 0
##$LPBIN= 0
##$MAXI= 10000
##$MC2= 0
##$MEAN= 0
##$ME_mod= 0
##$MI= 1.114404
##$NCOEF= 0
##$NC_proc= 0
##$NLEV= 6
##$NOISF1= 3.799351
##$NOISF2= 2.8
##$NSP= 1
##$NTH_PI= 0
##$NZP= 0
##$OFFSET= 15.70392
##$PC= 1
##$PHC0= -9612.637
##$PHC1= 14.40088
##$PH_mod= 1
##$PKNL= yes
##$PPARMOD= 0
##$PSCAL= 0
##$PSIGN= 0
##$REVERSE= no
##$SF= 200.130013532006
##$SI= 16384
##$SIGF1= 3
##$SIGF2= 2
##$SINO= 400
##$SIOLD= 16384
##$SREGLST= <1H.CDCl3>
##$SSB= 0
##$STSI= 0
##$STSR= 0
##$SW_p= 3612.71676300578
##$SYMM= 0
##$S_DEV= 0
##$TDeff= 0
##$TDoff= 0
##$TI= <>
##$TILT= no
##$TM1= 0
##$TM2= 0
##$TOPLEV= 0
##$USERP1= <user>
##$USERP2= <user>
##$USERP3= <user>
##$USERP4= <user>
##$USERP5= <user>
##$WDW= 1
##$XDIM= 8192
##$YMAX_p= 0
##$YMIN_p= 0
$$ End of Bruker specific parameters
$$ ---------------------------------
##NTUPLES= NMR FID
##VAR_NAME=  TIME,          FID/REAL,        FID/IMAG
##SYMBOL=    X,             R,               I
##VAR_TYPE=  INDEPENDENT,   DEPENDENT,       DEPENDENT
##VAR_FORM=  AFFN,          ASDF,            ASDF
##VAR_DIM=   8192,          8192,            8192
##UNITS=     SECONDS,       ARBITRARY UNITS, ARBITRARY UNITS
##FACTOR=    0.0002076,     1,               1
##FIRST=     0,             0,               0
##LAST=      1.7004516,     0,               0
##MIN=       0,             -104278,         0
##MAX=       1.7004516,     93074,           0
$$ Real data points
##PAGE= N=1
##DATA TABLE= (X++(R..R)), XYDATA
$$ [...]
219F19j100K31J749k678P71J630j636J37O58q33L57J430k723R69J955k338O29
$$ 619 -481 -250 1499 -1179 -408 1222 -414 -277 381 -452 -95 1335 -1388 -419 1536 -802 -173
236a73N14q45O79P58j968N36J952k184M80P05j078J072k6j334P48J323j812M88
$$ -173 341 -504 175 933 -1035 -499 1453 -731 -251 454 -624 448 422 -912 -164 1159 -653 -165
254a65O89j314J373k27j273Q94R00j265J06Q38j176R81n5j027R06K33p54K41M26
$$ -165 524 -790 583 356 -917 -23 877 -388 -282 556 -620 361 306 -721 185 418 -336 -95 331
273C31o85N93R7j097J132K2p46L60K22l88K39J45p89P14K80p76L77R0k17K42K3
$$ 331 -354 239 336 -761 371 393 -353 7 229 -159 80 225 -564 150 430 -346 31 121 -96 146 169
294A69m37L53L48p71L71J10l53L30O0m13J92M62o59M6M51m48K07N1k04J21J97
$$ 169 -268 85 433 -338 33 143 -210 120 180 -233 -41 421 -238 -192 259 -189 18 69 -135 -14 183
315A83k66m2M23n41K53K52n62L27J85l91j2M97m96Q7M86p30L60K54m64J48K82
$$ 183 -83 -125 298 -243 10 262 -300 27 212 -179 -191 306 -190 -103 383 -347 13 267 -197 -49 233
336B33l84N6M97o90K82L31o59M51J12m39J56M68p24K53N95j025N70J91n86L53
$$ 233 -151 -95 402 -288 -6 325 -334 117 229 -210 -54 414 -310 -57 538 -487 83 274 -312 41
356D1K42o19L49M22r02O19J74q15P08m1n85M66L50r16N08M40r93Q21po81O02R7
$$ 41 283 -336 13 435 -467 152 326 -489 219 178 -407 59 409 -507 1 441 -552 269 262 -419 183 280
378B80n87L04L62q53P67n3p46P86n4n16M29K5n07N92K0q85R75j75n43O07j74j99
$$ 280 -307 -3 359 -494 273 220 -526 260 206 -310 119 144 -363 229 249 -636 339 164 -379 228 54 -145
400a45L24O3o50O85n0n98O33l37p2M38l23k75N69rp03P42k72k51M90l65r8L66
$$ -145 179 242 -408 277 227 -371 262 -75 -147 291 -32 -307 262 253 -450 292 20 -231 259 -106 -204 162
422A62p7m09M57l2l74M51k86l4M05j93l11L05j4l44N36k68k50N87l53j47L20l3
$$ 162 85 -324 133 101 -273 178 -108 -142 263 70 -241 64 50 -294 242 -26 -276 311 -42 -189 131 98
444I8l01L27ql68N11k44j89L26j36j69L03o2l37N42k14l29M01j60k5R5n3j79L30
$$ 98 -203 124 116 -252 259 15 -174 152 16 -153 150 88 -249 293 79 -250 151 -9 -34 61 8 -171 159
467A59l4m77N09j35j37K81j81j28K75J5m41N91k31k64M09k73m4K47m0l51L84q1
$$ 159 125 -352 157 22 -115 166 -15 -143 132 147 -294 297 66 -198 211 -62 -106 141 101 -250 134 53
489E3l35M63j87j74L48j26k83L69M1m43M63j87k85O00l85r8K97n9k19K50l9l63
$$ 53 -282 181 -6 -180 168 42 -241 128 169 -274 189 2 -283 317 -68 -166 131 72 -147 103 64 -299
511b99N52k63j91M52k70j39L27j48k69N11l05j96N42m15K9L22l03n3L59k86k23
$$ -299 253 -10 -201 251 -19 -158 169 21 -248 263 -42 -238 304 -111 -82 240 -63 -116 243 -43 -266
532b66O23m37j17M27k99J0K91l18n8M71n01l6N33n46J47L64m87R9L27l29k1L86
$$ -266 357 -80 -197 230 -69 -59 232 -86 -144 327 -174 -210 323 -223 -76 288 -199 -100 227 -102 -123 263
554B63l04j0K90m25J39K64l04j5L28k98m3M04n01K22K19l59J10K05k91k0L46l95
$$ 263 -41 -51 239 -186 -47 217 -87 -102 226 -72 -115 289 -212 10 229 -130 -20 185 -106 -126 220 -175
576a75J78K48m22K12J33k82M5K15k45LK81m22K51N9k41J57J77k47J9K11k56N5
$$ -175 3 251 -171 41 174 -108 -63 152 -93 -90 191 -231 20 79 -162 -5 172 -75 -56 155 -101 -46
598d6K35m60K65J05k29M6K10k24KK73l82K01J67l04J20J22j53l0K71l45Q8K84
$$ -46 189 -271 -6 99 -130 -84 126 -98 -96 177 -205 -4 163 -141 -21 101 -52 -82 189 -156 -68 216
620B16l72J81R9k30P2J38j84M9K51l29Q8J46k65K21kk03J47J04k56N3K39k80J48
$$ 216 -156 25 124 -106 -34 104 -80 -31 220 -109 -21 125 -140 81 79 -124 23 127 -129 -76 163 -117 31
643C1l2j28J27Q6j47j6K63k61O9J27l20K46K7q8J3J41k41O7J66l00J86J05k13
$$ 31 -1 -129 -2 84 -63 -79 184 -77 -8 119 -201 45 72 -16 -3 138 -103 -36 130 -170 16 121 -92
666i2Q5J20j53k5J61k53J60J20k46N3J02n3RJ31j51K5J41k70J67J13k10L7P9j58
$$ -92 -7 113 -40 -65 96 -157 3 123 -123 -70 32 -21 -12 119 -32 -7 134 -136 31 144 -66 -29 50 -108
690a08J18J22k36J48J18k40J28k2p6J08Pj63J5J90k10J30J19k52J57Mj10R0Lj57
$$ -108 10 132 -104 44 162 -78 50 28 -48 60 67 -96 -81 109 -101 29 148 -104 53 57 -53 37 40 -117
714a17J17L3j94K25L0j18M8kj12R7J6j37J21J11k64J96K3j57Q9J01j88J15O8k43
$$ -117 0 33 -161 64 94 -24 24 22 -90 7 23 -114 7 118 -146 50 73 -84 5 106 -82 33 101 -142
738a42K43m8j55J71j10j3Q0L2r9O3P3j95J53n4l2K5N2j31J45L4k30K27J7k06J24
$$ -142 101 53 -102 69 -41 -54 26 58 -41 22 95 -100 53 -1 -33 -8 44 -87 58 92 -138 89 106 -100 24
763B4L2j33R3M3j36Q0K1j56J81P8j88M5J00j59P1J08k15J05M0j09J45n1q2P3L
$$ 24 56 -77 16 59 -77 3 24 -132 49 127 -61 -16 84 -75 -4 104 -111 -6 34 -75 70 19 -63 10 13
788A3r0N9J19j96J65m1j59J80M8j40L6L9j10J03lj44J09J4j10J38L5j05J1P0j11
$$ 13 -77 -18 101 -95 70 29 -130 50 98 -42 -6 33 -77 26 23 -121 -12 2 -108 30 65 -40 -29 41 -70
813g0M9M8q6R1j6k1L8M9j65Q6R3k10R5P5m8%n5l8J00L5j53J65l7n6N2J6o1Q9n3
$$ -70 -21 27 -59 32 16 -5 33 82 -83 3 96 -114 -19 56 8 8 -47 -85 15 50 -103 62 25 -31 21 37 -24 65 12
842A2r9N9J06k03J73k1j40P8Q2p6j0N1q9Q3j2o5J51o0l9O3K6q1M5j1j09J82o5
$$ 12 -87 -28 78 -125 48 27 -113 -35 47 -29 -39 12 -77 6 -6 -71 80 20 -19 44 70 -11 34 23 -86 96 31
869C1n2K6Rm7K8M4j14J55r4n2P7l9M5J9r0p5J84k5j24J01L1p1J25j03k7P5J1j37
$$ 31 -21 5 14 -33 -5 39 -75 80 -14 -66 11 -28 17 36 -54 -129 55 30 -94 7 38 -33 92 -11 -38 37 48 -89
897h9Q1Q1o9O0q2n1J34mq6L4Q7r5P3m9l3Q9j16k6N3J8q0Q0PKP1n2n8J31p5o3L2
$$ -89 -8 73 4 64 -18 -69 65 61 -25 9 96 1 74 25 -8 81 -35 -61 -8 10 -70 10 17 19 90 38 -20 111 36 -27 5
928Ej9LPl2m6J34n3k5M0lq7J10Pl2M3n1m5L3k8QM2J6m8O1n4j7L7M3q0R3n0l8J08
$$ 5 -14 -11 -4 -36 -82 52 -1 -26 14 11 -76 34 41 9 52 1 -44 -11 -39 -31 11 27 -21 40 -14 -31 6 49 -31 62 12 -26 82
961H2j10p0J72o2k7N9k8n9L7j6p1J29ln5J16r1l8J18m9o0N0M3q9Q7m4m2N6k5k5
$$ 82 -28 -98 74 12 -15 44 16 -43 -6 -22 -93 36 33 -22 94 3 -35 83 34 -26 24 67 -22 65 21 -21 35 10 -15
990a5k7L4l5N3l2J6K8l3L0J1k0k2L5k0r9J30Ko3Q2k6K2l0n4lJ08j00KR2q5L4k
$$ -15 -42 -8 -43 10 -22 -6 22 -11 19 30 10 -12 23 3 -96 34 36 -27 55 29 51 21 -33 -36 72 -28 -26 66 -19 15 13
1021A3l6%J06p9o3N0j2O5l5K0K6j7p8L2M4k8K0k5n3P7m2m3P8n0l0J7J14r4K6j7
$$ 13 -23 -23 83 4 -59 -9 -21 44 9 29 55 38 -40 -8 36 8 28 3 -50 27 -15 -58 20 -30 -60 -43 71 -23 3 -14
1051a4NK4N4n1l3Kj7O5n3K1l7M6p1J25pj36J00k7j1J7Jo9J19r7p2J47R0j43M1
$$ -14 -9 15 69 18 -15 -13 -30 35 -18 3 -34 12 -59 66 59 -77 23 -4 -15 2 3 -66 53 -44 -116 31 121 -22 19
1080A9p3M6J7j0m4K2O7q7P2J8j26J21n7j0N2l9n3N9K2n6J03qp7L3L5n1j5M7ro6
$$ 19 -54 -8 9 -1 -45 -23 44 -43 29 47 -79 42 -15 -25 27 -12 -65 -6 16 -40 63 55 -22 11 46 -5 -20 27 18 -48
1110d8L4l4R8l7l7L6K0m5R4r5n8O9M4j20P2R0n3P7n2m5M4rj21R1Km1J06q1K9O
$$ -48 -14 -48 50 13 -24 12 32 -13 81 -14 -72 -3 41 -79 -7 83 30 107 55 10 54 45 -76 15 17 -24 82 1 30 36
1140C6K7k2o0Q4r8Q6p4L1L1rj00O1J11r3j8k7pQ3n6j1M7N3m1k7l4l2N2qj6P9k8
$$ 36 63 41 -19 65 -33 53 -21 10 41 32 -68 -7 104 11 -7 -34 -41 42 -14 -25 22 75 34 7 -27 -59 -7 -15 -31 48 20
1171B0lm0j4L2JM8q4R6k5qK4l5Oj3j4k6O7k8j4P7n4k8M1j8m3K4LL1nj7m2O7l1
$$ 20 17 -23 -37 -5 -4 44 -40 56 31 23 47 12 18 5 -9 -35 32 4 -10 67 13 -15 26 8 -35 -11 -8 23 18 1 -41 26 -5
1204en9N3M6o3P9n0o9Q5k3J4k7MnJ5o8k3J48p2L0M0j2j43R4kj6K5rK0O4j21Q3
$$ -5 -64 -11 35 -28 51 1 -68 17 -6 8 -19 -15 -20 -5 -73 -96 52 -20 10 50 38 -105 -11 -13 -29 -4 -13 7 71 -50 33
1235C3J9loj8Nl4J7m6L4L7p0l0N7jp8O6J3NQl1p0J44n5p5P8k6j9M9J5p8J03pn
$$ 33 52 49 43 25 30 -4 13 -33 1 38 -32 -62 -5 -6 -84 -18 -5 0 8 -23 -93 51 -4 -79 -1 -27 -46 3 18 -60 43 36 31
1268C1M2o1n1P6m5ok5J3oR3o5k6L2l7n9J08k8LPl8K8KLj6N0Jm0M2p7L0P0o2o3
$$ 31 73 12 -39 37 -8 -14 -39 -26 -32 61 -4 -30 2 -35 -94 14 -14 -11 -4 -42 -14 -12 -9 -25 25 26 -14 28 -49 -19 51 -11 -74
1301g4J23o7n6R8mM8l3Nk1jk8rL9j0j9O5j08O1j4M2mk1m6KJ05n3o3J03m9m1O4
$$ -74 49 -18 -74 24 20 68 35 40 19 18 -10 -19 20 10 -9 56 -52 9 -5 37 33 12 -34 -32 73 20 -43 60 11 -30 34
1332C4j07M6N7J3n9K8n5PN2Rl0jj7mO7l1J5r4O2j7K2MJ5l2j9J1N7j3K3j39P0R
$$ 34 -73 -27 30 43 -16 12 -43 -36 16 25 -5 -6 -23 -27 40 9 24 -70 -8 -25 -3 1 16 -16 -35 -24 33 20 43 -96 -26 -17
1364a7l6J15j02j7MK7l9J12l8M9m3k0M5j2j3M8r7J7L8o0L4L1o2K9l0J0J6J6J7
$$ -17 -53 62 -40 -57 -53 -26 -65 47 9 58 15 -5 40 28 15 63 -34 -17 21 -39 -5 26 -36 -7 -37 -27 -11 5 22
1393B2l6rL2k9N5k8o3J29m9m7j4O6m4k1L7N4l5m0mM4o3K1K3MM5k3j2L1k2k1J5
$$ 22 -14 -23 9 -20 35 7 -56 73 24 -23 -37 29 -15 -36 1 55 20 -20 -24 20 -43 -22 1 5 50 27 15 46 24 3 18
1424A8l8M8JL4q5R4J5j08JJ4k9L9K8n9O4o8KP1l0l0M2m1q0J2J08n5pN5k0J1J2
$$ 18 -20 28 29 63 -22 72 87 -21 -20 -6 -35 4 32 -27 37 -31 -29 42 12 -18 24 -17 -97 -85 23 -32 -39 16 -4 7 19
1455A9p3K2JK5k5L9l5M1k3n1Q7k0l6Q6r2O2M5k7o4%K1n5L4K5j9K8pJn3O2j0j1
$$ 19 -54 -32 -31 -6 -31 8 -27 14 -9 -60 27 7 -29 57 -35 27 72 45 -19 -19 2 -53 -19 6 -13 15 8 9 -44 18 8 -3
1487cK7n0L4l9K5L0rL8p6M5K9p7k5Q2n6K4j9N8rp5N8K5l2L1j1N4j13M9p4J35m9
$$ -3 24 -26 8 -31 -6 24 15 53 -23 22 51 -26 -51 31 -25 -1 -20 38 29 -46 12 37 5 36 25 79 -34 15 -59 76 27
1518B7J2l8k1M2m4j2N3j7J0j2K5j3n1J42r3k3j3J0QK9j2J4K2o7mM8l4K9N3q4K2
$$ 27 39 1 -20 22 -22 -34 19 2 12 0 25 12 -39 103 10 -13 -26 -16 -8 21 9 23 45 -22 -26 22 -12 17 70 -14 8
1549HPk7m7P3m8L4M0J5pk2j0n5O9l4o7J04k5j5Q8o0j6K4m1L8l1J1l3M0P2q5j0
$$ 8 15 -12 -59 14 -34 0 40 55 48 26 16 -39 30 -4 -71 33 8 -7 81 21 5 29 -12 26 -5 6 -27 13 85 0 -10
1580a0jj5M5m2L1J4l9l2M8pN2j1k5p9J14q4n0N9K6N7o9LJ4M5j9p4J01p1N4K4o5
$$ -10 -11 -26 19 -23 8 22 -17 -49 -1 -8 44 33 8 -71 43 -41 -91 -32 -6 51 -18 -15 -1 44 25 -49 52 -19 35 59 -6
1611fJ02o7m6M4K5r2K6Qm0M8n7M9rK4m3L7Ll0j3K1N5p2P7o5Q0r6K5L3M1m9JJ1
$$ -6 96 29 -17 27 52 -40 -14 -6 -46 2 -55 -6 -15 9 -34 3 6 -24 -37 -16 39 -33 44 -21 59 -37 -12 21 62 13 14 25
1643B5Kq9L7j0l4O2q8R1K9j01M3N5l2m1M6j6j2Q0k1j7Mo2K2N2%nj1m2R9l3k3k7
$$ 25 27 -62 -25 -35 -69 -7 -95 -4 25 -76 -33 22 -10 -51 -5 -21 -33 47 26 9 13 -49 -27 25 25 20 9 -33 66 33 10 -17
1675a7J9n4N8P0m8j7N9o9n5R1k9l5N5mj4j1KpK9j54J29M4n1k1J10o7j6N1o6K2
$$ -17 2 -52 6 76 28 11 70 1 -54 37 8 -27 28 24 10 -1 1 -6 23 -131 -2 42 -9 -30 80 13 -3 48 -18 4
1705DM6q6Q7Pl6J8L1r1QO9l3K2no2L7N4m7k9K3M2p6K8o0O2N4j01j9J09j23O2R
$$ 4 50 -36 51 58 22 40 71 -20 -12 57 24 46 41 -21 16 70 23 -6 17 59 -17 11 -49 13 67 -34 -53 56 -67 -5 4
1736Dn6L5Ol0k0P1j6M6l2l9L8l2l1N2nn8M3O9o5j0M7r3J23m9m8O4NJ2jn0K4N4
$$ 4 -52 -17 -11 -41 -61 10 -6 40 8 -31 7 -25 -56 -4 -9 -67 -24 45 -20 -30 17 -76 47 -2 -50 14 19 31 30 -20 4 58
1768E8m4j5R1r8n9J27j13K9P9J3q3K7l6j9O5j6k6J4Rl8N6n0m1N9j2J4nJ15r3l2
$$ 58 14 -1 90 -8 -67 60 -53 -24 55 68 -15 12 -24 -43 22 6 -20 -6 3 -35 21 -29 -70 -11 -23 -9 -14 101 8 -24
1798b4L5p8R9m2l9J14o2o9P6K4lk9N8o2N9Lm3mPm9j1Q7K1J4j33K0Q4m3pQkk7N3
$$ -24 11 -67 32 -10 -49 65 3 -66 10 34 31 2 60 -2 57 60 17 13 20 -29 -40 47 68 82 -51 -31 53 10 3 11 9 -18 35
1831C5K2j17N6K1k5%j0O3K7p2p8J06l5K3k6O5r9K1M6m7P2n9j3J1Ol6L8qn3P9k6
$$ 35 57 -60 -4 17 -8 -8 -18 45 72 0 -78 28 -7 16 -10 55 -44 -23 23 -24 48 -11 -24 -13 -7 -43 -5 -13 -66 13 -13
1862a3r1J01K3p2K9P7j14M4J8k1L4j1J2j2LM5j7M9n7M7j5n2l1P4n4j2J4J0J2j3
$$ -13 -104 -3 20 -52 -23 54 -60 -16 2 -19 15 4 16 4 7 52 35 84 27 74 59 7 -24 50 -4 -16 -2 8 20 7
1892GmR5q7l8M7nk9J5M6m8N4j4j02N7K3qK8o7L5J5M3j19QP4l4j8l3N1RJ00j36
$$ 7 3 98 11 -27 20 15 -14 1 47 -1 53 39 -63 -6 17 9 37 -30 5 20 63 -56 -48 26 -8 -26 -59 -8 1 101 -35
1923c5K3J5n6P9l3M4N4q1k3M6l3L8l3m7mM6k8n8J19k1l6Pk9N4J1k7j6L6k5K4k8
$$ -35 -12 3 -53 26 -7 37 91 10 -13 33 0 38 5 -42 -46 0 -28 -86 33 12 -24 -17 -46 8 19 -8 -24 12 -13 11 -17
1954a7M7n1rO3o6N1l5j5mK1k1K1N7p3K6K6qm2J9l7O5k7L1K2q8L1N3l6K9K3o3j2
$$ -17 30 -21 -30 33 -33 18 -17 -32 -36 -15 -36 -15 42 -31 -5 21 13 -29 -10 -47 18 -9 22 44 -44 -13 40 4 33 56 -7 -19
1986a9O8m0L1J5o6J8pj1lN9rmj8o6M0L7o1L1J6l2O9j3k7J3L7m0m5N6M6j19N1n6
$$ -19 49 9 40 55 -11 7 0 -11 -14 45 36 32 14 -52 -12 25 -36 -5 11 -21 48 35 8 21 58 18 -27 29 75 -44 7 -49
2018d9ML8NKM0k1p9N9oM7m6k2k7Q6p2k2N5k0j0N9p7K9N8L1n3N5p0l2M7L7r5Q7
$$ -49 -45 -7 -2 0 40 19 -60 -1 -7 40 -6 -28 -55 31 -41 -63 -8 -28 -38 21 -56 -27 31 62 9 64 -6 -38 9 46 -49 38
2050C8j2p9L2NOk4K5k2L0j7K3p8O9k6O9l8lL2m6M9N7r5k1Q6j3n6k1N2Nl9j8Q5
$$ 38 26 -53 -21 -16 -10 -34 -9 -31 -1 -18 5 -73 -4 -30 39 1 -2 30 -16 33 90 -5 -26 60 47 -9 -30 22 27 -12 -30 55
2082E5N0j53oP0J6J0n1oK1l6n4N0J21r3kM6j8l7K9L0r3J53r9M5k4n9N8k9k2J3
$$ 55 105 -48 -54 16 32 42 -9 -15 6 -30 -84 -34 87 -6 -8 38 20 -17 12 42 -51 102 3 48 24 -35 23 -6 -28 -15
2112a5L6j8J2Pj0qNpk1M2q3pQ4M0m5n7N6n6j2nJ25m4n0J5J8K7o7P8o4O7q0Lk0
$$ -15 21 3 15 22 12 4 9 2 -19 23 -60 -67 17 57 12 -45 11 -45 -57 -62 63 19 -31 -16 2 29 -38 40 -24 43 -37 -34 -54
2145e4N2j5lM3r7K9J14j00L6J1k3p1Q0n3L3M7qN0r3K0m0R4m2m1L5mL4J4l0k9j2
$$ -54 -2 -17 -20 23 -74 -45 69 -31 5 16 -7 -78 2 -51 -18 29 21 71 -22 -2 -42 52 10 -31 4 0 34 48 18 -11 -23
2176b3M4j1qJK0M8q6K4Kn0M5Mj5J3Mn5K6J4J7LJ2j9L6p6M2o4R8o9J7O6n7Rl0m6
$$ -23 21 10 2 3 23 71 -15 9 11 -39 6 10 -5 8 12 -43 -17 -3 14 17 29 10 46 -30 12 -52 46 -23 -6 60 3 12 -18 -64
2210f4P0L1l2l0K5qk2L1l9j0L9K7k3%N9q0O4k3p8N8l9J3J7k9N6%n3L9O3n0L7j0
$$ -64 6 37 5 -25 0 -8 -30 1 -38 -48 -9 18 -5 -5 54 -26 38 15 -63 -5 -44 -31 -14 -43 13 13 -40 -1 62 12 49 39
2242C9q6Q0j8Nk1M2j0J1n8J7j3ln6R2r7J4l0J75m5n8J9m1K4K8k9J6J3o5J03m5
$$ 39 -47 33 15 20 -1 41 31 42 -16 1 -12 -15 -71 21 -76 -62 -92 83 38 -20 -1 -42 -18 10 -19 -3 10 -55 48 3
2272Cm7M2J17j51P4l9J2kpn2M4K9l2L0m7Qj4O2j0Qj2M7j4l8J4l1l8R1r5R2l7N
$$ 3 -44 -2 115 -36 38 -1 11 9 2 -50 -6 23 -9 21 -26 -18 -32 30 20 28 16 63 49 11 25 -6 -44 47 -48 44 7 12
2304A2k4M7l3KrRJ4l6M0n2J5Jl6J0M6n8K8R7p8qK8j8l6R4k9o9K9Qj1J5L3K2o6
$$ 12 -12 35 2 4 -5 4 18 -18 22 -30 -15 -14 -50 -40 6 -52 -24 73 -5 -13 15 -3 -39 55 26 -43 -14 -6 -17 -2 31 53 -13
2337a3j2N8l6O1q0J13n3p0QMj1R5o7j1M7j4Rr5J6N1M7m6K9o4L1L5j05M5OjOK5
$$ -13 -25 33 -3 58 -22 91 38 -32 -24 -20 -31 64 -3 -14 33 19 28 -67 -51 0 47 1 30 -34 -3 32 -73 -28 -22 -23 -17 8
2369Hj8lM1J0j0j14J14mo1O9j1J0q2N9l9O0q8R6p0J9j8O9o0K6jn2M2L6n2N0Qo9
$$ 8 -10 -13 28 38 28 -86 28 24 -37 32 21 31 -51 8 -31 29 -59 37 -33 -14 -32 37 -23 3 2 -50 -8 28 -24 26 34 -35
2401c5K0L0J9l0K7Po6L9K5n8P9j17Q2M3o4Kl9J21j76J02omk5K9m7M7K3l8m8L6
$$ -35 -15 15 34 4 31 38 -28 11 36 -22 57 -60 22 65 1 3 -36 85 -91 11 5 1 -24 5 -42 5 28 -10 -58 -22
2431b2J5N1q6L7Kj1K8L8j23M4j5N3j4K1m7nP3o7OJ9l2J7L4n5L1j2L3k4lO6n7m
$$ -22 -7 44 -42 -5 -3 -14 14 52 -71 -27 -42 11 -3 18 -29 -34 39 -28 -22 -3 -35 -18 16 -39 -8 -20 13 -11 -14 52 -5 -9
2463iL7m8M8k7K4l8l9Q9op9Q6j4l3K0J4n7K9MpJ7K5o3K2jR6r9J0k0J9N6j14J03
$$ -9 28 -20 28 1 25 -13 -52 37 31 -48 38 24 -9 11 25 -32 -3 1 -6 11 36 -27 -5 -6 90 -9 1 -19 0 56 -58 45
2495D5q6O1k5L9n2K3K7J5l6J6J6J9l7k8L2m3J7l4K5l4J4P8k9l1J2m3J4N2m3N4
$$ 45 -41 20 -5 34 -18 5 32 47 11 27 43 62 25 -3 29 -14 3 -31 -6 -40 -26 52 23 -8 4 -39 -25 27 -16 38
2525C8Pn4M1k0K0r4R8l8k2L1k1k9L3o3R5nm9N4l5L5qL5n3m6J11j13O1Km8M3Q1
$$ 38 45 -9 32 12 32 -62 36 -2 -24 7 -14 -43 -10 -73 22 17 -32 22 -13 22 14 49 -4 -50 61 -52 9 11 -37 6 87
2556H7j13M5o3M1Rj2J6j9k1mM3J3o9L5jL8o5J9L6lK6l1%qL4m6j0ROL2m1k6L1K4
$$ 87 -26 19 -44 -3 6 -6 10 -9 -30 -34 9 22 -47 -12 -13 25 -40 -21 15 12 38 7 7 -1 33 -13 -23 -14 -8 24 -17 -43 -12 12
2590A2k6k3J0R9r8N7o5J03n3pmkqO3q9KJ8rj2K8n7K8Q8k1m5N9l7o4O1n5O0j1r
$$ 12 -14 -37 -27 72 -26 31 -34 69 16 9 5 3 -5 58 -31 -29 -11 -20 -32 -4 -61 -33 55 34 -11 48 11 -53 8 -47 13 2 -7
2623gn0J33o4J2m5KQPm3M9N7q6L0KJ7j1kl9MO8j12O4K1k5J5k8J3O3p3L0l4K9l6
$$ -7 -57 76 12 24 -21 -19 -11 -4 -47 2 59 -27 3 5 22 11 9 -30 -26 42 -70 -6 15 -10 5 -23 -10 53 -20 10 -24 5 -31
2656c1P5l8j13O7K4K8j2K8l1K3L2l7n6MK7ON7k5m7N9m9j3L6pM0j6n2P8Jj09O9
$$ -31 44 6 -107 -40 -16 12 0 28 -3 20 52 15 -41 -37 -10 -4 53 28 -19 40 -9 -22 14 7 47 31 -21 57 58 -51 18
2687A8K3m2N6n1K1l4K6J2o7L0JM6k2qJ0M9p3k9K1l5J7J04m1l2J1k1MJ9Po2M0k3
$$ 18 41 -1 55 4 25 -9 17 29 -38 -8 -7 39 17 9 19 68 -5 -34 -13 -48 -31 73 32 0 11 -10 -6 13 20 -42 -2 -25
2719b5%K3k2j7R6Lk9N5j13N3n6M0K7nn4NN5k2J0j3J2p4Nl0R3k6k0J5M6o5O7p3
$$ -25 -25 -2 -24 -41 55 58 29 84 -29 24 -32 8 35 30 -24 -19 36 14 24 11 23 -51 -46 -76 17 -9 -29 -14 32 -33 34 -39
2751c9J09p1j7j6N6M2p3L1Lo7N4M4r3P8k7l3Q8n8n0J8K7j1J25j44k1O7o3L6J6
$$ -39 70 -1 -18 -34 22 64 -9 22 25 -42 12 56 -37 41 14 -19 69 11 -39 -21 6 -5 120 -24 -45 22 -41 -5 11
2780A1J5m3l0P3Kj5P6m0p6k3%R0l3l0K0J1k0JRqK1k5L3n7L0K6lM8r6Q5p4j9P6
$$ 11 26 -17 -47 26 28 13 89 49 -27 -50 -50 40 7 -23 -3 8 -12 -11 -2 -10 11 -14 19 -38 -8 18 15 63 -33 52 -22 -41 35
2813C5o9k3R1o3M0qK8j19Q0j2Kj1j3kO3j8k9M8j3j4MRj9K3Lm4L6pj5L8j8nJ0K
$$ 35 -34 -57 34 -29 11 3 31 -88 -8 -20 -18 -29 -42 -44 19 1 -28 20 7 -7 -3 6 -13 10 13 -31 5 -2 -17 21 3 -2 8 10
2847A0l4K2j2p0R5j0L1jm7L3j00Q5j4N9o3K4L1j6m2RJ0rJ4N0m5pK9k8m6M8L4j8
$$ 10 -24 -2 -14 -84 11 1 32 31 -16 17 -83 2 -12 47 -16 8 39 23 -19 -10 0 -9 5 55 10 3 32 4 -42 6 40 22
2879B2m1J5O3j08P9p4N8r0N2L7J4Omq5J16o9L6o2l8N5J2K8kL8j05J4P4q0lK7j9
$$ 22 -19 -4 59 -49 30 -44 14 -76 -24 13 27 33 29 -56 60 -9 27 -35 -73 -18 -6 22 20 58 -47 -33 41 -39 -42 -15 -34
2910c4kO0K6k9j2j7QN0n3M9l7pQL6Qp8N6m4jM3o6O8p5j0R2l9Ok2K5o2L8L9ML3
$$ -34 -36 24 50 21 9 -8 0 50 -3 46 9 2 10 46 54 -24 32 -12 -13 30 -36 32 -43 -53 39 0 6 -16 9 -53 -15 24 28 61
2944F1m8j3K1l9PK8m0J9k4L5p0P3M5q9L8LnML1l1l6Q3p3L2o8L9L2J4l7M6K4m7
$$ 61 13 0 21 -18 -11 17 -23 -4 -28 7 -63 10 55 -34 4 7 2 6 37 6 -30 53 -20 12 -56 -17 15 29 -8 38 62 15
2976A5L1l9k2M6L0nr3K8M4l8rL4jLJ2n1Q3q7%q1P0L8rp0K4K9M2RN1m7q6R1n3j9
$$ 15 46 7 -15 31 61 56 -37 -9 35 -3 -12 22 21 24 36 -15 68 -19 -19 -100 -30 8 -1 -71 -47 -18 24 33 84 37 -49 42 -11 -30
3010c0Q4m2J4l1L1n5K7o7J28r1M4l6J6RQQj0pk3Q4n3o2O8p4K9P4q5M5j1L0rn5
$$ -30 54 12 26 -5 26 -29 -2 -69 59 -32 12 -24 -8 1 9 17 7 0 -23 61 8 -54 14 -60 -31 43 -42 3 -8 22 13 -42
3042d2M9K3j2Lo0M3J0l1N7m6l7mL5L9p0Q0n4oM4oM3j0j8J0J0m6j0k3N7k8lN5M1
$$ -42 7 30 18 21 -39 4 14 -17 40 -6 -43 -47 -12 27 -43 37 -17 -23 21 15 58 48 30 40 50 4 -6 -29 28 0 -3 52 93
3075I3j08k7J6qO9p0j8K9R0q3Q0j30J00l7pL9m3N5o0J1m5J9N6M1m6J2o5L2rQ%
$$ 93 -15 -42 -26 -34 35 -35 -53 -24 66 -17 63 -67 33 -4 -11 28 -15 40 -20 -9 -54 -35 21 62 16 28 -37 -5 -14 -6 -6
3106fn1L2LPK8K5l1MN7q9K0Jk0kj1M8m2k2L8L8kj0m4j5NL6lM2Qnm2o6Q1n9J6K6
$$ -6 -57 -25 -22 -15 13 38 7 11 68 -21 -1 0 -20 -22 -33 15 -27 -49 -11 27 25 15 -29 -44 -39 -3 -6 36 44 39 -3 -69 12 -47 -31 -5
3142eOL7Pn3K4k1Jj3M3Qk8L0Lp1L8QL6m1Ln6nK9j4jQ8p5j5K6N1o3R7n0p3K7PM
$$ -5 1 38 45 -8 16 -5 -4 -17 26 34 6 36 39 -32 6 14 50 9 12 -44 -49 -20 -34 -35 53 -22 -37 -11 40 -23 74 24 -49 -22 -15 -11
3178a1K8M1Mo2m2N8k3M8r9N5n2P1J7m0K0n0RrK6L4L9m4l0N4rm2J9Nk2KNj0L3Q
$$ -11 17 58 62 0 -42 16 -7 41 -58 -3 -55 16 33 -7 13 -37 -28 -37 -11 23 62 18 -12 42 33 -9 10 15 -7 -5 0 -10 23 31
3212C1l3J4k2kM3K1n1J3J9m8K9K9n1qQ0o9L5K0o2jL2m5kk5N1jL6n2O1%r7M5N3
$$ 31 -2 12 -10 -12 31 52 1 14 33 -15 14 43 -8 -16 64 -5 30 50 -12 -13 19 -26 -28 -53 -2 -3 33 -19 42 42 -55 -10 43
3245D3o1K1M6k0l5k0J2K4m6M2l2K2j7R3j06L4M9m5LJ8l9j2m4N9j0OM0Mqn6N7o
$$ 43 -18 3 49 29 -6 -26 -14 10 -36 6 -26 -4 -21 72 -34 0 49 4 7 25 -14 -26 -70 -11 -21 -15 25 29 21 -35 22 16
3277A6l6K5J2L5q1K2Nk8k9l2J51j06R7o6R7p6p7J08m7j5j4O0j3o3M5n3N9L3o5
$$ 16 -20 5 17 52 -29 -7 -2 -30 -59 -91 60 -46 51 -15 82 6 -71 37 -10 -25 -39 21 8 -55 -10 -63 -4 29 -36
3306c6l3M8N3k8Qj6N7l8k3jM4Nk9l2K1o5O6l1P6Mo4N7l1m8Q3j3m5J6k5L4K5n5
$$ -36 -69 -21 32 4 12 -4 53 15 -8 -9 35 40 11 -21 0 -65 1 -30 46 50 -14 43 12 -36 47 34 -11 5 -20 14 39 -16
3338a6J3j6J2J5M0o9J2L9p8P5k8L6m4J1Pk0Q0p2Lk2rJ2K8m3K8%M2q5P7qj8M1q2
$$ -16 -3 -19 -7 8 48 -21 -9 30 -48 27 -1 35 -9 2 9 -11 69 -3 0 -22 -31 -19 9 -34 -6 -6 36 -49 28 20 2 43 -39
3371c9o1J54Mj06N6M5J1j42Q5l4K4M8m1K3k7J5l5N8k1j9Nj4J9Pl9qN1j7J2j8R6
$$ -39 -100 54 58 -48 8 53 64 -78 7 -27 -3 45 4 27 0 15 -20 38 17 -2 3 -11 8 15 -24 -32 19 2 14 -4 92
3402I2m6p2J5L8n1N9p3N0pm0J49q8p4L4P5p4N3r2Q0l6L9n0J4M2On0J5m0J2M8l1
$$ 92 46 -26 -11 27 -24 35 -38 12 5 -35 114 26 -48 -14 61 -13 40 -52 28 -8 31 -19 -5 37 43 -7 8 -32 -20 28 -3
3433cJ2l3KM5j6l5Q3l3m4K1J6lJ6k1j2pM6k9q1M5K6JK0qn9J29r8O6m4L8j1n0R
$$ -3 9 -24 -22 23 7 -28 55 22 -22 -1 15 12 28 7 -5 -12 34 5 -76 -31 -5 -4 16 8 -51 78 -20 46 2 40 29 -21 -12
3466a2M2K0m3m2N5KRp0O3%j8Q5r8K2k4j4pNPJ5J1L5p4m4O9n1N9L1k9N8m1K6m9
$$ -12 30 50 7 -35 20 22 31 -39 24 24 6 91 -7 15 -9 -23 -30 -25 -18 -3 8 43 -31 -75 -6 -57 2 33 4 62 21 47 -2
3499bn3J5O2l4L3j6no5N4j5p4R0J7rM9p3K7K8m3J7m3J5M2j3J7n5JL5j0pRl1K9
$$ -2 -55 -40 22 -12 21 5 0 -65 -11 -26 -100 -10 7 -2 47 -26 1 29 -14 3 -40 -25 17 4 21 -34 -33 2 -8 -15 -6 -37 -8
3532hk6J9P%l3Q3k9l9O4p8J04q9J7L5J7o9P8l9%N8j26J07o1L6mJ7j0ok0l8J0P
$$ -8 -34 -15 -8 -8 -41 42 13 -26 38 -40 64 -25 -8 27 44 -25 53 14 14 72 -54 53 -8 28 24 41 31 25 5 -33 -23 -16
3564a6J8j4rjK6m3J8P4p6lN4%r9L1j3K5QL1j6J3n3N9n4R9m8L0J5j6m4pM1q0J25
$$ -16 2 -12 -21 -22 4 -39 -21 53 -23 -26 28 28 -71 -40 -53 -28 -20 11 -5 8 -45 14 -40 59 11 41 56 40 -4 -11 30 -50 75
3597G5l8k7J3l0qL8j9j6Q4m3m3J8m5O5j0j5j4m6N6J2o5J8J4Ok1J2J7L5rm0Rk6
$$ 75 37 10 23 -7 -15 23 4 -12 72 29 -14 4 -41 24 14 -1 -15 -61 -5 7 -58 -40 -26 -20 -41 -29 -12 23 14 -26 -17 -43
3629d3J9k7NM4lRqp3N0jM0J6J6k0n1M0M5m7n2J28j42J01K5j5j8k1j1Om8k7R8n5
$$ -43 -24 -51 -46 -2 -5 4 -4 -77 -27 -28 12 28 44 24 -27 13 58 11 -41 87 -55 46 71 56 38 17 6 12 -36 -63 35 -20
3661b0L8n9J6M5l5oJ8p8M4O7K7j9j8N3k6p9M3j4K1J7%k5j1mJ8KP7m6n1k2lK1n0
$$ -20 18 -41 -25 20 -15 -21 -3 -81 -37 30 57 38 20 73 47 -32 11 -3 18 35 35 10 -1 -5 13 15 92 46 -5 -27 -30 -9 -59
3694e9J8O7j6M7p3q7J25m7J1Lj7MP4n5Pn1Q3K0Jn4PL7m1k7J7O1lm8L2j5lk5J5
$$ -59 -41 26 10 57 -16 -103 22 -25 -14 -11 -28 -24 50 -5 2 -49 34 54 55 1 8 45 4 -23 -6 55 52 4 36 21 18 -7 8
3727HM2m1l5k7Q8k4oq9J41k8Rlpk7M4n7M4k2j3L4Q0m3j28O5Rk3M4n2M0L7k8m0
$$ 8 50 9 -26 -53 35 11 5 -84 57 29 38 35 28 1 45 -12 32 10 -3 31 111 68 -60 5 14 -9 35 -17 23 60 32 -8
3759hN1Nk4oN7Mq4OL0o3nO1nm8O9k9Ll4L5lk6R2n6L4o5NK4o2L5L6m8p0P2kJ8M
$$ -8 43 48 24 18 75 79 -5 1 31 -32 -37 24 19 -29 40 11 14 -20 15 12 -14 78 22 56 -9 -4 20 -42 -7 29 -19 -89 -17 -19 -1 3
3795Crl1N0L6mQo5kM0p0O3J1m4J9K3q6K2N1p3M3M5m6M7j9l0K0K8J3m9O5l5j9l3
$$ 3 -6 -37 13 49 45 53 -12 -14 26 -44 19 30 -14 5 28 -58 -36 15 -58 -15 30 -16 31 12 -18 2 30 43 -6 59 24 5 -28
3828b8M7Oj7kK9m1n5O5nmm1Q0j1O2n1J9n0m0N3n9L9k9O2j6j6JL0n2O1jn4j0RQ9
$$ -28 19 25 8 6 35 -6 -61 4 -1 -5 -46 34 23 85 34 53 3 -37 16 -43 -4 -33 29 13 -3 -2 28 -24 37 36 -18 -28 -19 70
3862G0j07R9m6n7j9O5Jk4J0n0L1jJ8Qn2L4oQ1m1k6L3n3m2Q0j8l8J07j11J9N4k
$$ 70 -37 62 16 -41 -60 5 6 -18 -8 -58 -27 -28 -10 -2 -54 -20 -26 55 14 -12 21 -32 -74 6 -12 -50 57 -54 -35 19 17
3893A7j4r0Q8j1j9K7L9Om4nm5M3K4j0J9L5r4L1o6O0K7k9po4Q2J3n1M7J9j29Q5
$$ 17 3 -87 1 -10 -29 -2 37 43 -1 -6 -51 -8 16 6 25 60 -34 -3 -69 -9 18 -11 -18 -82 0 13 -38 9 28 -101 -16
3924a6L8m9M0j8j0J2k4N3j3l1m2P9o7k5P9LL8k4OK0r0j9J7M7J8p3Q4j7n1K4ML8
$$ -16 22 -27 13 -5 -15 -3 -27 26 13 -18 -60 19 -48 -73 6 9 47 23 29 49 -41 -60 -43 4 22 -51 33 16 -35 -11 -7 31
3956C1m4k4O6m6QL4k5Mk7oJ10m8j2l4J9K4l3RM3n2o6O5m2R1o3M7N5q9rM4K7q4
$$ 31 -13 -37 29 -17 -9 25 0 4 -23 -29 81 33 21 -13 6 30 -3 6 49 -3 -69 -4 -46 45 -18 29 84 -5 -14 30 57 -27
3988b7J9N3n7O2l2l2K9j9l7P2j7n9J06o9O4j13O2M2m0K8l3K9p8R6n5m9Q1m1Ln
$$ -27 -8 45 -12 50 18 -14 15 -4 -41 31 14 -45 61 -8 56 -57 5 47 7 35 2 31 -47 49 -6 -55 26 -15 -12 -17
4018a7K1rP9j02M8l5M3Nl4N0rj00N3NK7n7M2J5rj0k5jk5R2l0J8r1Q0n7K5P5j5
$$ -17 4 -5 74 -28 20 -15 28 33 -1 49 40 -60 -7 -2 25 -32 10 25 16 6 -19 -20 -45 47 17 35 -56 24 -33 -8 67 52
4050E2j3n2L9K8o1N5n8j6m4Q3n8M9m6k5R3j5l0N7l8ql2O1K3o2l8N3K3K5j9m2L8
$$ 52 39 -13 26 54 -7 48 -10 -26 -70 13 -45 4 -42 -67 26 11 -19 38 0 -8 -40 21 44 -18 -56 -3 20 45 26 -16 22
4081B2km1RJ9L3o0o6M9M0m8Q6n7lK5kJ4n5M9lp5N1R3p7O0o1J0j6Jk4J3J5j0l3
$$ 22 20 -21 -12 7 40 -20 -86 -37 3 -45 41 -16 -19 6 4 18 -37 12 9 -66 -15 78 1 61 0 10 -6 -5 -29 -16 -1 -11 -44
4114d4K2K3K4l3L4k5J3N7m5m2L0L2Jn1Ql7M1l2M1p5Q5j8j4J1K%j9j3K8J2m8J8
$$ -44 -22 1 25 -8 26 1 14 71 26 -16 14 46 47 -4 4 -33 8 -24 17 -58 27 9 -5 6 8 8 -11 -24 4 16 -32 -14
4146a4j0L4p9R3J7o2JkJM6n5M3K3kq3J4pN5nk5J0L5m8N9q2nN7n7N0NK8K3q8N9
$$ -14 -24 10 -69 24 41 -21 -20 -22 -21 25 -30 13 36 34 -49 -35 -42 13 8 -17 -7 28 -20 39 -43 -48 9 -48 2 7 35 58 -30 29
4180B9l0m0J3L4L2o4O7m4j5L5k5K9k6O2n3K2m9M8l7J5o2Q9o6L7J1m9J0O2m4l3
$$ 29 -1 -41 -28 6 38 -26 41 -3 -18 17 -8 21 -5 57 4 26 -23 25 -12 3 -59 30 -36 1 12 -37 -27 35 -9 -42
4210d2P3l1%j4J2M2j2qJ8oj4p1Q3k9l7N9m9L3l1M9j8Rm8J3P1l2j5j8K5j9Kl3L7
$$ -42 31 0 0 -14 -2 40 28 20 38 32 18 -53 30 1 -36 23 -26 7 -24 25 7 16 -32 -19 52 20 5 -13 12 -7 -5 -38 -1
4243aJ5k8K3%K2k9M1l9M1M2j43K9N5n3N2k4oK5J1n1P3j17L8M1k0j2m1L6N5m2%
$$ -1 14 -14 9 9 31 2 43 4 45 87 -56 -27 28 -25 27 3 -3 22 33 -18 55 -62 -24 17 -3 -15 -56 -20 35 -7 -7
4274gM7r8R2K5m2K5mk5J4l9l7N0J4MJ9J5j6Kn6J1k0Q0p6l0L5m6P3j6M2o2j8J2
$$ -7 40 -58 34 59 17 42 38 13 27 -12 -49 1 15 19 38 53 37 39 -17 -6 -26 54 -22 -52 -17 -63 10 -6 36 -26 -44 -32
4306c2l0N4l0P7K0m7K5r2O7K3k8j5l5L8MJ2n3P5o7L7M2Qm3M4q9j7O2j2J1K1j9
$$ -32 -62 -8 -38 39 59 12 37 -55 12 35 7 -8 -43 -5 -1 11 -42 33 -34 3 45 53 10 54 -35 -52 10 -2 9 30 11
4337A1K9j5qkK1k4Nj8j8M1k5O2m5J3p9k0O6l9N9J0k1m5k1N4m7J08p6K6j8K3m2
$$ 11 40 25 17 15 36 12 17 -1 -19 22 -3 59 14 27 -52 -72 -6 -45 14 24 3 -42 -63 -9 -56 52 -24 2 -16 7 -35
4368c5J1N8n7J7k1j7P2k9RL6l1m7O4m9K3j3K2qJ6Lk6J4J9K5l6K1p1N3o7K7j4J5
$$ -35 -24 34 -23 -6 -27 -44 28 -1 8 44 13 -34 30 -19 4 -9 13 5 21 24 -2 12 31 56 20 41 -30 23 -44 -17 -31 -16
4400a6K6K2p4K7M5l6LP8o9j0K8m4O8j2k2%l2M5k6L8n9N8J4n8O4p2J7%p5K9M9o1
$$ -16 10 32 -42 -15 30 -6 -3 75 6 -4 24 -20 48 36 14 14 -18 27 1 39 -20 38 52 -6 58 -14 3 3 -72 -43 6 -55
4432e5N3Jj4J1L2k4j2L9n3M1mL1p3j2qR8n2M7j6n0K8Jj4NoJK1l2N4l6Q7p8K2K
$$ -55 -2 -1 -15 -4 28 4 -8 31 -22 19 15 46 -27 -39 -47 51 -1 46 30 -20 8 9 -5 0 -6 -5 16 -16 38 2 89 11 33 35
4466C5j13P2m0M9L1j5K5m8J9j05J00L5l8o1R9p5M2L2n4j4nOK5j2QO9Lo8L0r2O6
$$ 35 -78 -6 -46 3 34 19 44 -4 15 -90 10 45 7 -54 45 -30 12 44 -10 -24 -29 -23 2 -10 -2 67 70 2 32 -60 6
4497Fj9kMK1j4K3j2oJ8l5K1kR1j12K0K5kn4R5o1N3n0p8J9nJ6l6J29o6PJ9JL0p1
$$ 6 -13 -15 -11 10 -4 19 7 1 19 -16 5 3 94 -18 2 27 25 -29 66 5 58 8 -70 -51 -56 -40 -76 53 -13 -6 13 14 44 -27
4531b7M3j4rjr4O9N4l9qk3j2J3R3n4KM3p8N9m1n3Q1k8j7O0k1K7on3Q5j5J6Pk5
$$ -27 16 2 -7 -8 -102 -33 21 -18 -26 -49 -61 -48 45 -9 -7 36 -42 17 -24 -77 4 -24 -41 19 -2 25 19 -34 51 36 52 59 34
4564C4l4k6k1O6M9r2J5K8pkm1J4K1Nl9P9j2K1p6jL1k4K4j6J1n0J9L7pj3o4R3K5
$$ 34 0 -26 -47 19 68 -24 -9 19 12 10 -31 -17 4 9 -30 49 37 58 -18 -19 12 -12 12 -4 7 -43 -24 13 6 -7 -71 22 47
4597D7k7kk0KK1Jo3M0j8Q0r1K8L0l4qm1P0l7J9L0l6J2QNM0j1pqk5KpJ5K9p0j6
$$ 47 20 18 -2 0 21 22 -41 -1 -19 61 -30 -2 28 -6 -14 -55 15 -22 -3 27 -9 3 11 16 56 45 38 30 5 7 0 15 44 -26 -42
4632d2M6OK4rK6j2p6N5k8KQK2j9QOk6N1mj2m3l0M1L8l5m9M6n4K1K0j1P7p4L2L
$$ -42 4 10 34 25 51 39 -37 18 -10 -8 0 22 3 11 17 -9 42 38 26 -17 -47 -6 32 -3 -52 -6 -60 -39 -19 -30 47 -27 5 8
4666Hk3Q1j01J5J6K2m2LJ0L4L2m9O3o4pl1N9j7P6n6o1O2m0J6RNk3J4L1J2m5pK2
$$ 8 -15 66 -35 -20 -4 18 -24 -21 -11 23 55 6 69 5 -2 -33 26 9 85 29 -32 30 -10 6 15 20 -3 11 42 54 9 2 24
4699B4N2p9K4p5K6KNM1k2jo9N5KK8J6j0K4r0Q3J0j7p2J2M1J5j8qj1K1J8n9M5o
$$ 24 76 -3 21 -54 -28 -26 -21 20 -2 -3 -72 -17 -15 13 29 19 43 -47 36 46 29 -43 -31 10 25 7 -1 -12 9 27 -32 13 7
4732Gm0K9ln4Q3Jj7Lj4M2J9k9l9K4N7m1j14J01m7M5%M2j09L7K1jpK5Pm1O8p5J3
$$ 7 -33 -4 -7 -61 22 23 6 9 -5 37 56 27 -12 12 69 28 -86 15 -32 13 13 55 -54 -17 4 3 -4 21 28 -13 55 -20 -7
4765gKNpk2N1m3J6j1Kj3NL9o1R0j9n1N5mmk8K0l3P9m9j6O0k1l5RoOO4lp8L2L4
$$ -7 -5 0 -7 -29 22 -21 -5 -16 -14 -27 -22 17 -44 46 27 -24 31 27 23 -5 15 -18 61 12 -4 56 35 0 9 3 9 73 70 -8 24 58
4801E8l7K7n8P0o7J1pK3M2q1K2L3k1n1L6K8n4m2N6K4m0m6M6j5L0Q0l1q3M5Lrq
$$ 58 21 48 -10 60 -7 4 -3 20 62 -19 3 36 15 -36 0 28 -26 -68 -12 12 -28 -74 -28 -43 -13 67 36 -47 -2 1 -8 -16
4833a6N4J3oo6LN1%l9k6Q7j7m9l1L8N9j31O4N4r1K0L0M7n5m4M7J6K3n1M2n5K2
$$ -16 38 51 45 -21 -18 33 33 -6 -32 55 38 -11 -42 -4 55 -76 -12 42 -49 -29 1 48 -7 -51 -4 12 35 -16 26 -29 -7
4864gN7o3k7J4O1m3K3J2j9J7k2m5NkM7k5KJ3m3K4J7k5N3m7K0L4o3%L5n5N4M1m0
$$ -7 50 -13 -40 -26 35 -8 15 27 8 25 3 -42 -37 -39 8 -17 -15 -2 -45 -21 -4 -29 24 -23 -3 31 -32 -32 3 -52 2 43 3
4897C%ONkK1o3N9p7K2K0J7l4NP1r8L8n2N9J4J6m6k9L6j3l3O5k7K5k7jO5q8O8m7
$$ 3 3 9 14 12 33 -30 29 -48 -26 -6 11 -23 -18 53 -45 -7 -59 0 14 30 -16 -45 -9 -22 -55 10 -17 8 -19 -20 45 -43 25 -22
4931b2O5Ml5J6J3o6J3pNo3P2L9n1l9O3jqK7j11P7NJJ1p9P0j0j3K0J6j9l5J3nK9
$$ -22 43 47 12 28 41 -25 -12 -19 -14 -77 -5 34 -17 -56 7 6 -2 25 -86 -9 -4 -3 8 -71 -1 -11 -24 -4 12 -7 -42 -29 -34 -5
4965eo2O5k0J5l2N3J2l2k8J02o3l4O9q1L5J6l1J1l2M1K0K1j0m9K3K0J2j9jk2j9
$$ -5 -67 -2 -22 -7 -39 14 26 -6 -34 68 5 -29 40 -41 -6 10 -21 -10 -42 -1 19 40 30 -19 4 24 36 17 16 -6 -25
4996b5K8J6m9JL0J0K2l0K8m1Q7j05O6ln6N5j4r3N5L4j6nj9%RN7q5K5jK8K6k5p4
$$ -25 3 19 -30 -29 1 11 33 3 31 -10 77 -28 38 35 -21 34 20 -73 -18 16 0 -5 -24 -24 -15 42 -43 -18 -19 9 35 10 -64
5029f4M2Lj3Q2n0K2N9j06O4J7p9j8N4p9N8Q8o2k6l8L4m1Q8m3J8l2j5M0J4m0J1
$$ -64 -22 -19 -32 50 0 22 81 -25 39 56 -23 -41 13 -66 -8 80 18 -8 -46 -12 -53 35 -8 10 -22 -37 3 17 -23 -12
5059a2M3j1L9n3j6M3J1l0l3O9j01O7Pm3Q4p0N6k1L0j9k2l8MK1L7l9J0j1J3l7K2
$$ -12 31 20 59 6 -10 33 44 14 -19 50 -51 16 23 -20 64 -6 50 29 59 40 18 -20 -16 5 42 3 13 2 15 -22 0
5090@j1L5m8L7lLo0PL0j4k9m6Q6j6N4l9J5j4rj9R3p9M1j02R7K8p0O9o1N0nO6r4
$$ 0 -11 24 -24 13 10 13 -47 -40 -10 -24 -53 -99 -13 -29 25 -14 1 -13 -22 -41 52 -27 14 -88 9 37 -33 36 -25 25 20 86 -8
5123hn0J6N2o2Q0K3k7k5l5P0k9J4Mm3L5ol2N9n0O8j33J27l3J4q0N0j4L7n8L0j6
$$ -8 -58 -42 10 -52 28 51 24 -1 -36 34 5 19 23 -20 15 9 -23 36 -14 54 -79 48 15 29 -51 -1 -15 22 -36 -6 -22
5154b2L6j3k8nN5mj7k3oL8J7nq3R3l8k7K1rN7n8P0k3l7K9o4L7L2rj9K0K3o2K1
$$ -22 14 1 -27 -32 23 19 2 -21 -27 11 28 23 -60 33 -5 -32 -11 -20 37 -21 49 26 -11 18 -46 -9 23 14 -5 15 38 -24 -3
5187cN3j9k6m0Q4l7Jj3J1k7N5nm7l2N9k4K8K0mj5q0Q4m5J8lL5n2pP2k4No6M8%
$$ -3 50 31 5 -35 49 12 13 0 11 -16 39 34 -13 -45 14 -10 18 38 34 19 -61 23 -22 -4 -7 28 -24 -31 41 17 22 -44 4 4
5221DO9m5k3l5J09r3K0p1L3M5p4O7l6J1j7O2p4P6k9jL8k7J5l3l0P6q9PR1N3j18
$$ 4 73 28 5 -30 79 -14 6 -65 -32 13 -61 6 -30 -19 -36 26 -48 28 -1 -2 36 9 24 -9 -39 37 -52 -45 46 99 -19
5252a9P1n3j8N5p0N6K0k5mJ0J6q8k3M7jL6K7m9K2n5lP5j6j09Q0L4k8k6J3N4o3
$$ -19 52 -1 -19 36 -34 22 42 17 13 23 39 -49 -72 -25 -26 10 37 -12 10 -45 -48 27 11 -98 -18 16 -12 -38 -25 29 -34
5283c4L5RJ7m8L1k9PJ4m1pMO4qk5L4kpql4O6Rr0J6O3p7J25j13K2OmjRrN7n8MJ7
$$ -34 1 10 27 -21 10 -19 -12 2 -39 -46 -42 22 14 -11 23 21 14 6 -28 38 47 -43 -27 36 -41 84 -29 -7 -1 -5 -6 3 -6 51 -7 -3 14
5320A4k2k9%N4j07J30J0n9P5n4mO3p4k2M7l7K5Nj9l6KN6Jk9L5jk0K5jl7m6M5J0
$$ 14 -8 -37 -37 17 -90 40 50 -9 66 12 8 71 -3 -25 22 -15 10 15 -4 -40 -38 18 19 -10 25 24 4 29 28 -9 -55 -10 0
5353@l9P3k8Rpo0M2M5mj1LQj4om8N2L1o1L3On4P4l0m6O5L7lr5L1rN6o9l7R6m8
$$ 0 -39 34 6 15 8 -52 -10 35 31 20 23 31 17 11 -37 15 46 -15 18 24 -30 44 14 -32 33 70 67 -28 3 -6 50 -19 -56 40 -8
5388hk8KQ8j1m6j7P2o5QO0m0l1l0P9j0m5L1K7J0m9m8L5k9M3%j2L9L3j4j4m6k5
$$ -8 -36 -34 54 43 -3 -20 52 -13 -5 55 15 -16 -46 33 23 -22 9 36 46 -3 -51 -16 -45 -2 -2 -14 25 58 44 30 -16 -41
5420d1K9K9j4j6J4k2Nl4R9j18PP5k8J5Rk6PO5l0l9n2J34n1Lo3J00j8m9L9m3J2
$$ -41 -12 17 3 -13 1 -21 -16 -50 49 -69 -62 13 -15 0 9 -17 -10 55 25 -14 -66 68 17 20 -43 57 39 -10 29 -14 -2
5451bk2M0j2K9j6J4l4P1k7K2np3J3J6l3O7j0Nj0o9P1o4Q4m4N5p7J7Lj6L2o0J2
$$ -2 -24 16 4 33 17 31 -3 68 41 63 58 -15 -2 14 -19 48 38 43 33 -36 35 -29 55 11 66 -11 6 9 -7 25 -35 -23
5483b3MMlJ6K9PK5n7K4%J7j0l1m8j5L0P2l5j6J3L9l3K9l1n5L3qP3k7j0k2J5q3
$$ -23 -19 -15 -18 -2 27 34 59 2 26 26 43 33 2 -46 -61 -31 41 6 -10 3 42 9 38 7 -48 -15 -23 50 23 13 -9 6 -77
5516g7J02l2l1L1n1J16o4N8p7RK9k1LL9k5J3K0L8r5j2l0J1Q8K0m0j5L7k3N4o8
$$ -77 25 -7 -38 -7 -58 58 -6 52 -25 -16 13 -8 -5 34 9 22 42 80 -15 -27 -57 -46 42 62 22 7 44 21 75 7
5546GM0J7pr5Q1o5l6R7M0j19Q7r3N4j2lM8n7K9l0P0l5M8j07P1Jm8L3n6N1No6Q1
$$ 7 47 64 57 -38 43 -22 -58 39 79 -40 47 -46 8 -4 -7 41 -16 13 -17 53 18 66 -41 30 31 -17 16 -40 11 16 -50 31
5578C1j3r2N2K7K4J1k5qj9J8Ok0L4kOj6k1K6k6J9j1Mk4m5N2omN3k5NK9l1L4o6
$$ 31 18 -74 -22 5 29 40 15 7 -12 6 12 -8 26 24 30 14 -7 19 -7 12 1 5 -19 -64 -12 -18 -22 31 6 11 40 9 43 -23
5612b3N4L6k3j6k1O8o5k3K7K7m9K0j9K0J5jn7J6MK8mJ1N1r4M8k2Rj4j3N6k7J7
$$ -23 31 67 44 28 7 75 10 -13 14 41 -8 12 -7 13 28 27 -30 -14 -10 18 14 25 76 -18 30 8 17 3 -10 46 19 36
5644C6p3j1P3jl2O8j11L3L6n7J2J5j5l7M4P5j35K0L3k0P6n6N8k1Pl7m2M6K3n9
$$ 36 -37 -48 25 24 -8 60 -51 -18 18 -39 -27 -12 -27 -64 -20 55 -80 -60 -27 -47 29 -27 31 10 17 -20 -62 -16 7 -52
5674e2Q0lj27Q2P6r6K7J3RM9p3PM3jl0J1J5pK5pkq2N9k0J6K3q0M3j8K1k3L2m8
$$ -52 28 25 -102 -20 56 -40 -13 0 9 58 -15 -8 35 34 4 15 30 23 48 41 39 -43 16 -4 12 35 -45 -2 -20 1 -22 10 -38
5707c8J8O8q6O8m1K1k1pJ7M0l2K5m4J9KQn0L2K8l7%l3M0J7K2k3M7o5j3j0K9j8
$$ -38 -20 48 -38 30 -11 10 -11 -18 -1 39 7 32 -12 7 9 17 -33 -1 27 -10 -10 -43 -3 14 36 13 60 -5 -18 -28 1 -17
5739a7O1q8L0k7lP0j4jJk4JO6j6o6M6o1O2J7k2Qrl7l8P9%o5j8O7k7O7m1J2k4l1
$$ -17 44 -44 -14 -41 -44 26 12 11 12 -12 -11 55 39 -27 19 -42 20 37 15 23 14 -23 -61 18 18 -47 -65 2 -25 42 1 13 -11 -42
5773d2M7M7o8k2R1n4j9M7n1K3K3pM8l1l5Nn4no0R6P4q2L6J8n5P0k8L7n3j5M0r6
$$ -42 5 52 -16 -38 53 -1 -20 27 -24 -1 22 15 63 32 -3 2 -52 -57 -117 -21 53 -29 7 25 -30 40 12 49 -4 -19 21 -75
5805g5Q2J7p4K5O8q2N3j05L4L0L0m6LL0K8j04J05j0Op6QJ09q6J19r2J4n7L2m3
$$ -75 7 24 -50 -25 43 -39 14 -91 -57 -27 3 -43 -40 -10 18 -86 19 9 15 -61 -53 56 -30 89 -3 11 -46 -14 -57
5834e7Q2K7l8K2j01M8R9m1m4j7oJ1M7m0j6J9L5r5O6J8n6N4k4K6Jk0pL8j7n6O8
$$ -57 25 52 14 36 -65 -17 82 41 -3 -20 -26 -15 32 -8 -24 -5 30 -65 1 19 -37 17 -7 19 20 0 -7 31 14 -42 26
5865B6Ro2Q0o5J8O2n4n7O5r5J19k5j0l2l4K4J00l0p5N1LM9k5p8Q2k5ml0l7N1J7
$$ 26 35 -27 53 -12 6 68 14 -43 22 -73 46 21 11 -21 -55 -31 69 39 -36 15 18 67 42 -36 46 21 17 -13 -50 1 18
5896A8l1K6K7j9j7J3k7ljPJ0l8KK6JkM9J1n1l5N8k8L5m0J1K2k1j6K8oNl1O0m0
$$ 18 -13 13 40 21 4 17 -10 -13 -14 -7 3 -35 -33 -7 -6 -8 41 52 1 -34 24 -4 31 -9 2 24 3 -13 15 9 14 -17 43 3
5930Ck2k1K6M7k1l5R6p2l4O6m8l8N8M0p2qL2k1o0N7L2k8K4O0l6m3M4l2K4Kj7m5
$$ 3 -19 -40 -14 33 12 -23 73 1 -33 33 -15 -53 5 45 -27 -35 -3 -24 -84 -27 5 -23 1 61 25 -18 26 -6 18 20 3 -42
5962d2M8pK7l6J8j4m3M8Qj8J2K9N3j00jL8k1N2o8N4M2q2k7O6n4M3N4q5M7j1m3
$$ -42 6 -1 26 -10 8 -6 -49 -1 7 -11 1 30 83 -17 -18 20 -1 51 -17 37 79 -3 -30 36 -18 25 79 -6 41 30 -13
5993a3Rl8M8L3k0L5o2M5p9J11j24O5l1K6N1m4k9O8p0R0l4n7P8k3m6j1K9m8P5o9
$$ -13 -4 -42 6 39 19 54 -8 37 -42 69 -55 10 -21 5 56 12 -17 51 -19 71 37 -20 58 35 -11 -22 7 -41 34 -35
6023c5j2K4OLK9k6qNK8n3P6n6R5r5M7Lm1NJ3J0m8PM3j2JJ7p4K4N0J1m6j5mN2p
$$ -35 -47 -23 -17 -14 15 -11 -19 -14 14 -39 37 -19 76 -19 28 31 -10 -5 8 18 -30 -23 20 8 9 26 -48 -24 26 37 -9 -24 -28 24 17
6058A7nn5P8j0m1j9%K6K5jn2N8j5j3jKmL0L5n0m4O9o6N8l6%m3M1omJ0JK2j8O3
$$ 17 12 -43 35 25 -16 -35 -35 -9 16 15 -37 21 6 -7 -8 -6 -10 20 55 5 -39 30 -36 22 -14 -14 -57 -16 -22 -26 -16 -15 7 -11 52
6093E2o4N0L8m0l8k6L6JM0k6mk1qK5L1K5r2lJ2N3q4L5K0M9m4K8j4K0l6OJ0j7K4
$$ 52 -12 38 76 36 -2 -28 8 9 49 23 19 -2 -10 15 46 71 -21 -24 -12 41 -43 -8 12 61 17 45 31 51 15 21 31 14 38
6126C8mj45J36qom2L8m9rK5L6K4j00P2K9K8m5j5n8O8L4k6o5M0K9no2O4q0M8P3
$$ 38 34 -111 25 17 11 -31 7 -42 -51 -26 10 34 -66 6 35 63 18 3 -55 13 47 21 -44 -4 25 20 -42 22 -58 -10 63
6157F3k5rm4j2L2k4O9pj1o4M1j5M9j8NJ0m5n7R4l1L0l9Mj7n9pN3Q8m4n7L1kNL8
$$ 63 38 29 -15 -27 5 -19 50 43 32 -32 9 -6 43 25 30 40 -5 -62 32 1 31 -8 -4 -21 -80 -87 -34 54 10 -47 -16 -18 -13 25
6191B5o5N7o4P6n3K1nK8l1KnJ3Mj1K2L7o5L4kL5r1j4M1nMn3O2J7k0J7L5m3MK9
$$ 25 -40 17 -47 29 -24 -3 -8 20 -11 -9 -14 -1 3 -8 14 51 -14 20 18 53 -38 -52 -11 -16 -12 -65 -3 14 -6 11 46 3 7 36
6225C6p5N3kL1ppj2l6ol0R6n3J4l9N3o8L8j0kL8l3M5k6j5J3O1m8l3j1K1prJ02
$$ 36 -39 14 12 43 36 29 17 -19 -25 -55 41 -12 2 -37 16 -52 -14 -24 -26 12 -21 24 -2 -17 -4 57 9 -24 -35 -14 -21 -30 72
6258G2o2j9J1O9m8m9K2M4n5M0Kj7J3k0KMmL8J9p5K2L8l6J2n4L1l3J3L4L2J2j08
$$ 72 10 -9 2 71 23 -26 -4 40 -15 25 27 10 23 3 5 9 5 43 62 -13 9 47 11 23 -31 0 -33 -20 14 46 58 -50
6290e0M7ok3R2j02M5K1j2J2l4K4K1p1J5L1m5j0O9n0J2N5Ql1n9lN0J1J7n7L0j2
$$ -50 -3 -9 -32 60 -42 3 24 12 24 -10 14 35 -36 -21 10 -35 -45 24 -26 -14 41 49 18 -41 -44 6 17 34 -23 7 -5
6321eJ3k9NN7j5n5K9J6o8M8J8OmoJ8m3j3O3r7L8L5l0j4P6q4J02m8j9K1k6qM5l5
$$ -5 8 -21 -16 41 26 -29 0 16 -52 -4 14 20 16 10 28 -15 -28 35 -62 -24 11 -19 -33 43 -41 61 13 -6 15 -11 -19 26 -9
6354iok5N6l6K0m2K6M6o1QK1K5o2J6k6O5Nn5P1lj07P4n2O9l1L5j2O2o6L6kk8m
$$ -9 -15 -40 16 -20 0 -42 -16 30 -31 -23 -2 23 -39 -23 -49 16 21 -34 37 34 -73 1 -51 18 -13 22 10 72 6 42 40 12 8
6387Hl0K3p2P9j6K8J4k4L1k1l8L5M0l8J8p6L9KoP3q7M1K2m5K9l5PJ1jl9M3j1m3
$$ 8 -22 1 -71 8 -8 20 34 10 41 20 -18 17 57 19 37 -39 0 2 -4 69 -18 23 45 0 29 -6 1 12 11 -28 15 4 -39
6420c9O7o4M9M1j24L3k2P2L1n1lk1K8J0n3Q9rj9o8l0O7lL8j5oPn3L8mO0l8m5O1
$$ -39 28 -36 13 54 -70 -37 -59 13 44 -7 -10 -31 -3 7 -46 43 34 15 -53 -83 -16 -19 19 4 -2 5 -48 -10 -14 46 8 -37 24
6453B4L9n7O0m2l6L9k0k4oRpL0j2rM4M0r8oM2o6L8j0j1N5m5rJ7NK2K9n6%L4m5
$$ 24 63 6 66 24 -12 27 7 -17 -23 -14 -21 9 -3 -12 32 72 -26 -32 10 -56 -18 -28 -39 16 -29 -38 -21 -16 6 35 -21 -21 13 -32
6487c2j1J0K2oJ9N9k8k1l4K9K8l6j9L5lp1J04m3%MM2%j9J6l2JK0J0k0o4M5rJ0
$$ -32 -43 -33 -11 -17 2 61 33 12 -22 7 35 -1 -20 15 12 -59 45 2 2 6 48 48 29 45 13 14 34 44 24 -40 5 -4 6
6520FK4k0%l3M3J2o5k0O1nJ6NL0n1m0pK7J7k9LL4j1M9n6L2l2L8jo1N8k7kJ6K9
$$ 6 30 10 10 -23 20 32 -33 -53 8 3 19 24 54 3 -37 -44 -17 0 -29 -26 8 -3 46 -10 22 -10 28 27 -34 24 -3 -5 11 40
6554D0k0Ol8l8O6jl6M4j6j7N6m9l1L8rm0J3K7J3k9J0k2O0j2lJ9q8K7R4l5K0n0
$$ 40 20 26 -12 -50 16 15 -21 23 7 -10 46 -3 -34 4 -5 -45 -32 -5 8 -21 -11 -33 27 15 12 31 -57 -30 64 29 49 -1
6586aK8po8K7%L7Lj5%J8p8J8Q5p5J4lj4J07j06L2L0k1m1P5o6J2m1L4OJK6l8L4
$$ -1 27 20 -48 -21 -21 16 19 4 4 22 -56 -38 47 -28 -14 -17 -31 76 -30 2 32 11 -30 45 -21 -9 -50 -16 -10 -9 17 -21 13
6619A3J6JO7p8l3L1%kl6l9O8M6k5L2p3K2mpj4Ml4J4Pj0M1j1k7k6J6m2P7k4Q4n1
$$ 13 29 30 97 19 -14 17 17 15 -21 -60 8 54 29 61 -12 10 6 -1 -15 -11 -45 -31 -24 -34 7 -4 -31 -57 -41 -83 -6 -30 54 3
6653Cm1M6j7k3KLJ9J1kJ0n0R2r6K1mM0n9N7mL0k7l2MN9p2m0N9K4P5j12k9qP2M2
$$ 3 -38 8 -9 -32 -30 -27 -8 3 1 11 -39 53 -43 -22 -26 14 -45 12 8 38 11 -21 -17 42 -30 -70 -11 13 88 -24 -53 -61 11 53
6687E3Op5N8l3m0M6L0j8j3K%o1L4OK0j7k4J1L3l9O2p3Q4l2JK2m2J9n3n2O0J3L7
$$ 53 59 -16 42 9 -31 15 45 27 14 16 16 -45 -11 -5 15 -2 -26 -15 18 -21 41 -32 52 20 21 43 1 20 -33 -85 -25 -12 25
6720B5L0k7m0QrN9o4J4nJ6%pL5k5k5o9Q7l0L5o1M9j2k4N5K4p0O1n3j5N3Qk0n0
$$ 25 55 28 -12 -4 -13 46 -18 -4 -9 7 7 0 35 10 -15 -84 3 -27 8 -53 -4 -16 -40 15 39 -31 30 -23 -38 15 23 3 -47
6753d7P7l3M4q0rO1l4N8l8k3J3M4j00J00Qm3j3J7QNK8ok1rk0m7P5L5p2Q7jk0k5
$$ -47 30 -3 41 -39 -48 13 -21 37 -1 -24 -11 33 -67 33 41 -2 -15 2 10 15 43 37 16 7 -13 -60 15 50 -22 65 64 44 19
6786A9J2k9M5q6K1K6Pj2K3j6k0L8k2J9Ol7L2j5Jl1oM0J5J2l1P8q7o2O4k8j7O1
$$ 19 31 2 47 -39 -18 8 15 3 26 10 -10 28 6 25 31 -6 26 11 12 -19 -25 15 30 42 11 89 2 -60 4 -24 -41 20
6818B0Ml4n3M0M4j5n2L9Jn8J5O6J9N6j16j7N5nK9ok2J8n9M7m6K2o9J14M4q1j9
$$ 20 24 -10 -63 -23 21 6 -46 -7 -6 -64 -49 17 36 92 -24 -41 14 9 38 32 10 28 -31 16 -30 -8 -77 37 81 0 -19
6849a9lJ8j2J3l7l7O8J1K5l7m5J18l8j2K8m9K2N7m9o7R7l2l9K3M4l9k6N0l2%J
$$ -19 -22 -4 -16 -3 -40 -77 -9 2 27 -10 -55 63 25 13 41 -8 14 71 22 -45 52 20 -19 4 48 9 -17 33 1 1 2
6880BJ0j8P6o2l5L7MK1o9K5J3P5q8n0J19m6m7m2P6jL1o2M5J6l0L1K6o5K7l4Rn9
$$ 2 12 -6 70 8 -27 10 14 35 -34 -9 4 79 -9 -59 60 14 -33 -75 1 0 31 -31 14 30 0 31 57 -8 19 -15 -6 -65
6912f5P1Omn9Q6n8O0q2LnL2J1l2J7KK2j0K5L8m3j6m5pJ15m3ol3KM8l4m3O2q2R8
$$ -65 6 12 8 -51 35 -23 37 -45 -42 -47 -15 -4 -36 -19 -17 5 -5 20 58 15 -1 -46 -53 62 19 13 -20 -18 30 -4 -47 15 -67 31
6946C1l3j3M7k7l3rnL5M2j9m3PK9j1k5L8K5RM0q7K8m3Mqml1K9M8l4m4N6m6N6k8
$$ 31 -2 -15 32 5 -28 -37 -42 -7 35 16 -27 -20 9 -2 -27 11 36 45 85 -2 26 -17 -13 -21 -25 -56 -27 21 -13 -57 -1 -47 9 -19
6980a9O8o1J2k5rM2l6Nl0P4K0l8no1N2M5j13R2k6rLm1Q4m8L3Rl3M7n6k0N3K7n2
$$ -19 49 -12 0 -25 -34 8 -28 -23 -53 21 41 3 -2 -63 -11 34 -79 13 -13 -22 -19 -60 24 -24 9 18 -15 32 -24 -44 9 36 -16
7013a6N1l0n2L4J9NQJ0j1l9O0o1MN3L5m3J9o0n0Q7j0L4j01R0l8kK2q9M7j1J8k
$$ -16 35 5 -47 -13 6 11 19 29 18 -21 39 -22 -18 35 70 27 46 -14 -64 23 13 47 -54 36 -2 -4 18 -71 -24 -35 -17 -19
7045a9Kl7k0J04K2r9l4Q7%n9L9m6N7k3j1M1r0P6N4l4p7J47r0j6L3J7m0L3K4n8
$$ -19 -17 -54 -74 30 52 -47 -81 6 6 -53 -14 -60 -3 -26 -37 4 -86 -10 44 10 -67 80 -10 -26 7 24 -16 17 41 -17
7075a7K7Lo1K8Q1j01M4m7K8L3L1o3M8o7JQ7o1L1ol1K6j8k7N4l3rm3O5Mrn8P2l5
$$ -17 10 13 -48 -20 61 -40 4 -43 -15 18 49 -14 34 -33 -32 55 -6 25 19 -12 14 -4 -31 23 -10 -19 -62 3 7 -2 -60 12 -23
7108b3J6L2m2J9N9l4m0%J9j1L8m7m8N3Q9l4nn1oM3PK8m3m5N8m2N3k5jJ3J7j7l8
$$ -23 -7 25 -17 2 61 27 -13 -13 6 -5 33 -14 -62 -9 80 46 41 -10 -16 27 34 62 19 -26 32 -10 43 18 17 30 47 30 -8
7141hM7m4j1K6J7l6j8m0O5l5M5l2m3O0j7J5nk0L4K0n2L5K0ml7j2O9o0M4o4R9l3
$$ -8 39 -5 -16 10 27 -9 -27 -67 -2 -37 8 -24 -67 -7 -24 -9 -14 -34 0 20 -32 3 23 19 -18 -30 39 -21 23 -41 58 25
7173B5m4M8p4J7j7R7r9Q3o3LM3o7N7jK4m1L5j2k0K2J1L5m9m0L8o1P8o0O9j00O1
$$ 25 -19 29 -45 -28 -45 52 -47 36 -27 -24 19 -48 9 8 32 -9 26 14 -6 16 27 62 13 -27 11 -50 28 -32 37 -63 -2
7204bK5rRRk8j4j0K6MqK4Mj6LJ6l6MKJ2Ll7l9M4M9q2M9K3K1rn2QjO0j07Q3k4J1
$$ -2 23 14 23 32 4 -10 -20 6 10 2 26 30 14 17 33 -3 1 3 15 18 -19 -58 -14 35 -47 2 25 46 37 -15 -7 -8 52 -55 28 4 15
7241A5nJ3j5J1n3M3k8J4J8m1R5p9L6n1K4n8Q5nl2L3k7N0r1L3J8K9o4NJ8m2j4N5
$$ 15 10 23 8 19 -34 9 -19 -5 13 -28 67 -12 24 -27 -3 -61 24 19 -13 20 -7 43 -48 -15 3 32 -32 -27 -9 -51 -65 -10
7273a0j8j9L1J0K1k7J9N3n9k6P4lLm1m1kJ5K5j9K2j3K7J5q5O2n8K3O4n2O0m0k4
$$ -10 -28 -47 -16 -6 15 -12 7 60 1 -25 49 46 49 8 -33 -35 -20 5 -14 8 -5 22 37 -48 14 -44 -21 43 -9 51 11 -13
7305a3j1J4j6O0m1J6n1N3n1P1k9k8N3l8M5m7lqO3l1j1m7O3K0k6qK5n4N1j3J6r
$$ -13 -24 -10 -26 34 -7 9 -42 11 -40 31 2 -26 27 -11 34 -13 -16 -24 39 8 -3 -50 13 33 7 -1 24 -30 21 8 24 15
7337A5l4J0K7Ll1j3k4O0j4m6O9k0M0p1L7LK5q2L0oM8k7O6l9Q5j05k7K1j4K6m0
$$ 15 -19 -9 18 21 -10 -23 -47 13 -1 -47 22 2 42 -29 8 11 36 -46 -16 -22 26 -1 65 26 111 6 -21 0 -14 12 -28
7368b8M3p6P9lnrJ4j8O8p4j8N4m0J1P2m8J2j4J3m7k3O7lo0N3o3J5K5j4M1j00R4
$$ -28 15 -61 18 15 10 1 15 -3 65 -9 -27 27 -13 -2 70 22 34 20 33 -14 -37 30 27 -33 20 -43 -28 -3 -17 24 -76 18
7400A8j2K6o5M5On8K2n6J1R4o5k7K4L9l8N8k5j9m8J63n1Ro6MK9k3k4n0O9N4p8
$$ 18 6 32 -33 12 18 -40 -18 -74 -63 31 -34 -61 -37 2 -36 22 -3 -22 -70 93 42 51 -15 -11 18 -5 -29 -79 -10 44 -34
7431c4j0L4J2j9j2L4N0j00K7L9n6K8rj5J0kL0Lm3k1L5R8p1K7k2n5P0j4k6M0k8
$$ -34 -44 -10 2 -17 -29 5 55 -45 -18 21 -35 -7 -16 -31 -21 -23 7 10 -33 -54 -19 79 8 35 13 -42 28 14 -12 28 0
7462@jN1m4JMj4l3M2K5n5K8N6j21N4l6J05j13Q6Kj01N7k3M7nkl6j2N6K4m2k3M6
$$ 0 -1 50 6 7 11 -3 -36 6 31 -24 4 60 -61 -7 -43 62 -51 35 37 -64 -7 -30 17 12 10 -26 -38 18 42 0 -23 23
7494B3m0J0j7KM3L2p8Oj9M9j5J6O2p0J7n8N3r4R6Lqn3L4l4P2m7l6M9pL0p4N6p4
$$ 23 -17 -7 -24 -22 21 53 -25 -19 -38 11 -4 12 74 4 21 -37 16 -78 18 21 13 -40 -6 -40 32 -15 -51 -2 -9 21 -53 3 -71
7527g1O4k0K6l9J00j00L1N1o0Pl2M6k3Q1K7o1k5m7N2J05j16%J9l5R9n9m2N3k3
$$ -71 -7 -27 -1 -40 60 -40 -9 42 -18 -11 -43 3 -20 61 88 27 2 -45 7 112 -4 -4 15 -20 79 20 -22 31 8
7556Hm3l2N8j1P0j05KO1K5m9J5k5MM4k0jm4Lrl2N8j2M3m0J8J6j1l5O1m8M3M2q8
$$ 8 -35 -67 -9 -20 50 -55 -53 8 33 -16 -1 -26 -22 22 2 1 -43 -40 -49 -81 -23 -35 8 -32 -14 2 -9 -44 17 -31 12 54 -34
7589c4J3P5mn5K3n5J2K2L4nmj4J8J8m0%pk1PK3k1N3j8Op2K0KL5l3P9q9L3l3J1
$$ -34 -21 54 50 -5 18 -37 -25 -3 31 26 22 8 26 44 4 4 -3 -24 -17 6 -15 38 20 26 -46 -26 -24 11 -22 57 -32 1 -32 -21
7623b1L4J7l9l5M6k2Ro1P8K6m9k0P5m5j8J2N1l3jo9Q4k8j3oj0O7j7n0N4l8nK1
$$ -21 13 30 -9 -44 2 -20 -11 -72 6 32 -17 -37 38 -7 -25 -13 38 5 4 -65 19 -9 -22 -28 -38 29 12 -38 16 -22 -27 -6
7655fn2N2j2K1M0j4o3K7K4m8j7J6M0K0pJj3k2rL1J1o7RL3M4m7J4Qn6J8J4N1JJ8
$$ -6 -58 -6 -18 3 43 29 -34 -7 17 -31 -48 -32 8 28 21 22 9 -13 -22 9 20 -47 -38 -5 39 -8 6 14 -42 -24 -10 41 42 60
7689F0k3k8j4j9k2L7k4KM1J3Qo2k2R5j8K1j6lo3m6P3o5O6L9l0j6JJ0l0J4MK6k1
$$ 60 37 9 -5 -24 -46 -9 -33 -31 10 23 31 -31 -53 42 24 45 29 26 -37 -83 -10 -75 -9 30 0 -16 -15 -5 -35 -21 -17 9 -12
7722a2j5L0j2K6m1K0l9J8L2k9M0K4n9K5p6M9J4K3n1O5Jl6LO9p1q5Q1j1K9Oj8J9
$$ -12 -27 3 -9 17 -24 -4 -43 -25 7 -22 18 42 -17 8 -68 -19 -5 18 -33 32 33 -3 0 69 -2 -87 -6 -17 12 18 0 19
7754A9m9P2n7j2OL3j5mK3o6R7k5j9m2L7k1M2J5l8JQRm4L6j0J2n4Q1k3l4M5j2J4
$$ 19 -30 42 -15 -27 -21 12 -3 -7 16 -50 47 22 3 -39 -2 -23 19 34 -4 -3 5 14 -30 6 -4 8 -46 35 12 -22 23 11 25
7787B5l2K3k8rl2K4J6J3J9n0J0O4n9l4M0j5K9m1L2M8q8Q1k1m0NnrK2N7l8k9J5
$$ 25 -7 16 -12 -21 -53 -29 -13 0 19 -31 -21 43 -16 -50 -10 -25 4 -37 -5 43 -45 36 15 -25 -20 -25 -34 -12 45 7 -22 -7
7819gN6l5j6k4L3m3J7Kj2M2N5o5l5NM0j7JQm0K7pl6Q6L4m5l2J3j7RL8m1oKM5p7
$$ -7 49 14 -2 -26 7 -36 -19 -17 -29 13 68 3 -32 -27 13 -4 -3 5 -35 -8 -15 -51 35 69 24 -8 5 -12 -3 35 -6 -12 -10 35 -42
7854d2M4k9kl1N7Rl2J5o2J9O3l4O9N3r5j21R5K8j5l0K5L7J8j6m5Jq1Q1M2j3k9
$$ -42 2 -27 -29 -60 -3 6 -26 -11 -73 -54 9 -25 44 97 2 -119 -24 4 -11 -41 -16 21 39 23 -22 -21 -102 -21 21 8 -21
7885b1N3qo2K6rM0l7N7k7k8K9n1O8r9JL1K1J0M0m9qN7l4l6oQP4m4J1j3M7l3kj7
$$ -21 32 24 -38 -12 -21 19 -18 39 12 -16 13 -38 30 -69 -68 -37 -16 -6 34 -15 -23 34 0 -36 -42 -34 40 -4 7 -6 41 8 6 -11
7919a1J7K1j4n6L7J6J5m5qN8L2r3K3m2O8N2j09R0l7km8M3J2K7m8J2L6l4j1M5l6
$$ -11 6 27 13 -43 -6 10 25 -20 -28 30 62 -31 -8 -50 18 70 -39 51 14 12 -36 7 19 46 -2 10 46 12 1 46 10
7950A0J1j9j5%k3l3P1l7L8k1j6M5J2o1J0K1m1P5jj2o2L8K4k1m7L6Nkj6nN6k2L
$$ 10 21 2 -13 -13 -36 -69 2 -35 3 -18 -34 11 23 -38 -28 -7 -48 27 26 14 -48 -10 14 -7 -54 -18 -13 -15 -31 -36 20 -2 1
7983AL2k1l9O8o5K4o4N9K8l1M8j9o0L4j6O1l3j1J6k0j1L5m2P8m0qK5n5K0O1j01
$$ 1 33 12 -27 41 -24 0 -64 -5 23 -8 40 21 -39 -5 -21 40 7 -4 12 -8 -19 16 -26 52 12 4 29 -26 -6 55 -46
8014d6J04p8N4Mp3N2L2m8k9k4ljQ7K1r0P2p6L4L6j8NO2n9j3K8lm1oj4Rn0M5O9
$$ -46 58 -20 34 38 -35 17 49 1 -28 -52 -55 -56 31 52 -38 34 -42 -8 28 10 15 77 18 5 33 30 -11 -17 -31 -22 -72 -27 42
8047D2j19J13j4k9N6m5M7l6k2jj5l4N1M6q3J9J5o6P7JK8n6N2m6o5J76j06L3k4
$$ 42 -77 36 22 -7 49 4 51 15 -7 -8 -23 -57 -6 40 -43 -24 -9 -75 2 3 31 -25 27 -19 -84 92 -14 19 -5
8076ejm0K0Q0p6k0O4k2l0P5r2J05j09J1Q1j7o0L8M5o0O0m0n4M5J4L7j0l2L1l8
$$ -5 -6 -46 -26 54 -22 -42 22 0 -30 45 -47 58 -51 -40 41 24 -36 2 47 -13 47 7 -47 -2 12 49 39 7 38 0
8106@Pqn9j2R9k6j3L8MM1o6l0lK8m8Om2J27m0n7P1j7J0J5Jl5L4l1L0N9r3k4J1
$$ 0 7 -1 -60 -72 27 1 -12 26 30 71 5 -25 -28 0 -48 -42 -84 43 3 -54 17 0 10 25 26 -9 25 -6 24 83 -10 -34 -23
8139b3J3ln4N9K6k4J1rK2k6l4N3L4o3k1M6j3M9p0Q1k0j0K5K4j00K8O9K0p6N0p3
$$ -23 -10 -13 -67 -8 18 -6 5 -4 18 -8 -42 11 45 -18 -39 7 -6 43 -27 54 34 24 49 73 -27 1 70 90 14 64 -9
8170il1L0k8P1qk1j9j8K2k8M1Kk5K2rO1j04k1Q5k8N0
$$ -9 -40 -10 -38 33 25 4 -15 -33 -11 -39 2 4 -21 1 -8 53 -51 -72 13 -15 35
8191C5
$$ Imaginary data points
##PAGE= N=2
##DATA TABLE= (X++(I..I)), XYDATA
0@%%%%%%%Qj6J6j6J6k4L2m0M8n6O5p3Q8j04J21j40J63j87K13k44K77l16L62m09
$$ 0 0 0 0 0 0 0 0 8 -8 8 -8 8 -16 16 -24 24 -32 33 -40 48 -56 65 -75 88 -99 114 -130 147 -169 193 -216
31b16M58n10N68o39P12p91Q80r77J082j198J327j470J629j801J995k216K467k754
$$ -216 242 -268 300 -339 373 -418 462 -515 567 -631 696 -774 855 -946 1049 -1167 1300 -1454
49a454L085l472L936m502N207o114P332r062J1725j6385K6841q8157n929J70023
$$ -1454 1631 -1841 2095 -2407 2800 -3314 4018 -5044 6681 -9704 17137 -71020 -76949 93074
63I3074p0444k2202k5406r182L9869O0135q9418k9077Q7536k1417j9213K091j8446
$$ 93074 22630 428 -24978 -34160 5709 65844 -23574 -52651 34885 13468 -5745 -3654 -22100
76b2100L7093J1774m5957r028N8055k4160j4906Q426j4060K9328K176l5002M991
$$ -22100 14993 26767 -19190 -28218 29837 5677 -9229 -803 -14863 14465 16641 -18361 -13370
89a3370L1823j4107j3743J0956j0438K0136k446k5225J3232J5564j1048p877O400
$$ -13370 18453 4346 -9397 1559 -8879 11257 8811 -16414 -3182 12382 1334 -6543 -143
102a43m938J4192k453k1752J5327Q477q778l701K944q98O628j473j3372J2041
$$ -143 -5081 9111 6658 -15094 233 8710 -68 -3769 -825 -1723 4905 3432 -9940 2101
116B101L648q139J184J40J009L628k421q592R790K871q706L153m76J000K496k951
$$ 2101 5749 -2390 -1206 -1066 -57 3571 1150 -7442 2348 5219 -3487 -334 -810 190 2686 -265
132b65l813N652J876o428L134l94J91K376l570j189L957J028n001K324L95j033
$$ -265 -4078 1574 3450 -2978 156 -238 -47 2329 -1241 -2430 1527 2555 -2446 -122 273 -760
148g60L233l510j018L254L83k850R23Q40j222K438k535p67L178r90j600P52O27
$$ -760 2473 -1037 -2055 1199 1582 -1268 -345 495 -727 1711 -824 -1591 1587 597 -1003 -251 376
165C76r05J997k034j503L905j304j483P91L01k43R54r88j499L111r43j638J405
$$ 376 -529 1468 -566 -2069 1836 532 -951 -160 141 -102 852 -136 -1635 1476 533 -1105 300
182C00m64J20P61r43j252K852n85k342K217p95j10J254j393p96K154j22k276J921
$$ 300 -164 -44 717 -226 -1478 1374 789 -1553 664 -131 -241 1013 -380 -1176 978 856 -1420 501
200E01l91o06J563j753q5J680m51j619J577k92q15K180k303k26K323j041j144
$$ 501 110 -496 1067 -686 -771 909 458 -1161 416 124 -691 1489 -814 -1040 1283 242 -902
217i02J124j2r42J881j671n26K465j634m96J097l91l80J356j598n40K929k156
$$ -902 222 210 -732 1149 -522 -1048 1417 -217 -713 384 -7 -387 969 -629 -1169 1760 -396
234c96m58J544r19J80P69j274l39K398j697p64J756j233M86N16j231K59J518j329
$$ -396 -854 690 -229 -49 720 -554 -893 1505 -192 -956 800 -433 53 569 -662 -403 1115 -214
252b14n74J664j338M88O88j619P13J029r97m93J225q02O2P96j328O44N84q14R0
$$ -214 -788 876 -462 26 714 -905 -192 837 -160 -653 572 -230 -168 628 -700 -56 528 -286 -196
271a96O08n72Q6N63j138O83N75j056K65M85m13O2L22o42K28P46r96J95M50l28
$$ -196 412 -160 -74 489 -649 34 609 -447 -182 303 -110 -48 274 -368 -140 606 -390 -195 255 -73
291g3J25Q1k90M3N50o51J9M30l67J14J65l86J52M32m03l00P16m07l8L42m17J30
$$ -73 52 133 -157 -114 436 -215 -196 234 -133 -19 146 -240 -88 344 -59 -359 357 -50 -88 254 -163 -33
313c3K13j87k67N82l07j86M84m74Q3L68l54j23M25j51l79O76n23k0N83n68M9L66
$$ -33 180 -7 -274 308 1 -185 299 -175 -92 276 -78 -201 224 73 -306 370 -153 -173 410 -158 -109 257
335B57k52k81N93m48j26P11p68J73M08l87lM33l83k29Q06p37LP39p62J87L83m71
$$ 257 5 -276 317 -131 -257 454 -314 -141 267 -120 -123 310 -73 -302 504 -233 -230 509 -253 -66 317 -154
357a54p4O06n56j21Q08q37K77L91o21K22M36n91r5Q51r29L52N17j053N59L20n55
$$ -154 -228 378 -178 -299 509 -328 -51 340 -281 -59 377 -214 -309 542 -387 -35 482 -571 -12 308 -247
378b47P5N45o38K13N56j049N41M08p44L36K36n23K61M48r62O24M52r86N86O3m09
$$ -247 -172 373 -265 -52 504 -545 -4 404 -340 -4 232 -291 -30 418 -544 80 532 -454 132 195 -214
399b14K76J84o15L68M21q70N56J18n84N75j78k77K78K72p48M50L09o71N19j20
$$ -214 62 246 -369 -1 420 -450 106 224 -360 215 37 -240 38 310 -438 12 321 -350 169 49
419D9l02L72J27m98K35K73n15L65J13n03M42p2k69J85K47n02K67K08n37N25r5
$$ 49 -253 119 246 -252 -17 256 -259 106 219 -284 158 86 -183 2 249 -253 14 222 -315 210 115
440A15l56K98K8k06J36J79l96K70P7l49L11n2j43J45M8l22K39J89m86M02n6j87
$$ 115 -241 57 85 -121 15 194 -202 68 145 -204 107 55 -88 57 105 -217 22 211 -275 127 71 -116
462a16J62J3j99J97J28m36L34Q5l85L32j30j61K68O9m01L12J81n22M26r8k46L13
$$ -116 46 59 -140 57 185 -251 83 168 -217 115 -15 -176 92 161 -240 72 253 -269 157 59 -187 126
484A26p2k09J76K11m77K64J56m95M91j35k01J67J48l57J62L09o30N38n4l64M10
$$ 126 54 -155 21 232 -245 19 175 -320 171 36 -165 2 150 -207 -45 264 -366 172 118 -246 164
505A64o7k31J66J13l99L66K6m00M22p8k98K67J10l67L32K5m24N20j88l63N28k54
$$ 164 97 -134 32 145 -254 112 138 -262 160 82 -216 51 161 -206 126 151 -273 247 59 -304 224 -30
527c0j67L22j08l28N13q2m29M91k16j09L10j72k01M02j35l50N42k27k37M83l88
$$ -30 -197 125 17 -311 202 120 -309 182 -34 -143 167 -5 -206 196 61 -289 253 26 -211 272 -116
548a16n8L50j76j82M45k22l50O19l43j94M11k72n6K62j09k78N23k81j00L58m19
$$ -116 -174 176 0 -182 263 41 -309 310 -33 -227 184 -88 -144 118 9 -269 254 -27 -127 231 -188
569a88J36K40k54j33M04k22j62M77l54kK63k74p7K80k41q2M23l03q4L86l68J4
$$ -188 -52 188 -66 -199 205 -17 -179 298 -56 -58 205 -69 -146 134 -107 -189 234 -69 -153 233 -135 -121
591a21K74j34j07K24j16j70M04l80K0L23l15N0J16r8q3K60j86j37L64k95M5J97
$$ -121 153 19 -88 136 20 -150 254 -126 -106 217 -98 -48 68 -30 -113 147 -39 -176 188 -107 -62 135
613A35j88n4K21p7k29L98k31r8K46j92P5O3j16l8L00k20j24K96k69O8J26j85P9
$$ 135 -53 -107 114 37 -192 206 -25 -123 123 -69 6 69 -47 -85 215 -5 -129 167 -102 -34 92 -93 -14
636a4J37j52j59M07k62o4K36k73P8J95j38j07K68j26j57L23k28k0K11j95nJ39
$$ -14 123 -29 -188 219 -43 -107 129 -144 -66 129 -9 -116 152 26 -131 192 -36 -56 155 -40 -45 94
658I4k2k43L53k66K9K30k37M8J24j16j2J12r9j37K65k00L8K05k19L9R0j57m4K79
$$ 94 72 -171 182 -84 -55 175 -62 -14 110 -6 -18 94 -5 -142 123 -77 -39 166 -53 -14 76 -81 -125 154
682A54k51KK34k60R1J47k06J6J91j32n5K24k49L5J29j07K6L7n2J1J89k31K7J25
$$ 154 -97 -95 139 -121 -30 117 -89 -73 118 -14 -69 155 -94 -59 70 -37 -11 26 -26 -15 174 -57 -30 95
706I5j84R2Q6j54P6O7j30K0J44j77P0J61k28M5M0o9L6J25k04L2J78k18R8J37k52
$$ 95 -89 3 89 -65 11 78 -52 -32 112 -65 5 166 -62 -17 23 -46 -10 115 -89 -57 121 -97 1 138 -114
731a14R9Q1j00o1J71k26R7J83j79P9M4j11P1R7j35l2J13j45K6J55k12P4J18j69
$$ -114 -15 66 -34 -95 76 -150 -53 130 -49 30 74 -37 34 131 -4 -36 77 -68 -42 113 -99 -25 93 -76
755g6M0J81k34L2J90k20N4P9o4M0N4j27j6K16k35L7J56k03J37rr3J2J24j16n6
$$ -76 -36 145 -89 -57 133 -87 -33 46 -18 22 76 -51 -67 149 -86 -49 107 -96 41 32 -61 -49 75 -41 -97
780i7K67j29n3N5o5L6M0j32L5J15j45O1Q3j13P4N0j13K0J19j27k6J35k00J17O3
$$ -97 170 41 -12 43 -22 14 54 -78 -43 72 -73 -12 71 -42 32 82 -31 -11 108 -19 -45 90 -110 7 70
805G0j74R6K7o4jQ0j01J8R2j39M0N2p2N1J13j21lJ05r2%N7%n2M3n1K2M2m5LK7
$$ 70 -104 -8 19 -45 -46 34 -67 -49 43 -96 -56 -4 -76 -25 88 -33 -36 69 -23 -23 34 34 -18 25 -26 -4 38 -7 -4 23
835B3p1O3rk5L3L3j14N1Q7q6p4J42r7P0j6jr3J38q8L0Q3j69N7M5o7PO8r2R2M9
$$ 23 -48 15 6 -19 14 47 -67 -16 71 -15 -89 53 -44 26 10 9 -84 54 -34 -4 79 -90 -33 12 -55 -48 20 -72 20 69
865F9j53J07O2k19J94j2r1P4J9j21N4L9q6Q2j2o3Q9J9m2L7K5j60J18O6j43R0J
$$ 69 -84 23 85 -134 60 48 -43 31 50 -71 -17 22 -64 18 6 -57 32 51 9 46 71 -89 29 95 -48 42 43
892D3j26R2ll5K2Q3j21R9k6n9N0Nn4Q3k5p8Q0n3O2N0j03NN9o7pO6m4K0k4Lp0N5
$$ 43 -83 9 6 -29 -7 76 -45 54 28 -31 19 24 -30 53 28 -50 30 -23 39 89 -14 -9 50 -17 -24 42 -2 18 -6 -3 -73 -18
924a8R6o7j8ml1Q3K8j60J60r8L2J8M1p2Q4j05l6P7J4q%po0Q5K9j15O7O9j23Q8
$$ -18 78 11 -7 -11 -42 41 69 -91 69 -29 3 21 62 -10 74 -31 -67 10 24 16 16 9 -51 34 63 -52 15 84 -39 49
954D9l3k6M8O0j84Q5mn2L5P7o9L7jj03J49k7j64J06K8l2R7j09k9K1N6m5M9j4q
$$ 49 16 -10 38 98 -86 -1 -5 -57 -22 55 -14 23 22 -81 68 41 -123 -17 11 -21 76 -33 -62 -41 15 -30 19 5 -3
983cK8k2m4O7q9p6J82j10j4J28p1m1J77j22l6N4K3n3P9o1r4J14k5o0J21n9J3j3
$$ -3 25 3 -41 26 -63 -139 43 -67 -81 47 -24 -65 112 -10 -46 8 31 -22 57 -4 -98 16 -9 -69 52 -7 6 -7
1011gl9j4Q9j4r3R0k5MKl2N4L2lq9O5k3p1J67j43Q6j6n5QJ05k4n5J3n0O1Mp0m
$$ -7 -46 -60 29 15 -78 12 -13 -9 -7 -39 15 47 44 -45 20 -3 -74 93 -50 36 20 -35 -27 78 54 -1 12 -38 23 27 -43 -47
1043d7Q0k1p4P9m6M1M7r0N0j1n1L2J7m9N3N4r5K1J11q2J3k4j9M8K6j12L7L5jQ
$$ -47 33 12 -62 17 -29 12 59 -31 19 8 -43 -11 6 -43 10 64 -31 -10 101 19 32 8 -11 37 63 -49 -12 23 22 30
1073C0l6MQ%%L1j0p5N9j2K0mJ9o9K9O3q8M9K1r4NM7j8j7O2n9M4k5K7j3K2p1M6
$$ 30 -6 -2 6 6 6 37 27 -48 11 -1 19 15 34 -35 -6 57 -31 18 39 -55 -50 -3 -21 -38 24 -35 9 -16 11 -2 20 -51 -5
1106eJ0m7rJ9l6N5M9o0J8Nj6N9k5j21P1J38j35N0O4j17M4o0L6N4l0m0J6L6j5Q2
$$ -5 5 -42 -51 -32 -68 -13 36 -24 -6 -1 -17 42 17 -104 -33 105 -30 20 84 -33 11 -49 -13 41 11 -29 -13 23 8 90
1136I0j05j0L3K9n0P4m2j6J1lj44J39L5r6N0L5Po6L0j2M9L6j35K9J42r5n4K5k2
$$ 90 -15 -25 8 37 -13 61 19 3 14 11 -133 6 41 -55 -5 30 37 -29 1 -11 38 74 -61 -32 110 15 -39 -14 -36
1165c6O9L1j47J10N1m7n4LK1P4n9j07R2N7o3QN5q3O7j0j20J02n0K5k6P6o9R0j0
$$ -36 33 64 -83 27 78 31 -23 -20 1 75 16 -91 1 58 -5 3 58 -25 42 32 -88 14 -36 -11 -37 39 -30 60 50
1194E0j41J21Nq6Q1o0jJ9L2n5J08m2q3O7J4m9k4O3j0j0K6j8Qj4J7j0k7MJ7l7L0
$$ 50 -91 30 35 -51 30 -30 -31 -12 20 -35 73 31 -52 15 29 -20 -44 19 9 -1 25 7 15 1 18 8 -19 -15 2 -35 -5
1225em2O2l6N1Kj07J44j04O7k5O8p4J4j8n8P2k0J3O1l5n1J05j26J6L7Pm8P5k0
$$ -5 -47 15 -21 30 32 -75 69 -35 32 7 75 1 15 -3 -61 11 -9 4 65 30 -21 84 -42 -26 11 18 -30 45 25
1254B5rl4oK0P2o5K1l8M%M1l5j27J26Mk8kK6J4J4j6n8Q8Jp6O5l9jRJ0qO1k1j04
$$ 25 16 -18 -24 -4 68 3 24 -14 -10 -10 31 -4 -131 -5 -1 -29 -31 -5 9 23 7 -51 37 38 -38 27 -12 -13 -4 6 -2 59 38 -66
1288f6O7JJ2k9M9q8R4J7q0kK4n9R0n6k5M2L2p4O6L0p3J8QJ7j0l3L8k3oN0l7O3
$$ -66 1 2 14 -15 34 -54 40 57 -23 -25 -1 -60 30 -26 -51 -9 23 -51 15 45 -28 -10 -2 15 5 -28 10 -13 -19 31 -6 57
1320E7k6J7l6Rn6M9k9N4l8K3l4k7L0n8M8j7j4O6n5J12o0j6K6j2j5Ok6J9j7N8%
$$ 57 31 48 12 21 -35 14 -15 39 1 24 -10 -37 -7 -65 -17 -34 -48 18 -37 75 15 -1 25 13 -2 4 -22 -3 -20 38 38
1351C8j0L9m5J8k2lJk0jjN6j23N2Moj3K0l7M8j3M6nk4o3K4K3K7k1J6l5k6K0P4
$$ 38 28 67 22 40 18 15 16 -4 -5 -6 50 -73 -21 -17 -23 -36 -16 -53 -5 -18 28 23 -1 -64 -40 -17 10 -11 5 -30 -56 -36 38
1384C8q7M9P4r7JO4r0J0N1m2O0q1Q3j6J6l0J9q7R0j8J2K4Mq6L4L3mJn1J3M2o8
$$ 38 -49 0 74 -23 -22 42 -48 -38 13 -29 31 -50 33 17 33 3 22 -65 25 7 19 43 47 -39 -5 28 24 25 -26 -13 29 -39
1416c9jN4k2J7K8r5J1L7Jl7R3j2k9lm2n5P8J4J3k2l8j3P1n4M6o9P6L3K3p8N3k
$$ -39 -40 14 -8 9 37 -58 -47 -10 -9 -46 47 35 6 3 -39 -94 -16 -2 11 -11 -49 -62 9 -45 1 -68 8 41 64 -14 39 37
1448C7j27O7LK7l4JN3n9J09o4p2J00o8P1L8p4kL9j16M4Q6j09P8nk0JK1p9O7p%
$$ 37 -90 -23 -20 7 -27 -26 27 -32 77 13 -59 41 -27 44 82 8 6 45 -71 -27 59 -50 28 23 3 4 25 -54 13 6 6
1479FK4k6o4P1l3RN5N3j04rJ7k8M4k2m5R2pOkk6m0K6L2m8L3l0qL8j2Km4N3m6j6
$$ 6 30 4 -60 11 -22 -13 42 95 -9 -18 -1 -29 15 -7 -52 40 33 39 37 11 -29 -3 29 -19 14 -16 -24 14 2 4 -40 13 -33 -49
1513d9Q9o6K1mmJ3J0j4j4Ok6M7M9r1N2rq9R2m9K1k2M6mK1P0j32P1%p8K8K9l6J01
$$ -49 40 -26 -5 -9 -13 0 10 -4 -18 -12 -38 9 58 -33 19 10 -79 13 -36 -15 -37 9 5 26 96 -36 35 35 -43 -15 14 -22 79
1546G9m4r6P1r7Q1J9m7K6M9l7l1N0k2l4J04r1nR7pj15O8K4k8J0n5J7L9o1N4L0
$$ 79 35 -61 10 -87 -6 13 -34 -8 41 4 -27 23 1 -33 71 -20 -25 72 65 -50 18 42 14 24 -31 -14 25 -36 18 48
1576D8p1K0L9o6l2Q4Mq8J15j4p7M9J9p2O6m4l0Q3p3L3KL0n1Oj2J0R0q6l2M6p3
$$ 48 -23 -3 36 -30 -62 22 26 -62 53 39 -38 11 30 -42 24 -20 -50 33 -40 -7 -5 25 -26 -20 -32 -22 68 -18 -50 -4 -77
1607g7P2qP1p5P9o9j2L8k6K3M4r5J2O7l8p6J07Nr1M5OQjrLM6l4k7mQ9o5K3n5O5
$$ -77 -5 -13 58 -17 62 -7 -19 19 -7 16 60 -35 -23 44 6 -70 37 42 -49 -4 2 10 9 0 3 49 15 -12 -16 73 8 31 -24 41
1641D1K8l6r3N2l0J0M1j4L6l9k7M7oq5P9l2K8o1O5Qj6N8j06N9J5n0P9k1j0J1k8
$$ 41 69 33 -60 -8 -38 -28 13 -1 35 -4 -31 16 10 -75 4 -28 0 -61 4 12 -4 54 -52 7 22 -28 51 30 20 31 3
1672CJ5j6l2J2oO6J0l8m2J6N1l0mlk1L9K4oq3pM4J7l0J9mo0J31j12pQ8om4N9n5
$$ 3 18 2 -30 -18 -24 42 52 14 -28 -12 39 9 5 2 -19 20 44 38 -45 -52 -8 9 -21 -2 -6 -66 65 -47 -54 34 28 -16 43 -12
1706a2k3O3j6m9P8K2j04MP6n3Q0r0N4L5n0l1O2q1O8J2j3o8L3p0Q9M0j27O3j2k6
$$ -12 -35 28 12 -37 41 63 -41 -37 39 -14 66 -24 30 65 15 -16 46 -35 33 45 32 -36 -3 -73 16 56 -71 -8 -20 -46
1736d6L2O6j27P6Mj8l5J11p1j8R3j10L9O9q6l3J08j5l1pm9M3N2n2M6l0m8J0O6
$$ -46 -14 52 -75 1 5 -13 -48 63 -8 -26 67 -43 -4 65 -21 -54 54 39 8 1 -48 -5 47 -5 41 11 -37 -27 39
1765C9j31L9P8Jj8L5k5l5m0N3ON9p3L7J5k7m7M9n0M7N5j26K3L6K5j0k2JK1j4p0
$$ 39 -92 -53 25 26 8 43 18 -17 -57 -4 2 61 -12 25 40 13 -34 15 -35 12 67 -59 -36 0 25 15 -7 -6 15 1 -69
1796f9k8J01p5O7O2k8J1n1j6J0J0J0K5k8QK8k9l3LJ1mk4M8m1J1rn4O5LJ5q8R6
$$ -69 -97 4 -71 -4 58 30 41 -10 -26 -16 -6 4 29 1 9 37 8 -25 -22 -11 -15 -39 9 -32 -21 -30 -84 -19 -16 -1 -89 7
1828Gl8L8J9j9l2k0J20m5J1o8j1P4p7N1n5j4L6J7o5P8on0j0O5LP9j03m4J03n0
$$ 7 -31 7 26 7 -25 -45 75 30 41 -27 -38 36 -41 10 -45 -59 -23 -6 -71 7 1 -49 -59 6 9 88 -15 -59 44 -6
1858fr5Q6K9m3N4J1r4O1j4J4l6L4l9K2lj8K0N8o6O3n6K5J2k3n1L1O6l7k6N6mR
$$ -6 -101 -15 14 -29 25 36 -58 3 -11 3 -33 1 -38 -16 -19 -37 -17 41 -25 38 -18 7 19 -4 -55 -24 42 5 -21 35 31 40
1890D0o1ON6j7n8Q8k8j18M4L3ooO2q1J0M1m1J04o2k6knJ4K6P7j22jK1rM2N4q0
$$ 40 -21 -15 41 24 -34 54 26 -92 -48 -15 -21 -27 35 -46 -36 5 -36 68 6 -20 -22 -27 -13 13 90 -32 -33 -12 -21 21 75 -5
1922ek0M3l8k5O4j0J4J0o6R1j17K3K5J3m2K3M2p1O0k3k0PN1n1L7M4p5K0M0o3j
$$ -5 -25 18 -20 -45 19 9 23 33 -33 58 -59 -36 -11 2 -40 -17 25 -46 14 -9 -29 -22 29 -22 15 59 -16 4 44 -19 -20
1953b0L3L9o2%l8L7N6r9M9K1LJ1o4K3L9Pm7m9M7j3O5o4mM9l3L5N2o6m7O4n8l3
$$ -20 13 52 -10 -10 -48 -11 45 -54 -5 16 19 30 -34 -11 28 35 -12 -61 -14 -27 38 -26 -30 19 -14 21 73 7 -40 24 -34 -67
1985f7L2O0p5N7K5m8Lj5j5N1o3K4jK9l1J15p5J5n1j3n5P2N9m8M0n2J4qQ1j04J23
$$ -67 -35 25 -50 7 32 -16 -13 -28 -43 8 -55 -31 -32 -3 -34 81 6 21 -30 -43 -98 -26 33 -15 25 -27 -13 -21 60 -44 79
2016G9n0m8J2JL3J4j7l8qJ%K3M7j17Q0Nm7L5Qo4M4mmJQ4o0o7P7o6J6J6oPL5r3
$$ 79 29 -19 -7 -6 27 41 24 -14 -22 -21 -21 2 49 -68 12 17 -30 5 13 -51 -7 -11 -15 -14 70 10 -57 20 -46 -30 -14 -20 -13 22 -71
2051g1P6L3m7M1o1j3M6l7N5p1Q3o2N3j4n8J28p2m8O3j9q2R0j2k1N7k7n0O8J5k6
$$ -71 5 38 -9 32 -29 -42 4 -33 22 -49 34 -28 25 11 -47 81 9 -39 24 5 -77 13 1 -20 37 10 -40 28 43 17
2081A7J9k6o6J11p3pN9J0p5L4L0J3k6nK6J8p9nJ5j5mK2j3LM0m2l3R3j5o5N2p8
$$ 17 36 10 -56 55 -18 -25 34 44 -31 3 33 46 20 15 41 59 -20 -25 -10 -25 -29 -7 -20 -17 23 -19 -52 41 26 -39 13 -65
2113f5N4K3k9PL3o7N3J09j09L0j4o3P5p0K9m2J14o7k2M7J4n8lK3Joj7J5O4m7o1
$$ -65 -11 12 -17 -10 23 -44 9 118 9 39 25 -38 37 -33 -4 -46 68 1 -21 26 40 -18 -21 2 3 -3 -20 -5 59 12 -49
2144d9N8pr9P3%N2Nm7K4L4m7k2K8J5l2L1m8l0P2o8L7K1n1J8PJ0OL4J6l9MKm3J0
$$ -49 9 2 -97 -24 -24 28 33 -14 10 44 -3 -25 3 18 -14 17 -31 -61 11 -57 -20 1 -50 -32 -25 -15 -9 25 41 2 6 8 -35 -25
2178b5j0M9m3M6p3R2n5m6Q5q3N4L4n1l8J07m6j5J7n1P6n5J8N1j0pp4J02p8P7J1
$$ -25 -35 14 -29 17 -56 36 -19 -65 20 -63 -9 25 -26 -64 43 -3 -18 -1 -52 24 -31 -13 38 28 21 -53 49 -29 48 59
2208E9j44N5J03k3j48J21j8L3o4j9M4P5p6m0N5l1nlj4O3k1PL0k8j2j8M2k0l4J05
$$ 59 -85 -30 73 50 -98 23 5 38 -26 -45 -1 74 -2 -42 13 -18 -23 -26 -40 23 2 9 39 11 -1 -19 23 3 -31 74
2238G4j05L2j7jJ6N9r3L3K7k1O3n0m2OK8k3Q8m7k4mM5l8m2J3K5PL2o8lM5j0lK1
$$ 74 -31 1 -16 -17 -1 58 -35 -2 25 4 67 17 -25 -19 9 -14 74 27 3 -1 44 6 -36 -23 2 9 41 -27 -30 15 5 2 23
2271B3n2J8K6J6n6M0jm4Q1j9l7L4Om5M0m0Jj4l4M9k3j1J0J9j3NM4l8m5P8j5k6
$$ 23 -29 -11 15 31 -25 15 14 -30 51 32 -5 29 35 -10 30 -10 -9 -23 -57 -8 -31 -42 -32 -13 -26 -21 23 -15 -60 18 3 -23
2303b3L1L6M1r2L8j6L7j1j3j6K3n3L7JJ0K3k9k1l1J6Nk6MMoL3j0k3J0L0k6j0O
$$ -23 8 44 85 -7 31 15 52 41 28 12 35 -18 19 20 30 53 24 3 -28 -12 -7 -33 -29 -25 -31 2 -8 -31 -21 9 -17 -27 -21
2336b1L8on4j2M9o8M1k4rJ38m5l1J9r0J27j18N0k3l6J15j4j9j1qL5J4j8k3l1M4
$$ -21 17 11 -43 -55 -6 -74 -33 -57 -66 72 27 -4 15 -75 52 -66 -16 -39 -75 40 26 7 -4 -12 23 37 19 -4 -35 9
2366IQm6J8O1o8M4n9M5m6L5j6Q5m6rL9q4M9k0j5k4N4K9n3K9m1o4M5P5o8K5J4q
$$ 9 17 -29 -11 50 -18 26 -33 12 -34 1 -15 70 24 15 54 -30 19 -1 -16 -40 14 43 -10 19 -22 -86 -41 34 -34 -9 5 -3
2398cJ5p0K5K3L5Kl0K6n5N3K9n2L0p1k3J11n4m8L7oK0jN6k5kN4j09J19j18k5R6
$$ -3 12 -58 -33 -10 25 27 -3 23 -32 21 50 -2 28 -43 -66 45 -9 -57 -20 -26 -6 -7 49 24 22 76 -33 86 -32 -57 39
2429C9o4N4l2l1nQ5n8K3L2m8j3L3rpL5n2J8K6jl2L4n0K0K3L6n3n8K1lJ0oj7N3
$$ 39 -25 29 -3 -34 -39 46 -12 11 43 -5 -18 15 6 -1 34 -18 0 26 25 -7 27 -23 -3 20 56 3 -55 -34 -37 -27 -33 -50 3
2462Ckk6k2P3k8j2qK7p1M9L3k2L9k4K3l8mN3j4m7J10o9l2J1kp4O2N5rJ0j06j6
$$ 3 1 -25 -47 26 -2 -14 -22 5 -66 -17 16 -6 33 9 32 -6 -10 43 29 -18 92 23 -9 2 0 -74 -12 43 34 44 -62 -78
2494g8J01j7n7m5J21o3L8k1jQ7m0l1n1M4RK1l0L7J2K5q8j1M0l4O7o7mJ4M5r7N3
$$ -78 23 6 -51 -96 25 -38 0 -21 -22 65 25 -6 -57 -13 -4 17 -13 24 36 61 -27 -38 2 -32 35 -32 -36 -22 23 -74 -21
2525b1J9L8l0l2J2N6j2j0Mk3%M1o1O5k0Rl0KM2m3P1j27PM7Q4j30M5j2k5K9%j6
$$ -21 -2 36 6 -26 -14 42 30 20 24 1 1 42 -19 46 26 35 5 7 49 6 77 -50 -43 4 88 -42 3 -9 -34 -5 -5 -21
2557b1J16j14k9O1M2j13L6j0OK6K8r0J23l6mnn4P0p2k4O1Pn3l2J28Oo3K2j8L1
$$ -21 95 -19 -48 13 55 -58 -22 -32 -26 0 28 -62 61 25 21 16 -38 32 -40 -64 -3 4 -49 -81 47 53 -10 12 -6 25
2587B5l5J4l0L7PJ1j7l1K5J1k0j2NM1j8j3M2Qm2m2j0R3r2N3nN5p3mL4Rj4mo0J16
$$ 25 -10 4 -26 11 18 29 12 -19 6 17 -3 -15 -10 31 13 0 42 50 8 -34 -44 49 -43 10 5 60 -13 -17 17 26 12 8 -52 64
2621F4n2k5N1p9M6Nkj2nk5Q0o7J7K0Pl6k0l1P3k2N0L5j24N7%k0rK0o5J28NK5p9
$$ 64 12 -13 38 -41 5 10 8 -4 -9 -34 46 -21 -4 16 23 -13 -33 -64 9 -13 37 72 -52 5 5 -15 -24 -4 -69 59 64 89 10
2654A0jp7J00j6l5K3on1O2m4L8k7pL8oRq8Q3K2K0n5KJ0L4o7K1ro6L5J03p6j4O2
$$ 10 9 -68 32 16 -19 4 -2 -53 9 -35 3 -24 -31 7 1 10 -78 5 27 47 -8 -6 4 38 -29 -8 -17 -83 -48 55 -21 -35 27
2687B7Kl3J5l8l7P6j4j7O4Pj4J1n1K0L5r7kJ50p6km4RP2q8rQM1q1Q5k0N8r2O7
$$ 27 29 -4 11 -27 -64 12 -2 -19 45 52 38 49 -2 18 53 -44 -46 104 28 26 -18 -9 63 -25 -34 -26 15 -66 19 -1 57 -35 32
2720C2nr4L0K3RJ9n5O3L1m7mj5L9k9K4l4L3J7o4K8O1q8kM0Lm7j6K2N2m0J5QQJ2
$$ 32 27 -67 -37 -14 -5 14 -41 22 53 6 2 -13 26 -3 21 -13 20 37 -27 1 62 -26 -28 12 15 -32 -48 -26 26 -14 1 9 17 29
2754B9ml4j7L1M1j6rm0O1n5K3J5o2L5pk0J16q4olk4L5K4m2l5N0L5m0nk7L6Q8o8
$$ 29 25 -9 -26 5 46 30 21 -19 42 -13 10 25 -37 -2 -9 -29 87 3 -3 -6 -30 5 29 -13 -48 2 37 -3 -8 -35 1 89 21
2787B1m3J5j7M3K3q5N4l2MJ4J9j1K9n6K8k2O2o5l6J08q1K8P1p0K3k5l8k4J07j8
$$ 21 -22 -7 -24 19 42 -43 11 -21 -17 -3 16 5 34 -22 6 -16 46 -19 -55 53 -28 0 71 1 24 -1 -39 -63 44 26
2817B6j09J09l5M9o5LK6l2M5J4j5j5Qk5L9o2N5o3K2O7q0K2j4N9Kn3j7L1jK9J1
$$ 26 -83 26 -9 40 -25 -22 4 -28 17 31 16 1 9 -16 23 -39 16 -47 -25 42 -38 -16 -30 29 31 -22 -39 -8 -9 20 31
2848C1K2p6k9M9J1Q%q9Q8k1K0j9K8l6m%kj2K4QQJ5k1L7m2L9o3K0M8J2p1P0Nm7
$$ 31 53 -23 -52 -3 8 16 16 -73 15 -6 14 -5 23 -13 -17 -17 -19 -31 -7 1 9 24 3 40 -2 37 -26 -6 42 54 -17 53 58 11
2882A1L9k7j2N0k4n8j6J07m8j7l7L2pkJ1l2L6j7NNNQQQn2M4m1k4O8M6r8LK4K7
$$ 11 50 23 11 61 37 -21 -37 70 22 5 -32 0 -7 -9 2 -30 6 -11 -6 -1 4 12 20 28 -24 20 -21 -45 23 69 -29 -26 -2 25
2916B5l3K9JM1m3q3J5O9j2K6Ol6m4ljJ1O9k4Rm3j0RK2%mrQ9m2p3P7m5L9K5k0k2
$$ 25 -8 21 22 63 20 -63 -48 21 9 35 41 5 -39 -42 -43 -32 37 13 22 -21 -31 -22 0 0 -4 -13 76 34 -39 38 -7 32 57 37 15
2951A5k9N6j3n8L6j3Mj4lK9NQL4n6o2N4k0K8N3o4P0j8j26J13J6l4Pm3K9l6O6k5
$$ 15 -14 42 29 -29 7 -6 -2 -16 -19 10 15 23 57 1 -61 -7 -27 1 54 -10 60 42 -84 29 45 11 18 -25 4 -32 34 9
2983Ijj4n1M2K8n0R7qo3L3nk7J7M2p5N9Mj2j0l5M1k4p9P0K2k4PM2j00J4Q7qo3
$$ 9 8 -6 -57 -15 13 -37 60 52 -11 22 17 -10 7 49 -26 33 37 25 15 -20 21 -3 -82 -12 10 -14 -7 35 -65 -51 36 28 -35
3016c5J3L8l6N1q1P3Kn3R3p2L8l3Lj1J0K7l9jRK5qKm2%K9rN2Momk1k8P7o0mjJ9
$$ -35 -22 16 -20 31 -50 23 25 -28 65 -7 31 -2 1 -10 0 27 -12 -13 -4 21 13 15 -27 -27 2 -7 45 49 43 39 18 -10 67 7 3 2 21
3053B1l0J1K0j0k6L0o5P0L5q2K5J6M8n6m9K2O3o1J9L5j17Q5J9J5j6pk8M6l9l2
$$ 21 -9 2 22 12 -14 16 -49 21 56 -26 -1 15 63 7 -42 -20 43 -18 1 36 -81 4 23 38 22 15 -13 33 -6 -38
3083c8O2l6lN1K9p7ok2K2j8N7m8k2R9o3j6M9nmk7M8q8O3M5m2J5rk2L3n7KJJ2O4
$$ -38 24 -12 -15 36 65 -12 -18 -40 -18 -36 21 -27 -49 50 -13 -29 20 15 11 -16 32 -56 7 52 10 25 16 -6 27 -30 -28 -27 -15 49
3117D9r7k5J03j0n0PQ3p9O8n4J6n0M8L0m2q5M7N7Ool5M2k8n4O6qqK6k3M3jk7n4
$$ 49 -48 -73 30 20 -30 -23 60 -19 49 -5 11 -39 9 39 -3 -88 -41 16 22 16 -19 23 -5 -59 7 -1 -9 17 -6 37 36 9 -45
3150d5kO0j5J7l1L1Rn3J9M1l0OL8j9K1j00J28r3L1Nl2r7J43jO3j40N9mJ0N2l8
$$ -45 -47 13 -2 15 -16 15 24 -29 -10 31 1 7 45 26 47 -53 75 -18 13 18 -14 -111 32 31 94 -46 13 9 19 71 33
3181C3l7K1M2l0m6QqK0Qk8K5k1L3J1L3l6k0LJ4J1m7j2L0n5L6l3L6M0l1j4kj2K5
$$ 33 -4 17 59 29 -17 -9 -17 3 11 -17 8 -13 20 31 64 28 8 11 25 36 -11 -23 7 -48 -12 -45 -9 31 0 -14 -16 -28 -3
3214cJ5%J7L4o9J00j24L3m2P1m8nM6m8L9j9M0q0K9K4k6j8MM0l0M4o0qK3K6J7o3
$$ -3 12 12 29 63 -6 94 -30 3 -39 32 -16 -21 25 -23 16 -3 37 -43 -14 10 -16 -34 -30 10 -20 24 -36 -44 -21 5 22 -41
3246d1L8%J3K8o5M7l6M5n1K1n3N0K2k3nO3p7L2m6O5k5k8K3J2J9RLj5k3L7l9JK6
$$ -41 -3 -3 10 38 -27 20 -16 29 -22 -1 -54 -4 18 -5 -10 53 -24 8 -38 27 2 -26 -3 9 28 37 40 25 2 39 0 1 27
3279B7Nj6o2Q9p9K0N5p3J7J11j07l8P7m4K3K9n1j5jJ2ol5J7P0pj9NRk0kj0L3J1
$$ 27 32 16 -46 43 -36 -16 39 -34 -17 94 -13 -51 26 -18 5 34 -17 -32 -33 -21 -27 -62 -45 25 18 -1 4 13 -7 -9 -19 14 25
3312B5p0k9J00l0k1O1r9O2l5L6o8J4M4l9R4p3M9o5L4O9p7N5j4j3k1qR4j61Q6%
$$ 25 -45 -74 26 -4 -25 36 -63 -1 -36 0 -68 -54 -10 -49 45 -28 21 -44 -10 59 -18 37 23 10 -11 -19 75 -86 0 0
3342@J3J9j5n6LP5k3k5K4p6O6J5k5R6o6oj0j4L9n1K3M7n5J8m0J6lO6o3j8nK7N3
$$ 0 13 32 17 -39 -36 39 16 -9 15 -61 5 20 -5 91 25 19 9 -5 34 -17 6 53 -2 16 -24 -8 -11 55 -8 -26 -31 -4 49
3375D9l5O4j53M0L2M9q6J3N3Jj5m7K3N4l7j8oN6l1k3L1J4nj5L7l8l3M2m4j3K4
$$ 49 14 78 -75 -35 -3 46 -40 -27 26 27 12 -35 -12 42 5 -13 -19 37 6 -17 14 28 23 8 45 7 -26 16 -28 -41 -17
3406a7L9L4q6J3N1k0k3M5l5k3M2k7J4n9nL1l5J0N6j0l9j7M3J2n0rM0N7q0N0j0
$$ -17 22 56 -30 -17 34 14 -9 36 1 -22 20 -7 7 -52 -57 -26 -61 -51 5 -5 -44 -61 -18 -6 -56 -65 -25 32 -48 2 -8
3437hOj4L9k8Lk4L4o6L1Q1o2qL4k8l3J11k2m3l7P0J0o7J9m5LN3p1K6%KK1O0o8
$$ -8 -2 -16 23 -5 -2 -26 8 -58 -27 54 -8 -16 18 -10 -43 68 46 3 -34 36 46 -21 -2 -47 -44 9 -62 -36 -36 -34 -13 47 -21
3470b1Q1p9J8jJ2j0N9q3J3K0j8L4n3N3j3k0J2j6M3j01O1p0Q5J3%k1p2J19m3L5
$$ -21 60 -19 -1 -2 10 0 59 -24 -11 9 -9 25 -28 25 12 -8 4 -12 31 -70 -9 -79 6 19 19 -2 -74 45 2 37
3500C7m4Lk6KM3L8k8n6M5L3k0j3L6m4j5l0K5L9l1j5J1J1j9L7o4R6r2K2k4O7L4
$$ 37 -7 -4 -30 -28 15 53 25 -31 14 47 27 14 50 6 -9 -39 -14 25 -6 -21 -10 1 -18 19 -45 51 -41 -19 -43 24 58
3531E8k1J9j22Q0n6Nj3L2l0O5K1J7n6Rk6m5J2R4j7q5M1r%J3L0m2J0K2mpj1J4N0
$$ 58 37 56 -66 14 -42 -37 -50 -18 -48 17 38 55 -1 8 -18 -63 -51 43 26 -59 -18 -27 -27 -14 16 -26 -16 6 2 -5 -16 -2 48
3564D8n9Q2j05kK5K0l4M3j2Jl0J0P7n8O8K4j55N2j8M0m9L3k2k0K1N1n5%N2n3L4
$$ 48 -11 71 -34 -36 -11 9 -25 18 6 7 -23 -13 64 6 74 98 -57 -5 -23 17 -32 1 -21 -41 -20 31 -24 -24 28 -25 9
3595IL7m5J4k3K4j3Oj9L4l1rkL8J5l7J0j4J9m7N5nk1J0lpJ7l4ml3R0m2m8M9m8
$$ 9 46 1 15 -8 16 3 9 -10 24 -7 -16 -18 20 35 -2 8 -6 13 -34 21 16 -5 5 2 -5 12 -22 -26 -59 31 -11 -59 -10 -58
3629e8L5P3n8k9Q0o4L2Rj9K9o4Oj5N1oK5k9K1mJ3ml9n7J9M7L4m3L2K5m0O8j22
$$ -58 -23 50 -8 -37 43 -21 11 20 1 30 -34 -28 -43 8 2 27 -2 19 15 28 24 -15 -72 -53 -6 28 -15 17 42 2 70 -52
3661e2N7K8l2j7K9K8m9N3j29J00pLP4p0q7R0Qn7J4O5n8l9P7j01N8Ql0J12m8pk2
$$ -52 5 33 1 -16 13 41 -8 45 -84 16 9 12 86 16 -71 19 27 -30 -16 49 -9 -48 29 -72 -14 -6 -36 76 28 21 -1
3692am8J6O1J6l4j9l2O4l5n3L2K7rk8P9n1QNk4l2MO3l0pL6o3N1rL4n3J2M2m1j9
$$ -1 -49 -33 28 44 10 -9 -41 23 -12 -65 -33 -6 -15 -43 36 -15 -7 -2 -26 -58 -54 9 -21 -28 8 -55 -4 -13 21 -32 -20 22 -19 -38
3726c8RK1N7j03K9K2m5N5r0P4L8J0jo2Mj4N5l7O1o7j6L2o2M8l2O8k4Oo9M7L5p7
$$ -38 -29 -8 49 -54 -25 -3 -48 7 -83 -9 29 39 38 -24 -20 -34 21 -16 45 -22 -38 -6 -68 -20 -52 16 -8 -2 -71 -24 11 -66
3758f6J03m3jj9k1N9Op2M9j3Qj2j8J9j4J9K6l3j1J02p5l4mO0J7l2P2p4k4%KM0
$$ -66 37 -6 -7 -26 -47 12 18 -54 -5 -18 -10 -22 -40 -21 -35 -16 10 -23 -34 68 -7 -41 -45 15 32 0 72 -2 -26 -26 -24 16
3790A6l1M2j02J13l9nj8J0O0j0m0l0J3%M7M9m3k3k4k2j5R3q7P0on8OK9jMJ3N5
$$ 16 -15 27 -75 38 -1 -6 -24 -14 46 36 -4 -34 -21 -21 26 75 32 9 -15 -37 -52 41 -46 24 18 -40 -34 -5 -6 -2 11 66
3822F6q9q9Q1Lj7LJ6m2j1L0M9L4m9K0m7N0m6J7j7J2jN8n1K6K5%n9%N8l7K8j3J2
$$ 66 -23 -112 -31 -28 -45 -42 -26 -68 -79 -49 0 34 -15 5 -42 8 -38 -21 -38 -26 -27 31 -20 6 31 31 -28 -28 30 -7 21 8 20
3855B0J1k7m9N8M6j08N8k8K2N0p0O6m4K6n3mQO0k9j2k5K4j0J0J2k8k1L2J1K0J2
$$ 20 31 4 -45 13 59 -49 9 -19 3 53 -17 49 5 31 -22 -26 -18 42 13 1 -24 0 -10 0 12 -16 -37 -5 6 26 38
3886C8n4j8M3m3J9RO9k5m9P5k9o6K1P8r5OORJ8n6K2k0N4M7r3j4nO7j1MJ3KoL8
$$ 38 -16 -34 9 -34 -15 -6 63 38 -11 64 35 -31 -10 68 -27 -21 -15 -6 12 -44 -22 -42 12 59 -34 -48 -53 14 3 7 20 22 16 54
3920E4j04K4M8N5j17R3j67J44n9M2j8K4p8K3L6oJ3k6K8n3L3LL3m4N2l0Ok8OM3
$$ 54 -50 -26 22 77 -40 53 -114 30 -29 13 -5 19 -59 -36 0 -6 7 -19 9 -44 -11 -8 25 -19 33 3 9 -19 -13 30
3950C0k5m5J6L1M3n7J8l3M4nPm2Rn5P2L6N2q4l5J2N4o7Pl4L4MM3M4m5m5j1P5j5
$$ 30 5 -40 -24 7 50 -7 11 -22 22 17 24 -18 -9 -64 8 44 96 12 -23 -11 43 -24 -17 -51 -17 -13 30 74 29 -16 -27 48 33
3983C3j4q5O8o5M2k6P7jl2L7r8R4q5K7J2j9J4jj2N4m4L9k2K8n8K8J6N7n9m5M2
$$ 33 19 -66 2 -63 -21 -47 30 29 -3 34 -64 30 -55 -28 -16 -35 -21 -22 -34 20 -24 15 -7 21 -37 -9 7 64 5 -40 2
4014BNj5M7m6M8n1K9j8k7L1k0L4p5N5N7m5l6j8Q8J0j36J04Mj6J9Qm2K9k5J3n3
$$ 2 7 -8 39 -7 41 -10 19 1 -26 5 -15 19 -56 -1 56 11 -25 -43 45 55 -81 23 27 11 30 38 -4 25 0 13 -40
4045d0K3N1PQk4Nm9K9l7L7K4o8N1mJ3J0m3Pn5oR5p0K5j1O0J3p1O4o3L7l6k2M8
$$ -40 -17 34 41 49 25 30 -19 10 -27 10 34 -34 17 13 26 36 -7 0 -55 -61 34 -36 -11 -22 38 51 -20 44 -19 18 -18 -40 8
4078HM6j9k6ml9M5k5J4MK2l0NJL1o3K4k%Rp2O5Mj7J9O2n8kPO8m7Jq3N3p%J0j4
$$ 8 54 35 9 5 -34 11 -14 0 4 26 -4 1 2 33 -30 -6 -8 -8 1 -71 -6 -2 -19 0 62 4 2 9 77 30 31 -52 1 -6 -6 4 -10
4115a0M1m5J0N4p8lJ6L2m3NOO3m6p7N2M0M2k5m6J9k7K5K0m4J4K9n0OJ6k1Q2j46
$$ -10 31 -14 -4 50 -28 -31 -15 17 -26 -21 -15 48 2 -75 -23 17 59 34 -12 7 -20 5 25 -19 -5 24 -26 -20 -4 -25 57 -89
4147h9P6J0N8j3n6jqJ3rl0k1J16J7p1J2k6l2J03q2j5O5n6M8m7kM0K3jPl9L0m8
$$ -89 -13 -3 55 42 -14 -15 -23 -10 -19 -49 -70 46 63 -8 4 -22 -54 49 -33 -48 17 -39 9 -38 -40 0 23 22 29 -10 20 -28
4179b8O8jJ7j05J6j7N6m6O5J4j24Q7m1M0K8r3P3m0j5Q0j5rj8J7j2K5l0J1n9M5
$$ -28 40 39 56 -49 -33 -50 6 -40 25 39 -85 2 -39 1 29 -64 9 -31 -46 34 19 10 -8 9 -3 22 -8 3 -56 -11
4209a1L3j8o5O3L2n3K3L5n4L7k8JO1l8n0Rm0J12m2l3K9J3k9J9L7m9k1M8k7J1L3
$$ -11 22 4 -61 2 34 -19 4 39 -15 22 -6 -5 56 18 -32 -23 -63 49 7 -26 3 16 -13 6 43 -6 -27 21 -6 5 38
4240C8k3K3qk1k7j0N4j8J1m2O8q6M2Nk1K8L8p0M6k8%K0n8Q4J0J8p6l0l1J00m0
$$ 38 15 38 30 9 -18 -28 26 8 19 -23 45 -41 1 6 -15 13 51 -19 27 -1 -1 19 -39 45 55 73 -3 -33 -64 36 -4
4271dmlo8P1l0QK0NN0lk8n9M0m7L5L2p4L3N2J9r2j0M4km7J7M1l8N5KJ4Pq0P2n5
$$ -4 -8 -11 -79 -8 -38 -30 -10 -5 45 42 14 -45 -5 -52 -17 15 -59 -26 26 45 -47 -57 -13 -15 -62 -45 -4 -42 13 15 29 36 -44 28 -27
4306b7O6l3J0K4p2k4P6K9p2K0k5M6j9k2J11r4L5p2M6M7p5L7J4l2nJ2PL0l3mQP
$$ -27 39 6 16 40 -32 -56 20 49 -23 -3 -28 18 -1 -23 88 -6 29 -43 3 50 -25 12 26 -6 -11 1 8 38 5 1 9 16
4338A6PQp1P2p1N9J6n2K6J4n4O7o6rO8q2J30o4Rl7M9k4n9J5M3j5J2Km7L0K8j8
$$ 16 23 31 -40 32 -39 20 36 -16 10 24 -30 37 -29 -38 30 -52 78 14 23 -14 35 11 -48 -33 10 -5 7 9 -38 -8 20 2
4370Bmn7M4K7J9m2M6j05R3k8k0K6k6K8n4Q4m2RK2j7RJ8Ro3Jj9J6L1k3K0m4l1K0
$$ 2 -2 -59 -15 12 31 -11 35 -70 23 -5 -25 1 -25 3 -51 33 -9 0 22 5 14 32 41 -22 -21 -40 -24 7 -16 4 -40 -71 -51
4403e1Q0m4k4Q2o5L0j4Ml1O6l0K9m4M9o8J02j3m3m2QL8l6j4L4K0l7J1k4O1j8P
$$ -51 29 -15 -39 43 -22 8 -6 -2 -33 33 3 32 -12 37 -31 71 58 15 -27 -19 19 -17 -31 3 23 -14 -3 -27 34 16 23
4434B3J0q0P4m9Nl7L1J8p4L9M2O7q1l4L9k5O9p4K8j7j4K1NK1m9M4j8j4J3M4k4
$$ 23 33 -47 27 -22 -17 -54 -23 -5 -79 -40 2 69 -12 -46 -7 -32 37 -37 -9 -26 -40 -19 -14 7 -42 2 -16 -30 -17 27 3
4465Cmj9K4l8N9l6l3L6J6m0K0mM5J3o9Q7q6L7L0k3m8p4O2P2om9Q4l8N2q9J8O7
$$ 3 -1 -20 4 -34 25 -11 -44 -8 8 -32 -12 -16 29 42 -27 60 -26 11 41 18 -30 -104 -42 30 24 -25 59 21 73 -16 2 69
4497F9o3q5Q8n4Q8m5k5k3M2l5R1o7RJ4k2qO5k1l0l1O4k7kLML1l1PJ2j8J7J6j9
$$ 69 6 -79 9 -45 43 -2 -27 -50 -8 -43 48 -19 -10 4 -18 -26 39 18 -12 -43 21 -6 -8 -5 -1 30 -1 6 18 0 17 33 14
4530A4K2p3O4k9J0k6K2N0j30J03o5M7l3O2mm5Rjl9Q2Km7k8L2K9j17J08p0R2K8
$$ 14 36 -37 27 -2 8 -18 4 54 -76 27 -38 9 -24 38 34 -11 -2 -3 -42 40 42 -5 -33 -1 28 -89 19 -51 41 69
4560F9l8rmo4Q4n7K9m1K7kl4N0rj4M2m4Klj8lL5N4n9Qk0O0o5J07j28O8M4q4M8
$$ 69 31 22 18 -46 38 -19 10 -31 -4 -6 -40 10 1 -13 29 -15 -13 -16 -34 -37 -2 52 -7 1 -19 41 -24 83 -45 23 67 -17 31
4593C1l0lNRm2K0k0Qj2l7J01p1L6l5P3l6n7Q8k8L5p3J1j8L9k4NK7J0J4rk6l9P9
$$ 31 1 -2 3 12 -30 -10 -30 -22 -34 -71 30 -41 -5 -40 33 -3 -60 28 0 35 -38 -27 -45 -6 -30 -25 2 12 26 17 -9 -48 31
4626C1L4m3l1L8k3k0Q2n0j4N9j2o5qpK9mRK1j7qlLj2J1lM6n5J3NoM8q5P3Pp5L6
$$ 31 65 22 -9 29 6 -14 68 18 4 63 51 -14 -22 -29 0 -4 5 26 9 1 -2 1 -11 0 -3 43 -12 1 6 0 48 -37 36 43 -32 4
4662DK1r7N0l4M5P3p5omoK2j0K2rL3q1R6l5K7J1m7jN2l3MNKm2K5J9o2QL9l4l6
$$ 4 25 -72 -22 -56 -11 62 -13 -19 -23 -29 -7 -17 5 -4 29 -52 44 9 36 47 0 -1 51 18 22 27 29 -13 12 31 -31 -23 16 -18 -54
4697e4L8N%L3M3j45J09K7n7K2j5jL9q2N8%pO2j13qL2l2M5J4p5O5Om4N3l8K6QL0
$$ -54 -16 -11 -11 22 65 -80 29 56 -1 21 6 5 44 -38 20 20 13 75 -38 -46 -14 -46 -1 13 -62 3 9 -35 18 -20 6 14 44
4730D4n0J1kNl3N3K4n7pK6K0k3M3m7j8L6n8P9%l9j8J6n8Q9m8n7J33j26J9J1J3
$$ 44 -6 5 3 8 -25 28 52 -5 -12 14 34 11 54 7 -11 25 -33 46 46 7 -11 5 -53 36 -12 -69 64 -62 -43 -32 -19
4761a9jK5Rl6Oj7Q8m7J0l4J3o5R3k8l1K5l2jN0n1O8qJ6m3L1o2L3L5k5J6l9K0M
$$ -19 -20 5 14 -22 -16 -33 55 8 18 -16 -3 -68 25 -3 -34 -9 -41 -42 8 -43 25 17 33 -10 21 -41 -8 27 2 18 -21 -1 3
4794CJ7k0J6k2N8o3K1j1K2l9k8M4k0L3Ko0J08q9K6L2q1L7P0o1l1P5%ol6Mn3P6
$$ 3 20 0 16 -6 52 -11 10 -1 21 -18 -46 -2 -22 11 13 -47 61 -28 -2 30 -51 -14 56 -5 -36 39 39 33 -3 1 -52 24
4826B4Mk9J4P9j32M4L4n5l5N6L2m3R2j14Q2r7J4n5N7K1j0QJ3l0O0m2n3L5J7mL8
$$ 24 28 -1 13 92 -40 4 38 -17 -52 4 36 -7 85 -29 53 -44 -30 -85 -28 -7 -17 -9 4 -26 34 -8 -61 -26 -9 -13 25
4857B5o3N3J6l5L4Lo6J6K1m8J02m6J1n4j9P3l3J4j9NJ7j2j3L1l0OO7j29J13n6
$$ 25 -38 15 31 -4 30 33 -33 -17 4 -44 58 12 23 -31 -50 23 -10 4 -15 -10 7 -5 -18 13 -17 -11 56 -73 40 -16
4887a6J0o3P9k9k0M7M1o4J4m6N4R1j95J17m1L9j06J24Nj9m9J9L6k0j5K8Qm9Q9
$$ -16 -6 -69 10 -19 -39 8 49 -15 -1 -47 7 98 -97 20 -21 18 -88 36 41 22 -27 -8 28 8 -7 21 29 -20 69
4916F9n6J4k4nppL2l7jPN2k3l6N0mn6P8n0L0k1rJ5L8o9j7N8%n0k9J18m3K4n7N0
$$ 69 13 27 3 -2 -9 -16 16 -21 -22 -15 37 14 -22 28 24 -32 46 -4 26 5 -4 11 49 -20 -37 21 21 -29 -58 60 17 41 -16 34
4950C4k0lOp4Q9l0l5O2qm4J1Rjk2kL4qKJ6om9N3j1o3M0K1L8n0K1rl6L8j8K9k7
$$ 34 14 11 17 -57 32 2 -33 29 21 -23 -12 -3 -4 -26 -28 6 -2 0 16 10 -39 14 3 -60 -20 1 39 -11 10 1 -35 3 -15 14 -13
4985a3L8ll2j8L5qj5N8j19O7O9p2N0p8l1J10pOk2k4JK5n9O5l0L0o6L6K8j7N4m0
$$ -13 25 22 -10 -28 7 -1 -16 42 -77 -10 59 -13 37 -41 -72 38 31 37 15 -9 -8 17 -42 23 -7 23 -43 -7 21 4 58 18
5017A8m5k9R0q7L8j9L3Oqk6L9j8k0RK0Lj6m0K8P0k5n0M5l0j4N6o8O4p2P6J1k4
$$ 18 -27 -56 34 -53 -15 -34 -1 5 -3 -29 10 -8 -28 -19 1 4 -12 -52 -24 46 21 -29 16 -14 -28 28 -40 24 -48 28 39 15
5049A5L6l3M1j09O4pn3O3k0Jl9L2J3L6n1oR1q3J9j2j1K1j4J6l6L1LQq3J07l6J2
$$ 15 51 18 59 -50 14 7 -46 17 -3 -2 -41 -9 4 40 -11 -17 74 -9 10 -2 -13 8 -6 10 -26 5 8 16 -67 40 4 16
5081A6n4N2J7m1p3J21m1LJ4j5l7L5l5N1N4l6K2o0j8L0l4LJ19j00N6o5m7J02k7
$$ 16 -38 14 31 -10 -83 38 -3 0 14 -1 -38 -3 -38 13 67 31 53 -7 -25 5 -29 -26 93 -7 49 -16 -63 39 12
5110A2j1L1l9K4j6n9L8O2q7O3K7m5m1M3K3j2p3J2P9j3p0O8J1jo1L2k8K8K9J9O
$$ 12 1 32 -7 17 1 -58 -20 42 -45 18 45 0 -41 2 25 13 -60 -48 31 18 -52 16 27 26 -35 -3 -31 -3 26 45 51
5141E1j02P3m2Q7q5N5n5M6oj4Ok3Q0r9O3o5O9m8m2P1k8L4j2l1m2J14j5%oN2j33
$$ 51 -51 22 -20 67 -18 37 -18 28 22 8 14 -9 71 -28 35 -30 39 -9 -51 20 -8 26 14 -17 -59 55 40 40 34 86 -47
5172d7L4JM6p3N2p9O8p4O2O2o7k7L8pL7o9N2M8o6j3k0N1KM1n4J7K9m2L8j9Pk4
$$ -47 -13 -12 34 -39 13 -66 2 -72 -10 52 -15 -42 -4 -11 26 -43 9 57 -9 -22 -42 9 11 52 -2 15 44 2 40 21 28 4
5204DnJ5n3j1M0k2K4L7l1l0J7j4M6Lj5J4m9M7ql2M7K5q5K1PJ7l1L2n8JQOM9rJ2
$$ 4 -1 14 -39 -50 -10 -32 -8 29 -2 -32 -15 -29 17 20 5 19 -30 17 9 -23 24 49 -36 -15 -8 9 -22 10 -48 -47 -39 -33 16 7 19
5239A9q3K1Q5k7n6J04J8n7k1L7l8k6k4K1R8r2N9l0m4kM4j4l3N4j8m0l7J05p0O6
$$ 19 -64 -43 42 15 -41 63 81 24 3 40 2 -24 -48 -27 71 -21 38 8 -36 -38 6 -8 -41 13 -5 -45 -82 23 -47 19
5269A9oK3j56P4P4n9J2Q3q4QP8o1K7Ql0l5rM6J7q4N2K1o3lM4K4j8pl5N3j3k3%
$$ 19 13 36 -120 -46 28 -31 -19 64 -20 -12 66 5 32 40 10 -25 -34 12 29 -55 -3 18 -45 -48 -4 20 2 -5 -40 13 0 -23 -23
5302b3O0q9M3K1o8Q9J7o4n7J18n3J7K8p7j3P9Rl7m4O4M7n1k3j1KN1k7M9l1nm1
$$ -23 37 -52 -9 12 -56 33 50 -14 -71 47 -6 11 39 -38 -51 28 37 0 -44 20 67 16 -7 -18 -16 35 8 57 26 21 -20
5333b0K7j1J6j4nnN5oq3M8L0m3P6q3j4LL8p0M2qN9Mj9q0J8J0L5Q1j7j6k5j4m3
$$ -20 7 -4 12 -2 -7 -12 43 37 -46 2 32 -11 65 -18 -32 -29 9 -61 -19 -27 32 36 17 -63 -45 -35 0 81 64 48 23 9 -34
5366c4J0N3l6K5j0m8K5K5Mm8J6M9k5o1J06p8jJ3R0n9nqN9q0oN2l3M0o2K8j2L1
$$ -34 -24 29 -7 18 8 -40 -15 10 14 -34 -18 31 6 -55 51 -27 -28 -15 75 16 11 3 62 -18 -24 28 -5 35 -27 1 -11 20
5398B0Ol6N1q7jL6J5K3p4O6l2m7J06j20R3jk2m3PL4M4m3J6ok8L9pm2N0J7q9K4
$$ 20 26 -10 41 -46 -47 -11 4 27 -47 19 -13 -60 46 -74 19 18 -4 -47 -40 -6 38 -5 11 5 -23 16 9 -33 17 34 -55 -31
5430c1NJ7R3p0p5M3l3KK6N6k2Kj7k1M7p9K7L1L5m0l7J6M5M3n1J2j6J6l5nNQ1q7
$$ -31 -26 -9 84 14 -61 -18 -51 -49 -23 33 11 13 -4 -25 22 -57 -30 1 36 -4 -41 -25 20 63 12 24 8 24 -11 -16 -11 70 -17
5463a7mO0l9k6PL5k8k5J01l8l0J3K2j4mm1R8p8M4q3OQ1o9K1LJ8p3R4k2j5J7QL0
$$ -17 -21 39 0 -26 -19 16 -12 -37 64 26 -4 9 31 17 13 -28 70 -8 36 -47 -41 40 -29 -8 -5 13 -60 34 12 -3 14 22 52
5496E2m3L5n0pK3j7jl9MO4j7l2O0n0O3j0jj8ko5k1J9J02m1k2j7L2m5N0m9O0n4
$$ 52 9 44 -6 -13 10 -7 -8 -47 -43 21 4 -28 32 -18 45 35 34 16 14 -51 -72 -53 49 8 -14 -31 1 -44 6 -43 17 -37
5528c7M1j4Ql7M5k4J1K3Ml3J9Qm1OL9n3O0%k0kkMn0R2Om1l8M1j7qk1K0nqk2M9
$$ -37 4 -10 -2 -39 6 -18 -7 16 20 -13 6 14 -27 -21 18 -35 25 25 5 3 1 5 -45 47 53 12 -26 15 -2 -10 -31 -11 -16 -24 -46 3
5564CM5j8Jl1K0nl2L1n1K1QK1j4J5j8M4k6k3j3N8p3L7Mj7J3mo1J03k6n9O9m8L5
$$ 3 48 30 31 0 20 15 -17 14 -37 -16 -8 13 -1 14 -4 40 14 -9 -22 36 -37 0 4 -13 0 -4 -65 38 12 -47 22 -26 9
5597IM4p4l1L2J8j3N9j1o9K8O9j04O1k7Q3j12J0J11l8n3l8M6K2l4pK6Mn3j2M7
$$ 9 53 -21 -52 -20 -2 -15 44 33 -36 -8 61 -43 18 -9 74 -38 -28 83 45 -8 -46 0 22 -12 -19 7 11 -42 -54 -7
5627gJ2J5L6l2r5P8k8M3J5o6jM0k0pKL9or4L7J5PO4q0N1k1l8k1Q0o5O4k2M7k7
$$ -7 5 20 56 24 -71 7 -21 22 37 -29 -30 10 -10 -17 -15 24 18 -76 -39 -24 -17 47 -33 18 -3 -41 -62 18 -47 17 -5 42 15
5660A5m3O3l6k0L6ql8J9K8J8p4M4l1M4pl9M7J7n4J8k6P2J1o2ppK0NO0J8m5r6m3
$$ 15 -28 35 -1 -21 15 7 -31 -12 16 34 -40 4 -27 17 10 -29 18 35 -19 -1 -27 45 56 -6 -13 -20 0 5 65 83 38 -58 -101
5693a01nR0J5ML5Jk1m1J6N3o6K8m1O5p8J8OL9k0L3m4l7J13o8j3N1q6O8L4nk3n8
$$ -101 -106 -16 -1 3 38 39 18 -23 -7 46 -20 8 -33 32 -46 -28 -22 17 -3 30 -14 -51 62 -6 -19 32 -54 14 48 43 20 -38
5725c8N4m0J3K2J1l0oJ8Qj0K8K4m8l4P7o2l2N6N0r2O5j4q5P5k5N9p0L6K8l1J8
$$ -38 16 -24 -11 11 22 -8 -14 4 12 2 30 54 6 -28 49 -13 -45 11 61 -31 34 20 -65 10 -15 44 -26 10 38 7 25
5756B5n2N8l1J7l3k9O9K8p7j8P8l2kk0M1k0j2N9p3M6m7O5m2k1N0m7M0k7Q1j7o0
$$ 25 -27 31 0 17 -16 -45 24 52 -25 -43 35 3 1 -19 22 2 -10 49 -24 22 -25 40 -2 -23 27 -20 20 -7 74 57 -3
5787cl5K3L7p1R1j3k3L4K2n5J3jO5m9J2p3M4KJ3m2RLOj1M5o9K4PL4l7nN9m6qL5
$$ -3 -38 -15 22 -49 42 29 6 40 62 7 20 19 84 35 47 -26 18 20 33 -9 0 3 9 -2 43 -26 -2 5 39 2 -3 56 10 2 37
5822C7J9q1J1K7Kj0k1j4L2JM0n8nK5Rk5j4PlJ2L3j8QL0l1j9jJ6J7Pk5P4k2l8m9
$$ 37 56 -25 -14 13 15 5 -16 -30 2 3 43 -15 -20 5 14 -11 -25 -18 -21 -9 24 6 14 44 13 -6 -7 9 26 33 8 82 60 22 -27
5857b7J0M9p3L0j0NO6q6Q9l4No0j0O9j2L6o0L7jm7J4M7m3Qjj6L0L3J1k3j2J9p8
$$ -27 -17 32 -41 -11 -21 -16 50 -36 53 19 24 -36 -46 23 11 47 -13 24 23 -24 -10 37 -6 2 1 -15 15 48 59 36 24 43 -35
5890c5N1j1rJ9l6N7l9P5n3j6N9m9L4k9k5k9N0Nk8N3p2pN8k6K3n3K4lJ4J9o6R9
$$ -35 16 5 -4 15 -21 36 -3 72 19 3 62 13 47 18 -7 -36 14 19 -9 44 -28 -35 23 -3 20 -33 -9 -12 2 21 -45 54
5922E4n7pJ4l3k1Q4l4m8J19q1%PK9k3o4M4l0qN8jK5kp6K6L8m7P8l7K7q1L4M6j
$$ 54 -3 -10 4 -29 -50 34 0 -48 71 -10 -10 -3 26 3 -61 -17 -47 -55 3 2 27 25 -51 -25 13 -34 44 7 34 -47 -13 33 32
5955C2L8o5Rl5O6k5j2J9jo7K1M8n2M3j8n7Q6m6L0LJ7n2j1M0QJ2j7m6M8j0m8O0
$$ 32 70 5 14 -21 45 20 8 27 26 -41 -20 28 -24 19 1 -56 30 -16 14 17 34 -18 -29 11 19 31 14 -32 16 6 -42 18
5987A8l1K8Ll3OPl1QK9n4L9K7j8j6P2p2J6k6J04p0j0O8j63Q3O0J6k5pj20O1K9
$$ 18 -13 15 18 -15 -9 -2 -33 -25 4 -50 -11 16 -2 -18 54 -18 -2 -28 76 6 -4 64 -99 -16 44 60 35 28 -92 -31 -2
6018bkkK9l8LMM4q4L4O1o0N0r3P2l9O9j34J6Q6k7RJ9qJ4pqqj7K8K1l2l5LL0K9
$$ -2 -4 -6 23 -15 -12 -8 36 -48 -14 47 -13 37 -56 16 -23 46 -88 -72 14 -13 -4 15 7 21 14 6 -2 -19 9 30 -2 -37 -34 -4 25
6053B5l8jP9p9Q5m5r4N4KOJ2K4o4pN7J9l9M7k0m2j9M7oJ6Jj1l5K1K9np3P4l6J3
$$ 25 -13 -14 65 -14 71 26 -68 -14 -12 -6 6 30 -34 -41 16 35 -4 43 23 -19 -38 9 3 19 20 9 -26 -5 24 19 -54 20 -16 -3
6087cK0lk2Lj2J1K6j5mj9k5L9kLL%K5Lj03P2j4L6j5k4Rj9J03q9J7JM5m7J3K6o3
$$ -3 17 14 -8 -5 -17 -6 20 5 1 -18 -43 -4 -6 -3 0 0 25 28 -75 -3 -17 19 4 -20 -11 -30 73 -16 1 2 47 0 13 39 -24
6122b4m2M8r0J33m4L9J3p7M6k2K4Rn4j6P7q5M9J2n9R0J8p9N7j7m7J03k8o1K0k
$$ -24 -66 -18 -108 25 -19 20 33 -44 2 -20 4 13 -41 -57 20 -65 -16 -4 -63 27 45 -34 23 6 -41 62 34 -27 -7 -9
6152ipj3M1j0l4mN5l3Nj7j3J8k6j4L4Q8p0Nk5qJ14p2qL0K4j5o7M8j9rkJM6M6j10
$$ -9 -16 -29 12 2 -32 -36 19 -14 -9 -26 -39 -21 -47 -61 -27 61 -9 -4 -29 -37 77 5 -3 27 51 36 -31 17 -2 -11 -13 -12 34 80 -30
6187c0L4OK5J5r4J09l4j5j5l6K2m7O0L6p2N1m5JO1Oj07P9j0NJ0k6m0R0n8On6L3
$$ -30 4 10 35 50 -44 65 31 16 1 -35 -13 -60 0 36 -36 15 -30 -29 32 38 -69 10 0 5 15 -11 -51 39 -19 -13 -69 -36
6219c6L2L8n8L3J3l9L0l4N3j0p1pK4J10o4k1J9j6K1K6J9p5K7L0j00P2k6n3J19
$$ -36 -4 34 -24 9 22 -17 13 -21 32 22 -49 -56 -32 78 14 -7 12 -4 17 43 62 -13 14 44 -56 16 -10 -63 56
6248E6m2o3K1k0k1O0O4p6k2L9oJ9J6o4P9m7j0K8L0OJ7p3l7L4LL0nM3j07J01q2
$$ 56 14 -49 -28 -48 -69 -9 55 -21 -43 -4 -10 9 25 -39 40 -7 -17 11 41 47 64 -9 -46 -12 -9 21 16 59 -48 53 -29
6279b9J03r1KJ2LnQM8r1K7oL1J8j03Q4L0j3K3n5j9M0MM0N5r6j1pM6k7rK4K2r6
$$ -29 74 -17 -15 -3 0 -5 3 51 -40 -13 -19 12 30 -73 11 41 28 51 -4 -23 17 21 61 116 20 9 2 48 21 12 36 58 -38
6312c8m6J18m8RmPpj0j8M6k8J0K3lm0L4l8K3l2L1K3l9QK7m7J1M4o4M8qrM0J2l5
$$ -38 -84 34 -14 -5 -9 -2 -9 -19 -37 9 -19 -9 14 11 -29 5 -33 -10 -42 -11 12 -27 -19 8 -39 -28 16 -48 0 -8 -17 23 35 0
6346@J7P%p9J06q1QN1Oj7j7j9kK9m0k2j6R2l2N4n0j0O5j2k2j6j3L0l3%k1L7rj0
$$ 0 17 24 24 -55 51 -30 -22 29 35 18 1 -18 -20 9 -31 -53 -69 23 -9 45 -5 -15 50 38 16 0 -13 17 -16 -16 -37 0 -9 -19
6380a9J1J0Pn0M0J1M0J9j51O4K9M5k0o1N6l5Nm4M1m0N6j8Oqm5ON4l2J3j5RPm6
$$ -19 -8 2 9 -41 -1 10 50 69 -82 -18 11 56 36 -25 31 -4 1 -43 -2 -42 14 -4 2 -6 -51 -45 9 -23 -10 -25 -16 -9 -55
6413e5M3M2j9L8o3j8P3n9J3k0J7L9Op2J1MjL3L7j01Q4n2L1l8K4Pk8j9JK2nKJ1
$$ -55 -12 30 11 49 -14 -32 41 -18 -5 -25 -8 31 37 -35 -24 -20 -21 12 49 -52 32 -20 11 -27 -3 4 -24 -43 -42 -20 -25 -23 -12
6446a2L5p9qK2MK3QJ8l9L8M8r1K8k3M4l0J7Ql9N2K5j8J2k3k0M8Nk6K0o4K3L4l5
$$ -12 23 -56 -64 -42 -38 -15 -7 11 -28 10 58 -33 -5 -28 16 -14 3 11 -28 24 49 31 43 20 0 48 53 27 47 -17 6 40 5
6479EK7r7M3M7l5n0P8K6m8n1J14j09Q5m4Qk9J9k6K9N5j20P7m8j0P2Jn6J5N9j10
$$ 5 32 -65 -22 25 -10 -60 18 44 -4 -55 59 -50 35 -9 -1 -30 -11 -37 -8 47 -73 4 -44 -54 18 19 -37 -22 37 -73
6509g3K7R2rj6N3j17K4J8K3Qk8KM7l8p0P4L9k1l0l5L7J1o4M7J4n7Q2q3J29q2j0
$$ -73 -46 46 37 21 74 -43 -19 -1 22 30 2 4 51 13 -57 17 56 35 5 -30 7 18 -46 1 15 -42 40 -43 86 4 -6
6540fMj6k1M8jnK9k9k8K6k8l8N7L8j19M2mN3L9o3jj1O2k6OJ5p3Q9m1l4M1j3N8
$$ -6 -2 -18 -39 9 8 3 32 3 -25 1 -27 -65 -8 30 -89 -47 -51 2 41 -22 -23 -34 28 2 8 23 -50 39 -2 -36 5 -8 50
6573E0k8l8J7k4JN3J6k5r7J08k1k9K3J5K8o1L4J2lm1N3l6j1kP5p6m1J21o0m6J8
$$ 50 22 -16 1 -23 -22 31 47 22 -75 33 12 -17 6 21 49 -12 22 34 31 -10 43 7 -4 -6 69 -7 -48 73 13 -33 -15
6604a5No8R3m3j3N9k5Oj1O8r5O0p5N6k7M0l0n3R4m7K9m1P1l3k6N4J6l9j0k6K9
$$ -15 -10 -78 15 -28 -41 18 -7 -1 -12 56 -39 21 -54 2 -25 15 -15 -68 26 -21 8 -33 38 5 -21 33 49 10 0 -26 3
6635Co5P9j1L8o9P7POr8K2J2%Lk3J5qQ0n5m3lj5N2K9k0k6Lk7KK2J4n7O9Pl4N9
$$ 3 -62 17 6 44 -25 52 59 65 -33 -11 1 1 4 -19 -4 -12 68 13 -30 -33 -48 4 33 13 -13 -10 -37 -35 -13 1 -56 13 20 -14 45
6670D5%m1pm6J7O2l1J9J6mn7J14j53k2J17J8m0j7N9o2M0m9N4Plj3Lj4m2N5k6l6
$$ 45 45 4 -3 -49 -32 30 -1 18 34 30 -27 87 -66 -88 29 47 7 -10 49 -13 27 -22 32 39 36 23 26 12 -30 25 -1 -37
6702c7K6pL2m5K3L6nK6PNqm7n1L9K4Mm5N4o9P3K2l4k0%k6M7L1n9ml6P4p2J7Rk4
$$ -37 -11 -18 14 -31 -8 28 23 49 56 61 53 6 -45 -6 18 22 -23 31 -38 35 57 23 3 3 -23 24 55 -4 -8 -44 30 -42 -25 -16 -40
6737d0J9M2L2o8M3p5MM1lN6o1M4p8QqK6K6L7k4j0l2k6O0J6pL7j5m2k1L2OL0o3
$$ -40 -21 21 53 -15 28 -47 -43 -2 -5 51 -10 34 -44 -36 -44 -18 8 45 21 11 -21 -47 13 29 22 59 44 2 -19 13 19 49 -14
6770a4%J9J1k5M7l1k1M0r1L3J1K9K9p6O1l7k6O9o4%O2q9R8m0j4mOJ5J0l6L0j6
$$ -14 -14 5 16 -9 38 7 -14 26 -65 -32 -21 8 37 -39 22 -15 -41 28 -36 -36 26 -63 35 -5 -19 -23 -17 -2 8 -28 2 -14
6802a4J5J8M9m4m5Q9j02J8M9o3L2J5Pl9L1j6l2M1pM2l6j4N5m0L3j0J4m5l9kO0
$$ -14 1 19 68 24 -21 68 -34 -16 33 -30 2 17 24 -15 16 0 -32 9 2 44 8 -6 49 9 42 32 46 1 -38 -40 20
6833B0j6Mp4L6PN4k6K3r5R3j9RNln1l3O3N2p2K0n8Q9o3JM8k7j5N3j2k6K5r5P0
$$ 20 4 8 -66 -30 -23 31 5 28 -67 26 7 16 21 18 -33 -66 -3 49 -23 -3 -61 28 -35 -34 14 -13 -28 25 13 -13 12 -83 -13
6866a3K5OK0M0j33Q1K1q4Q3j3J0r1L5n4rM5M9kJ5K8p0N3r0J6J8l3M4J2J8l7J4
$$ -13 12 18 38 78 -55 26 47 -37 46 33 43 -48 -13 -67 -76 -31 18 16 31 59 -11 42 -48 -32 -14 -47 -3 9 27 -10 4
6897Do4J11n4n2R9k3j4Np8M0K8rL4p0P6n6Kl6PJ00n6k1M9oJ4oj6k7Oj2K7P7q0
$$ 4 -60 51 -3 -55 44 21 7 12 -66 -26 2 -7 27 -43 33 -23 -21 -57 -50 50 -6 -27 22 16 30 24 8 -19 -13 -25 2 79 -1
6930aM0l4K5%l6L9nk9L4j28N7P3m8l9J03Rj15O5k3j4P6o1K8k4p5Q9Om4J3Mj8l2
$$ -1 39 5 30 30 -6 33 28 -1 33 -95 -38 35 -13 -52 51 60 -55 10 -13 -27 49 -12 16 -8 -83 6 12 -32 -19 -15 -33 -65
6962f5L7J5Ol5N7p8O7m4QnN5o0P3oj8M3m9k5o2R4l1M0PM3Oj2l8l6Q3j02%N9m0
$$ -65 -28 -13 -7 -42 15 -63 4 -40 -32 -37 18 -42 31 25 7 50 1 -24 -86 8 -23 17 24 67 73 61 23 -13 70 -32 -32 27 -13
6995a3l7R2j2J0m8m6M4mN2l7O4o0Ro5RJ1L9k1k5mK3rO3j3k9L7Kp1J04k8J0l3k7
$$ -13 -50 42 30 40 -8 -54 -10 -14 38 1 65 5 14 -51 -42 -31 8 -13 -38 -42 -19 -28 35 22 -7 30 32 -39 65 37 47 14 -13
7028a3l0ML5J07j32PK6ljl8O7nl4k6M8l1J1QPM0j01P4RKoL9o9Qj5K9L6p5n7RN0
$$ -13 -43 -39 -4 103 -29 -22 4 1 0 -38 29 24 -10 -36 12 -19 -8 0 7 47 -54 20 29 31 25 64 -5 3 -12 17 53 -22 -79 -70 -20
7063b0oK6j0M2q%n6m7Q2J2k5p4R3M9q6L4m2k4R9o0%R2n6KlJJ0l3o4N6M6ok7K4
$$ -20 -26 0 -10 32 24 24 -32 -79 3 15 -10 -84 9 58 -28 6 -36 -60 39 -21 -21 71 15 17 14 15 25 -8 -72 -16 30 24 -3 21
7097B1j9J8j1o0Q5K2Mn1P8j01m3O4k3J8j2rJ0J4j6Jm5K6L9o9K2M2m2L4L7o7m1
$$ 21 2 20 9 -51 34 56 60 9 87 -14 -57 7 -16 2 -10 -19 -9 5 -11 -10 -55 -29 10 -59 -37 5 -37 -3 34 -33 -74
7128g4J08m5j3L0k7J00q8qRK1m7Q2j09Q3J6n7NJ3J0l5LK2N6k4k5j5J3K5kkp6N2
$$ -74 34 -11 -24 6 -21 79 -9 -17 -8 13 -34 48 -61 22 38 -19 -14 -1 9 -26 -23 -1 55 31 6 -9 4 29 27 25 -51 1
7160Al3L3L2l6k6O1Kj01N2N3Pmj2JJ2r1N1o6L3K9P8j36P1knl2rJ6JK9J7J9m0l1
$$ 1 -32 1 33 -3 -29 32 34 -67 -15 38 45 41 29 30 42 -49 2 -64 -31 -2 76 -60 11 9 4 -28 -37 -21 -20 9 26 45 5 -26
7194b6N3j00O0O7l7nq0R9M3l7M8p6qoL4%j9j4l9L4K3k8p0J31m2j4j01P7K5J4J5
$$ -26 27 -73 -13 54 17 12 -68 31 74 37 85 9 1 -5 29 29 10 -4 -43 -9 14 -14 -84 47 5 -9 -110 -33 -8 6 21
7225B1j8l7M9L6o5K6%l8jP2o2J6oK9o0K2l9J06oq1P1n6J8OL0p7N0Q4q9k2O4lm8
$$ 21 3 -34 15 51 -14 12 12 -26 -27 45 -17 -1 -7 22 -38 -16 -55 51 45 -36 35 -21 -3 3 33 -44 6 90 1 -21 43 40 -8
7258hJ6p0N1J0mN6n2l3L9M5n0O0o7L7L2p9M0k3JqL%l1O8n9Q9m9l8L3MM4o1M6j0
$$ -8 8 -62 -11 -1 -5 51 -1 -34 5 50 0 60 -7 30 62 -17 23 0 1 -7 -4 -4 -35 33 -26 63 14 -24 9 13 57 -4 42 32
7292C2o6L4Nq0O5m7K6P5J4o2O2o7L5n5qL1j0J3o3O3R3o5q1N9l8N2KL0r3P0l5K0
$$ 32 -34 0 5 -75 -10 -57 -31 44 58 -4 58 -9 26 -29 -37 -6 -16 -3 -66 -3 90 25 -56 3 -35 17 19 49 -44 26 -9 11
7324A1l9M3K7kk2j3l4L8l4RJ4J9k2QJ5jk8LP6k6n1pk8N5J5L5j12P5k2L0o9L5K9
$$ 11 -28 15 42 40 18 5 -29 9 -25 -16 -2 17 -5 3 18 17 -11 -8 68 42 -9 -16 -44 11 26 61 -51 24 2 32 -37 -2 27
7357B7l7OJ9n9k1O5lJ8N3m9m3MJMK8o1Q1j9J0J3j9Om9M1P0n3j7M5o4L5k8q0R7
$$ 27 -10 -4 15 -44 -65 0 -3 15 68 19 -24 -20 -19 -15 13 -48 33 14 24 37 18 24 -25 16 86 33 16 61 -3 32 4 -76 21
7390B1o8j7J24q4L0j7J0jqJ5nN9k2l0pK0N0o8k6jMM5k7l5LJ7O5n4k4L9pk1jJ1
$$ 21 -47 -64 60 -24 6 -11 -1 -2 -10 5 0 59 37 7 0 20 70 2 -24 -25 -21 24 -3 -38 -35 -18 47 -7 -31 8 1 -20 -21 -10
7424a0m4R9p5O4k2l1k9pN5l2OpQ1n4M7j3KK4p0K1M9L3p7l8MJ7l3K0k0P2qrk0O
$$ -10 -54 45 -30 34 12 -19 -48 -55 0 -32 -26 -33 48 -6 41 28 30 54 -16 5 54 87 10 -28 -24 -7 -40 -20 -40 32 24 15 -5 1
7458AML4k7L2o9O5r0L0L0m1P8n6K4l0N1l4J3k8N2j9l3j8K3N2m2l9L6J0M1n5J4
$$ 1 5 39 12 44 -25 40 -50 -20 10 -31 47 -9 15 -15 36 2 15 -13 39 20 -13 -31 -8 44 2 -37 -1 9 50 -5 9
7489Ipj8JQ1q5j3L6nmj3j9M1j5k3O1p0O4k4k4J4Rkj8K8M1k7K4m1k1J3J7k9Nj6
$$ 9 2 -16 -15 66 -19 -32 4 -1 -5 -18 -37 4 -11 -34 27 -43 21 -3 -27 -13 -4 -6 -24 4 45 18 42 1 -20 -7 10 -19 -14 -30
7523c0K6%N2n1Nm7N9J4j09N7J8Pk5M0qol1N3Ro3M8r4J20J8m8j0o5P7kn2L1L0o4
$$ -30 -4 -4 48 -3 2 -45 14 28 -81 -24 -6 1 -24 16 8 2 -29 24 33 -30 18 -76 44 62 14 4 -61 16 14 -38 -7 23 -41
7556d1K2M1Rj0Kj6l4K2K0j3%j3j1j1K6K7o9kN7k2L5m5J6L9j9j1l1N9l0l3M1J8
$$ -41 -19 22 31 21 23 7 -27 -5 15 2 2 -11 -22 -33 -7 20 -49 -51 6 -16 19 -26 -10 29 10 -1 -32 27 -3 -36 5 23
7588B3oo0R0r4%O7kn5O0j8K9m6K6P0o7n8J14l3j12P6Mo4J6J08j1r7M8j9j0O3J3
$$ 23 17 -43 47 -47 -47 20 18 -37 23 5 34 -12 14 84 17 -41 73 40 -72 4 8 -56 -40 68 57 -40 8 -11 -21 42 55
7619E5o5lN2p6L2k7L1o4K6Q0J3o8L6oL7n0j9L1k8K9J7mJ1J2p4k6M0k6nN2P2j02
$$ 55 -10 -13 39 -37 -5 -32 -1 -65 -39 41 54 -14 22 16 53 3 -16 15 -13 16 33 29 40 52 -22 -48 -8 -34 -39 13 85 -17
7651a7j2k2M9O9q6J5l4N3nnj0qL2n1L6k9K3k7pQ5m8j1P5q3j6N2k0k9M1%MK4m8
$$ -17 -29 -51 -2 67 -19 -4 -38 15 10 5 -5 -13 19 -32 4 -25 -2 -29 -36 49 1 -10 65 -18 -34 18 -2 -31 10 10 14 38 -10
7684a0J9M5N1j14oM4klrJ8l1J4m8N4o2k4L6J13j27O5J3r0M4J2L2kk9L5l0%j7k4
$$ -10 9 54 105 -9 -15 29 27 24 15 33 2 16 -32 22 -40 -64 -28 85 -42 23 36 -54 -10 2 34 32 3 38 8 8 -9 -33
7716c3k4O5K8K4m2j8qN7q4L2K2n1J24p1p9K6P5Mn6L1k7j2OL9l9J7L1p8J4K9ll3
$$ -33 -57 8 36 60 18 0 -8 49 -35 -3 19 -32 92 21 -58 -32 43 47 -9 22 -5 -17 -11 28 -11 6 37 -41 -27 2 -1 -34
7748c4N1o6M4lJ0l4o3R4l2MK1m0J6ol6M7J4qL7p8Q8m1K8O7j01J2mL2o4L1M8m6
$$ -34 17 -49 -5 -8 2 -32 -95 -1 -33 -29 -8 -48 -32 -38 -74 -27 -13 -21 16 -62 26 -15 13 80 -21 -9 -13 19 -45 -14 34 -12
7780a2J1L9k9Km3O4o3JJ0k0N3nK6k6qk2j4P6j01O6J4l1kM3n4L5k5J2qk7JrN3n1
$$ -12 -1 38 9 11 -32 32 -31 -30 -20 -40 13 8 34 8 0 -22 -36 40 -61 5 19 -12 -14 29 -25 10 -15 -3 -11 -38 -37 -46 7 -44
7814d4L9k5LKK0K8o0O6m9lj8N8lL5l5L0Jn5pK2M8j08P6l6K5J8n8O5K4l9lm2N4
$$ -44 -5 -30 -27 -25 -5 23 -37 29 -20 -23 -41 17 14 49 14 44 45 -10 -17 5 53 -55 21 -15 10 28 -30 35 59 20 17 -25 29
7847B9j3N4n7j1N9o5K0l3J7k9L8j0k4J6J3j5j6k9L5M0l5k0O5K2r2M7P8p0rLkj5
$$ 29 16 70 13 2 61 -4 16 -17 0 -29 9 -1 -25 -9 4 -11 -27 -56 -21 19 -16 -36 29 51 -41 6 84 14 5 8 6 -9
7879iPl1J02m1Jk7L2K4n5l1L3j8K2j5r0J77o4QqMM8o9j2K7Oo2R7m8l1K4j8J0L2
$$ -9 -2 -33 69 28 29 2 34 58 3 -28 5 -13 9 -6 -96 81 17 25 17 21 69 0 -12 15 21 -41 56 8 -23 1 -17 -7 25
7912B5j9j7J8L0o4m1J08l7pj2N1kq2J4J4k4j5J9nj6O3Jj1K5J7j5k6K5n7M0j7O8
$$ 25 6 -11 7 37 -27 -68 40 3 -4 -16 35 33 -49 -35 -21 -45 -60 -41 -46 -62 1 2 -9 16 33 18 -8 17 -40 0 -17 51
7944E1p4j8Mk4JQ2K5m1J1J0m5K6Pj9n1R8m1K4o4N9M6l1o2M9k9M5k0m7NK9l0MK9
$$ 51 -23 -41 -37 -61 -60 22 47 6 17 27 -18 8 15 -4 -55 43 2 26 -38 21 67 36 -26 23 -6 39 19 -28 -23 6 -24 -20 9
7977IKK1k4m6Mk8M3Q6n2mNl7N1l9M9q7P1r3O3J2J7l0OO1l0O8p7m4J5K0p6J09l6
$$ 9 11 32 8 -38 -34 -62 -19 67 15 11 16 -21 30 -9 40 -47 24 -69 -6 6 23 -7 -1 60 30 98 21 -23 -8 12 -64 45 9
8010Ik7M8J3r8P2L3q4L1r2Q7N0Kj07kN1J1K5k1J4J0j0l6M6no1J7k1P3n3nK5n8
$$ 9 -18 30 43 -55 17 50 -34 -3 -95 -8 42 44 -63 -65 -14 -3 22 1 15 25 15 -21 25 20 -41 -24 -45 28 -25 -30 -5 -63
8042f3J08m6Rj8J7j6m4M3j0k0N4o8L5K6k2J5Kj2m0M1M9Om6L3Jnk6j9R7q3M5l5
$$ -63 45 -1 8 -10 7 -9 -53 -10 -20 -40 14 -54 -19 7 -15 0 2 -10 -50 -9 40 46 0 33 34 29 3 -16 81 -2 43 8
8074HJ5n8OkK9K3J4m0K4k1l0K2k7N0nLk1M3o5K3l5rRN0m8JN4J6k7j5pL8l8L2q
$$ 8 23 -35 -29 -31 -2 21 35 -5 19 -2 -32 -10 -37 13 8 11 -10 33 -32 -9 -44 -53 -44 6 -42 -41 13 29 2 -13 -20 18 -20 12 4
8109DJ0RJ5K3rm4l2M2m9RP2l3L3o9KOl4Q6j8n5J7l1N2n8J5P0m1O8o2m0L0M1n1
$$ 4 14 23 38 61 52 8 -24 18 -31 -22 50 17 50 -19 -17 -11 -45 41 23 -32 -15 -46 6 -52 -37 33 -8 60 -2 -42 -12 29 -22
8142b2L8p9L7K6LK9Pm3kjJ6K0J6k8qKK3n8K1l5L7k1M9j8M1l9j7QqNO7r0j1O6j2
$$ -22 16 -63 -26 0 3 32 39 -4 -6 -7 9 29 45 17 9 11 34 -24 -3 -38 -1 -22 27 9 50 11 -6 2 -6 -1 66 -24 -35 31 19
$$ [...]
8191A
##END NTUPLES=NMR FID
##END=
