##TITLE=1H_LR_0155-CBz-EtOAc
 CD3CN
 8 sc, 
 16.2.2023
##JCAMPDX= 6.0         $$ Bruker NMR JCAMP-DX V2.0
##DATA TYPE= NMR FID
##DATA CLASS= NTUPLES
##ORIGIN= UXNMR, Bruker Analytische Messtechnik GmbH
##OWNER= root
$$ XWIN-NMR		Version 3.5
$$ Thu Feb 16 14:20:59 2023 Russian Standard Time (UT+4h)  she@DPX200
##.OBSERVE FREQUENCY= 200.13135
##.OBSERVE NUCLEUS= ^1H
##.DELAY= (6, 6)
##.ACQUISITION MODE= SIMULTANEOUS
##.ACQUISITION SCHEME= undefined
##.AVERAGES= 8
##.DIGITISER RES= 18
##SPECTROMETER/DATA SYSTEM= spect
##.PULSE SEQUENCE= zg30
##.SOLVENT NAME= CD3CN
##.SHIFT REFERENCE= (INTERNAL, CD3CN, 0, 15.7039)
##AUDIT TRAIL= $$ (NUMBER, WHEN, WHO, WHERE, WHAT)
$$ ##TITLE= Audit trail, XWIN-NMR		Version 3.5
$$ ##JCAMPDX= 5.01
$$ ##ORIGIN= Bruker BioSpin GmbH
$$ ##OWNER= she
$$ F:/spectra/data/she/nmr/H-F/1/audita.txt
$$ ##AUDIT TRAIL=  $$ (NUMBER, WHEN, WHO, WHERE, WHAT)
(   1,<2023-02-16 14:19:51.18 +0400>,<she>,<DPX200>,
      <created by zg, POWCHK disabled, PULCHK disabled
       configuration hash MD5:
       00 E9 B6 7A A2 85 ED C7 34 08 36 98 17 FE 4E 26
       data hash MD5: 16K
       D8 F9 76 09 4C 06 7B 19 08 0E CE 82 4C 59 1A FD>)
$$ ##END=
$$ 
$$ hash MD5
$$ B4 E4 69 83 C1 1A EF EB 59 BC 12 19 D7 C4 2B BC
##$RELAX= 
##$RELAX= 
##$RELAX= 
##$RELAX= 
##$RELAX= 
##$RELAX= 
$$ Bruker specific parameters
$$ --------------------------
##$DU= <F:/spectra>
##$EXPNO= 1
##$NAME= <H-F>
##$PROCNO= 1
##$TYPE= <nmr>
##$USER= <she>
##$AMP= (0..31)
100 100 100 100 100 100 100 100 100 100 100 100 100 100 100 100 100 100 
100 100 100 100 100 100 100 100 100 100 100 100 100 100 
##$AQSEQ= 0
##$AQ_mod= 1
##$AUNM= <au_zg>
##$AUTOPOS= <>
##$BF1= 200.13
##$BF2= 200.13
##$BF3= 200.13
##$BF4= 200.13
##$BF5= 200.13
##$BF6= 200.13
##$BF7= 200.13
##$BF8= 200.13
##$BYTORDA= 1
##$CFDGTYP= 0
##$CFRGTYP= 5
##$CHEMSTR= <none>
##$CNST= (0..31)
1 1 145 1 1 1 1 1 1 1 1 1 1 1 1 1 1 1 1 1 1 1 1 1 1 1 1 1 1 1 1 1 
##$CPDPRG= <>
##$CPDPRG1= <>
##$CPDPRG2= <>
##$CPDPRG3= <>
##$CPDPRG4= <mlev>
##$CPDPRG5= <mlev>
##$CPDPRG6= <mlev>
##$CPDPRG7= <mlev>
##$CPDPRG8= <mlev>
##$CPDPRGB= <>
##$CPDPRGT= <>
##$D= (0..31)
0 1.2 0 0 0 0 0 0 0 0.06 0 0.03 0 0 0 0 0.0002 0 0 0 0 0 0 0 0 0 0 0 0 
0 0 0 
##$DATE= 1676542790
##$DBL= (0..7)
120 120 120 120 120 120 120 120 
##$DBP= (0..7)
150 150 150 150 150 150 150 150 
##$DBP07= 0
##$DBPNAM0= <>
##$DBPNAM1= <>
##$DBPNAM2= <>
##$DBPNAM3= <>
##$DBPNAM4= <>
##$DBPNAM5= <>
##$DBPNAM6= <>
##$DBPNAM7= <>
##$DBPOAL= (0..7)
0.5 0.5 0.5 0.5 0.5 0.5 0.5 0.5 
##$DBPOFFS= (0..7)
0 0 0 0 0 0 0 0 
##$DE= 6
##$DECBNUC= <off>
##$DECIM= 32
##$DECNUC= <off>
##$DECSTAT= 4
##$DIGMOD= 1
##$DIGTYP= 9
##$DL= (0..7)
0 120 120 120 120 120 120 120 
##$DP= (0..7)
150 150 150 150 150 150 150 150 
##$DP07= 0
##$DPNAME0= <>
##$DPNAME1= <>
##$DPNAME2= <>
##$DPNAME3= <>
##$DPNAME4= <>
##$DPNAME5= <>
##$DPNAME6= <>
##$DPNAME7= <>
##$DPOAL= (0..7)
0.5 0.5 0.5 0.5 0.5 0.5 0.5 0.5 
##$DPOFFS= (0..7)
0 0 0 0 0 0 0 0 
##$DQDMODE= 0
##$DR= 18
##$DS= 0
##$DSLIST= <SSSSSSSSSSSSSSS>
$$ [...]
##$SUBNAM2= <"">
##$SUBNAM3= <"">
##$SUBNAM4= <"">
##$SUBNAM5= <"">
##$SUBNAM6= <"">
##$SUBNAM7= <"">
##$SUBNAM8= <"">
##$SUBNAM9= <"">
##$SW= 18.05172834244
##$SWIBOX= (0..15)
0 0 2 0 0 0 0 0 0 0 0 0 0 0 0 0 
##$SW_h= 3612.71676300578
##$TD= 16384
##$TD0= 1
##$TE= 0
##$TE2= 300
##$TE3= 300
##$TEG= 300
##$TL= (0..7)
0 120 120 120 120 120 120 120 
##$TP= (0..7)
150 150 150 150 150 150 150 150 
##$TP07= 0
##$TPNAME0= <>
##$TPNAME1= <>
##$TPNAME2= <>
##$TPNAME3= <>
##$TPNAME4= <>
##$TPNAME5= <>
##$TPNAME6= <>
##$TPNAME7= <>
##$TPOAL= (0..7)
0.5 0.5 0.5 0.5 0.5 0.5 0.5 0.5 
##$TPOFFS= (0..7)
0 0 0 0 0 0 0 0 
##$TUNHIN= 0
##$TUNHOUT= 0
##$TUNXOUT= 0
##$USERA1= <user>
##$USERA2= <user>
##$USERA3= <user>
##$USERA4= <user>
##$USERA5= <user>
##$V9= 5
##$VALIST= <valist>
##$VCLIST= <CCCCCCCCCCCCCCC>
##$VD= 0
##$VDLIST= <DDDDDDDDDDDDDDD>
##$VPLIST= <PPPPPPPPPPPPPPP>
##$VTLIST= <TTTTTTTTTTTTTTT>
##$WBST= 1024
##$WBSW= 4
##$XGAIN= (0..3)
0 0 0 0 
##$XL= 0
##$YL= 0
##$YMAX_a= 211286
##$YMIN_a= -377303
##$ZGOPTNS= <>
##$ZL1= 120
##$ZL2= 120
##$ZL3= 120
##$ZL4= 120
##$ABSF1= 10
##$ABSF2= 0
##$ABSG= 5
##$ABSL= 3
##$ALPHA= 0
##$AQORDER= 0
##$ASSFAC= 0
##$ASSFACI= 0
##$ASSFACX= 0
##$ASSWID= 0
##$AUNMP= <proc_1d>
##$AZFE= 0.1
##$AZFW= 0.1
##$BCFW= 1
##$BC_mod= 2
##$BYTORDP= 1
##$COROFFS= 0
##$CY= 11.3945322036743
##$DATMOD= 1
##$DC= 2
##$DFILT= <>
##$DTYPP= 0
##$F1P= 2.36226072786647
##$F2P= -0.459571619588291
##$FCOR= 0.5
##$FTSIZE= 0
##$FT_mod= 4
##$GAMMA= 1
##$GB= 0.15
##$INTBC= 1
##$INTSCL= 1
##$ISEN= 128
##$LB= 0.24
##$LEV0= 0
##$LPBIN= 0
##$MAXI= 10000
##$MC2= 0
##$MEAN= 0
##$ME_mod= 0
##$MI= 1.114404
##$NCOEF= 0
##$NC_proc= 0
##$NLEV= 6
##$NOISF1= 3.799351
##$NOISF2= 2.8
##$NSP= 1
##$NTH_PI= 0
##$NZP= 0
##$OFFSET= 15.70392
##$PC= 1
##$PHC0= -19117.08
##$PHC1= 16.00078
##$PH_mod= 1
##$PKNL= yes
##$PPARMOD= 0
##$PSCAL= 0
##$PSIGN= 0
##$REVERSE= no
##$SF= 200.130013532006
##$SI= 16384
##$SIGF1= 3
##$SIGF2= 2
##$SINO= 400
##$SIOLD= 16384
##$SREGLST= <1H.CDCl3>
##$SSB= 0
##$STSI= 0
##$STSR= 0
##$SW_p= 3612.71676300578
##$SYMM= 0
##$S_DEV= 0
##$TDeff= 0
##$TDoff= 0
##$TI= <>
##$TILT= no
##$TM1= 0
##$TM2= 0
##$TOPLEV= 0
##$USERP1= <user>
##$USERP2= <user>
##$USERP3= <user>
##$USERP4= <user>
##$USERP5= <user>
##$WDW= 1
##$XDIM= 8192
##$YMAX_p= 0
##$YMIN_p= 0
$$ End of Bruker specific parameters
$$ ---------------------------------
##NTUPLES= NMR FID
##VAR_NAME=  TIME,          FID/REAL,        FID/IMAG
##SYMBOL=    X,             R,               I
##VAR_TYPE=  INDEPENDENT,   DEPENDENT,       DEPENDENT
##VAR_FORM=  AFFN,          ASDF,            ASDF
##VAR_DIM=   8192,          8192,            8192
##UNITS=     SECONDS,       ARBITRARY UNITS, ARBITRARY UNITS
##FACTOR=    0.0002768,     1,               1
##FIRST=     0,             0,               0
##LAST=      2.2672688,     0,               0
##MIN=       0,             -377303,         0
##MAX=       2.2672688,     211286,          0
$$ Real data points
##PAGE= N=1
##DATA TABLE= (X++(R..R)), XYDATA
0 0 0 0 0 0 0 0 0 0 0 0 -8 8 -8 8 -16 16 -23 24 -32 40 -45 56 -64 72 -88 104 -120 136 -159 183 -208 235
32 235 -269 305 -344 387 -435 487 -546 607 -676 753 -835 924 -1023 1128 -1246 1375 -1514
49 -1514 1670 -1838 2025 -2232 2464 -2720 3013 -3345 3723 -4166 4686 -5307 6073 -7032 8284
64 8284 -9989 12461 -16388 23621 -41440 185409 149148 -157456 -7660 53775 120029 205602
76 205602 211286 12705 -111820 -103181 -23342 40511 88910 19236 -97689 -211160 -242030 -98647
88 -98647 94966 46017 -102328 -124476 -102628 -115200 -22345 118586 97145 -36680 -50489
99 -50489 -4102 9180 85321 181465 134677 15866 -40193 -12599 51825 94179 86172 44484
111 44484 -15245 -72422 -71614 19877 77689 5202 -68073 -75460 -102259 -88847 16254 60547
123 60547 -14962 -71869 -53807 -36806 -25097 27863 62123 19059 -36706 -42354 822 51920
135 51920 65235 52305 30181 -18559 -43783 4007 60575 50674 10290 456 -8523 -34425 -10839
148 -10839 47530 41534 -15664 -41404 -32598 -27449 -13205 26423 37106 -11167 -50867 -36948 -6699
161 -6699 4416 6755 11381 -5382 -42754 -38347 13978 39384 20321 5223 1026 -18279 -25408
174 -25408 17004 52071 26498 -5827 -1444 7169 1657 9872 32668 23536 -19020 -31506 -6737
187 -6737 1023 -5979 4984 11150 -17799 -44099 -22323 8414 -240 -14134 -5417 -3618 -18677
200 -18677 -13038 20499 30393 3848 -4457 12322 7766 -4558 13419 36921 20344 -8931 -1550
213 -1550 14697 3417 -3803 10450 5039 -24419 -31302 -4375 7905 -9195 -13599 -3241 -11380
226 -11380 -24710 -11126 12259 6960 -13309 -5829 11150 2129 -1198 22388 29156 2066 -10805
239 -10805 8164 15481 2867 6473 17682 3013 -15251 -8448 7438 3680 -12145 -11290 -4491
252 -4491 -15887 -22433 -2586 11478 -2276 -13655 -1739 2952 -10143 -3631 17583 11927 -6121
265 -6121 -2142 10838 10445 6364 13411 14945 -1409 -10150 117 8406 1111 -6519 -1065 1986 -10561
280 -10561 -12441 2486 3271 -10175 -8700 1220 -3750 -10130 1463 11585 1840 -3764 3296 4666
294 4666 -36 1650 6827 6153 -1044 -1562 5366 5128 -2424 -2509 3049 -401 -8826 -5576 1690 -3108
310 -3108 -4953 2112 1133 -6762 -2426 7017 3424 -5209 -2910 3801 2913 967 4135 4671 269 -1693
326 -1693 2456 4118 -920 -3153 1279 556 -6371 -4750 3747 2638 -4817 -3565 692 -3604 -5531
341 -5531 3603 6860 -663 -3536 2266 4390 1619 2633 5222 1575 -4161 -1307 3807 1830 -2559
356 -2559 486 4421 -1090 -7041 -3080 1590 -2219 -5365 -899 -832 -5871 -2485 5702 3992 -2881 -582
372 -582 5288 2467 -2075 1641 5454 2678 112 2960 3937 -1629 -2971 3249 3648 -3792 -7020 -1237
388 -1237 1226 -2983 -3960 489 -836 -5650 -1481 2215 -2379 -4753 2491 6713 1364 -2501 2718
403 2718 6015 3166 768 1534 2122 -161 -324 2352 1585 -3159 -2012 3108 1004 -5508 -5093 -65
419 -65 -1304 -4002 -1681 52 -2320 -1437 1680 1428 9 340 2844 3315 596 -782 2337 4950 3321
436 3321 160 40 -382 -2372 -871 2079 -1168 -3949 -1941 -1306 -2396 -1949 -743 -446 -1623 -2743
452 -2743 -2590 -584 2430 2238 1370 2727 1657 1836 3663 3034 521 435 1381 1541 245 -1233 -1153 -426
470 -426 97 -669 -2449 -2789 -2895 -2883 -1665 -847 -1381 -1390 -1209 -1164 -582 848 3003 2686 395 -75 2097 4267
490 4267 4006 2070 535 92 306 1861 1449 -1986 -2362 -79 1867 -465 -3478 -3152 -1151 -1111 -2167
507 -2167 -2044 -1068 -1447 -2095 91 1471 -342 548 3044 1208 -1015 153 2951 3144 1786 -409 -215
524 -215 1529 1832 -305 -16 74 -1769 76 2140 -1288 -3749 -137 2228 88 -2097 -2856 -2086 -85
541 -85 1671 1008 -577 -932 -676 1144 2570 -149 -1992 401 1404 -1453 -1425 754 1268 -97 449
558 449 552 -495 -222 670 634 383 73 130 1305 672 -1586 -1081 2235 2030 -342 -1236 -1018 -1260 203
577 203 1887 101 -2666 -2531 -1185 95 47 -893 -595 -72 -164 -236 1139 1715 662 941 1606 469 -14
596 -14 1569 1824 727 395 459 1097 294 -1230 -943 367 -656 -2014 -1100 -567 -2622 -2614 -428 -706 -981
615 -981 -129 -202 -682 -174 523 2056 1938 -30 -764 1618 2912 1151 797 2641 658 -466 1124 783
633 783 -1053 -945 -394 -448 -1007 -2079 -2247 -730 -388 -1912 -1815 -49 -208 -1691 278 1363 17 1216
651 1216 2426 955 -413 93 1593 2369 1524 66 -812 960 1944 -324 -549 91 -1764 -1718 -237
668 -237 -1873 -3105 -614 1229 252 -1411 -1147 -209 241 1180 483 254 537 -455 366 2792 1206 -466
686 -466 1110 1427 -155 -969 803 1004 -794 -645 506 -610 -1338 -1168 -453 -276 -1708 -1416 690 130
704 130 -1466 -174 1848 1650 -576 -196 585 -742 320 2694 1926 -622 -684 718 1715 -271 -572
721 -572 794 -305 -2151 -1173 428 111 -1729 -1188 989 -174 -1761 -122 1034 65 -480 900 1858
738 1858 -113 -756 1175 1786 -305 -494 570 855 -878 -983 1061 485 -970 -760 -497 -1086 -1517 -560
756 -560 449 300 -917 147 758 112 -122 1073 1476 -330 -551 1115 427 -344 401 1177 450 -378
774 -378 -1024 -633 -240 -211 174 -493 -921 -775 -425 218 -478 -820 296 297 -355 231 858 930 741 1134 1043 116
796 116 -21 290 -78 208 1003 199 -390 -233 -64 -137 -374 -202 -347 -886 -891 -1215 -610 539 132 44 -83
817 -83 -947 -227 1441 991 -443 -361 1015 1283 208 312 834 -260 -289 586 352 -718 -1048 458 797
836 797 -504 -873 -269 -179 -993 -1194 135 638 -799 -80 1407 221 -645 601 2259 665 -1655 -497
854 -497 1036 366 -13 796 -97 -1083 -520 496 508 -1697 -1228 921 755 -1036 -1477 589 1226 -369
872 -369 86 1370 -527 -803 1199 1385 -174 -546 885 1226 -960 -1282 149 295 -251 -655 -183 -331
890 -331 -941 -185 1387 575 -1198 -663 700 495 -683 -14 1186 419 51 749 416 -207 368 832 532
909 532 -944 -1417 176 160 -387 -612 -441 12 -824 -1141 429 16 -330 422 532 -349 -452 748 921
928 921 56 27 475 608 380 173 394 647 667 -156 -147 -483 -887 -828 -18 -267 -928 -1025 -567 -739 -782 -225 275
951 275 190 88 -613 135 761 898 888 673 486 310 559 1469 895 114 -98 550 555 -323 -801 -397 -330 -735
973 -735 -739 -364 -807 -1091 -524 -86 -578 -596 -11 181 -511 -408 65 1405 1268 -223 -79 563 836 654 1391
994 1391 466 -372 33 757 419 -785 -424 34 -19 -592 -1014 -433 114 -377 -482 88 -213 -816 -110 612
1014 612 -355 -647 265 653 -140 -44 352 428 550 352 173 -66 -412 58 648 445 139 -674 463 619
1034 619 -730 170 641 124 -532 -326 -466 -442 -279 238 -46 -490 -583 -324 164 232 -638 -340 814 -577
1054 -577 -630 659 476 -225 -188 747 295 -171 333 426 542 537 181 411 420 -677 -53 764 32 -802 -404 -66
1076 -66 -518 -724 -234 -151 -621 -662 -190 -355 -488 -597 141 805 -243 -332 100 476 484 848 1152 222 -178 754
1098 754 795 164 -227 191 451 221 28 -575 117 308 -656 -663 -270 -580 -663 -358 -300 -773 -600 564 -212
1119 -212 -295 -257 -28 782 1366 73 -292 300 759 502 782 119 -510 -257 539 577 -194 -44 -250 -52 602
1140 602 -651 -1072 -182 -125 -833 -360 16 -768 -498 897 543 -312 251 533 9 -75 -109 399 436 355 -147
1161 -147 314 385 -442 329 884 -185 -917 318 716 -433 -501 50 131 -873 -638 -1 -300 -765 121 749
1181 749 247 -945 -576 624 233 -741 -411 943 -178 -529 654 1308 -311 -405 1099 932 -419 -323
1199 -323 846 315 -696 -635 617 -39 -1478 -292 804 63 -955 54 685 -469 -1079 600 1091
1216 1091 -631 -1173 459 701 -411 -589 1403 1211 -870 -108 1235 221 -722 4 902 -282 -698
1233 -698 512 787 -387 -491 554 159 -975 -795 467 297 -995 -686 860 62 -1294 -147 982
1250 982 -331 -951 857 924 -707 -501 905 736 -489 -140 1244 210 -597 105 1268 295 -392 267
1268 267 982 -353 -933 525 734 -857 -775 890 215 -1089 -142 982 -14 -1137 -184 659 -554 -822
1286 -822 608 907 -642 -757 673 861 -583 -355 1117 522 -572 149 1265 -270 -1208 495 1338
1303 1338 -812 -1183 567 882 -1242 -929 903 413 -1247 -787 1367 -209 -1751 134 1327 -433
1319 -433 -1588 536 1754 -119 -1078 1219 1098 -1035 -786 1808 1083 -1684 -314 1955 341 -2224
1335 -2224 -38 1570 -501 -1552 374 1349 -1285 -1788 1236 1299 -1582 -1197 1600 1069 -1801 -614
1351 -614 2024 554 -1384 151 2071 -423 -1770 1079 1930 -1125 -1912 1171 1678 -1159 -1136 1510
1367 1510 930 -1968 -778 1750 183 -2132 9 2112 -489 -1968 353 1926 -879 -1723 1314
1382 1314 1580 -1573 -1228 1872 986 -1736 -400 2178 272 -2066 86 2256 -102 -1746 853 1891
1398 1891 -956 -1774 1320 1502 -1327 -1517 1372 678 -2009 -621 2136 381 -2154 -135 2115 -319
1414 -319 -1919 581 1754 -1104 -1486 1387 1221 -1342 -1237 2058 641 -2056 -544 1957 421 -1476
1430 -1476 95 1706 -506 -1854 782 1279 -1059 -1132 1717 1311 -1832 -955 1754 772 -1814 -406
1446 -406 1911 -385 -1865 514 2049 -871 -1605 1448 1698 -1843 -1083 1794 1097 -1572 -976 1663
1462 1663 263 -2124 54 2339 -286 -2205 469 2169 -1025 -1966 1377 1401 -1506 -1409 1408 574
1478 574 -2286 -426 1848 281 -1961 402 2279 -515 -1733 826 2289 -828 -1744 1032 1613 -1539
1494 -1539 -687 2598 724 -2058 -407 2404 33 -2208 -58 2097 -860 -2404 590 1760 -1194
1509 -1194 -1693 1223 1656 -2288 -1542 2238 787 -2302 -334 2361 302 -1992 534 2202 -487 -1741
1525 -1741 1012 2334 -1030 -1714 1384 1570 -1638 -1651 1788 597 -2419 -1123 2083 126 -2499 -164
1541 -164 2177 -573 -2054 1009 2027 -1412 -2114 1422 1666 -1392 -1261 1562 1019 -1730 -606 2044
1557 2044 588 -2247 -66 2190 -918 -2268 834 1503 -1020 -1146 1216 1329 -1209 -805 1182 463
1573 463 -1482 -443 2092 45 -2072 306 2155 -694 -1818 860 1421 -1458 -1497 1336 775 -1548
1589 -1548 -535 1153 481 -1880 -398 1646 11 -1676 299 1582 -467 -1137 1277 1425 -1451 -936
1605 -936 1246 914 -1536 -629 1467 368 -1241 177 1421 -369 -1446 596 1469 -710 -1448 717
1621 717 1245 -1258 -1079 1441 882 -1514 -590 1388 59 -1730 583 1401 -709 -1517 680 1270 -492
1638 -492 -1009 837 1080 -1090 -756 1044 798 -1614 -310 1586 167 -1777 211 1731 -449 -1178
1654 -1178 571 1262 -1047 -869 1386 1177 -1055 -957 1484 557 -1593 -501 1430 41 -1701 401
1670 401 1093 -574 -1687 425 1137 -1022 -1099 763 653 -1013 -577 1299 629 -1264 -575 1809 357
1687 357 -1127 144 1351 -271 -1409 371 1371 -738 -1298 846 499 -1066 -723 1022 308 -1276
1703 -1276 -443 1007 489 -1275 -179 985 -124 -1081 879 1170 -832 -745 956 902 -794 -555 781
1720 781 558 -889 -32 878 252 -887 -120 634 57 -834 378 945 -605 -872 589 515 -790 -316
1738 -316 762 527 -800 55 1201 -84 -476 219 809 -82 -579 303 508 -565 -557 477 730 -574
1756 -574 -532 553 99 -837 -31 611 -479 -461 254 314 -35 -152 213 548 -469 -189 709 105 -410 -313
1776 -313 373 -48 -839 -18 432 -254 -458 149 568 -383 -156 512 151 -262 -460 413 -47 -486 -233 323
1796 323 301 -548 12 560 -68 -353 406 522 -250 -524 241 453 -452 -38 389 90 -279 -376 301 -162 -505
1817 -505 -118 719 -6 -394 382 276 -284 -112 568 177 -379 121 429 154 -248 -10 401 -227 -511 -113
1837 -113 245 -148 -355 99 470 -343 -311 244 754 -72 -223 455 87 -324 42 371 95 -458 76 282
1857 282 -271 -214 456 33 -164 -291 -297 222 -408 -358 361 -27 -398 -400 286 259 -146 271 209 -81 -519 61 254
1880 254 -35 -80 189 16 393 -425 -34 33 -71 -99 119 -53 -175 -133 304 130 -116 -4 38 60 -44 -194
1902 -194 108 202 279 199 81 -85 -247 329 14 137 -42 156 151 195 0 -19 152 60 -98 196 -193 -183 37
1925 37 -84 -129 54 -227 -160 -10 314 -111 -103 195 -162 -279 232 56 -102 12 14 -110 253 -225 96 73 221
1948 221 -125 45 -116 48 -179 21 43 -419 172 217 163 135 191 224 -64 -88 -38 -14 266 -85 -27 -71 -104 -114
1972 -114 46 -3 61 0 124 22 -54 -258 340 52 -125 10 133 232 -12 194 424 59 81 -36 335 143
1994 143 -171 -20 115 -148 -41 46 73 -36 -200 20 -42 -118 -290 -42 83 -69 -271 -63 148 -206 -265 139
2016 139 296 -105 -76 74 -144 40 58 -26 -320 61 202 42 -308 -139 -27 10 240 -379 -1 67 -177 -59
2038 -59 -278 -37 48 -100 203 12 -91 -78 152 113 140 -79 76 128 -346 -281 113 89 71 227 -182 82 -465
2061 -465 -77 -264 -240 -309 147 160 317 11 -80 61 -12 26 213 243 -70 -203 22 -68 -50 -162 34 -87 -88 97
2085 97 -125 189 267 273 -84 244 -9 -14 116 98 95 -120 -196 -213 -1 263 -94 2 -105 -44 -110 -116 -160 -158 239 9
2111 9 1 -182 -18 186 -256 -110 -68 -117 -139 180 220 -13 195 23 54 90 109 1 172 -215 80 -115 178 -142
2135 -142 -1 139 -236 75 -36 -142 -50 -185 -178 46 169 -100 62 96 -256 -252 178 52 -130 228 151 44
2157 44 -167 -246 100 101 -169 87 166 117 148 192 92 139 -166 -142 155 -380 -258 204 -26 -156 -201 -95 369 -286
2181 -286 78 267 175 -304 -66 95 -21 -18 109 346 -18 55 34 221 210 6 -68 -132 -189 -255 -170 31 -79 7
2205 7 -204 -124 30 -48 -41 96 -14 -9 30 -90 75 128 246 -140 -135 251 89 -9 -240 355 135 -37 29 -118 127
2230 127 -100 200 210 55 17 324 57 -23 -173 333 -54 197 -179 95 14 -39 -4 186 203 115 15 -162 -72
2253 -72 -100 31 20 -251 -349 71 -130 71 -178 -56 -205 -83 -87 -73 -159 -268 49 9 -264 130 197 128 62 11
2277 11 221 -26 -383 64 34 143 -193 14 39 -53 28 171 -125 70 69 -157 64 214 58 -32 -140 -369 194
2300 194 196 -110 108 -9 -56 -371 -21 197 -122 -63 -28 49 -109 -243 -178 -247 -189 -178 63 170 -116 -136 -125 292
2324 292 -158 130 226 49 -30 97 -82 223 -27 -172 456 200 11 -133 34 161 -215 -93 -28 -54 -186
2345 -186 4 233 -133 -5 -91 -151 -142 -159 -70 -140 -269 -206 -22 75 58 -45 -126 -238 -194 147 -18 -120 -147 -35
2369 -35 8 14 81 315 124 -208 187 56 -201 -53 115 -47 135 16 18 86 -250 78 -266 -7 -212 65 -52
2392 -52 -128 136 -160 159 -79 -136 -248 -111 -356 38 -20 42 23 -18 25 -3 77 247 -65 -117 -51 87 -168 -138
2416 -138 -248 -202 -11 14 102 -223 141 84 50 72 -126 -189 -178 -50 -17 57 276 123 -31 -85 -160 -71 41 -144
2440 -144 -247 -228 5 184 -141 -15 -50 116 7 259 -47 147 124 -61 -33 107 137 -2 -54 -154 -150 109 83
2463 83 111 -81 -180 -75 -151 8 -69 102 -18 -29 -206 -39 70 -98 -124 -53 -90 -4 45 128 127 -11 -67 120 41
2488 41 70 109 -46 -154 -100 -147 327 -66 -172 117 -190 -23 -206 -31 14 10 17 46 -123 -3 178 -194 180 -59
2512 -59 69 323 164 -206 36 -23 -194 67 -36 -35 -163 -36 -132 14 24 -5 46 -49 102 -35 106 -20 55
2535 55 159 -67 140 -63 -99 16 133 -132 -29 -1 -27 -85 -273 32 168 -49 -75 41 93 -277 159 157 -67
2558 -67 -61 3 -34 -121 -290 34 -55 217 -37 -223 -81 72 -53 -85 -60 144 -15 32 67 87 -12 -24 23 -80 -82 106
2584 106 91 9 -263 93 -171 -193 -8 74 -78 -125 -168 -68 -48 6 -124 7 -102 -129 100 9 73 50 8 -63 -213
2609 -213 -138 -49 151 -19 -50 -113 89 -170 229 225 178 3 -171 180 179 -117 20 207 -128 16 154 74 10 -145
2633 -145 -50 88 91 -54 115 152 -59 -242 189 -66 -263 52 -59 71 -113 -184 146 41 36 -135 -86 -96 -296
2656 -296 203 20 -65 -263 96 115 44 -233 126 -42 -108 -66 92 128 -30 263 189 -254 -182 88 24 159 -89
2679 -89 387 137 -231 28 199 11 41 35 158 228 -215 31 344 87 -148 -96 0 -23 -142 218 -62 -72 -113
2702 -113 -71 -80 -218 27 212 56 -291 -106 146 185 -113 82 14 -93 -237 -20 154 -452 52 222 24 -164
2724 -164 157 223 133 -274 222 -146 18 -16 167 118 -182 4 327 13 -9 -200 146 -3 -254 42 261 0
2746 0 -216 162 -42 -114 -185 63 278 -135 -82 251 -40 -458 15 203 -6 -162 -44 2 -91 -169 -96 330 -56
2769 -56 28 334 -114 -387 -13 -10 -34 -401 122 174 -55 -44 83 166 -245 -346 255 154 -140 -18 474 149 -375
2792 -375 -91 454 -85 -381 37 356 -156 -437 239 309 -67 -305 17 279 -397 -524 408 -57 -420 119
2812 119 344 -108 -16 -225 492 -299 -246 337 306 -353 -351 336 449 -200 99 515 155 -351 -148 200 22 -236
2834 -236 -59 281 -183 -79 60 298 -21 -428 186 71 51 -293 83 217 -361 -278 394 -67 -391 -10 265
2855 265 -95 -471 183 402 -211 -367 384 118 -447 3 255 44 -179 -70 374 147 -295 381 369 -129
2875 -129 -522 140 277 -428 -142 364 188 -509 -209 472 -3 -247 -53 379 -224 -292 29 458 -219 -410
2895 -410 138 490 -161 -234 342 31 -321 -296 426 292 -378 -150 243 -86 -403 -232 391 83 -154 43 335
2916 335 -170 -156 237 107 -308 -73 535 162 -216 17 156 -177 -360 182 329 -456 -307 96 449 -509
2936 -509 -311 328 174 -304 -201 425 77 -263 31 233 -119 -348 103 470 -150 -25 563 494 -335 -195
2956 -195 449 33 -176 -69 521 294 -340 10 290 -352 -320 406 508 -90 -222 369 485 -240 -368 301
2976 301 196 -360 -181 412 -11 -317 63 458 128 -101 97 210 -150 -240 317 312 -430 -188 280 274 -518 30
2998 30 757 158 -307 131 488 -107 -290 144 151 -275 -457 97 192 -108 -238 481 32 -295 -265 352 -153 -235
3020 -235 65 487 -330 -283 -96 135 -295 -342 482 149 -124 -122 35 -38 -112 -356 450 375 -31 328 286 -53 -556
3043 -556 372 379 -143 -311 307 513 -150 -15 317 190 -485 -183 427 165 -285 -55 377 -478 -465 80 315
3064 315 -92 -428 280 362 -158 -79 185 218 -266 -248 444 72 -243 180 201 66 -32 72 204 10 -37 223
3086 223 12 -567 -141 295 46 -309 133 457 43 -412 -166 340 -319 -117 154 172 -417 -221 479 101
3106 101 -383 -19 51 185 -290 -31 315 -198 -162 105 220 -247 -267 72 176 -390 53 197 164 -269 92
3127 92 476 150 -366 -167 146 11 -329 245 220 -181 -204 47 205 -318 -110 402 173 -213 53 304 106
3148 106 -509 -47 179 -133 -349 -153 178 -194 -183 269 220 -142 -160 349 12 -390 -88 332 -195 -3 111
3169 111 168 37 -262 -20 116 -152 -110 247 216 -297 -197 432 195 -91 -43 -14 5 -278 104 203 83 -49
3191 -49 -48 381 -290 -254 -57 106 -77 -198 422 21 135 71 183 112 -267 -27 456 55 -110 106 190 -91
3213 -91 -42 -51 75 47 14 233 240 -31 65 344 -30 -327 166 173 133 -112 27 164 73 -176 62 24 -232 -7 -113
3238 -113 -194 97 191 172 34 -246 74 152 -139 89 -234 231 -299 -84 277 36 -119 -228 353 -16 -10 -56
3260 -56 -33 15 -102 100 302 45 -96 -197 167 -106 196 26 130 -198 -109 24 -34 95 -41 205 22 120
3282 120 257 -88 -175 -155 69 269 -102 -237 73 200 -175 254 141 -133 -122 11 143 54 198 43 172
3303 172 403 -161 277 61 114 56 196 -278 29 117 74 -73 -46 -118 111 -21 -113 417 102 -249 2 90 -50
3326 -50 -221 134 -47 -6 -171 -22 124 -181 170 -97 -156 -46 -146 -158 156 57 -147 85 -133 127 -12 -109
3348 -109 110 -9 -232 134 75 58 -160 194 72 -56 -105 187 -122 -2 -190 112 67 -101 -63 -35 136 -5
3370 -5 91 69 -57 51 -39 -222 -164 263 415 235 -54 135 -130 31 -174 -207 -217 103 130 -180 -81 -84 25 -90
3394 -90 -202 247 25 29 -91 -137 -12 293 132 -57 66 93 48 150 -35 21 -136 -119 -18 -27 79 22 17 -99
3418 -99 149 -161 67 97 351 265 -139 22 -4 23 140 -11 158 208 -34 -68 44 -62 207 105 -80 -25 215
3441 215 -29 -209 1 -150 197 136 -41 72 -233 53 42 121 -29 -111 331 180 -96 -161 -73 50 45 97 147
3464 147 -114 -6 -72 93 -33 148 92 145 -234 197 -160 35 -154 -325 -312 129 336 95 -95 72 -200
3485 -200 -6 401 -104 161 110 -176 -309 160 -226 -250 189 18 44 -192 18 129 -104 105 132 166 7 -91
3507 -91 -133 60 -26 -44 163 60 120 28 -277 121 -67 61 63 279 373 -39 -71 -25 304 16 59 22 -3 32 159
3532 159 61 -26 22 -72 185 106 51 228 44 16 -5 -128 272 63 227 -49 99 -150 -4 180 -168 -98 151
3555 151 100 29 48 82 177 27 248 -86 -60 -28 -155 149 81 73 22 -37 -64 -93 -13 -60 -208 136 -138 155 9
3580 9 -97 -153 -215 174 -32 -199 12 128 89 82 116 -84 -101 67 123 345 -146 10 19 238 139 -37 175 6
3604 6 244 138 -12 103 -66 211 9 -95 75 -33 -47 -309 57 223 -147 -164 -98 14 -345 -99 18 -180
3626 -180 -177 8 156 -96 307 137 -26 174 32 -115 156 217 -10 82 215 127 10 233 43 -112 -32 165
3648 165 164 -262 -74 -182 126 -255 -105 6 -54 -103 67 -25 329 163 -5 22 -66 154 -15 174 55 241
3670 241 -44 85 -110 -6 182 -117 -46 67 168 149 -46 2 46 -42 16 69 166 -70 -318 108 86 -36 -223
3693 -223 -18 -1 27 128 26 -25 -52 -269 -51 -229 -71 150 -91 -113 -170 -35 -27 1 -222 111 199 -307 -9
3716 -9 124 -96 -7 25 -130 40 12 191 209 87 37 72 -130 189 -252 -164 -276 2 97 -146 -13 -273 -29
3739 -29 31 -117 25 -126 -258 83 -73 -24 48 132 -26 -79 -55 21 47 -10 -109 112 -86 202 255 -239 94 -36
3763 -36 -115 185 -7 -47 -129 -177 -9 -113 -187 -84 7 200 -139 -61 -52 -137 -3 48 -14 -16 145 73 -120 -52 64 -131
3789 -131 103 128 -122 -41 100 -104 -130 -238 -69 129 309 337 24 42 -94 -110 -254 -89 -56 233 -134 31
3811 31 1 -122 73 28 -11 5 192 -36 -69 -195 28 36 44 -1 -68 -88 9 3 169 87 -84 -34 10 178 142 -36 -204
3838 -204 -237 -84 70 47 -220 -294 25 -260 156 -75 -25 -229 0 48 214 83 -26 -76 209 -193 -1 -113
3860 -113 27 -26 -90 123 84 -39 9 268 -90 56 -242 -8 197 -162 -14 -65 -54 146 -21 -38 61 -83 1
3883 1 -54 -184 -22 204 9 -148 39 67 82 32 77 73 71 91 -60 -56 -134 108 431 113 97 106 310 -108 82 -35
3909 -35 -18 -414 -189 190 -331 215 -146 58 -288 -195 12 -149 -24 40 119 -79 8 16 41 83 -40 47 187 -90
3933 -90 142 100 51 35 143 32 28 -214 53 -40 169 52 38 -46 103 67 89 -53 91 16 125 57 -2 -87 -83 -72
3959 -72 -116 52 147 50 82 72 82 -31 202 12 -138 -12 -106 91 -316 40 -164 -57 49 -76 -90 -138 -74 247
3983 247 212 -52 264 12 -14 -154 5 115 -156 -8 35 13 -64 113 0 -54 -59 200 -85 8 -59 -2 -184 136
4007 136 -140 182 93 72 79 -131 -155 -4 128 65 -62 -166 209 80 8 72 65 32 37 134 289 -197 -6 -120 52
4032 52 45 58 55 -102 -16 199 263 285 74 269 -96 62 -330 -135 -51 35 6 93 58 -105 256 -115 53 -136 290
4057 290 18 -326 38 75 41 -33 94 45 32 -55 200 127 22 -249 -190 7 -49 -4 47 -88 -70 -112 2 162
4081 162 36 -270 -11 41 45 91 -394 -241 -181 277 68 59 -307 212 -156 73 182 -18 248 239 -51 29 -42 -45
4105 -45 51 3 24 -21 171 100 -97 13 114 37 -42 137 97 74 -17 -40 3 291 186 -215 104 -136 11 -120
4129 -120 -218 -14 -179 147 -128 142 -32 -86 -7 -123 -52 -119 -175 -192 29 -6 92 9 -217 192 -68 25 121 116 148
4154 148 -121 65 169 49 135 207 83 -8 -181 -29 14 4 12 179 -106 59 10 60 -275 330 43 92 37 -35
4178 -35 83 -50 -160 -121 76 -90 -125 -76 61 -81 -252 10 84 -35 -55 -100 -16 78 14 147 9 -281 157
4201 157 -56 -293 -211 5 -77 43 -215 -56 463 -64 -134 -20 9 -115 -245 -14 -136 -114 -292 22 -51 -178
4223 -178 86 117 -18 -63 -38 134 -272 9 218 221 -387 -316 -4 42 -80 85 151 -128 -85 -18 281 -20 -4 -45
4247 -45 290 -142 -49 -54 -21 -353 -17 3 66 298 -209 119 28 225 -59 -13 98 -68 155 -46 -89 -115 240 131
4271 131 -40 -103 121 -167 -451 -21 98 -136 -107 190 289 -230 -291 -68 118 61 155 74 -215 273 -101 -134 204
4294 204 -176 29 235 -83 83 46 176 -222 -86 -13 96 91 -300 234 -23 -235 228 441 69 -181 67
4315 67 140 65 -102 49 -128 -304 -135 90 70 -234 54 70 53 -217 -28 51 87 -255 217 -155 22 -58 -153
4338 -153 57 -104 -30 248 91 -8 -88 66 49 -156 75 -132 -166 -499 -186 174 -40 -43 266 78 -236 -275 28
4361 28 129 -340 -307 148 -143 -228 58 -3 11 -135 137 158 -66 -139 -33 352 -268 312 136 40 -27 -71 135
4384 135 73 -378 -116 -153 18 1 -25 -223 -142 128 351 148 -429 -81 29 181 -254 65 32 467 -47 117
4406 117 302 -38 -166 -147 231 -189 -133 0 126 -202 -59 43 22 -61 -255 71 6 -125 -281 72 -17 26
4428 26 151 143 65 -166 66 203 -95 -428 -139 -78 -187 -213 219 -27 -290 107 204 -253 -91 16 -265 -25
4450 -25 84 -164 331 90 318 34 138 -196 -276 150 -19 -62 -276 479 224 -154 62 107 -122 52 -155
4471 -155 288 14 27 213 -7 -156 72 -54 150 -32 -224 -47 2 -130 178 351 214 -147 -107 206 -301
4492 -301 -293 188 225 -135 -185 263 -14 163 130 381 -6 -75 -101 171 42 1 160 -21 47 12 -67 -25 -278 90
4516 90 7 -5 -96 238 169 253 19 -230 91 -181 -111 -144 81 -210 80 115 45 112 -241 72 72 -166 280 -10
4540 -10 -163 -35 -61 152 -45 22 404 274 -64 -104 42 -11 -263 -45 20 111 -149 74 -43 106 -268 290
4562 290 -29 -81 83 -7 -100 -307 201 95 38 -335 -183 -140 119 37 14 68 -211 -270 69 149 14 -65 65 -74
4586 -74 -162 -81 251 -30 -163 61 -99 59 5 14 79 26 -59 3 88 37 -92 84 18 -190 -148 205 194 -82 -52
4611 -52 -109 -199 -76 103 296 -5 -216 357 34 -127 175 220 3 233 -180 174 53 -180 -146 228 -184 245
4633 245 103 65 -94 -78 194 274 -239 142 113 -120 -204 151 -31 -6 -210 -60 -76 32 117 -219 -63 -146 -135
4656 -135 -138 136 -174 129 96 -86 -40 171 -11 116 36 70 159 -143 107 -67 233 -57 -207 -40 209 194 107
4679 107 -15 -38 1 -84 16 -4 -205 -143 -42 -35 -106 74 141 125 -72 56 -44 -288 87 124 -117 -45 202 -177
4703 -177 -77 232 242 -163 -315 49 161 -74 -129 294 249 117 -252 17 104 49 56 33 88 97 45 58 97 -403 93
4728 93 55 50 -19 103 -33 -144 -396 -93 -256 223 -134 -139 125 -383 -79 -110 18 -20 -100 239 150 -116 -115 5
4752 5 -76 19 164 -108 -11 -155 82 -140 190 4 -101 -19 -169 19 5 -23 -141 70 -10 -67 44 228 122
4775 122 126 -118 64 -19 -179 -35 84 144 -135 -273 163 -264 -21 -197 46 248 -123 -64 36 -104 321 79
4797 79 -67 2 115 -151 57 73 91 110 -227 112 -182 -42 83 -30 -81 -58 81 124 196 -7 -88 95 54 -235
4821 -235 -473 -52 175 -93 41 177 -2 106 -146 51 219 -245 -76 -40 65 4 97 -353 -150 -1 120
4842 120 221 -87 -207 7 -34 15 -54 159 347 -167 85 -17 -47 -85 112 -52 63 155 -308 39 -50 148
4864 148 -71 -82 17 -93 17 -24 -200 188 136 -45 10 -82 97 -90 -7 141 58 -4 101 -78 80 -111 167
4887 167 84 -89 166 -145 91 23 234 231 38 219 32 25 -17 37 151 -30 -157 -50 -105 -58 -78 137 -25 -13
4911 -13 -207 -16 -29 90 223 -28 -18 -60 119 -45 54 172 -174 -17 -115 -201 78 -162 41 88 112 100 61 181
4935 181 185 263 27 -200 37 -80 117 430 36 132 -131 -139 22 -61 22 -59 120 -5 -104 102 173 187 68 50
4959 50 -73 121 -117 -42 -95 132 -307 -144 -39 -298 -54 -112 -172 -88 -32 -88 98 -133 28 -35 -225 -93 -372
4982 -372 -89 140 -68 -40 -241 -11 5 -149 49 -27 1 -182 287 123 -231 -332 138 -49 -174 -138 102 1
5004 1 -67 47 -127 -78 120 -114 40 159 32 58 -24 118 -9 304 -37 -34 -71 7 -28 -43 88 169 259 -177 129
5029 129 189 -3 -229 -197 160 189 89 24 -27 100 -27 80 -187 116 205 -210 -34 77 281 81 -89 -97 74
5052 74 51 -87 -28 110 160 -167 -135 174 -133 51 -10 -119 180 206 94 -248 205 114 -26 135 226 -95 -20
5075 -20 -23 -83 100 -218 -147 107 -61 168 52 238 -4 -146 -10 -122 -45 26 128 -79 -152 -45 -215 79 -114
5098 -114 -73 -110 36 157 89 127 -116 -31 -106 -55 110 -101 53 50 48 -93 -189 130 -47 56 -78 -167 305 -140
5122 -140 -84 163 -131 -52 55 253 194 -58 42 -14 243 75 -392 -65 -77 22 -252 -42 96 283 120 -28
5144 -28 -69 106 108 -135 65 -77 74 -37 -15 -124 -86 252 119 -30 77 -1 88 56 -210 145 249 15 28
5167 28 -163 -47 136 81 -221 -244 -229 138 -29 109 -26 88 184 233 37 -40 -28 -155 -19 -58 46 -73 168
5190 168 94 51 266 13 26 82 -10 136 -39 266 224 -176 61 31 214 83 165 158 -63 -205 75 -129 -66 81
5214 81 -52 119 292 82 60 94 258 -78 123 86 194 228 -175 68 40 -301 -364 16 -159 55 -56 47
5236 47 245 -14 -70 -26 49 113 114 141 -165 33 129 -104 -25 -26 -142 165 49 104 -239 -159 -216 -35 160 1 107
5261 107 -168 180 -53 -138 170 223 -286 212 73 78 175 -185 121 -57 178 5 51 -9 -43 21 -122 -4 22
5284 22 -6 -65 274 177 27 -103 171 64 23 -259 -67 -28 220 231 -95 -98 -24 -187 -255 -11 50 -177 14 106
5308 106 -207 -104 33 50 37 77 -210 102 35 206 -261 48 88 167 -154 181 56 261 203 383 113 -55
5330 -55 -101 103 152 254 206 168 182 146 215 95 121 21 14 20 -208 65 21 27 -199 190 -91 8 -90 -161 108 -101
5356 -101 230 2 73 -368 45 253 130 -49 192 170 -224 12 129 -179 -14 166 -41 112 -145 27 -139
5377 -139 -9 -6 -16 -183 -2 132 -119 13 -189 47 198 131 -70 -61 -52 -123 -253 -312 57 237 -217 -30 -22 -88
5401 -88 -229 -40 -2 79 97 235 31 85 -84 -33 -79 -65 -206 -29 212 223 245 -217 -196 -26 -236 55 -176 -210
5425 -210 -56 -7 15 -161 -165 73 -35 173 -141 -167 32 84 -175 -109 149 -170 63 92 -91 -134 -186 -257 137 93
5449 93 -288 -122 26 -20 2 -82 120 -190 -255 66 -12 -263 -2 -78 105 -170 139 28 325 -152 108 71 -243
5472 -243 107 -278 -96 154 -200 12 106 282 63 -47 54 -74 144 19 -336 -94 155 202 98 -203 138
5493 138 -166 -135 -345 10 -87 67 138 -26 -54 -40 -232 -90 -122 -45 -37 70 4 4 -322 -78 -41 -68 -30 -79 115
5518 115 162 297 -119 7 -36 -204 402 -238 -145 85 155 -152 167 -165 -88 17 -135 -126 34 -157 -70 107 -391
5541 -391 105 -103 -126 -59 -121 107 250 -59 167 -107 7 132 -139 -102 -10 201 41 -15 349 -73 -53 -86 235
5564 235 -51 143 71 244 81 75 -13 48 111 32 -70 60 133 -135 99 41 421 187 -164 119 233 94 355
5587 355 -80 -181 -129 -186 82 14 64 13 -37 286 149 -53 -166 102 65 191 -54 79 182 -35 219 -91
5609 -91 -83 -84 -89 -61 68 -63 40 -9 -159 -198 -173 -6 -236 -73 -79 22 249 -58 -24 236 -159 -21 -151 -58 14
5634 14 77 -137 -180 171 66 -39 64 4 -58 65 51 -133 -332 136 6 -181 -78 -6 -194 -47 258 32
5656 32 80 4 -210 -231 11 -88 71 108 -206 70 -26 -46 35 158 -177 -20 38 13 -48 -62 -249 169 -90 -87 -15
5681 -15 25 -205 13 -258 -174 122 -123 148 -105 61 -113 -129 144 -68 36 35 -97 -16 215 52 -145 -122 126
5704 126 -118 -100 210 177 27 -10 -47 95 117 -30 -81 30 -32 4 -60 -44 -165 -18 75 -16 -127 -81 272 142
5728 142 -20 155 -42 96 -14 77 215 74 18 -112 26 205 -18 -156 23 -31 83 -78 135 -171 95
5749 95 178 60 -14 13 51 -205 21 89 26 -7 -21 244 -97 -104 155 -36 47 107 39 -47 87 46 -245 -48 -24 169
5775 169 180 -32 -98 -30 148 112 -133 137 218 -100 -21 -76 226 -143 -262 128 -124 146 -113 29 -147 34
5797 34 -64 90 -10 7 294 -6 288 124 -193 212 163 -93 38 169 -46 -38 298 128 -103 -134 156 34
5819 34 -75 63 -95 -101 261 -65 317 90 -33 21 278 -342 73 28 -34 -284 133 -156 4 92 -15 56 -61
5842 -61 -116 -40 149 53 156 -251 489 310 -106 21 45 -202 -111 94 244 -177 -20 -69 186 -100 -198 49 56
5865 56 18 270 140 -161 -49 68 -9 -318 28 130 -129 -120 63 96 263 -136 15 42 -34 -16 -271 257 -122
5888 -122 177 195 224 15 -66 44 -9 -203 -93 -138 -114 125 -235 157 -164 -64 -35 -17 9 -247 17 -55 71
5911 71 57 -23 -228 -107 -114 -27 -167 -403 -244 47 142 -404 161 56 -46 280 58 -28 -117 122 210 -117 175
5934 175 288 66 390 -107 182 29 -196 -37 136 -108 -87 91 -384 114 18 84 271 -110 -123 -35 75 193
5956 193 135 26 71 156 -88 54 148 228 7 360 189 -121 118 172 39 210 41 376 -63 -146 -12 114
5978 114 -19 -220 -20 190 -159 -161 -10 233 181 83 185 44 -75 -30 260 -175 27 228 168 -80 -228 -94
6000 -94 29 -142 -242 173 -76 41 182 178 -65 42 -120 -147 -283 71 130 -89 -245 -180 -33 -33 -319 -171 67
6023 67 60 -63 360 173 241 222 23 214 -305 -307 4 21 87 35 -154 32 19 -6 -196 85 -216 164 206 -205
6047 -205 -194 28 -48 3 75 150 130 -230 292 3 -122 31 -408 44 -257 -105 136 241 -68 -74 14 -227 -161
6070 -161 368 -235 155 -78 -126 23 -183 43 49 -129 -29 -94 -220 167 98 17 350 250 79 -101 129 -167
6092 -167 -145 -25 -85 61 14 147 182 -92 -231 307 -117 84 30 -27 -5 -226 0 -17 45 439 -119 1 -64
6115 -64 31 -244 158 -135 -106 192 -80 -171 -113 45 291 129 -91 56 -140 50 -282 121 75 -329 -85 -212
6137 -212 -154 -16 -97 -121 -104 296 107 -357 -74 -108 -256 39 121 -3 145 -106 -4 -61 -201 91 178 -80 -133
6160 -133 -134 -3 54 -92 -380 -8 24 133 -4 114 12 -5 -115 147 299 -219 168 37 38 135 -61 80 81
6183 81 138 -320 288 125 120 -47 -5 -141 78 63 -46 94 320 -95 103 140 -157 -293 33 12 -22 259 179
6206 179 48 -52 -62 -107 206 270 32 -284 4 48 -33 6 73 122 -69 37 -57 78 22 -39 14 -208 135 183
6230 183 10 -78 -112 -98 146 -27 136 -3 -116 20 40 -224 -11 282 -204 -7 200 237 116 20 14 -36 -126
6253 -126 -16 294 -281 20 -120 101 29 -337 -226 13 31 74 59 175 238 6 82 -101 -194 -49 -125 -230 -48
6276 -48 79 -186 -64 -89 -84 -87 -75 -69 50 -142 40 -370 53 -170 29 -149 -1 31 -2 19 -98 -171 6 184
6300 184 139 103 54 -80 -103 223 -238 -135 0 -117 131 241 186 90 -7 109 -110 62 101 197 119 -187 -214 66
6324 66 -169 116 138 -184 -117 -132 -190 236 -65 -61 -5 -47 44 54 280 44 28 -357 30 -109 48 28 -125 -170 -238
6349 -238 -150 119 133 -64 301 122 -134 -82 -56 164 -82 73 6 139 97 169 -170 -68 193 56 375 66
6371 66 92 -122 -15 -120 125 262 -90 147 67 57 -153 15 -49 -368 -7 -22 89 35 -217 -92 111 184 -104
6394 -104 -197 11 161 -7 271 -193 211 137 110 -86 -119 -41 -211 242 270 -60 43 -171 -96 -39 3 21 -342
6417 -342 224 -36 109 -197 -166 -213 25 -141 -42 73 -151 -53 -79 -69 -135 -57 85 73 -66 -40 -37 167 32 -98
6441 -98 -130 169 -143 -170 -44 -21 -204 144 35 32 204 239 124 -83 -23 -32 -17 -139 -66 -84 185 67 -70 -87 -59
6466 -59 103 -97 -181 -287 -23 -112 -60 -35 -127 19 174 65 104 -176 58 42 -59 16 -27 -71 87 28 35 -153 -133
6491 -133 127 22 34 146 261 -25 -234 -229 -29 93 -46 240 -234 87 105 95 9 273 -84 -158 235 108
6513 108 85 131 59 68 122 51 -24 153 -118 -79 86 -65 189 142 -160 -102 -62 -224 258 -206 -86 18 -217 95
6537 95 140 -107 -38 224 247 60 -252 206 -59 -69 38 40 -115 81 -15 -152 280 104 279 -408 12 108 26
6560 26 -14 2 -84 -89 -61 86 126 -59 163 -100 13 19 34 -79 91 -108 -219 7 -256 -271 -15 166 191 -193
6584 -193 106 -192 59 -20 137 -204 -96 -28 22 17 -44 -124 39 34 151 105 -50 231 78 -127 279 -79 -64 -24
6608 -24 -78 -116 -43 112 -53 7 40 34 238 60 -161 -148 -197 3 -212 -28 -220 195 11 139 -232 -26 285
6631 285 8 -3 -247 -128 -59 -2 -60 -103 71 -41 -167 -94 53 26 -10 4 175 -65 21 -114 -106 -128 -55 -193 -44
6656 -44 -283 46 -9 -144 -255 132 174 -13 279 -96 88 292 38 81 -52 276 -108 123 138 64 -53 -256
6678 -256 -45 -16 -134 81 57 -88 -162 -14 82 181 -8 -175 179 -7 -10 127 -129 -164 84 -67 -17 50 242
6701 242 -74 88 12 -41 -52 80 -288 150 0 20 33 241 -300 -195 47 -245 292 11 107 -140 -17 -138
6723 -138 58 -89 -36 -110 14 -52 155 43 117 163 101 -121 72 -148 148 29 46 37 171 -175 -63 43 -239
6746 -239 27 77 -145 -251 100 134 51 -95 79 149 -171 19 -115 136 -234 20 5 87 -8 -60 -67 -336 -46
6769 -46 102 -1 -45 67 -35 85 -29 307 -104 33 -37 32 -116 -1 -12 99 68 194 83 37 87 135 191
6792 191 92 33 -177 -17 4 -45 41 50 76 430 177 -9 30 -23 193 72 -11 10 -205 -68 -44 39 -144 142 110
6817 110 -93 18 -310 375 37 -102 510 -62 -139 -140 -171 107 -33 116 62 23 88 -51 -38 -101 -42 266 -122
6840 -122 -22 113 -176 124 -61 451 -85 -79 -94 100 -124 -167 -49 33 -86 11 202 32 -85 2 -195 45
6862 45 -4 83 156 -37 28 -183 128 -52 170 86 211 -162 -40 65 118 -12 -50 52 -4 58 -6 -359 -166 109
6886 109 -97 -153 22 236 -188 -72 -12 26 -69 -22 31 -72 -222 116 16 -38 144 -10 12 -80 216 198 293 -243
6910 -243 -20 45 -32 128 50 185 190 46 75 60 -92 -93 -15 -89 -135 11 -57 -61 -268 -107 -309 0 34 87 -218 -95
6936 -95 22 -144 -158 59 -70 -147 275 -85 -32 -59 -84 -12 57 103 121 -47 -47 130 -66 -125 363 85 47 -101 -59
6961 -59 -69 67 -255 110 158 -113 -118 60 43 91 1 -32 144 93 131 -261 -71 -110 -174 -93 -43 -60 75 9 118 192
6987 192 26 -191 48 246 -151 146 132 -147 46 33 -101 -191 -63 336 -109 3 -141 34 -71 185 -48
7008 -48 141 120 -71 52 -74 -51 193 -113 -220 -377 -131 281 -105 -92 22 -219 329 91 -18 -60 100 -241
7030 -241 -153 156 251 94 -199 109 -4 -205 6 -64 -206 116 166 -39 193 -94 157 -25 -46 174 -336 -267
7052 -267 106 256 109 -80 -22 -95 -70 114 -44 -9 86 2 149 174 -35 -250 -101 31 -324 -32 -91 -53 137
7075 137 88 -143 -31 -40 -103 101 -217 -1 158 185 47 -17 -120 -57 43 44 -166 340 282 -98 -60 -138 257 138
7099 138 312 -101 37 15 -270 87 30 -108 99 -133 -258 164 -137 -4 -151 86 157 -222 -10 170 -172
7120 -172 -81 20 21 145 -106 132 -131 -45 164 162 68 217 85 -80 241 173 28 -71 -59 -228 -58 132 79 113
7144 113 139 158 -141 -179 0 24 -30 -3 -40 -160 24 69 -91 159 40 -83 24 102 -312 -28 -87 34 -108
7167 -108 150 -155 -107 100 -113 128 148 70 282 -200 -106 -85 -105 92 -71 251 -49 -37 -60 109 267 -180 19
7190 19 -17 321 208 -26 -26 2 249 146 24 -167 89 -51 -55 113 -37 63 11 57 -247 -73 -73 66 -31 45
7214 45 168 -59 -269 34 -64 33 151 174 102 -253 -132 -87 -176 -116 37 -82 -51 376 -91 114 0 232 68
7237 68 50 -18 216 -1 -243 -63 -117 -47 -120 -141 6 -18 -51 -9 -40 191 -252 -121 -80 58 -95 -3 266 -1
7261 -1 110 -242 238 122 -19 147 142 -218 -196 256 149 -156 263 206 91 -184 73 200 334 150 -92 74
7283 74 -98 -86 56 64 157 -19 18 182 -14 21 344 177 201 -238 277 180 -146 12 63 -73 -5 149 62 38
7307 38 -349 189 -148 -55 -193 320 -96 -183 -14 58 -36 61 318 -47 -270 265 -56 125 -77 69 297 26
7329 26 193 219 -35 -349 -166 -128 205 -158 -39 305 126 -91 23 -172 107 -22 -23 215 86 -143 -48 -54 -70
7352 -70 -7 -145 -194 153 -200 -5 120 -162 50 -46 218 -2 -148 53 -299 -223 146 -33 71 66 -113 -76 113
7375 113 93 2 -41 -90 10 146 104 -540 -116 -286 2 -3 -163 118 -228 45 138 -61 -49 -226 235 41 125
7398 125 17 -128 -2 -217 63 46 -175 -15 -217 176 181 -4 26 33 77 -76 -56 -185 10 121 11 19 -89
7421 -89 123 143 150 39 97 17 -37 -187 -39 -56 -109 1 209 163 -141 -112 45 -28 -286 -128 66 -71 -58 -141 -287
7446 -287 221 21 201 -49 -147 122 26 130 -235 49 -17 -165 0 134 -151 -36 -142 51 132 -177 -94 -40
7468 -40 153 -8 -33 50 133 -213 71 -99 -203 -47 17 159 -142 87 60 10 46 -288 -109 -19 154 5 -55
7491 -55 165 -240 61 275 -34 3 143 36 179 84 -270 9 289 -68 71 8 217 -202 -48 -90 -254 143
7513 143 72 -35 -126 118 43 52 50 80 -414 -286 -74 121 -228 69 31 180 -290 199 -154 114 -18 -193 -276
7536 -276 71 -238 -124 11 -128 3 -102 158 -112 48 -5 6 -129 -25 -149 436 254 -66 113 93 -107
7557 -107 184 6 -5 -72 -32 -99 -186 36 -46 59 126 6 -7 -7 -122 -143 42 -189 267 -249 -18 -146 128 -127
7581 -127 -34 66 254 -253 -161 227 208 164 59 187 -43 196 26 -146 93 71 111 -60 -188 131 -115 0
7603 0 -136 16 7 -294 150 -131 -373 -114 4 55 -65 -95 162 36 210 -15 1 -4 -74 -79 190 55 -359 25
7627 25 198 -163 177 -37 187 29 70 -275 -51 44 -104 62 -138 8 -58 -179 183 56 90 68 207 -57
7649 -57 -173 124 67 -82 64 -183 175 -118 205 70 248 -204 -175 -65 -126 184 -44 62 357 -175 209
7670 209 -27 -76 -209 212 168 135 139 36 24 -127 -87 -157 127 86 -5 -18 -16 -89 113 46 -61 -24 166 -132 -59 20
7696 20 190 -211 -58 -52 -14 -155 0 18 -131 143 176 33 31 123 177 86 -28 102 227 16 -143 -202 8 -9
7720 -9 -288 18 231 -179 -125 -263 80 -239 -163 -258 -20 5 135 60 36 213 119 8 -15 -102 203 -1 235 -210
7744 -210 -64 -82 -222 154 163 147 221 -56 228 2 -298 -62 52 81 115 69 -166 -69 28 -126 -45 -122 -88 -114 83
7769 83 -107 98 223 47 128 110 99 126 -96 101 67 75 -138 -70 197 -9 -31 236 31 33 -96 -96 -59 230 153
7794 153 57 35 -138 -197 -78 -278 -12 -30 -45 162 -308 -24 -53 -109 -335 -81 -122 167 301 72 -50 250 6
7817 6 -13 -117 136 -138 -293 184 -54 -15 75 78 -71 -115 -19 -138 190 95 -153 131 -100 -49 -80 45 38 -476 119
7842 119 167 -273 -103 -52 -151 -126 -320 96 -124 231 18 77 -81 87 13 61 -88 41 130 -135 -305 -93 213
7865 213 257 48 17 -105 -21 144 -130 70 -49 57 204 -59 -9 370 -259 22 59 -156 -197 -128 62 -200
7887 -200 -40 -84 -165 -30 28 46 69 142 -105 28 -17 -169 -132 81 -126 -275 43 4 -4 -131 5 133 -317 93
7911 93 152 19 -49 81 110 -62 107 -124 -152 -22 -14 -179 -65 -97 -229 -63 124 -59 22 -40 75 63 -195 -258
7935 -258 -116 88 15 137 -195 94 432 -14 -166 -57 80 -242 -29 56 -281 -109 91 -101 149 33 66
7956 66 -40 -17 -97 -225 -34 -70 97 71 -44 -21 -84 76 55 100 -46 159 -65 -187 54 -39 8 -299 155 -67
7980 -67 -224 73 14 1 28 83 201 61 460 -71 -7 7 168 105 63 110 82 -132 -54 121 -21 234 -42 94
8004 94 -236 -62 33 7 -29 -13 81 129 -171 -42 -169 -60 -343 32 74 -95 -30 3 -89 -194 -12 126 143 15
8028 15 -2 36 -4 -28 -131 95 28 -68 -6 -38 159 98 92 -34 -68 152 58 -116 47 61 120 -162 144 81 -10 -157
8054 -157 40 -72 26 -102 -4 -155 -137 -80 -46 -346 -115 32 -31 61 131 -38 -170 -182 83 394 -56 -81 10 -190
8078 -190 169 -119 56 78 -207 383 -132 178 241 -173 -192 -199 -21 144 -155 37 -53 -30 39 -46 29 -163 260
8101 260 -68 189 191 19 1 -19 82 -46 -10 138 -18 11 14 -259 -188 -83 118 -18 -292 -234 -98 359 -205
8124 -205 -183 -50 7 155 -126 -112 39 -145 80 -44 91 -216 -128 -134 29 110 18 304 -204 -68 -75 -34 -17 342
8148 342 -16 50 -125 32 100 28 -138 -109 57 12 46 -198 194 -37 -175 176 278 68 20 151 -149 70
8170 70 132 -9 235 -156 -63 253 -99 -138 -59 -86 -292 27 -84 -183 114 -70 174 23 -31 399 90
8191I0
$$ Imaginary data points
##PAGE= N=2
##DATA TABLE= (X++(I..I)), XYDATA
0 0 0 0 0 0 0 0 0 0 0 0 0 0 2 -8 8 -8 8 -16 16 -16 24 -24 32 -33 40 -48 56 -64 72 -82 93 -107 122 -138 156
35 156 -174 196 -219 244 -271 302 -334 371 -411 454 -501 553 -608 672 -739 814 -897 990
53 990 -1094 1210 -1342 1490 -1665 1869 -2112 2407 -2770 3242 -3865 4742 -6063 8267 -12623
68 -12623 24497 -124786 -377303 -94359 107056 135611 162707 139493 -23614 -79446 38076
79 38076 169788 204136 182783 79264 -37449 -76934 -29915 99706 210624 83894 -128570
90 -128570 -147152 -72907 -66198 -22547 50732 -19051 -172901 -170086 -62536 -24933 12014 66399
102 66399 -96 -108851 -102024 -6628 80871 108200 74828 25984 -6208 -10498 28632 109528
114 109528 136300 38012 -49203 -26671 -5538 8253 76064 80993 -29144 -95649 -56448 -17354
126 -17354 -14221 6956 14445 -42233 -89042 -63369 -2053 38479 28427 -8656 -30611 -48270
138 -48270 -42043 18586 68510 41397 -11570 -16649 -159 -3081 18680 63442 43590 -22172 -36101
151 -36101 -1985 18551 26577 42276 33918 -18728 -49632 -17611 20214 21394 5885 -3477 -18231
164 -18231 -40263 -26805 22366 33298 -6840 -32461 -28665 -29561 -25080 12599 37212 2886 -32342
177 -32342 -15941 8591 9392 13552 28097 18106 -16157 -17595 19766 32630 17002 16230 16887 -8090
191 -8090 -27023 -2342 26066 8427 -17583 -13150 -8639 -21098 -18064 6777 8526 -22992 -33085
204 -33085 -9064 -3417 -12460 3863 24866 8885 -16055 -2589 23449 16662 5257 17476 16237
217 16237 -6780 -7884 20909 29450 4226 -8823 722 -4557 -17623 -7772 8911 -2225 -25649
230 -25649 -20143 -499 -7061 -14714 3184 8883 -15828 -22988 3160 18203 5135 5135 17464 7767
244 7767 -6220 5187 22296 15965 -2085 -2260 7060 -371 -7441 7233 15169 -4255 -20420 -9770
258 -9770 -1978 -14552 -12876 5427 -402 -19366 -12876 5219 5743 -724 3847 6896 -4340 -7907
272 -7907 7698 17108 8913 385 5647 9993 -133 -3837 9023 8568 -7594 -8195 1817 -2029
286 -2029 -10173 -1665 6589 -5201 -13251 -3943 26 -4523 -2742 3078 2743 -2384 -1477 6655 7375 -354
302 -354 -380 5811 3490 -3895 -906 6997 2691 -2874 1998 1568 -6924 -4303 3793 -87 -9433 -6326
318 -6326 2130 1517 -2330 332 2130 -1328 -1864 2241 4761 913 -1584 3397 4199 -1970 -950 6223
334 6223 4504 -4619 -4526 896 -2185 -4889 1863 4296 -4565 -8071 -520 2514 -1308 -1519 1459 -795
350 -795 -3847 504 6839 5056 269 2543 5873 1282 -4079 216 5376 397 -3924 -486 269 -4526
366 -4526 -2507 3819 844 -7353 -5521 1172 -760 -5510 -1431 3575 1046 -1570 1964 3903 44
381 44 -455 5379 6490 -716 -3063 3360 5689 416 -2407 1240 384 -4958 -2802 1042 -3058 -6276
397 -6276 -198 3236 -2856 -6378 -907 2878 -634 -2547 -101 1525 1338 1257 3763 4038 622 1553
413 1553 5981 3306 -2849 -1956 3040 1932 -2765 -1357 530 -2551 -3200 -583 -1134 -3481 -2783 -780
429 -780 -274 -2119 -2448 1270 3977 1924 -1063 121 1807 1229 2759 5208 2084 -828 1368 2175
445 2175 366 -364 -62 -995 -2549 -3640 -2863 -1427 88 -822 -2511 -1663 -1592 -1759 527 767 -1151 28
463 28 2075 3049 2269 1837 1810 3188 3334 2076 101 -60 149 -30 391 240 -1518 -2526 -2620 -3015 -2484
482 -2484 -1526 -523 -1377 -3336 -3435 -81 1495 1057 -554 -911 530 1942 3057 3012 892 797 3408 4408
500 4408 1583 -1258 -356 1601 1191 -1054 -1406 -828 -1056 -2196 -1009 -114 -2120 -2571 -218 -1488 -3425
517 -3425 -1250 1888 1372 -532 -1460 -241 1896 2058 390 576 1576 639 1318 2672 152 -2514 1320
534 1320 3433 37 -2858 -2146 -740 990 2080 -181 -1921 -1733 -686 385 1647 -1278 -2836 163
550 163 1731 -1269 -1455 1530 1601 -457 -697 161 -827 -731 63 349 -495 -395 -254 611 522 -1102 -98
569 -98 2441 2059 -681 -1358 430 828 1346 2368 491 -2113 -1312 514 1145 348 -1405 -1470 -921 -990 -1250
588 -1250 -597 -332 -1500 -1272 -235 -902 -1167 798 1235 445 394 1339 1877 1491 648 1333 2295 1429 -195
607 -195 288 1093 -522 -1227 670 459 -1239 -972 -1592 -1961 -1457 -867 -551 -785 -2429 -2784 463 1713
625 1713 65 -291 1580 1013 6 1833 2089 336 1192 2074 1822 1100 -67 139 783 551 -768 -1446
643 -1446 -228 -586 -2433 -1308 -132 -1805 -1520 -357 -1543 -2332 -741 744 1675 701 -421 267 1594
660 1594 3059 787 171 1628 686 -76 1685 319 -1365 737 2077 -189 -2265 -1961 -641 -775
676 -775 -333 -1017 -1747 -769 -1074 -398 1605 759 -1445 491 1338 133 -203 1770 2224 715 78 1299
694 1299 496 -473 -130 352 232 -836 -1176 806 118 -2082 -1048 702 -188 -1943 -1580 -87 -640 -302
712 -302 2139 1323 -798 -485 1526 2001 204 -599 966 461 -909 -280 1397 865 -1028 -940 842 11
730 11 -2090 -793 994 -1040 -831 159 612 -856 -1545 882 1440 -662 -573 1090 1109 -219 -22 1594
748 1594 1001 -909 -479 201 -288 -634 -87 717 -180 -1296 -593 316 -817 -829 205 468 -1044 -1045 695
767 695 915 -416 676 1334 539 -8 -138 501 979 1011 451 32 -342 -381 62 183 -205 -964 -140 -180 -678
788 -678 -410 -186 -165 -384 -444 -684 -741 -564 251 573 812 1568 925 142 396 1053 760 451 207 39 -435
809 -435 -574 211 334 531 -210 -733 -1050 -992 -518 883 269 -1273 -1297 731 843 -681 -231 568 -34 -61
829 -61 1042 880 -281 -102 1096 1498 -346 -1155 -8 -156 -653 -696 579 560 -956 -721 954 -281
847 -281 -1390 -263 1063 -164 -2036 -927 1266 782 -53 592 79 -493 -122 894 983 -1074 -1186 1149
865 1149 819 -1141 -1119 401 1246 -514 -721 723 -140 -915 893 1050 -394 -785 429 1445 -800
882 -800 -1191 625 1317 -57 -554 3 494 -229 -396 1010 -97 -1991 -1023 170 19 -1085 -485 1086
900 1086 341 -644 333 460 -377 384 1250 538 -419 -573 822 954 -82 -102 -68 733 -249 -785 176 308
920 308 -358 207 -255 -1024 -956 -360 304 -400 -698 318 166 -220 -48 141 751 675 28 477 346 177 476
941 476 890 932 270 -306 28 -196 -632 -492 -352 -767 -1085 -1205 -964 -75 -296 -492 -726 -265 -116 20 989
962 989 865 121 477 774 1390 446 44 842 1236 638 294 547 164 -155 -47 355 -596 -1231 -363 -350 -1237
983 -1237 -986 -218 215 -281 -1420 -912 367 412 -210 142 199 -641 36 1267 793 -321 151 793 1079
1002 1079 307 18 480 695 11 -318 -107 -222 -993 -719 379 -503 -1118 -205 352 -575 -403 -220 101
1021 101 -142 60 -434 -337 -187 87 640 518 -20 -545 627 667 -315 -119 833 188 -320 217 339 69
1041 69 249 363 218 -435 -35 272 265 470 -557 -381 164 -713 -1344 -184 -174 -704 -324 108 -217 -452 -169
1062 -169 198 218 289 -152 -44 308 82 47 1269 626 -566 292 896 77 187 520 568 -113 -459 96 -99
1083 -99 -377 -803 -260 -4 -491 -1299 -505 451 -161 -199 -159 -733 -774 194 902 18 -296 529 827 550 401
1104 401 151 497 981 178 88 512 160 -52 147 -220 -683 -194 158 -661 -938 -494 -277 146 465 -690
1124 -690 -1254 -85 330 -51 161 57 -424 185 811 833 370 227 -50 235 586 -37 -704 293 444 -308
1144 -308 -183 -197 -658 -343 426 -311 -872 -506 91 -86 -439 40 174 73 -61 -294 230 189 -88 346 1051
1165 1051 85 -662 561 1002 -204 -236 394 695 -491 -603 439 337 -371 -182 426 -240 -1139 -831 424
1184 424 443 -797 -460 602 -418 -600 395 693 -378 -1063 379 756 -588 -395 794 1028 -212 -164
1202 -164 805 385 -579 -78 1191 292 -958 220 874 -143 -1115 335 805 -661 -1408 -61 388 -774
1220 -774 -365 593 346 -986 -630 1087 75 -755 93 1018 0 -752 489 1166 -276 -612 778 675
1238 675 -434 -634 834 828 -734 -309 876 22 -1066 312 879 -165 -1201 100 502 -819 -820 640
1256 640 22 -806 -774 660 188 -841 9 1111 179 -449 -12 682 -128 -909 645 1030 -454 -648 1141
1275 1141 1008 -504 -177 1186 -58 -1101 -39 931 -756 -885 569 874 -935 -917 555 727 -965
1292 -965 -575 686 284 -782 -260 1179 -79 -1022 384 1466 -399 -971 1118 1413 -575 -504 1349
1309 1349 699 -1427 -357 1176 -63 -1224 -54 1229 -227 -1720 183 1374 -502 -1434 510
1324 510 1004 -1319 -792 1443 977 -1588 -632 2029 726 -1560 81 1898 104 -1377 445 1897
1340 1897 -866 -1725 1057 1350 -1456 -1574 1170 1144 -2098 -1064 1741 423 -2081 -488 1736 -259
1356 -259 -1953 827 1796 -1144 -1767 1215 1938 -1014 -818 1914 986 -1977 -811 2039 324 -1831
1372 -1831 -159 2008 -312 -2124 316 1916 -747 -1923 727 1826 -1482 -1267 1867 1177 -1877
1387 -1877 -864 2101 504 -2045 -1 2171 540 -1856 459 1696 -925 -1711 1299 1588 -1592
1402 -1592 -1573 1416 1091 -1921 -767 2108 406 -2149 -318 1969 -409 -1981 526 1988 -748 -1736
1418 -1736 1002 1247 -1397 -1054 1561 1173 -1988 -818 2178 552 -1840 -93 1769 -373 -1862 822
1434 822 1536 -675 -1229 1342 1250 -1649 -953 1674 742 -2058 -681 1865 -160 -1784 393 1774 -911
1451 -911 -2026 897 1508 -1581 -1757 1594 1278 -1691 -1240 1758 723 -1861 -89 2195 109 -2066
1467 -2066 731 2428 -886 -1739 1184 1927 -1270 -1440 1566 1020 -1986 -673 1575 207 -2340 -417
1483 -417 2063 -239 -2610 375 1924 -928 -1698 1084 2082 -1206 -989 2350 1308 -2065 -393 2508
1499 2508 580 -1754 135 2186 -260 -2264 702 2161 -856 -2136 895 1539 -1924 -1704 1912
1514 1912 1057 -2527 -925 2117 167 -2194 73 2470 -147 -2083 940 1989 -1033 -1726 1441
1529 1441 2135 -1274 -1510 1656 1235 -2056 -506 2273 351 -2286 -264 2311 -660 -2126 889 1372
1545 1372 -1474 -2053 1228 1787 -1596 -1544 1836 887 -1747 -542 2006 371 -2227 53 2176 -649
1561 -649 -2370 1015 1906 -814 -1473 855 1430 -1440 -968 1276 928 -1618 -647 1440 -128 -1845 144
1578 144 1781 -388 -1809 872 1477 -961 -1168 1246 1123 -1330 -553 1689 611 -1800 -150 1678
1594 1678 297 -1782 -444 1571 -496 -1579 733 1325 -1367 -1240 1234 940 -1544 -840 1832 729
1610 729 -1377 -13 1411 -80 -1191 721 1590 -679 -1405 688 1527 -999 -1195 1452 1106 -1647
1626 -1647 -652 1423 244 -1528 -1 1068 -566 -1634 629 1614 -697 -1133 747 1150 -1088 -817
1642 -817 1258 713 -1561 -755 1361 204 -1686 387 1661 -390 -1482 856 1549 -534 -1412 1098
1658 1098 940 -1211 -741 1358 894 -1286 -335 1843 470 -1477 356 1683 -321 -1218 700 1589
1674 1589 -782 -1518 1016 757 -1095 -875 979 642 -1416 -446 1712 318 -1488 145 1326 -244
1690 -244 -1277 702 1380 -236 -1213 763 916 -656 -599 930 569 -1477 -654 1357 121 -1241 -71
1707 -71 1034 -222 -1263 219 694 -478 -1184 821 976 -722 -617 761 601 -1061 -55 960 282
1724 282 -1112 23 908 157 -1127 228 827 -569 -1148 319 669 -902 -645 751 392 -701 -226
1741 -226 681 45 -601 -91 803 141 -904 464 952 -260 -507 796 500 -471 -487 497 331 -486 -268
1760 -268 525 48 -1095 -76 489 -261 -241 245 278 -430 -451 502 334 -435 -294 500 -109 -362 -116 686
1780 686 -80 -531 203 531 -254 -124 419 270 -648 -496 495 160 -376 -250 732 263 -485 115 583 -157
1800 -157 -343 372 387 -114 -349 549 474 -600 -143 533 349 -496 -45 270 54 -292 148 226 -397 -630 382
1821 382 438 -536 -161 259 665 -410 -329 485 329 -260 170 284 2 -520 56 544 -13 -556 57 274
1841 274 -160 -481 12 351 -344 -282 487 369 -298 -4 340 89 -156 21 294 21 -242 -39 333 -206
1861 -206 -68 212 288 -178 -269 355 167 -417 -138 225 161 -245 -320 283 -247 -507 298 164 -4 -154 -94 349
1883 349 47 -11 218 -16 -5 -128 122 -76 -205 -50 219 -207 -359 -101 25 -86 -123 -119 62 -136 -219 23
1905 23 104 14 179 188 183 -155 39 297 189 318 41 155 -112 -30 106 -18 -121 98 -111 314 -82 156 -46
1928 -46 -147 243 173 -139 -32 -79 -17 18 -15 232 3 178 -3 -220 -64 83 -58 227 -137 -200 -207 -62 3
1951 3 -80 -112 231 23 50 26 -170 17 -60 139 -413 -174 -133 89 88 22 -39 370 -56 -137 189 -120 80 2 160
1976 160 109 43 -121 262 165 -140 -258 2 -97 23 -43 41 224 -306 -11 227 -310 -93 -160 -40 29 262 94
1999 94 181 79 160 -36 65 -157 -101 -9 16 21 -48 -192 57 -34 -183 -72 74 -153 -322 48 70 13 -28 37 -119
2024 -119 -79 293 252 -139 340 243 166 -7 -24 91 58 -174 -81 130 -116 -212 -118 -66 210 224 -178 96 105 -315
2048 -315 -111 30 -147 -27 1 -37 13 44 315 221 -130 -166 139 85 151 -6 -294 244 -180 -72 183 13 100
2071 100 172 -61 15 -101 -99 101 7 -49 -239 0 -184 -9 206 -25 -114 -31 -150 -150 -177 -35 -140 68 271 -203
2095 -203 4 -35 205 -1 -122 29 -114 93 -335 92 170 39 -239 92 275 -498 47 112 -24 -127 -76
2116 -76 240 162 70 190 -89 -113 -78 30 277 -154 -267 -81 139 -193 12 114 202 -195 -32 259 233 -102
2138 -102 -235 79 104 -130 18 -80 156 19 69 -31 -82 60 -192 -5 -309 -87 86 159 -207 -33 76 32
2160 32 190 313 206 -62 -143 47 324 79 184 24 325 -157 -348 11 256 -56 -210 -20 157 74 -30
2181 -30 13 198 -178 -243 194 122 -241 -225 -21 42 -102 -277 231 -295 -404 -22 208 4 -76 -143 49 79 -101
2204 -101 98 67 -243 -78 -46 -93 -283 53 -103 188 -212 -107 95 122 -128 118 101 -398 -25 -27 187 155 -38
2227 -38 -176 123 28 260 102 9 20 -247 90 -367 27 325 22 -153 -11 193 -83 295 67 -133 290
2248 290 -171 201 167 142 -2 -7 219 -118 -124 -182 -59 -189 337 148 47 96 -154 281 -177 -121 -92 86 -278
2271 -278 -105 -105 -185 54 -229 110 -4 32 -181 -87 214 -26 -15 -103 6 73 79 28 -107 -7 -132 -50 -455 180
2295 180 130 -39 -303 -33 148 -29 138 408 148 -147 -179 -37 196 -211 74 224 297 46 131 143 -28 -165
2317 -165 -56 -10 114 130 117 78 -37 -10 -49 39 -219 -64 297 -142 -37 -40 10 181 -143 202 179 34 -135 99
2341 99 7 -150 -288 45 241 -223 -88 -155 264 6 -153 173 48 -108 204 85 -47 147 -15 168 -22
2362 -22 -201 -118 86 -77 204 -227 174 -338 -219 -224 -125 -50 135 -190 35 -94 -19 -136 308 -42 72 150 183
2385 183 181 35 196 88 -26 -171 243 -242 -121 9 -131 -83 11 36 -125 50 45 8 -386 -244 -85 -47 -99
2408 -99 -86 137 41 -61 -119 -47 -224 -132 168 276 -60 -53 -101 -125 217 81 -41 -153 58 156 179 204 -263 -196 32
2433 32 -6 211 -119 155 -178 91 -21 -291 -136 3 225 -56 -17 46 272 18 4 146 -103 15 -94 -26
2455 -26 216 223 -53 175 -364 -187 -14 -225 26 131 109 8 -50 70 -92 -212 51 32 23 31 -154 -81 217 46
2479 46 -63 19 107 277 285 27 -29 -92 30 196 68 -7 -166 77 -84 53 -230 63 -16 -147 -129 8 46 19
2503 19 59 59 73 22 -15 50 -154 -30 38 48 -14 258 93 -90 315 -169 58 25 34 124 221 122 175 85 96 154 -167
2530 -167 -187 -14 -100 -62 -82 -150 -81 -87 231 197 -333 -15 49 111 -172 -23 68 -22 150 8 168 -26 71 8 85
2555 85 36 4 -186 115 37 38 228 374 28 346 -218 64 -57 62 -45 -31 -126 110 176 6 296 83 -65
2578 -65 54 -191 -46 24 136 -38 -211 -125 -167 228 -85 -61 -162 115 -112 -119 -96 390 -104 74 58 -23 -4 27
2602 27 -64 316 -72 144 81 -154 -240 69 54 117 -16 56 -20 -275 -165 27 8 154 129 109 46 -54 135 -111
2626 -111 -157 -242 313 205 171 -22 -11 19 -171 154 -66 53 -22 135 -247 -180 12 43 -285 -135 86 -10 -31
2649 -31 -38 -103 15 160 14 -188 177 50 -314 -247 53 75 -130 67 100 98 -167 82 -123 68 -166 -269 192
2672 192 11 -211 48 -94 83 -146 207 -17 -59 145 -83 105 -288 -69 279 -176 -80 -60 140 -45 -69
2693 -69 80 -3 -280 -183 -59 199 -96 134 229 -41 -186 -175 213 -101 -109 -35 129 -217 -44 91 154 -181 -40
2716 -40 102 62 36 -217 54 -111 -153 202 -41 21 -104 182 74 -149 -128 158 432 -66 -243 20 158 -62
2738 -62 117 52 -89 -161 -2 142 29 -179 -4 -85 -219 -344 19 73 -125 -196 -40 -62 -322 -236 153 262 -279
2761 -279 149 336 68 -340 264 116 -106 39 35 -50 47 -66 215 65 -261 -48 309 -365 -133 179 -47
2782 -47 -13 -422 -86 70 -131 301 262 -68 84 -83 -73 -172 -33 278 -10 344 -217 -34 369 -18 -295 98
2804 98 189 -293 3 438 259 -275 67 251 -110 -212 96 292 76 -190 -6 189 -253 -384 132 430 -311
2825 -311 -370 68 424 -219 -82 462 277 -87 4 354 156 -352 235 307 -117 -260 115 511 -137 -175 76
2846 76 306 -373 -138 338 -32 -191 2 563 -147 -315 -46 243 -303 -569 168 120 -162 -227 65 85 -350
2867 -350 -147 407 -31 -197 -74 133 28 -153 224 189 124 -412 271 119 -404 -191 111 183 -690 -165 264
2888 264 -10 -275 67 317 -85 -186 103 337 -218 13 292 37 -380 -56 401 147 -424 62 432 -177
2908 -177 -433 -105 432 -48 -83 218 -21 -360 -284 472 175 -106 56 120 238 -233 -42 348 -26 -576 128
2929 128 270 -123 -171 292 271 -160 -228 270 342 -607 -234 416 102 -160 -189 293 -127 -268 94 639 -78 -411
2951 -411 251 371 -189 -292 309 -9 -170 -331 657 338 -378 234 267 202 -205 -44 158 -237 -152 414 194
2972 194 -426 -18 259 86 -405 -100 524 -147 -435 90 486 128 -648 -83 403 -152 -466 7 473 -351
2992 -351 -199 278 54 -361 14 503 225 -401 224 255 -199 -239 243 242 -325 -132 230 -55 -191 -152 254 -31
3014 -31 -464 -60 271 29 -604 -38 576 -126 -479 127 435 -28 -484 113 187 -241 -135 298 168 -789 -148
3035 -148 146 86 -306 -100 621 -7 -258 12 416 -156 -41 94 195 -223 -19 481 195 -107 -161 85 -62
3056 -62 -571 92 417 43 -368 -59 172 70 11 436 148 -274 -120 107 297 -451 -79 195 45 -323 115
3077 115 151 168 -254 129 118 -125 -251 87 129 -322 -156 411 -6 -465 37 379 78 -287 90 191 -307
3098 -307 -150 21 197 -231 -336 251 180 -210 -198 280 -86 -355 -13 286 154 -485 179 123 -179 -458 48
3119 48 305 88 148 467 125 -394 121 242 256 -116 -150 305 58 -144 79 272 -57 -186 252 98 -354
3140 -354 -135 399 -163 -307 -74 232 13 -175 6 -64 -182 -184 195 392 -94 -342 538 64 -185 -145 520
3161 520 166 -89 163 264 80 -128 -38 239 -84 -126 102 338 78 -245 22 -18 -315 -201 -193 -88 -327 -200
3183 -200 308 -151 -100 129 268 -42 -34 351 123 48 -91 79 96 -48 -211 337 71 -222 -41 120 -173 -302
3205 -302 -229 432 -324 -19 113 63 -78 -345 -69 113 -133 -298 193 -12 -44 -52 -78 117 136 236 -52 93
3227 93 -215 -98 110 -45 4 -43 -84 -79 -204 240 38 -245 -126 203 -99 -312 76 35 -112 -115 41 -108 -211
3250 -211 -1 60 122 -85 -163 143 -97 29 106 -3 -102 -378 122 268 64 -169 -29 -10 -194 388 137 -37
3272 -37 -142 -174 435 37 21 -100 -75 -253 -272 11 -33 -31 -183 -4 143 91 -342 160 -73 -52 -266 13 206
3295 206 -36 -28 174 -53 -238 -192 312 -43 90 -13 56 -138 4 133 -66 -104 -151 126 62 -192 -416 122
3317 122 -31 -124 99 -144 110 89 -252 330 -138 -21 108 74 -18 -62 -83 -70 -19 286 36 -160 -122 -290 169
3340 169 241 -121 92 34 66 -11 61 211 -34 105 98 166 -301 63 -5 -237 -74 76 151 103 -69 -41 -128 56
3364 56 -21 44 94 -127 41 207 108 54 -61 -98 293 -2 155 -66 46 148 51 -107 186 21 142 114 -56
3387 -56 4 -89 56 233 -76 0 27 -27 24 149 61 -81 23 304 157 122 77 148 83 -78 -178 8 -97 -145
3411 -145 -58 123 -10 42 -132 -144 143 -73 30 -82 -174 182 11 -9 36 -63 88 -11 124 247 -20 312 -139
3434 -139 -16 111 -48 -22 -44 -1 -14 164 -54 -136 120 307 83 -218 -205 -126 50 3 -206 52 183 -69 -104
3457 -104 -38 -51 -151 -39 -65 47 -19 169 -74 -195 -75 401 -211 138 198 -153 -91 59 337 -217 -56 17
3479 17 -79 47 167 20 -149 111 -73 -58 -292 -171 211 192 44 33 -124 -100 95 125 -79 109 -22 -145
3501 -145 -242 -156 -174 -84 85 -8 -46 29 125 -293 -131 -45 -111 211 307 7 298 16 -236 29 94 -69 8 150
3525 150 -43 199 175 -198 284 33 -148 151 138 -233 -105 -64 -95 -107 -21 247 -122 -284 -23 -156 -89 -32 -81
3548 -81 85 14 -168 151 -28 -195 9 173 -20 21 88 -130 103 151 49 -379 -144 66 241 66 -106 -212
3570 -212 53 -31 91 157 197 82 -25 -170 -165 3 110 131 -107 -23 75 294 -477 38 -174 -41 -47 -215 179
3593 179 -67 -37 -30 -74 77 54 -196 -309 -29 -77 -21 123 243 190 40 228 142 87 23 -137 208 110 -137 50
3617 50 -174 38 8 -90 -1 180 -52 166 -54 -104 305 -82 -127 79 195 226 -137 215 145 -67 -72 101 46 146
3641 146 -95 252 128 50 2 105 -161 -51 24 121 68 -84 197 51 -306 204 -100 116 178 -200 1 243
3663 243 242 96 31 -24 7 177 317 39 -18 199 182 44 14 26 -40 136 265 123 64 126 -98 -263 331 -22
3687 -22 -152 53 -52 31 3 -5 235 -137 1 -10 293 -23 -211 -106 57 272 18 -78 -102 27 18 324 129
3710 129 198 90 -255 48 -248 -55 154 76 116 260 -55 156 -157 -121 29 3 149 -353 -131 -66 73 225
3732 225 -65 238 140 -40 -76 24 33 -95 357 -171 195 -52 201 183 -218 221 -5 -279 148 -38 -155 32
3754 32 56 75 -31 -137 -147 -70 118 94 -64 -107 -212 94 81 143 55 -180 81 92 30 -12 63 210 -13 -277 42
3779 42 288 -72 -78 -103 79 144 -21 -51 163 150 -80 94 138 -101 106 -2 57 -150 -24 42 84 -132 -26 -25
3803 -25 22 -12 -191 -259 -89 -271 -320 -136 275 146 148 80 -262 -46 138 309 -36 -323 88 13 -25 -100 153 -51
3827 -51 8 59 99 26 93 38 225 112 65 -330 -32 251 100 12 -194 88 -172 111 47 -261 -9 198 64
3850 64 -11 -3 -147 23 155 -142 58 124 6 158 -136 149 -28 89 -5 206 265 145 -108 -108 60 -368 -133
3873 -133 29 281 -51 289 313 91 -131 -47 -34 -122 -60 -275 85 59 -201 48 -37 -123 258 -88 52 -28 -178
3896 -178 48 47 -229 205 -137 -67 -110 -137 -73 7 140 63 118 55 -101 -76 -17 128 -37 -139 114 55 -172 -9
3920 -9 -30 -90 73 -34 210 -21 -39 -9 114 -164 -147 -242 -138 -187 -78 -41 1 45 -41 49 228 220 27 30 -96 -37
3946 -37 -56 139 -85 -41 -5 -65 133 16 -47 -275 -155 -17 -48 183 -56 196 -6 182 54 45 -20 -205 39
3969 39 -138 86 405 159 -125 130 -145 135 163 -389 -75 -104 -70 -59 87 44 167 -217 27 64 -59 46
3991 46 227 -70 151 16 161 -131 -150 4 140 14 34 306 66 144 13 -25 -164 75 -3 19 -143 37
4013 37 -67 54 44 48 148 -111 39 57 -39 234 58 72 -93 42 180 -250 -3 -64 -138 -13 75 -29 5 127
4037 127 72 -27 -34 24 148 37 -82 -14 -145 99 47 -45 60 120 102 -99 65 123 99 4 24 79 -7 12 41 -43
4063 -43 -121 4 -7 97 26 3 -153 -181 -238 102 -25 -101 257 -166 118 -180 89 -61 -114 -11 31 168 202 94
4087 94 -78 30 318 -199 -208 -17 94 26 41 480 240 65 -136 42 75 150 -24 26 253 162 65 38 -153 -30
4111 -30 58 -34 -76 125 -3 158 -49 110 -234 90 20 255 -135 -193 -18 -226 -79 -167 -152 86 58 189 65
4134 65 41 162 253 214 -109 332 304 41 -148 -191 -97 -322 203 150 -47 -47 178 70 -182 -138 24 73 9 200
4158 200 -417 24 -35 -61 252 -80 45 78 -46 -109 -74 215 157 -115 -240 11 155 5 41 144 272 -47
4180 -47 -115 78 -105 156 -91 49 186 -341 -142 -13 135 -262 -176 11 -161 -208 293 162 47 0 -132 145
4202 145 -39 28 381 -102 2 32 -119 -62 198 -76 -174 75 -93 27 200 -120 38 -8 -223 66 -99 -290
4224 -290 -11 -281 195 17 -24 -203 47 -29 -14 103 444 -132 -274 88 -47 520 17 -157 -74 -16 58 169
4246 169 -9 -25 -10 56 -167 -108 -120 103 257 180 152 89 -271 -115 164 164 50 -446 55 100 -37 -293 89 -158
4270 -158 -255 -250 186 5 -52 -67 22 -64 47 -26 12 -53 -116 -144 -144 -164 5 242 41 115 160 80 156 -262 -127 276
4296 276 3 65 147 -112 123 -41 -63 168 1 24 239 147 -302 -283 -65 -4 -37 -174 -43 -45 -1 53 35 66 63
4321 63 60 119 -320 -105 40 40 -62 -158 277 -78 -100 88 -7 14 -111 53 -128 -174 -59 -100 57 14 -129 177
4345 177 56 6 259 73 88 -199 311 103 -41 -159 68 71 24 207 -234 282 94 144 160 -224 -33 242
4367 242 -148 -98 -121 80 122 -7 -256 342 138 83 61 105 429 -116 97 80 73 -121 -12 168 107 -100 95
4390 95 309 -382 113 342 12 -394 51 253 77 -186 46 -99 -183 -400 -99 265 -265 -6 -17 111 -265
4411 -265 -194 240 218 -150 -69 338 106 -259 -174 -12 78 -281 -479 -42 -172 -191 -170 425 -33 -125 266 -1 -260
4434 -260 -44 149 -12 -403 84 189 -83 -194 -82 190 74 -315 189 66 -30 85 47 265 -97 -162 -2
4455 -2 32 -135 -241 -29 -90 -161 -351 379 -107 29 -41 289 1 73 38 -88 90 92 129 135 -64 38 253 -88
4479 -88 -453 -83 147 72 56 -79 171 -183 -60 45 2 -220 -11 3 31 -139 -101 145 -22 -25 -109 194 217 -92
4503 -92 256 -130 -43 -329 47 36 27 -38 -147 -143 -32 22 -90 307 -41 -55 20 -51 -261 -43 136 -201 -120 -171 465
4528 465 10 91 5 131 -155 80 167 -117 -228 -356 177 93 19 83 149 -96 -269 61 177 26 116 78 -128
4551 -128 -244 20 247 10 -232 -7 339 -149 -89 82 -8 -295 -24 93 136 -377 67 47 57 -21 -2 -123
4573 -123 -231 -104 -145 160 -59 64 -138 17 -240 -46 -83 -3 3 -112 -64 166 -100 48 126 -72 44 -15 -37
4596 -37 -134 -137 -255 436 -260 -140 147 122 -131 -107 -31 48 -176 39 -69 -96 -179 200 38 108 -187 235 76 -247
4620 -247 157 -195 109 -84 -71 53 6 -175 -70 -30 -49 47 -184 77 -248 13 247 -59 -198 131 141 161
4642 161 58 -96 28 -10 58 3 129 104 -164 145 284 19 -485 -108 83 -103 -224 81 -129 -63 -261 202
4664 202 69 -145 -40 98 -85 55 -4 -115 -3 -207 501 156 -61 82 220 -316 181 -43 -104 -63 -8
4685 -8 30 -88 -168 -219 187 62 -336 -169 -70 143 -66 -127 170 -98 46 140 140 -142 -18 183 319 109 41 -6
4709 -6 -119 -345 142 52 -74 -64 -245 147 2 -30 -1 7 -91 -184 70 33 -258 11 -192 5 -146 30 130 -7
4733 -7 -75 -227 2 -61 -4 39 -106 -256 -245 -93 -8 -277 58 -17 -91 77 71 75 0 -13 223 -2 87 -208 39 -17
4759 -17 203 71 57 161 10 49 197 76 250 51 -259 267 111 -227 243 143 -19 100 23 238 103
4780 103 223 -27 38 254 -65 -160 -81 -88 69 45 107 165 79 82 -164 205 -96 45 -71 -7 116 11 31 78 100
4805 100 116 -28 126 37 -252 193 141 78 129 -20 7 135 -70 103 79 193 -25 49 37 -24 -350 331 -88
4828 -88 48 21 199 151 245 -143 -29 -83 -129 -31 62 -288 169 -27 -241 184 98 -139 128 208 -107 -229 -169 161
4852 161 136 51 -66 109 88 145 108 -172 -172 12 34 -238 -117 16 -129 124 -180 56 -245 -46 252 -32 6
4875 6 -92 148 -106 -197 81 86 -72 -27 257 172 46 -103 -206 -8 61 160 -80 -252 166 156 -102 -291 -108 31
4899 31 30 -126 -265 27 -83 -144 18 -110 -283 4 -101 -177 30 -108 -35 252 339 27 -2 242 100 -401 -24
4922 -24 63 63 11 -79 215 -84 -272 -51 -323 65 44 -104 3 42 195 -225 9 -97 -52 -34 9 -226 -36 4
4946 4 -84 -54 73 -15 185 133 -94 -72 187 284 200 -103 -32 270 -19 307 274 197 -78 -59 -21 -60 3 43 55 -252
4972 -252 -208 184 43 66 -203 -394 183 -84 0 73 -102 85 -34 150 134 -63 -55 -85 -64 -39 19 200 -54 -61
4996 -61 168 177 125 36 -68 -100 -4 -89 93 -28 -81 -278 -191 -159 -33 72 50 124 64 3 74 115 9 39 31 -41 92
5023 92 30 -102 59 -40 418 217 -137 -108 104 0 315 55 -235 -84 10 -3 -89 -94 150 -63 74 -5 98
5046 98 230 -17 -125 -15 -8 105 -123 44 128 45 223 310 278 -123 -319 -4 72 -86 83 -55 -191 85 185
5069 185 -177 70 204 -41 47 -125 -157 -4 148 121 34 -112 -195 -104 -128 -137 30 -11 -4 -140 -111 51 116 -15 164
5094 164 69 144 -49 76 -93 21 -172 68 84 -165 -85 164 -127 -92 195 5 -132 133 51 154 319 -100
5116 -100 -153 -160 70 126 -88 -100 -142 140 94 153 49 160 6 -143 130 -13 -170 3 160 216 72 122 -95
5139 -95 -374 -104 89 -120 163 -26 108 352 9 13 254 -221 93 -233 -32 -109 53 -59 43 -150 11
5160 11 -178 42 125 66 -44 260 408 47 -6 -68 -60 35 -41 127 -75 176 236 204 -142 -109 149 139 59 -147 -5
5185 -5 188 473 5 -78 -75 -171 206 -114 -68 122 -171 -206 -60 117 -164 -162 28 -205 -61 174 1 -90 65 -3
5209 -3 151 -41 -127 -44 172 -65 62 58 10 -91 274 198 -31 -70 55 -7 116 293 92 -37 -225 -42 20 331
5233 331 -178 -116 29 186 -118 314 1 -91 234 105 -106 -196 -208 -17 171 -67 -192 -271 100 136 54 23 -94
5256 -94 -216 232 -48 302 258 -104 93 192 52 199 140 -167 -21 41 137 155 27 -151 190 104 -170 -147 -202
5279 -202 -76 15 -1 153 19 -60 449 101 -31 156 -346 10 241 69 101 67 97 302 19 146 -57 -35
5301 -35 159 -2 -446 19 125 -67 -70 318 -57 97 -46 -54 -67 7 -40 -71 -169 155 -42 -74 -14 245 107 51
5325 51 -153 120 73 -168 -35 -29 -22 218 76 -154 95 -206 292 96 125 -7 59 176 -194 -206 -100 58 313
5348 313 -75 12 -98 -15 -218 18 -4 -144 -98 77 -64 213 -33 -239 91 21 -321 210 -63 168 239 59
5370 59 99 -39 82 -116 -165 -150 -275 164 18 -132 18 -93 3 -185 -113 56 114 80 -27 -75 -240 80 107
5393 107 125 100 -161 47 -81 -134 -63 -243 -107 114 -10 -68 54 -127 -66 -45 11 -195 -117 -239 -265 67 110 -92
5417 -92 -138 131 12 132 -189 -91 -81 -63 233 -11 -58 -150 399 -133 137 0 -44 527 -216 -3 63 33 -121
5440 -121 -145 28 8 -109 37 67 -87 -121 -127 -60 79 176 -46 98 -174 11 12 -265 -175 145 -96 73 -107 35
5464 35 -54 59 41 57 -79 -415 -61 -167 -104 98 -29 -131 -19 -141 408 12 125 -46 133 -84 23 -43
5486 -43 -174 -1 -47 -229 18 75 11 -5 -116 5 -32 82 -10 -21 -61 24 124 68 -12 -181 -25 -39 245 41
5510 41 1 118 -388 -85 -388 116 156 -39 165 -64 20 -195 -143 33 -115 -88 -52 43 80 -83 -86 -48 -41 -24 -79
5535 -79 141 171 72 -101 13 16 -51 50 -34 2 -86 79 -79 3 -158 161 105 -8 61 12 -222 -41 4 19 -22
5560 -22 87 54 93 -13 36 -27 165 48 239 6 25 -102 -65 160 -138 67 109 5 -132 -157 102 -108 -76
5583 -76 54 31 201 64 -32 56 98 82 338 223 152 -303 188 221 -321 -31 -5 -146 164 7 321 140 154
5606 154 -99 93 -103 -161 -66 213 -342 0 -32 -55 -135 -11 -50 124 -139 42 -201 -60 -191 -78 -136 131
5628 131 -309 61 104 -378 -140 -125 -10 -151 -38 -11 -308 134 8 131 47 -106 125 -110 -216 79 -140
5649 -140 -167 162 -135 39 -194 -76 -53 -329 -184 114 136 -105 -50 47 -371 238 26 -18 292 42 126 -105
5671 -105 129 265 119 226 216 139 147 220 77 -3 -68 61 140 -140 91 -280 143 15 -269 -56 107 -91 -35
5694 -35 36 -16 -197 -1 129 47 65 -419 -150 -67 90 -255 84 77 205 2 222 -134 -158 305 43 128 -152
5717 -152 14 -88 49 -200 221 -54 -150 -59 226 4 -57 -233 0 -28 -129 94 -131 -141 128 34 100 -240
5739 -240 -123 109 -123 58 -131 -16 -21 -28 -88 107 -89 -227 26 14 52 -183 12 28 -33 96 316 -214 -312
5762 -312 -73 16 -29 -130 158 244 74 -109 7 271 81 7 -102 293 94 -47 115 262 137 -60 -33 -97
5784 -97 -44 -260 232 224 -179 11 175 117 -10 -194 59 7 -312 222 504 0 84 -4 -111 -19 57 -72 101
5807 101 171 18 65 143 156 85 55 -20 -46 71 -139 -40 107 240 94 -28 97 -9 202 -94 27 243 -108
5830 -108 60 -30 -6 -41 -102 -106 133 -241 19 256 -222 35 9 73 -236 67 108 14 -99 32 -123 12 -59 46
5854 46 -73 73 -82 136 320 2 93 15 158 0 -190 -306 31 -10 -56 37 93 249 7 -125 -202 -191 8
5877 8 13 268 8 -96 215 227 -211 102 -16 9 -145 -159 27 98 23 326 42 239 -68 -89 -146 -88 -25 -22 77
5902 77 94 -221 215 2 -56 100 -197 171 35 -79 39 -30 92 -10 -1 186 -180 315 -5 -86 -288 244
5924 244 -32 -114 -2 -117 -143 -67 214 109 -152 209 180 38 -109 107 -146 -222 -162 305 284 3 91 -20 13
5947 13 178 -57 -71 184 -234 -101 270 138 196 126 -28 -304 -127 -40 -33 -95 -191 329 58 -175 99 275 -10
5970 -10 -176 156 137 218 36 23 -174 31 -129 107 412 -276 -148 160 -50 -3 -24 167 -159 -59 -243 17
5992 17 41 16 170 -90 -300 -78 60 64 9 188 80 -158 -147 47 19 151 97 107 55 158 9 -59 20 -106
6016 -106 -76 230 -124 169 -22 64 19 -36 13 238 -123 -220 6 -94 -35 179 134 88 -54 32 280 6 -103
6039 -103 48 27 73 -163 -22 -12 -138 157 193 3 222 -143 76 18 -150 -51 145 93 -167 342 158 145 -51
6062 -51 100 -3 -64 127 20 6 77 -161 -77 315 -124 105 247 -66 -372 -54 48 -35 -94 313 68 -24 -125
6085 -125 96 134 -203 -327 -62 -118 -238 392 -31 50 -289 153 56 50 -12 198 157 -270 -133 46 -265 -110 -30
6108 -30 132 -116 -197 64 58 20 -28 -199 89 11 47 13 1 20 -110 -184 -93 77 -204 -158 44 -68 259 169 11
6133 11 118 100 143 282 -21 40 -30 129 21 151 -15 -145 110 5 -42 192 -182 -63 110 -72 -323 16
6155 16 13 -307 134 89 335 -149 173 4 -48 -13 1 160 -59 -273 277 41 92 173 120 64 -26 -98 251 15
6179 15 302 67 32 27 -185 -63 208 -99 83 161 -128 58 54 -59 36 -32 95 -140 115 125 72 134 102 -76
6203 -76 -60 162 124 -18 176 -11 -53 81 31 16 -124 -134 142 -234 323 156 46 272 17 -262 -117 132
6225 132 -198 210 139 -131 -18 -67 -123 -25 23 103 -26 -42 86 135 -95 -248 19 -54 64 212 241 101 -162
6248 -162 -254 -71 -62 -137 -183 33 -208 27 59 -36 175 -97 -29 -317 29 -294 36 -108 93 -130 56 -7 46
6271 46 -248 -71 -37 -241 121 74 -97 113 268 76 -124 -34 131 -261 -212 -125 94 -65 -41 210 14 -64 -150
6294 -150 -319 77 216 178 208 12 -96 279 73 333 -177 -133 211 28 80 -161 196 -16 -108 -123 73 -138
6316 -138 252 -143 -191 -184 182 157 67 326 9 74 122 16 27 233 51 -40 -116 -240 -122 84 -10 98 5 -121
6340 -121 41 -174 162 13 2 72 38 -114 -163 -82 193 -41 -18 -81 -9 270 127 31 250 142 133 -15 162 -108
6364 -108 -71 -25 -184 37 -51 156 -64 -29 208 173 201 108 -110 79 328 -63 -148 -281 148 -26 -199 -28 212
6387 212 61 -336 -35 -11 -61 294 224 -276 -84 -68 -134 -298 8 85 141 288 82 -192 -1 -29 -4 -234 201
6410 201 131 23 54 -83 -124 77 170 115 156 148 44 149 -35 -153 -110 213 98 -203 152 42 138 46 -145 -82
6434 -82 12 -23 -43 -299 -15 66 -39 -21 80 -150 -80 56 -295 7 -193 203 -246 -264 3 138 46 125 -5
6457 -5 38 14 51 121 -147 -30 -12 57 66 -129 -55 122 -61 25 -190 44 -56 376 -7 238 56 -19 250 -156
6481 -156 -97 -169 3 12 2 -79 -37 -177 161 80 23 4 -104 10 -153 -261 -13 250 65 -11 115 108 106 -198 -31
6506 -31 -82 138 170 -128 -136 147 108 -94 -100 -68 46 -49 46 93 55 -48 -75 -41 220 -255 123 229 -241 -211 193
6531 193 5 -208 131 33 -12 -181 33 -42 -12 -157 14 29 148 -48 -87 -96 188 -178 127 62 5 -166 -13
6554 -13 -64 94 6 267 178 179 25 51 35 125 80 -127 -72 10 -162 343 -81 24 137 -42 76 208 193 -100
6578 -100 -112 -10 55 -136 75 -221 39 4 64 9 -65 254 8 6 78 -8 110 94 92 -113 -65 -4 161 12 39
6603 39 287 110 197 -82 -10 209 -31 130 -116 235 -104 78 -302 13 70 -53 45 68 58 -39 213 -137 -13
6626 -13 1 130 -64 -136 -64 -308 -73 70 -19 36 89 330 80 -36 29 217 -261 14 122 131 39 33 6 37 144
6651 144 -218 102 148 37 -57 -30 -260 -169 -201 -147 92 -354 -121 -222 58 -191 10 8 -156 84 81 227 -117
6674 -117 14 -97 -64 -297 -230 234 83 -15 174 107 -60 -1 -46 -144 277 23 14 -47 -76 102 76 -135 69 84
6698 84 -42 -8 18 11 339 -74 -55 -44 -103 -44 -220 -158 35 52 200 -204 -47 -228 215 -31 45 40 113 -181 -195
6723 -195 -93 -153 279 -4 13 87 -59 61 -255 12 67 217 116 207 -209 38 -87 -32 -22 -144 143 307
6745 307 91 132 114 -60 -159 136 -127 60 -10 -597 137 -165 34 -197 81 60 -69 9 -49 118 -35 201
6767 201 99 -119 236 33 115 235 24 231 -174 -286 132 -134 -7 7 -86 -29 264 44 34 -20 -105 248
6789 248 -169 141 92 236 151 31 -12 155 102 -29 125 2 -13 -7 -215 -94 -120 -255 -441 -173 29 -175 4
6812 4 -58 -68 -22 111 -115 116 168 68 -256 -43 -256 31 -116 140 61 69 16 34 -71 26 -61 -54 -271 71 147
6837 147 -137 136 -321 -37 -221 -38 -54 -210 -24 -73 43 -69 -48 292 22 11 -110 -62 403 253 -230 99
6859 99 -27 202 24 219 267 -111 254 -94 -57 31 87 105 185 -71 169 32 132 111 -21 -214 5 -148 -256
6882 -256 -187 74 -246 93 184 -153 127 -197 -172 -188 167 -158 -185 -18 -82 193 -107 75 92 101 -184 5 -94
6905 -94 244 31 -22 -143 218 134 -364 85 37 -34 -159 -191 -65 39 52 -125 70 -40 -87 -219 163 37 90
6928 90 12 60 -53 5 -87 30 -102 -49 -107 -22 133 -203 176 186 35 -16 72 185 -89 6 79 -235 -167 31 171
6953 171 -204 -74 55 94 157 227 326 -126 -78 63 -37 28 -85 123 126 76 114 -230 -24 122 -5 330 -18
6976 -18 218 -31 -54 9 -5 17 -156 -152 46 -137 243 96 -103 -45 -136 21 233 87 -127 -198 127 79 -56 -31
7000 -31 164 20 -3 40 -23 -32 -79 -160 -234 -42 -88 9 -82 -11 -225 22 -205 -59 -90 37 112 -101 91 95 -96 92
7026 92 113 -100 -85 -251 262 107 128 -87 -29 160 200 -42 -101 -128 44 220 99 146 -83 156 -109 -66 26 52
7050 52 38 42 164 250 24 -126 -186 134 -68 -131 104 -48 78 -297 194 -53 -96 -34 -96 70 -258 318 -47
7073 -47 62 77 -19 -191 44 -110 -22 5 -238 28 135 161 -242 -45 76 56 -39 186 -94 -170 125 -276 -92
7096 -92 62 -120 -175 72 -300 -65 122 -20 -291 -343 36 176 -143 103 81 26 -115 -170 -124 -123 269 111 -175
7119 -175 -103 91 -129 -11 -243 -172 89 -17 -196 -97 -354 58 -106 19 -250 -95 89 -7 298 -60 -155 -84
7141 -84 138 -1 -51 -5 -30 -277 -91 344 164 -15 130 0 -105 -8 260 83 -223 142 254 260 59 -90
7163 -90 -73 -7 -18 19 145 -96 74 -150 142 163 -145 9 -303 246 13 6 -27 -12 155 -295 103 97 -69 -20
7187 -20 12 -229 194 -146 88 -84 90 -69 94 -86 284 69 136 17 113 -156 -271 133 14 -59 -214 12
7209 12 88 132 33 -67 92 169 69 -73 13 -24 -29 182 -190 -71 -139 220 -135 242 17 -1 41 106 72 -26 46
7234 46 145 16 -55 129 113 -40 -133 74 136 -54 69 -62 -95 189 5 -14 -80 81 52 169 50 -156 118
7257 118 -17 2 126 159 -240 234 98 -253 35 -231 80 339 26 95 64 -9 -94 252 275 45 100 -120 -42
7280 -42 162 257 -45 93 108 29 -103 -214 62 172 -108 20 -134 -53 -219 -13 -143 88 -170 164 -135 -157
7302 -157 -370 122 -72 48 -38 156 88 136 -108 -97 143 -27 -4 31 -16 0 -68 163 98 58 -67 -274 -167 -128
7326 -128 -90 190 49 -136 22 80 -68 -294 -66 -167 -35 -48 126 -40 -141 78 101 58 -250 123 -51 -2
7348 -2 -48 93 77 -194 -104 79 -164 -229 -224 87 -58 -2 24 -41 -355 -57 86 76 -9 101 -32 92 -208 -59
7372 -59 -10 -127 -127 -117 24 17 165 200 123 -266 -165 -154 106 -217 38 239 61 163 -95 -6 -11 -304 -12 -37 -12
7397 -12 -182 164 116 -208 109 62 -111 27 24 -8 244 75 227 -52 -43 -74 -35 148 48 85 -96 -97 1 -59 25
7422 25 -190 94 -42 50 -136 -256 78 27 -105 37 2 -226 39 -118 118 80 88 -71 -155 -95 59 115 63 96
7446 96 119 46 145 -215 -77 45 112 -35 73 396 -186 -156 -43 -141 -180 -38 -194 78 314 208 195 61 -219
7469 -219 18 133 -22 21 -116 192 231 -177 -48 111 7 170 173 209 24 -52 26 231 74 -292 171 -27
7491 -27 -181 114 -147 254 -5 -100 -21 174 -3 260 233 130 -142 -108 -108 -215 -55 21 36 8 -112 -74 -73 48
7515 48 364 121 20 -184 76 101 48 -88 167 -331 -533 -303 58 45 86 78 279 115 -153 14 297 -217
7537 -217 84 17 30 105 53 98 -213 -17 -19 -208 -195 -18 -131 -11 -28 116 248 -47 -142 178 85 82 -39 -181
7561 -181 -26 77 -199 21 224 -61 68 54 248 311 -34 25 -353 -4 -5 -89 -133 138 -124 104 55 21 345
7584 345 -68 -70 -42 5 117 158 -156 -118 207 317 224 46 -162 -347 68 113 254 208 114 -335 221 -163 149
7607 149 149 131 121 127 -65 -80 -168 -113 100 -87 67 150 -79 37 -72 123 -13 27 284 8 69 159 33 1 -195
7632 -195 -254 -24 147 -4 -2 0 -97 119 75 121 30 39 -6 -115 0 206 -7 -9 12 -279 277 4 46 -63 112
7657 112 3 20 -195 -245 -118 42 -141 108 -104 -128 101 -117 212 10 -79 -57 -124 -150 104 173 -63 370 121
7680 121 -197 -211 -79 -135 -86 45 93 -95 98 -107 -120 -53 20 23 107 -41 -22 86 116 -17 40 -38 100 -181 75
7705 75 -52 -61 103 2 19 129 -113 -55 -28 -47 45 -103 261 -70 18 -106 141 2 161 -139 30 119 -108
7728 -108 127 20 203 328 207 -138 106 244 39 -14 302 -240 87 -42 -132 151 -60 -57 237 -201 -291 -264
7750 -264 -3 -158 -74 36 231 -265 -35 102 147 -369 -24 36 193 160 13 87 100 72 19 -18 -62 -83 -63 -75
7774 -75 -62 221 -42 -81 262 -218 66 13 202 28 -204 -165 -357 -137 20 13 67 -115 -166 46 143 174 -59 127
7798 127 -141 -145 28 44 -112 -210 -36 22 71 155 -409 -290 7 141 -148 -292 38 146 -10 -129 87 -135
7820 -135 -125 -87 279 -293 79 130 22 162 202 163 108 -20 192 83 90 -188 -90 -173 97 15 125 45 65 -20 71
7845 71 351 108 38 246 -4 109 234 32 226 15 -181 111 83 31 -197 -78 95 -113 4 158 136 -209
7867 -209 237 -138 149 -83 -136 -94 -112 -276 129 -30 135 -100 235 -12 -117 28 -75 -282 -235 113 57 287
7889 287 42 156 193 -89 -408 139 272 -49 -46 76 -169 -37 61 37 -119 -102 2 -46 38 -17 57 7 25 -41
7913 -41 -338 -191 85 -116 231 -55 -49 -145 173 -92 13 15 -13 -5 -202 40 44 85 -9 10 137 207 181 265 181 -50
7939 -50 -282 -74 113 46 14 219 213 -148 102 104 -108 77 -81 -56 77 -82 81 -133 -13 72 104 82 -101 21
7963 21 135 68 -229 -190 86 32 150 -14 -28 -69 -345 110 -140 93 58 -167 128 62 366 -74 -35 52 -184
7986 -184 83 -191 -127 -248 69 -81 -146 48 2 73 -46 -43 25 24 -37 107 40 -12 117 -1 131 71 -61 163
8010 163 -143 68 -138 -33 21 -209 -23 56 -14 106 -215 150 51 -88 -284 60 99 -54 -147 48 -9 -96 -47
8033 -47 -13 3 88 228 -68 -167 -80 111 2 238 -46 56 154 -51 94 -41 186 -73 357 -119 24 -56 79
8056 79 -68 242 -205 6 -289 138 -10 -133 26 -54 146 22 139 224 128 67 -103 296 -78 90 71 12
8078 12 64 77 -113 8 -90 -27 -21 32 64 62 -94 -11 -91 -155 -61 -46 40 -55 56 -38 119 -35 71 164 185 -93 23
8105 23 -133 -154 1 -294 -109 90 30 -50 -193 0 105 -26 81 24 5 -114 -2 207 150 -165 -125 172 -86
8128 -86 73 146 -71 -166 -65 -8 26 -40 126 -148 -103 279 -90 71 -60 -55 183 110 6 -21 129 195 -55 38
8152 38 -198 -56 -107 435 93 -126 119 -27 198 -230 -106 -272 -92 -128 9 -114 -47 -121 -147 88 91 83 28 30
8176 30 -126 -261 -91 -200 -31 -153 126 6 -51 -104 -55 53 -33 208 -33
8191c3
##END NTUPLES=NMR FID
##END=
