##TITLE=1H_LRR-5243
 200.13MHz,CDCl3 ,
 8 sc
 
 12.3.2025
##JCAMPDX= 6.0         $$ Bruker NMR JCAMP-DX V2.0
##DATA TYPE= NMR FID
##DATA CLASS= NTUPLES
##ORIGIN= UXNMR, Bruker Analytische Messtechnik GmbH
##OWNER= pz
$$ XWIN-NMR		Version 3.5
$$ Wed Mar 12 15:02:37 2025 Russian Standard Time (UT+4h)  she@DPX200
##.OBSERVE FREQUENCY= 200.1313
##.OBSERVE NUCLEUS= ^1H
##.DELAY= (6, 6)
##.ACQUISITION MODE= SIMULTANEOUS
##.ACQUISITION SCHEME= undefined
##.AVERAGES= 8
##.DIGITISER RES= 18
##SPECTROMETER/DATA SYSTEM= spect
##.PULSE SEQUENCE= zg30
##.SOLVENT NAME= CDCl3
##.SHIFT REFERENCE= (INTERNAL, CDCl3, 0, 14.3821)
##AUDIT TRAIL= $$ (NUMBER, WHEN, WHO, WHERE, WHAT)
$$ ##TITLE= Audit trail, XWIN-NMR		Version 3.5
$$ ##JCAMPDX= 5.01
$$ ##ORIGIN= Bruker BioSpin GmbH
$$ ##OWNER= she
$$ F:/spectra/data/she/nmr/H-C/1/audita.txt
$$ ##AUDIT TRAIL=  $$ (NUMBER, WHEN, WHO, WHERE, WHAT)
(   1,<2025-03-12 15:01:34.81 +0400>,<she>,<DPX200>,
      <created by zg, POWCHK disabled, PULCHK disabled
       configuration hash MD5:
       00 E9 B6 7A A2 85 ED C7 34 08 36 98 17 FE 4E 26
       data hash MD5: 16K
       7F 3B 1C 73 3C A8 D0 9D B0 51 77 4E 20 7F FE 53>)
$$ ##END=
$$ 
$$ hash MD5
$$ C9 C9 97 5D 03 59 17 4E AF 3C 86 09 1D 32 43 06
##$RELAX= 
##$RELAX= 
##$RELAX= 
##$RELAX= 
##$RELAX= 
##$RELAX= 
$$ Bruker specific parameters
$$ --------------------------
##$DU= <F:/spectra>
##$EXPNO= 1
##$NAME= <H-C>
##$PROCNO= 1
##$TYPE= <nmr>
##$USER= <she>
##$AMP= (0..31)
100 100 100 100 100 100 100 100 100 100 100 100 100 100 100 100 100 100 
100 100 100 100 100 100 100 100 100 100 100 100 100 100 
##$AQSEQ= 0
##$AQ_mod= 1
##$AUNM= <au_zg>
##$AUTOPOS= <>
##$BF1= 200.13
##$BF2= 200.13
##$BF3= 200.13
##$BF4= 200.13
##$BF5= 200.13
##$BF6= 200.13
##$BF7= 200.13
##$BF8= 200.13
##$BYTORDA= 1
##$CFDGTYP= 0
##$CFRGTYP= 5
##$CHEMSTR= <none>
##$CNST= (0..31)
1 1 145 1 1 1 1 1 1 1 1 1 1 1 1 1 1 1 1 1 1 1 1 1 1 1 1 1 1 1 1 1 
##$CPDPRG= <>
##$CPDPRG1= <>
##$CPDPRG2= <>
##$CPDPRG3= <>
##$CPDPRG4= <mlev>
##$CPDPRG5= <mlev>
##$CPDPRG6= <mlev>
##$CPDPRG7= <mlev>
##$CPDPRG8= <mlev>
##$CPDPRGB= <>
##$CPDPRGT= <>
##$D= (0..31)
0 0.7 0 0 0 0 0 0 0 0 0 0.03 0 0 0 0 0 0 0 0 0 0 0 0 0 0 0 0 0 0 0 0 
##$DATE= 1741777294
##$DBL= (0..7)
120 120 120 120 120 120 120 120 
##$DBP= (0..7)
150 150 150 150 150 150 150 150 
##$DBP07= 0
##$DBPNAM0= <>
##$DBPNAM1= <>
##$DBPNAM2= <>
##$DBPNAM3= <>
##$DBPNAM4= <>
##$DBPNAM5= <>
##$DBPNAM6= <>
##$DBPNAM7= <>
##$DBPOAL= (0..7)
0.5 0.5 0.5 0.5 0.5 0.5 0.5 0.5 
##$DBPOFFS= (0..7)
0 0 0 0 0 0 0 0 
##$DE= 6
##$DECBNUC= <off>
##$DECIM= 32
##$DECNUC= <off>
##$DECSTAT= 4
##$DIGMOD= 1
##$DIGTYP= 9
##$DL= (0..7)
0 120 120 120 120 120 120 120 
##$DP= (0..7)
150 150 150 150 150 150 150 150 
##$DP07= 0
##$DPNAME0= <>
##$DPNAME1= <>
##$DPNAME2= <>
##$DPNAME3= <>
##$DPNAME4= <>
##$DPNAME5= <>
##$DPNAME6= <>
##$DPNAME7= <>
##$DPOAL= (0..7)
0.5 0.5 0.5 0.5 0.5 0.5 0.5 0.5 
##$DPOFFS= (0..7)
0 0 0 0 0 0 0 0 
##$DQDMODE= 0
##$DR= 18
##$DS= 0
##$DSLIST= <SSSSSSSSSSSSSSS>
$$ [...]
##$SUBNAM0= <"">
##$SUBNAM1= <"">
##$SUBNAM2= <"">
##$SUBNAM3= <"">
##$SUBNAM4= <"">
##$SUBNAM5= <"">
##$SUBNAM6= <"">
##$SUBNAM7= <"">
##$SUBNAM8= <"">
##$SUBNAM9= <"">
##$SW= 18.0517328524113
##$SWIBOX= (0..15)
0 0 2 0 0 0 0 0 0 0 0 0 0 0 0 0 
##$SW_h= 3612.71676300578
##$TD= 16384
##$TD0= 1
##$TE= 0
##$TE2= 300
##$TE3= 300
##$TEG= 300
##$TL= (0..7)
0 120 120 120 120 120 120 120 
##$TP= (0..7)
150 150 150 150 150 150 150 150 
##$TP07= 0
##$TPNAME0= <>
##$TPNAME1= <>
##$TPNAME2= <>
##$TPNAME3= <>
##$TPNAME4= <>
##$TPNAME5= <>
##$TPNAME6= <>
##$TPNAME7= <>
##$TPOAL= (0..7)
0.5 0.5 0.5 0.5 0.5 0.5 0.5 0.5 
##$TPOFFS= (0..7)
0 0 0 0 0 0 0 0 
##$TUNHIN= 0
##$TUNHOUT= 0
##$TUNXOUT= 0
##$USERA1= <user>
##$USERA2= <user>
##$USERA3= <user>
##$USERA4= <user>
##$USERA5= <user>
##$V9= 5
##$VALIST= <valist>
##$VCLIST= <CCCCCCCCCCCCCCC>
##$VD= 0
##$VDLIST= <DDDDDDDDDDDDDDD>
##$VPLIST= <PPPPPPPPPPPPPPP>
##$VTLIST= <TTTTTTTTTTTTTTT>
##$WBST= 1024
##$WBSW= 4
##$XGAIN= (0..3)
0 0 0 0 
##$XL= 0
##$YL= 0
##$YMAX_a= 105809
##$YMIN_a= -166644
##$ZGOPTNS= <>
##$ZL1= 120
##$ZL2= 120
##$ZL3= 120
##$ZL4= 120
##$ABSF1= 10
##$ABSF2= 0
##$ABSG= 5
##$ABSL= 3
##$ALPHA= 0
##$AQORDER= 0
##$ASSFAC= 0
##$ASSFACI= 0
##$ASSFACX= 0
##$ASSWID= 0
##$AUNMP= <proc_1d>
##$AZFE= 0.1
##$AZFW= 0.1
##$BCFW= 1
##$BC_mod= 2
##$BYTORDP= 1
##$COROFFS= 0
##$CY= -3
##$DATMOD= 1
##$DC= 2
##$DFILT= <>
##$DTYPP= 0
##$F1P= 0
##$F2P= 0
##$FCOR= 0.5
##$FTSIZE= 0
##$FT_mod= 4
##$GAMMA= 1
##$GB= 0.15
##$INTBC= 1
##$INTSCL= 1
##$ISEN= 128
##$LB= 0.25
##$LEV0= 0
##$LPBIN= 0
##$MAXI= 10000
##$MC2= 0
##$MEAN= 0
##$ME_mod= 0
##$MI= 1.114404
##$NCOEF= 0
##$NC_proc= 0
##$NLEV= 6
##$NOISF1= 3.799351
##$NOISF2= 2.8
##$NSP= 1
##$NTH_PI= 0
##$NZP= 0
##$OFFSET= 14.38212
##$PC= 1
##$PHC0= -460.0917
##$PHC1= -4.207786
##$PH_mod= 1
##$PKNL= yes
##$PPARMOD= 0
##$PSCAL= 0
##$PSIGN= 0
##$REVERSE= no
##$SF= 200.129724274929
##$SI= 16384
##$SIGF1= 3
##$SIGF2= 2
##$SINO= 400
##$SIOLD= 16384
##$SREGLST= <1H.CDCl3>
##$SSB= 0
##$STSI= 0
##$STSR= 0
##$SW_p= 3205.1282051282
##$SYMM= 0
##$S_DEV= 0
##$TDeff= 0
##$TDoff= 0
##$TI= <>
##$TILT= no
##$TM1= 0
##$TM2= 0
##$TOPLEV= 0
##$USERP1= <user>
##$USERP2= <user>
##$USERP3= <user>
##$USERP4= <user>
##$USERP5= <user>
##$WDW= 1
##$XDIM= 8192
##$YMAX_p= 0
##$YMIN_p= 0
$$ End of Bruker specific parameters
$$ ---------------------------------
##NTUPLES= NMR FID
##VAR_NAME=  TIME,          FID/REAL,        FID/IMAG
##SYMBOL=    X,             R,               I
##VAR_TYPE=  INDEPENDENT,   DEPENDENT,       DEPENDENT
##VAR_FORM=  AFFN,          ASDF,            ASDF
##VAR_DIM=   8192,          8192,            8192
##UNITS=     SECONDS,       ARBITRARY UNITS, ARBITRARY UNITS
##FACTOR=    0.0002768,     1,               1
##FIRST=     0,             0,               0
##LAST=      2.2672688,     0,               0
##MIN=       0,             -166644,         0
##MAX=       2.2672688,     105809,          0
$$ Real data points
##PAGE= N=1
##DATA TABLE= (X++(R..R)), XYDATA
$$ plain form
0 0 0 0 0 0 0 0 0 0 0 0 0 0 0 0 0 0 0 0 0 0 0 0 6 -7 8 -8 8 -8 8 -9 14 -16 16 -17 22 -24 27 -30 33 -38 42 -47 52 -56
44 -56 63 -69 75 -83 91 -101 112 -124 137 -152 167 -185 207 -230 257 -291 333 -381 447 -531 650
65 650 -833 1135 -1739 3431 -18241 -69128 -42681 20854 79879 104100 105809 96261 85584 76384
79 76384 71655 63011 38851 -11891 -71717 -108827 -100077 -59672 -22250 -14538 -31778 -49978 -47437
92 -47437 -24300 5768 25427 27391 15142 4873 11073 36034 63582 69293 43188 -1533 -37698
105 -37698 -46157 -30600 -11788 -7729 -21441 -40091 -44523 -26169 7810 37371 46440 36267 20158
118 20158 16937 32028 52548 56945 34797 -5116 -41777 -57106 -47114 -26095 -13824 -20565 -38940
131 -38940 -52005 -45919 -23556 -22 8534 1132 -8879 -4716 21832 60068 89727 91818 67314
$$ packed form
0@%%%%%%%%%%%%%%%%%%%%%%Oj3J5j6J6j6J6j7K3l0L2l3L9m6N1n7O3p1Q0q9R9j08
44e6J19j32J44j58J74j92K13k36K61k89L19l52L92m37M87n48O24p14Q28r78J181
65F50j483J968k874N170k1672n0887K6447O3535N9025K4221J709r548j0677r200
79G6384m729q644k4160n0742n9826l7110Q750M0405L7422P712j7240j8200K541
92d7437K3137L0068J9659J964j2249j0269O200K4961K7548N711k6105m4721l6165
105c7698q459J5557J8812M059j3712j8650m432J8354L3979K9561R069j0173j6109
118B0158l221J5091K0520M397k2148l9913l6661j5329R992K1019J2271o741j8375
131c8940j3065O086K2363K3534Q556p402j0011M163K6548L8236K9659K091k4504
$$ plain form
144 67314 30894 1149 -11114 -10897 -12036 -24453 -43835 -55413 -48525 -24478 1435 11572 -1089
157 -1089 -25402 -42810 -39332 -16083 14143 34429 37658 30647 26187 30107 38418 39062 21602 -9314
171 -9314 -38959 -50199 -38701 -13475 7257 11720 2101 -10291 -13144 -3816 10379 17216 11211
184 11211 -2335 -10196 -4729 12006 27456 29484 14413 -8112 -23998 -24987 -13502 -2295 -1318
197 -1318 -11328 -23519 -25840 -14471 4066 18352 20681 12137 3766 4872 15222 27748 30434
210 30434 18360 -2980 -20733 -24810 -14209 415 8050 3112 -8125 -15918 -14111 -5403 1288
223 1288 -1315 -11532 -21129 -18918 -3071 19566 36382 37869 24748 6668 -5492 -7910 -4855
236 -4855 -4039 -9199 -16496 -18580 -10860 4664 17776 19559 8768 -8469 -21550 -22072 -11947 1630
$$ packed form
144F7314l6420k9745j2263K17j139j2417j9382j1578O888K4047K5913J0137j2661
157a089k4313j7408L478K3249L0226K0286L229p011m460L920Q311O44j7460l0916
171i314k9645j1240J1498K5226K0732M463r619j2392k853R328J4195O837o005
184A1211j3546p861N467J6735J5450K028j5071k2525j5886r89J1485J1207R77
197a318j0010j2191k321J1369J8537J4286K329q544q371J106J0350J2526K686
210C0434j2074k1340j7753m077J0601J4624P635m938j1237p793J807Q708O691
223A288k603j0217r597K211J5847K2637J6816J487j3121j8080j2160k418L055
236d855Q16n160p297k084P720J5524J3112J783j0791j7237j3081n22J0125J3577
$$ plain form
250 1630 9422 9754 6458 6411 12108 18629 19152 9280 -7478 -21808 -25966 -17606 -3337 6621 8265
265 8265 2358 -3853 -4574 697 6730 7242 1471 -7440 -10781 -5675 5894 15730 16699 8707 -2076
280 -2076 -7806 -6001 1132 5551 2728 -5677 -14165 -15857 -9153 1198 7988 7978 2163 -2702 -884
295 -884 6042 12532 13000 5283 -5544 -12606 -11236 -2843 5970 9595 5901 -697 -4952 -4140 -477 1160
311 1160 -2748 -9979 -14913 -12522 -1941 10983 19599 18708 11002 1348 -3800 -4147 -2043 -2155 -5838
326 -5838 -10075 -10126 -3860 5702 13010 12624 4799 -5994 -12758 -11928 -5804 923 4251 3402 1997 3470
342 3470 8657 13593 13473 6475 -4529 -13396 -15201 -10357 -2566 2271 1417 -2575 -5088 -3286 2072
357 2072 6051 5511 -52 -6103 -8300 -3832 4079 10538 11161 7133 1531 -642 1744 5371 6044 1607
$$ packed form
250A630P792L32l296m7N697O521N23r872j6758j4330m158Q360J4269R958J644
265H265n907o211p21N271O033N12n771q911l341N106J1569R836R69p992j0783
280b076n730J805P133M419k823q405q488j692O704J0351O790j0n815m865J818
295h84O926O490M68p717j0827p062J370Q393Q813L625l694o598m255Q12L663J637
311A160l908p231m934K391J0581J2924Q616q91p706r654n148l47K104j12l683
326e838m237n1O266R562P308l86p825j0793o764Q30O124O727L328q49j405J473
342C470N187M936j20o998j1004q867j805M844P791M837q54l992k513J802N358
357B072L979n40n563o051k197M468P911O459O23m028n602k173K386L627O73m437
$$ plain form
373 1607 -5691 -11505 -11660 -6425 502 4142 2657 -1207 -3746 -2308 1825 5022 3654 -1952 -8029
388 -8029 -10168 -6224 1169 7550 9499 6280 1617 -670 664 3592 4307 1020 -3973 -7255 -5217
403 -5217 1383 8564 11701 8931 2331 -3555 -5928 -4367 -2662 -3425 -6674 -9850 -9234 -4119 3105 7852
419 7852 7077 1978 -3899 -5948 -4354 60 3500 3704 1095 -87 2189 6936 11436 11924 6684 -668
435 -668 -6203 -7274 -4209 -348 1258 -873 -3570 -4041 -1458 2537 4290 1965 -3639 -9653 -11679 -8727
451 -8727 -3159 1377 2630 1418 -13 1321 4947 8374 8086 4383 -1048 -4083 -2761 2138 7329
466 7329 9112 7276 3313 -106 -460 -117 -273 -3198 -8302 -12317 -12223 -8353 -2266 1731 2512 51 -2299
483 -2299 -3047 -199 2723 3732 2484 -140 -911 1374 5942 9625 9906 6477 1693 -1813 -2178 -485
$$ packed form
373A607p298n814j55N235O927L640j485l864k539J438M133L197j368n606o077
388h029k139L944P393O381J949l219m663k287J334K928P15l287m993l282K038
403e217O600P181L137k770o600n886k373J561J705p63l249l176O16N115P224M747
419G852p75n099n877k049J594M414L440K04k609j182K276M747M500M88n240p352
435f68n535j071L065L861J606k131k697m71K583L995J753k325n604o014k026K952
451h727N568M536J253j212j431J334L626L427k88l703n431l035J322M899N191
466G329J783j836l963l419l54L43j56k925n104m015R4L870O087L997P81k461k350
483b299p48K848K922J009j248k624p71K285M568L683K81l429m784l506l65J693
$$ plain form
499 -485 740 -116 -3312 -6270 -6344 -3523 1398 4173 2982 -469 -3658 -4870 -3255 -1232 -521 -2014
515 -2014 -4735 -5524 -3154 1266 5447 7137 4953 1226 -1510 -1084 878 2607 3034 1660 1073 1867
531 1867 4937 7791 8189 4873 -876 -6611 -9542 -8774 -6489 -4135 -3280 -3485 -3433 -1465 1473 3162 2069
548 2069 -724 -3977 -5373 -3029 1656 6250 8698 7888 6159 4248 3301 2744 1593 -1262 -4364 -6511
564 -6511 -5471 -2691 1165 2893 2171 -707 -3030 -3693 -3129 -1251 -480 -1418 -2265 -2356 -650 2042 3957
581 3957 3481 948 -1589 -2603 -1012 892 2656 2304 500 -1270 -1650 111 2298 3686 3209 1908
597 1908 385 93 910 1183 -28 -2872 -5115 -6094 -4854 -1574 1302 3007 1817 -104 -1687 -1897
613 -1897 -1419 -773 -845 -1410 -986 1100 4110 6953 7711 5757 1805 -1929 -4259 -4564 -3254 -2019 -873
$$ packed form
499d85J225q56l196k958p4K821M921K775j191l451l189j212J615K023P11j493
515b014k721p89K370M420M181J690k184l727k736M26J962J729M27j374n87P94
531A867L070K854L98l316n749n735k931P68K285K354Q55k05N2J968K938J689j093
548B069k793l253j396K344M685M594K448q10j729j911r47n57j151k855l102k147
564f511J040K780L856J728p22k878k323o63N64J878P71r38q47r1J706K692J915
581C957m76k533k537j014J591J904J764l52j804j770l80J761K187J388m77j301
597A908j523k92Q17K73j211k844k243r79J240L280K876J705j190j921j583k10
613a897M78O46p2n65M24K086L010K843P58j954l952l734k330l05J310J235J146
$$ plain form
630 -873 -154 386 1649 3090 2849 349 -2209 -5136 -6300 -4578 -958 2614 4048 4346 3301 2302 1975
647 1975 994 -331 -2013 -3749 -4026 -2595 474 3121 3820 2848 477 -1411 -2154 -1409 -349 225 47
664 47 -36 345 933 2147 2340 1035 -1127 -2472 -2213 -1305 524 1606 499 -576 -1790 -2426 -1696 -33
682 -33 620 1016 874 1101 1635 2879 2665 1407 -1332 -2863 -3612 -2595 -485 1610 2778 2099 910 -409
700 -409 -1287 -2148 -2332 -2979 -3446 -2017 447 2902 5506 5800 4196 1024 -2009 -3421 -3320 -2772 -1413
717 -1413 -701 256 1144 2010 2728 2119 55 -2407 -4326 -4622 -2689 -29 2377 3839 3975 3408 2255
734 2255 1642 258 -940 -2364 -3197 -3125 -1961 350 1897 1878 917 -1096 -2224 -2368 -1445 -345 420 820
752 820 1323 1857 2410 2500 1901 647 -825 -1663 -1697 -814 94 1000 274 -907 -2197 -2511 -1899 -1539 -709 -251
$$ packed form
630h73P19N40J263J441k41k500k558k927j164J722L620L572J434K98j045r99l27
647A975r81j325j682j736k77J431L069K647O99r72k371j888p43P45J060N74j78
664D7q3L81N88J214J93j305k162j345K59R08J829J082j107j075j214o36P30J663
682c3O53L96j42K27N34J244k14j258k739j531p49J017K110K095J168o79j189j319
700d09q78q61j84o47m67J429K464K455K604K94j604l172l033j412J01N48J359
717a413P12R57Q88Q66P18o09k064k462j919k96J933K660K406J462J36n67j153
734B255o13j384j198j424q33P2J164K311J547j9r61k013j128j44R23J100P65M00
752H20N03N34N53R0n99j254j472q38l4Q83R08R06p26j181j290l14O12L60Q30M58
$$ plain form
772 -251 623 1433 2231 3304 2641 1527 -406 -1857 -1960 -1327 203 1533 2183 1826 1112 40 -682 -1764
790 -1764 -2419 -3162 -2964 -2037 58 2367 4218 4253 2757 888 -1503 -2616 -2897 -2269 -1523 -786 284 1493
808 1493 2375 2641 2065 353 -1950 -2783 -2818 -1334 475 2328 2976 3088 2856 1757 779 -173 -1550 -2905
826 -2905 -2869 -2578 -1590 -145 1092 836 -114 -1253 -2281 -2079 -860 -49 548 1032 1253 1826 2632 2536 1933
845 1933 534 -198 -837 -455 579 1176 1394 981 -338 -985 -1848 -1797 -1908 -1333 -1074 -593 -61 774 1262
864 1262 405 -438 -1538 -2756 -2254 -1206 303 1439 2179 2424 2188 1565 1058 525 -436 -1365 -1023 -438
882 -438 1148 2505 3235 2753 1324 -360 -2055 -3186 -3363 -2877 -2416 -1950 -836 330 1152 1553 612 -339
900 -339 -1629 -2125 -1441 -415 1379 2435 2820 3056 2162 1629 1538 678 -491 -1058 -1423 -948 -262 671 1146
$$ packed form
772b51Q74Q10P98J073o63j114j933j451j03O33J530J330O50l57p14j072p22j082
790a764o55p43J98R27K095K309J851L5j496j869k391j113k81O28P46P37J070J209
808A493Q82K66n76j712k303q33l5J484J809J853O48J12k32j099r78r52j377j355
826b905L6K91R88J445J237k56r50j139j028K02J219Q11N97M84K21N73Q06r6o03
845A933j399p32o39L82J034N97K18m13j319o47q63N1j11N75K59M81N32Q35M88
864A262q57q43j100j218N02J048J509J136P40K45k36o23n07n33r61r29L42N85
882d38J586J357P30m82j429j684j695j131j77M86M61M66J114J166Q22M01r41r51
900c39j290m96O84J026J794J056L85K36q94n33r1q60j169n67l65M75O86R33M75
$$ plain form
919 1146 577 -311 -1370 -2010 -1922 -1564 -1479 -902 -693 -430 355 627 420 -3 -449 -784 -651 -95 1435 2117
939 2117 2005 1738 941 591 554 548 334 363 42 336 527 933 891 -99 -1025 -2245 -3030 -2937 -2060 -1005 -307
960 -307 209 483 583 593 536 67 -366 -468 -571 383 1522 2362 3024 2873 1869 533 -309 -673 -1250 -1164
980 -1164 -1032 -672 -361 232 624 761 516 -892 -1536 -2369 -2048 -1201 -157 434 698 1103 862 864 766 385
1000 385 -202 -618 -791 -219 569 1043 1240 1127 422 47 -97 -365 -295 -120 -182 -620 -249 -8 61 10 -744
1021 -744 -791 -1218 -924 -669 -55 404 847 157 -208 -35 74 0 362 -41 123 741 936 1003 1341 934 -9
1042 -9 -589 -1095 -964 -641 -159 208 -64 254 94 -286 -315 -287 -726 -1051 -737 -183 379 1130 1458 1130 685
1063 685 499 -227 -283 -440 -395 -697 -722 -291 148 636 549 542 -223 -900 -981 -490 -277 121 307 697 443 606
$$ packed form
919A146n69q88j059o40Q8L58Q5N77K09K63P85K72k07m23m46l35J33N56J530O82
939B117j12k67p97l50l7ok14K9l21K94J91M06m2r90r26j220p85R3Q77J055O98
960c07N16K74J00J0n7m69m33j02j03R54J139Q40O62j51j004j336q42l64n77Q6
980a164J32L60L11N93L92J37k45j408o44q33L21Q47J044N91K64M05k41Kr8l81
1000C85n87m16j73N72P88M74J97j13p05l75j44k68P0J75o2m38L71K41O9n1p54
1021g44m7m27K94K55O14M59M43o90l65J73J09p4L62m03J64O18J95O7L38m07r43
1042in80n06J31L23M82L67k72L18j60l80k9K8m39l25L14N54N62P51L28l28m45
1063F85j86p26n6j57M5l02k5M31M39M88q7pp65o77q1M91K13L98J86L90k54J63
$$ plain form
1085 606 864 637 318 -121 -660 -659 -561 -283 141 33 -107 -368 -320 -60 86 248 222 176 -13 321 127 436
1107 436 556 241 21 -284 -453 87 67 -174 -90 -581 -844 -739 -515 -268 -102 159 132 265 497 527 654
1128 654 812 153 -334 -120 -297 -12 164 175 -442 -371 -448 146 -245 -303 -186 -518 -300 44 323 675 1085
1149 1085 750 321 310 130 353 258 -128 -464 -879 -677 -120 137 8 -192 -234 -590 -248 118 413 518 514
1170 514 483 282 821 775 941 387 236 -321 -669 -717 -989 -786 -932 -849 -968 -597 -309 403 350 406 235 356
1192 356 363 558 784 677 978 696 773 696 318 143 4 -644 -758 -1007 -640 -838 -843 -49 -345 -166 -231 145
1214 145 20 206 -97 109 -148 81 523 472 548 55 -105 -282 18 -174 112 -70 336 310 327 488 252
1235 252 586 358 211 7 -207 -16 -274 174 -434 -783 -1051 -1081 -1221 -861 -402 -319 -396 -359 -28 181 920
$$ packed form
1085F06K58k27l19m39n39JR8K78M24j08j40k61M8K60J46J62k6m6j89L34j94L09
1107D36J20l15k20l05j69N40k0k41Q4m91k63J05K24K47J66K61k7J33K32L0J27
1128F54J58o59m87K14j77K85J76J1o17P1p7N94l91n8J17l32K18L44K79L52M10
1149A085l35m29j1j80K23r5l86l36m15K02N57K57j29k00m2l56L42L66K95J05m
1170E14l1k01N39m6J66n54j51n57l48m8k72K03j46Q3j19L71K88P12n3N6j71J21
1192C56PJ95K26j07L01k82P7p7l78j75j39o48j14k49L67j98nP94k96J79o5L76
1214A45j25J86l03K06k57K29M42n1P6m93j60j77L00j92K86j82M06k6J7J61k36
1235B52L34k28j47k04k14J91k58M48o08l49k68l0j40L60M59Q3p7L7L31K09P39
$$ plain form
1256 920 740 637 721 848 1035 1256 1613 1439 806 561 106 -139 -340 -795 -946 -1378 -1306 -1313 -621 -489 -593
1277 -593 -737 -925 -953 -747 -473 138 409 474 800 742 937 1256 832 713 187 -96 -219 164 618 561 384
1298 384 236 4 -299 -353 -626 -355 -615 -723 -663 -533 -239 -49 -205 -727 -1010 -1001 -760 -590 148 139 120 286
1320 286 227 830 414 674 605 819 491 1053 1129 1284 1150 741 180 -260 -806 -1030 -1000 -1218 -1100 -1401 -1000
1341 -1000 -1118 -726 -480 -878 -712 -587 -244 273 1111 1564 1506 1601 1404 980 707 555 200 -191 -619 -560 -285
1362 -285 47 -159 -161 -667 -752 -1075 -1180 -819 -478 -60 151 228 514 617 360 272 -175 -246 -614 -603 -105 506
1384 506 390 591 409 288 -88 -143 389 337 419 403 763 614 945 720 444 -260 -754 -1016 -1193 -1016 -867
1405 -867 -749 -538 -423 -615 -86 -373 -301 -173 -10 322 503 1267 1441 1337 893 662 300 -366 -136 -357
$$ packed form
1256I20j80j03Q4J27J87K21L57j74o33k45m55k45k01m55j51m32P2pO92J32j04
1277e93j44j88k8K06K74O11K71O5L26n8J95L19m24j19n26k83j23L83M54n7j77
1298C84j48k32l03n4k73K71k60j08O0J30K94J90j56n22k83RK41J70P38rj9J66
1320B86n9O03m16K60o9K14l28N62P6J55j34m09n61m40n46k24L0k18J18l01M01
1341a000j18L92K46l98J66J25L43N17Q38M53n8R5j97m24k73j52l55l91m28N9K75
1362b85L32k06kn06q5l23j05L61L41M18K11P7K86J03k57q8m47p1l68J1M98O11
1384E06j16K01j82j21l76n5N32n2Q2j6L60j49L31k25k76p04m94k62j77J77J49
1405h67J18K11J15j92N29k87P2J28J63L32J81P64J74j04m44k31l62o66K30k21
$$ plain form
1425 -357 -657 -301 -614 -128 -125 -382 -232 -400 -724 -706 -506 53 276 796 931 895 542 39 78 -185 -252 -290
1447 -290 -386 -256 -79 283 185 60 75 -264 -262 -401 -432 207 300 512 639 423 511 445 -53 -602 -872 -794 -581
1470 -581 -147 40 262 323 302 63 -63 -86 -348 -116 145 10 141 524 626 492 283 -191 -580 -776 -726
1491 -726 -437 -162 173 202 118 -129 262 -133 -461 -355 -417 -146 45 341 495 261 382 116 -150 -361 -234
1512 -234 -137 -165 -200 290 224 148 513 114 167 -348 -407 -602 -393 -102 254 387 314 151 -153 -117 -115 -87 -9 14 -127
1537 -127 303 591 681 475 274 -165 -549 -910 -577 -209 -125 -293 188 222 9 259 -111 -370 -210 -179 -549
1558 -549 233 607 878 493 43 158 -166 -630 -209 -545 -363 -98 -160 -36 273 18 357 -130 -136 -132 -471 313
1580 313 498 488 708 765 374 -197 29 -37 -568 -469 -646 -347 -92 168 -237 -109 -118 -265 -228 -630 -157 -7
$$ packed form
1425c57l00L56l13M86Lk57J50j68l24J8K00N59K23N20J35l6l53n03L9k63o7l8
1447b90r6J30J77L62r8j25J5l39Kj39l1O39R3K12J27k16Q8o6m98n49k70P8K13
1470e81M34J87K22O1k1k39j26k3k62K32K61j35J31L83J02j34k09m74l89j96N0
1491g26K89K75L35K9q4k47L91l95l28J06o2K71J91K96J54k34J21k66k66k11J27
1512b34R7k8l5M90o6p6L65l99N3n15n9j95K09K91L56J33p3j63l04L6KK8P8K3j41
1537a27M30K88R0k06k01m39l84l61L33L68Q4j68M81L4k13K50l70k59J60L1l70
1558e49P82L74K71l85m50J15l24m64M21l36J82K65o2J24L09k55L39m87oMl39P84
1580C13J85j0K20N7l91n71K26o6n31R9j77K99K55K60m05J28rj47L7m02M73J50
$$ plain form
1602 -7 342 397 386 269 733 337 250 47 -363 -359 -104 62 238 448 134 -89 -310 -78 -36 -235 -380 -236 -334
1625 -334 -113 -145 280 356 139 -10 -172 -500 -584 -579 82 400 -76 470 457 159 204 321 263 176 415 458 384 556
1649 556 300 345 81 -333 -361 -749 -678 -366 -521 -497 -336 -235 -267 168 -276 -655 -321 -390 -51 233 707 497
1671 497 697 435 383 450 463 -20 138 -148 -180 177 210 188 49 -32 -68 -725 -367 -323 -180 -451 -251 -80 -11
1694 -11 -343 -13 -157 -246 -132 -294 -246 280 395 671 526 567 256 130 397 583 264 275 589 244 368 -31
1716 -31 208 -352 -324 -676 -669 -1033 -512 -285 -456 -386 -257 -293 -239 90 -304 35 167 175 200 845 873 765 828 669
1740 669 571 199 144 473 98 109 -279 -34 -216 -442 -261 -710 -825 -657 -644 -446 -237 46 161 79 22 170
1762 170 -151 -150 257 243 228 271 408 524 395 536 239 30 46 42 -3 -35 279 107 -253 -319 65 -312 -377 -315
$$ packed form
1602gL49N5j1j17M64l96q7k03m10MK55J66J76K10l14k23k21K32M2j99j45J44r8
1625c34K21l2M25P6k17j49j62l28q4NO61L18m76N46j3k98M5J17n8q7K39M3p4J72
1649E56k56M5k64m14k8l88P1L12j55K4J61J01l2M35m44l79L34o9L39K84M74k10
1671D97K00k62n2O7J3m83J58k86l2L57L3k2j39q1l6o57L58M4J43k71K00J71O9
1694a1l32L30j44q9J14j62M8N26J15K76j45M1l11j26K67J86l19J1L14l45J24l99
1716c1K39n60K8l52Pl64N21K27j71P0J29l6N4L29l94L39J32QK5O45K8j08O3j59
1740F69r8l72n5L29l75J1l88K45j82k26J81m49j15J68J3J98K09K83J15q2n7J48
1762A70l21JM07j4j5M3J37J16j29J41k97k09J6mm5l2L14j72l60o6L84l77o5O2
$$ plain form
1786 -315 -382 -412 -580 -196 -628 -49 -139 -267 -277 -199 -6 60 264 339 101 533 504 592 644 336 344 137 194 86
1810 86 24 -60 -158 -88 -535 -213 -625 -583 -506 -526 -599 -56 -422 40 141 301 564 303 264 231 488 375 47 430
1834 430 98 39 300 405 2 -341 -43 -442 -416 -145 -256 -144 -140 -55 -57 -65 -75 -171 173 175 -31 158 -238 4
1858 4 12 -167 137 -27 45 -69 8 344 285 98 302 185 116 214 309 353 288 253 -142 -145 -154 95 -134 -121 -368 -134
1884 -134 -323 -380 -335 -149 -9 388 -48 195 378 324 239 143 350 46 470 525 200 5 -4 -313 -361 -221 246
1907 246 -249 -229 -475 -250 -143 51 273 105 -65 221 174 110 203 505 -9 -147 -177 -94 -55 -190 -192 -188 -199 -213
1931 -213 -129 -7 -25 -79 378 181 -112 293 323 330 638 155 -31 -53 -130 -210 -219 -619 -58 -362 -311 49 -201 -138
1955 -138 -236 -9 53 77 349 153 216 594 59 70 142 -68 21 -168 -234 -516 -293 -275 -92 66 141 18 -162
$$ packed form
1786c15o7l0j68L84m32N79r0j28j0P8J93O6K04P5k38M32k9Q8N2l08Qk07N7j08
1810H6o2q4r8P0m47L22m12M2P7k0p3N43l66M62J01J60K63k61l9l3K57j13l28L83
1834D30l32n9K61J05m03l43K98l99K6K71j11J12MQ5kqj0r6L44Kk06J89l96K42
1858DQj79L04j64P2j14P7L36n9j87K04j17o9R8R5M4o5l5l95lrK49k29J3k47K34
1884a34j89n7M5J86J40L97m36K43J83n4q5r6K07l04M24N5l25j95rl09m8J40M67
1907B46m95K0k46K25J07J94K22j68j70K86m7o4R3L02n14j38l0Q3L9j35kMj1j4
1931b13Q4J22j8n4M57j97k93M05L0PL08m83j86k2p7q0rm00N61l04N1L60k50O3
1955a38r8K27O2K4K72j96O3L78n35J1P2k10Q9j89o6k82K23J8J83J58P5j23j80
$$ plain form
1978 -162 -181 105 54 241 356 234 116 -76 119 365 165 -136 -748 -182 -111 -146 -301 -260 11 -80 -161 108
2000 108 99 95 309 108 277 530 204 385 177 34 105 -381 -229 -58 -543 -440 -159 -748 -656 -240 -68 -45
2022 -45 332 326 327 57 385 613 442 104 197 335 -261 -381 -252 -322 -429 -483 -125 -285 -410 -155 -357 -246 -162
2045 -162 43 142 310 493 517 271 363 357 -93 228 -168 -36 -422 -375 -311 -307 -357 -247 -251 -230 -1 -97 -232 41 245
2070 245 279 311 107 164 -42 -88 -19 -34 -533 -197 -548 -283 -219 -281 -94 -404 -216 -28 161 311 659 411 281
2093 281 356 587 448 394 221 -178 -374 -190 -205 -563 -384 -480 -825 -534 -276 -531 168 -49 277 208 273 521
2115 521 396 767 489 231 444 15 221 209 58 -292 -218 -3 -118 -96 -233 -198 -69 -87 -125 63 101 163 340
2138 340 127 262 148 -362 75 -114 -95 -283 -109 -446 -43 -141 -149 61 -36 295 98 328 562 536 469 562 410
$$ packed form
1978a62j9K86n1J87J15j22j18j92J95K46k00l01o12N66P1l5j55M1K71r1q1K69
2000A08rmK14k01J69K53l26J81k08j43P1m86J52J71m85J03K81n89R2M16J72K3
2022d5L77oJk70L28K28j71l38R3J38n96j20J29p0j07n4L58j60j25K55k02J11Q4
2045a62K05R9J68J83K4k46R2om50L21l96J32l86M7O4Mn0J10mK1K29r6j35K73K04
2070B45L4L2k04N7k06m6O9j5m99L36l51K65O4o2J87l10J88J88J89J50L48k48j30
2093B81P5K31j39n4j73l99j96J84j5l58J79r6l45K91K58k55O99k17L26o9O5K48
2115E21j25L71k78k58K13m29K06j2j51l50P4K15j15K2j37L5J29j8l8J88L8O2J77
2138C40k13J35j14n10M37j89J9j88J74l37M03r8qK10r7L31j97K30K34k6o7R3j52
$$ plain form
2161 410 454 328 2 91 -132 -282 -556 -438 -493 -475 -681 -629 -480 -441 60 -229 156 -235 294 433 685 580
2183 580 562 648 662 240 141 149 -102 -32 -515 -28 -201 -79 -97 -250 -156 -252 -381 -121 -40 100 216 126 120 153 188
2208 188 43 -123 90 119 -173 -354 -424 -182 -193 313 -10 70 -237 15 322 102 400 366 101 -9 442 169
2230 169 45 -51 -100 -495 -384 -275 -292 -463 -191 -287 -117 -131 334 31 478 335 579 277 272 511 445 515 30
2253 30 -136 -254 -312 -249 -41 -194 -96 -528 -588 -216 1 -81 -164 64 -8 252 268 415 332 364 327 147 -222 125
2277 125 38 -7 -125 -83 -346 -350 -38 -64 -149 -338 -260 5 187 284 498 349 50 213 78 26 40 -191 9 -458
2301 -458 -447 -592 -341 -370 -11 -150 -306 -223 -15 -1 110 244 189 315 159 146 -57 353 -153 15 135 -146
2323 -146 -188 -304 -21 -327 -46 -138 -154 -402 -87 84 116 323 111 296 338 191 314 270 114 -141 -221 -71
$$ packed form
2161D10M4j26l26Q9k23j50k74J18n5J8k06N2J49L9N01k89L85l91N29J39K52j05
2183E80j8Q6J4m22r9Qk51P0m83M87j73J22j8j53R4r6j29K60Q1J40J16r0oL3L5
2208A88j45j66K13K9k92j81p0K42j1N06l23Q0l07K52L07k20K98l4k65j10M51k73
2230A69j24r6m9l95J11J09j7j71K72r6J70j4M65l03M47j43K44l02nK39o6P0m85
2253C0j66j18n8O3K08j53R8m32o0L72K17q2q3K28p2K60J6J47q3L2l7j80l69L47
2277A25q7m5j18M2k63mL12k6q5j89P8K65J82R7K14j49k99J63j35n2J4k31K00m67
2301d58J1j45K51k9L59j39j56Q3K08J4J11J34n5J26j56j3k03M10n06J68J20k81
2323a46m2j16K83l06K81r2j6k48L15J71L2K07k12J85M2j47J23m4j56k55q0J50
$$ plain form
2345 -71 -15 -236 -649 -300 -535 -258 -264 210 -64 221 -161 385 205 376 77 474 301 8 169 -99 21
2366 21 88 -285 -89 -252 -508 102 -98 -76 -442 70 -26 213 298 401 461 162 287 441 -99 233 -27 -167
2388 -167 -109 -255 -67 -341 -42 -153 -61 -328 -117 177 62 322 309 62 376 381 30 -109 9 -99 161 -241
2410 -241 31 -271 -219 -315 -130 -37 -459 -110 -233 15 7 34 -29 272 126 272 355 207 255 100 27 -165 -186 35
2434 35 -100 -26 -49 -113 -157 -327 -59 -84 123 169 127 307 103 19 21 30 141 22 76 -21 -23 -47 -304 -457 -479 -281
2460 -281 -84 -310 -99 -125 -37 -93 -387 153 210 77 87 74 376 132 180 118 -128 -181 -58 -47 -38 -86 -145 -199 -88
2485 -88 -66 -109 -265 -154 22 148 248 302 254 120 275 117 -121 -126 -7 -449 40 22 -32 13 -63 313 111 214
2509 214 22 147 234 318 219 219 261 128 120 -143 -49 -322 -96 -214 -168 -333 -299 -55 -229 -64 96 -54 162 -55
$$ packed form
2345g1N6k21m13L49k35K77oM74k74K85l82N46j80J71k99L97j73k93J61k68J20
2366B1O7l73J96j63k56O10k00K2l66N12r6K39Q5J03O0k99J25J54n40L32k60j40
2388a67N8j46J88k74K99j11R2k67K11K94j15K60j3k47L14Nl51j39J18j08K60m02
2410b41K72l02N2r6J85R3m22L49j23K48qK7o3L01j46J46Q3j48M8j55p3j92k1K21
2434C5j35P4k3o4m4j70K68k5K07M6m2J80k04q4KRJ11j19N4r7kk4k57j53k2J98
2460b81J97k26K11k6Q8n6k94N40N7j33J0j3L02k44M8o2k46n3J23J1Rm8n9n4J11
2485h8K2m3j56J11J76J26J00N4m8j34J55j58k38nJ19m42M89j8n4M5p6L76k02J03
2509B14j92J25Q7Q4r9%M2j33qk63R4k73K26j18M6j65L4K44j74J65J60j50K16k17
$$ plain form
2533 -55 432 294 176 407 140 18 251 137 134 13 -81 133 -34 38 -449 -390 -54 -482 110 -48 -4 79 -121
2556 -121 -220 207 75 -179 70 30 -126 83 163 23 28 -253 56 -227 -150 -101 232 -321 -15 -32 124 -137 79
2579 79 -45 3 185 7 92 34 -354 -346 93 256 -274 88 162 -324 15 132 170 63 177 43 -250 221 319
2602 319 121 271 77 201 -94 -288 -70 217 239 -329 -128 142 60 -146 -130 7 -236 -207 -208 -110 -69 30 -84
2625 -84 -2 47 218 90 -65 46 -5 162 4 23 184 -15 -411 -186 -187 -163 -16 12 333 -49 13 59 171 -282
2649 -282 -143 -161 -58 -162 -32 133 42 -67 94 -184 -158 127 -14 6 -219 63 132 -51 50 -67 -52 -120
2671 -120 1 -163 101 -58 -59 -159 -42 -109 40 115 -93 -21 -255 49 141 126 -85 214 -21 394 9 -53 68
2694 68 116 70 103 373 -122 -94 92 -119 -94 -314 46 -247 -21 153 -86 79 167 92 -296 -182 -80 57 -30
$$ packed form
2533e5M87j38j18K31k67j22K33j14lj21r4K14j67P2m87N9L36m28N92j58M4Q3k00
2556a21r9M27j32k54K49m0j56K09Q0j40Nk81L09k83P7M9L33n53L06j7J56k61K16
2579G9j24M8J82j78Q5n8l88QM39J63n30L62P4m86L39J17L8j07J14j34k93M71R8
2602C19j98J50j94J24k95j94K18K87K2n68K01K70q2k06J6J37k43K9jR8M1R9j14
2625h4Q2M9J71j28j55J11n1J67j58J9J61j99l96K25jK4J47K8L21l82O2M6J12m53
2649b82J39j8J03j04J30J65r1j09J61k78K6K85j41K0k25K82O9j83J01j17J5o8
2671a20J21j64K64j59jj00J17o7J49P5k08P2k34L04R2j5k11K99k35M15l85o2J21
2694F8M8m6L3K70m95K8J86k11K5k20L60k93K26J74k39J65Q8p5l88J14J02J37q7
$$ plain form
2717 -30 81 241 152 -70 -114 114 -30 -31 -82 -261 -88 -144 154 -167 31 -117 13 76 129 43 -37 14 303 62
2741 62 -110 121 -131 123 -61 310 350 -93 65 83 149 -173 -267 -17 -173 17 26 -117 -75 -56 121 -323 78
2764 78 -229 -163 105 -209 95 -175 -98 -170 -30 -184 186 -102 151 -102 107 97 49 119 -101 47 -18 -101 -31
2787 -31 8 45 64 -260 284 -189 94 -6 -171 -57 -78 -292 25 -84 159 95 -23 -27 -85 160 -238 -21 14
2810 14 23 -11 11 -124 -100 -140 -54 338 -146 90 26 -59 345 303 213 -51 316 78 -41 331 77 128 61 -54 224
2835 224 -42 50 -12 -14 -108 -104 167 -28 -270 97 14 -6 -47 240 95 -91 -27 51 -16 28 120 -17 -117 -107 108
2860 108 -20 8 -84 -7 -75 -220 21 -160 -99 105 -33 -183 28 154 -62 -121 48 37 -2 151 -230 65 -185
2883 -185 -97 -49 -6 -75 -58 85 83 242 -70 -156 107 339 5 -309 -11 211 -126 71 -116 114 113 -55 -4 -193
$$ packed form
2717c0J11J60q9k22m4K28j44jn1j79J73n6K98l21J98j48J30O3N3q6q0N1K89k41
2741F2j72K31k52K54j84L71M0m43J58J8O6l22r4K50j56J90Rj43M2J9J77m44M01
2764G8l07O6K68l14L04k70P7p2J40j54L70k88K53k53K09j0m8P0k20J48o5q3P0
2787c1L9L7J9l24N44m73K83j00j65J14k1k14L17j09K43o4j18mn8K45l98K17L5
2810A4Rl4K2j35K4m0Q6L92m84K36o4q5M04m2r0k64L67k38j19L72k54N1o7j15K78
2835B24k66R2o2kr4MK71j95k42L67q3k0m1K87j45j86O4P8o7M4R2j37j00J0K15
2860A08j28K8r2P7o8j45K41j81O1K04j38j50K11J26k16n9J69j1l9J53l81K95k50
2883a85Q8M8M3o9J7J43kJ59l12q6K63K32l34l14K98K22l37J97j87K30jj68N1j89
$$ plain form
2907 -193 109 131 -238 188 40 1 124 -129 -2 191 23 195 -163 432 133 135 205 -3 405 -169 -89 -163
2929 -163 30 -8 -351 -74 -79 -338 -38 51 -232 -96 -105 83 -117 114 71 115 -98 6 180 -25 -167 44 36
2952 36 -47 213 169 -34 22 64 242 110 310 91 -137 134 -94 251 29 -263 -78 -202 8 -120 -91 -322
2974 -322 143 92 -220 -22 112 -64 63 267 152 -90 -129 73 101 234 7 -164 -109 26 -36 393 -193 -282
2996 -282 109 -67 110 69 -15 120 10 -82 -189 -217 154 183 111 176 268 9 -61 244 103 41 -61 58 67 -205
3020 -205 -136 17 119 -226 89 119 9 -86 -94 -280 60 -223 -34 -112 145 172 221 -128 86 -127 -83 122 40
3043 40 76 -8 388 61 -363 -56 112 31 248 -82 -15 -152 -42 -57 131 237 -130 39 -119 195 -89 -44
3065 -44 195 -95 209 -134 -126 340 40 -239 -141 19 261 -281 -22 74 425 -318 -35 -47 -79 63 108 14 -99
$$ packed form
2907a93L02K2l69M26j48l9J23k53J27J93j68J72l58N95k99KP0k08M08n74Q0p4
2929a63J93l8l43K77nk59L00Q9k83J36rJ88k00K31m3M4k13J04J74k05j42K11q
2952C6q3K60m4k03N6M2J78j32K00k19k28K71k28L45k22k92J85j24K10j28K9k31
2974c22M65n1l12J98J34j76J27K04j15k42l9K02K8J33k27j71N5J35o2M29n86q9
2996b82L91j76J77m1q4J35j10r2j07k8L71K9p2O5R2k59p0L05j41o2j02J19Rk72
3020b05O9J53J02l45L15L0j10r5qj86L40k83J89p8K57K7M9l49K14k13M4K05q2
3043D0L6q4L96l27m24L07J68q1K17l30O7j37J10j5J88J06l67J69j58L14k84M5
3065d4K39k90L04l43QM66l00k79R8J60K42n42K59R6L51p43K83j2l2J42M5r4j13
$$ plain form
3088 -99 -326 -1 -473 -68 48 99 206 -74 -149 175 -211 -56 -98 -21 94 69 -73 -2 27 74 -134 -136 -136 -45 71
3113 71 7 134 144 -3 25 109 163 -112 80 -273 56 -138 44 -63 -67 -102 -1 72 92 3 -20 -192 106 -135
3137 -135 -150 -134 -92 19 156 -97 113 -76 -68 121 -218 183 199 181 -59 69 2 -108 -168 80 -49 -146 107
3160 107 6 -56 79 57 274 176 -21 44 -129 -171 19 -51 -174 -326 -61 123 27 -49 -2 177 57 -42 -78 -198
3184 -198 157 148 -103 -196 -53 237 -74 11 477 -8 -125 -322 71 -16 231 15 -79 113 -56 -297 -42 -2
3206 -2 40 351 -125 87 79 381 -79 -24 60 -11 157 77 80 38 -247 -105 159 24 41 -89 -312 91 -24 57 101
3231 101 302 -155 78 -95 -89 314 -172 -3 179 -160 -34 288 -299 -330 -40 -125 -176 -239 -187 -2 27 239 -229
3254 -229 -96 102 274 50 -3 -36 159 191 -106 -278 -28 -68 -75 306 -104 -114 94 -12 -3 162 33 -110 49
$$ packed form
3088i9k27L25m72M05J16N1J07k80p5L24l86J55m2P7J15k5j42P1K9M7k08k%R1J16
3113G1o4J27J0j47K8Q4N4k75J92l53L29j94J82j07ml5J01P3K0q9k3j72K98k41
3137a35j5J6M2J11J37k53K10j89QJ89l39M01J6j8k40J28o7j10o0K48j29r7K53
3160A07j01o2J35k2K17r8j97O5j73m2J90p0j23j52K65J84r6p6M7J79j20r9l6j20
3184a98L55rk51r3J43K90l11Q5M66m85j17j97L93q7K47k16r4J92j69k41K55M0
3206bM2L11m76K12qL02m60N5Q4p1J68q0Lm2k85J42K64j35J7j30k23M03j15Q1M4
3231A01K01m57K33j73OM03m86J69J82l39J26L22n87l1K90q5n1o3N2J85K9K12m68
3254b29J33J98J72k24n3l3J95L2k97j72K50m0pL81m10j0K08j06RJ65j29j43J59
$$ plain form
3277 49 1 256 180 39 94 -138 -187 221 -109 148 120 -110 -26 -148 273 32 55 -40 146 -38 -227 143 272
3300 272 36 141 193 -129 162 143 326 -91 237 149 134 15 -80 0 -68 -140 -83 -110 -207 250 171 86 -3 126 -399
3325 -399 167 -130 -85 -164 -47 24 -100 48 -26 -201 191 91 102 -80 23 279 167 -193 104 -59 -22 -166
3347 -166 -327 -46 -63 211 -109 -56 -24 -121 -178 -161 -156 22 -65 -164 56 152 -30 156 229 68 -92 76 -43 138
3371 138 44 336 -99 162 28 -155 -106 217 -104 82 61 63 -79 57 482 -110 56 -23 -2 61 264 87 150
3394 150 111 84 238 -209 3 -80 158 -214 -188 45 -191 -81 85 -305 214 -147 -206 70 30 -14 -73 0 150
3417 150 52 -196 236 14 -129 -77 -213 309 -276 -32 216 247 -2 -171 -137 -141 -78 -76 250 -30 -101 74 -62
3440 -62 -54 -7 140 33 -66 -56 11 -11 -243 -74 -46 55 -49 -163 132 2 88 -91 -115 80 9 320 188 -7
$$ packed form
3277D9m8K55p6j41N5k32m9M08l30K57k8k30Q4j22M21k41K3r5J86j84j89L70J29
3300B72k36J05N2l22K91j9J83m17L28q8j5j19r5Q0o8p2N7k7r7M57p9q5q9J29n25
3325c99N66k97M5p9J17P1j24J48p4j75L92j00J1j82J03K56j12l60K97j63L7j44
3347a66j61K81j7K74l20N3L2r7n7J7NJ78q7r9K20R6j82J86P3j61j60J68j19J81
3371A38r4K92m35K61j34j83M9L23l21J86k1Kj42J36M25n92J66p9K1O3K03j77O3
3394A50l9k7J54m47K12q3K38l72K6K33k36J10J66l90N19l61n9K76m0m4n9P3J50
3417A50r8k48M32k22j43N2j36N22n85K44K48L1k49j69L4mO3KL26k80p1J75j36
3440f2QM7J47j07r9J0O7k2k32J69K8J01j04j14K95j30Q6j79k4J95p1L11j32j95
$$ plain form
3464 -7 172 -179 49 -339 -100 45 -241 76 30 -142 275 259 49 82 -213 -70 -30 110 94 -260 -154 -55 159
3487 159 14 -110 94 52 -74 14 -301 -296 -292 -1 69 106 161 9 57 168 191 187 -156 31 347 43 17 -122 76
3512 76 -362 -132 157 205 14 -35 220 -38 105 153 -92 76 60 -11 -108 -92 208 -128 -213 174 146 121 136 107
3536 107 -44 -19 127 7 -8 55 129 -13 -138 58 -103 -82 5 -89 -110 -241 -255 -34 -212 130 -187 -215 208
3559 208 113 -155 -184 164 -10 -37 -174 -78 -5 -48 -35 -131 182 -124 170 -25 -192 155 -119 -91 416 78 -39
3582 -39 -195 -366 91 120 227 207 -109 151 -54 -46 -7 107 20 -149 125 -75 140 21 -26 -6 30 -32 383 6
3606 6 -215 35 -79 -119 -42 156 38 -9 -186 274 -100 -87 -163 29 -152 -135 -79 88 289 -43 -5 -55 -120 18
3630 18 -29 77 83 -42 207 -25 -218 72 -119 35 215 142 -139 -26 -95 -146 -149 -25 -36 -37 -134 -49 -141 84 372
$$ packed form
3464gJ79l51K28l88K39J45k86L17m6j72M17j6k10L3k95J43M0J40j6l54J06R9K14
3487A59j45j24K04m2j26Q8l15NMK91P0L7N5j52M8J11K3ml43J87L16l04k6j39J98
3512G6m38K30K89M8j91m9K55k58J43M8k45J68j6p1r7J6L00l36q5L87k8k5J5k9
3536A07j51K5J46j20j5O3P4j42j25J96j61K1Q7r4k1j31j4K21j78L42l17k8M23
3559B08r5k68k9L48j74k7j37R6P3m3J3r6L13l06K94j95j67L47k74K8N07l38j17
3582c9j56j71M57K9J07k0l16K60k05QL9J14q7j69K74k00K15j19m7K0L6o2M15l77
3606Fk21K50j14m0P7J98j18m7j77M60l74J3p6J92j81J7N6J67K01l32L8n0o5J38
3630A8m7J06Oj25K49k32j93K90j91J54J80p3k81J13o9n1lJ24j1jr7Q5r2K25K88
$$ plain form
3655 372 47 286 47 209 -187 155 144 143 12 -193 -79 -118 233 149 35 -137 219 87 -67 125 45 20
3677 20 167 -74 -373 -230 -66 -80 -63 138 -18 128 -119 -217 163 -232 -15 -232 -135 -212 -86 110 -155 107
3699 107 -186 33 -27 65 -108 -194 131 -7 179 -33 -81 60 -17 126 244 105 -66 42 -63 -62 208 164 -67
3722 -67 47 -181 -38 -59 -304 162 424 -76 186 144 -19 -329 34 66 -10 257 183 -234 -186 144 -147 299
3744 299 116 11 -166 -241 -42 -114 213 66 -219 -304 115 -204 159 -38 139 -64 148 198 12 -516 -184
3765 -184 220 -94 -134 -219 -157 273 149 -83 -54 174 77 67 -155 50 209 -20 200 -10 112 314 -111 -268
3787 -268 79 -97 11 -175 3 11 78 -26 107 88 196 -17 -3 -432 -185 -161 -129 51 -56 -75 -224 -18 103
3810 103 -49 -37 38 142 244 225 -220 -80 -180 -252 250 -133 -154 87 89 -129 109 -35 -308 -1 -30 78 74
$$ packed form
3655C72l25K39k39J62l96L42j1jj31k05J14l9L51q4j14j72L56j32j54J92q0k5
3677B0J47k41k99J43J64j4J7K01j56J46k47r8L80l95K17k17R7p7J26J96k65K62
3699A07k93K19o0R2j73q6L25j38J86k12m8J41p7J43J18j39j71J08j05JK70m4k31
3722f7J14k28J43k1k45M66K62n00K62m2j63l10L63L2p6K67p4m17M8L30k91M46
3744B99j83j05j77p5J99p2L27j47k85q5M19l19L63j97J77k03K12N0j86n28L32
3765a84M04l14m0q5O2M30j24k32K9K28r7j0k22K05J59k29K20k10J22K02m25j57
3787b68L47j76J08j86J78QO7j04J33j9J08k13J4m29K47K4L2J80j07j9j49K06J21
3810A03j52J2P5J04J02j9m45J40j00p2N02l83k1K41Kk18K38j44k73L07k9J08m
$$ plain form
3833 74 98 63 -192 191 -197 133 -99 -160 -171 96 124 231 -60 -84 -337 -18 -139 -135 45 185 84 -195 -5
3856 -5 -88 47 108 103 -20 132 115 -43 -100 267 -22 109 -88 178 -95 -67 -3 -54 -62 -270 139 -14 -200 8
3880 8 207 -10 13 125 -38 -29 -74 191 72 213 -24 -174 -190 356 -5 10 -112 -151 237 24 268 48 15
3903 15 138 127 101 139 51 -133 -4 9 -10 109 -60 251 -75 -153 -110 -111 -72 -74 88 235 75 -266 -154 85 -109
3928 -109 109 45 200 -153 224 30 -151 -61 94 58 22 -34 167 185 -32 280 -160 -137 77 -85 93 -62
3950 -62 29 -106 196 -211 251 48 -123 -63 155 -42 -24 -30 -221 -54 -18 145 126 36 104 -96 215 17 38 164
3974 164 210 -83 -186 207 95 16 39 -61 -94 -133 156 174 -272 -127 207 315 -2 156 -15 50 14 -106 83
3997 83 -197 5 -216 39 -38 412 -302 7 -10 -27 60 -121 -353 80 -141 -246 348 245 -89 -351 182 145
$$ packed form
3833G4K4l5k55L83l88L30k32o1j1K67K8J07k91k4k53L19j21MJ80J40j01k79J90
3856eq3J35O1nj23J52j7j58n7L67k89J31j97K66k73K8O4n1qk08M09j53j86K08
3880HJ99k17K3J12j63Rm5K65j19J41k37j50j6N46l61J5j22l9L88k13K44k20l3
3903A5J23j1k6L8q8j84J29J3j9J19j69L11l26p8M3jL9kJ62J47j60l41J12K39j94
3928a09K18o4J55l53L77j94j81R0J55l6l6n6K01J8k17L12m40K3K14j62J78j55
3950f2R1j35L02m07M62k03j71O0K18j97J8oj91J67L6J63j9r0O8k00L11j98K1J26
3974A64M6k93j03L93j12p9K3j00l3l9K89J8m46J45L34J08l17J58j71O5l6j20J89
3997H3k80K02k21K55p7M50p14L09j7j7Q7j81k32M33k21j05N94j03l34k62N33l7
$$ plain form
4019 145 -78 -119 51 -123 -459 -52 151 -102 -120 -67 59 -56 3 -24 188 -77 -73 37 88 41 -26 122 -168
4042 -168 -21 270 -55 78 23 -48 159 -14 154 82 -53 -61 -204 -230 -115 110 -18 -9 -201 -99 11 0 -131
4065 -131 -260 238 -15 20 83 145 20 8 -150 -170 135 -91 163 -36 -128 97 -148 42 -248 -45 9 -96
4087 -96 -88 181 85 101 54 5 -61 166 115 -188 57 87 -25 -234 233 -60 -124 -13 14 174 16 -237 -83 -314
4111 -314 -249 39 131 61 181 -63 210 114 -102 -144 -321 15 283 -121 61 59 286 108 108 107 60 -23 39 -52 12
4136 12 126 -168 214 88 -260 -17 70 16 142 154 -193 84 88 202 112 -137 98 -108 52 29 -208 -246 -95
4159 -95 7 7 364 20 -35 -102 -240 48 -25 95 400 -8 37 -31 108 37 86 -259 29 199 208 -72 -4 80 -228
4184 -228 147 -222 -146 98 47 169 -228 -1 288 -108 -14 -96 158 -37 182 22 -23 149 -1 87 10 -36 -52
$$ packed form
4019A45k23m1J70j74l36M07K03k53j8N3J26j15N9k7K12k65MJ10N1m7o7J48k90
4042a68J47K91l25J33n5p1K07j73J68p2j35qj43k6J15K25j28Rj92J02J10j1j31
4065a31j29M98k53L5O3O2j25j2j58k0L05k26K54j99r2K25k45J90k90K03N4j05
4087i6QK69r6J6m7m9o6K27n1l03K45L0j12k09M67k93o4J11K7J60j58k53J54k31
4111c14O5K88R2p0J20k44K73r6k16m2j77L36K68m04J82kK27j78%jm7q3O2r1O4
4136A2J14k94L82j26l48K43Q7n4J26J2l47K77MJ14r0k49K35k06J60k3k37l8J51
4159i5J02%L57l44n5o7j38K88p3J20L05m08M5o8J39p1M9l45K88J70Rk80O8Q4l08
4184b28L75l69P6K44n1J22l97K27K89l96R4q2K54j95K19j60m5J72j50Q8p7m6j6
$$ plain form
4207 -52 -4 306 99 -90 39 24 -23 -278 89 75 -84 -85 -102 -50 -223 -8 293 -150 -101 -65 327 182 -408 -124
4231 -124 -114 23 154 -59 157 -134 154 46 -372 -48 -42 -86 -60 -362 -203 116 53 329 68 -3 -12 67 -46
4254 -46 175 145 -36 -105 -271 7 128 -336 -289 16 -135 -113 66 -335 -279 -114 75 -16 -14 -47 136 27 -49 42
4278 42 120 75 -38 -55 -80 181 224 -159 64 125 169 192 26 116 284 125 71 166 115 115 -147 82 233 141 -166
4303 -166 -83 298 -74 313 81 -196 198 90 96 -203 -142 -14 157 -200 259 347 -71 74 29 65 -94 71
4325 71 -60 -57 -81 155 -198 -74 -38 -115 -22 -246 -93 146 72 65 120 -53 118 -144 141 216 38 -51 26 -229 17
4350 17 90 -24 -122 -20 -175 -154 222 69 -34 -135 72 13 -73 -340 -129 119 -37 -68 133 -76 -156 46 -70
4373 -70 53 163 66 293 189 -45 61 -82 97 -138 192 -95 51 32 -188 -22 -77 -40 145 72 28 108 -14
$$ packed form
4207e2M8L10k07j89J29j5m7k55L67j4j59jj7N2j73K15L01m43M9L6L92j45n90K84
4231a24J0J37J31k13K16k91K88j08m18L24Om4K6l02J59L19o3K76k61p1rP9j13
4254d6K21l0j81o9j66K78J21m64M7L05j51K2J79m01N6J65J89r1Kl3J83j09p6R1
4278D2P8m5j13j7k5K61M3l83K23O1M4K3j66R0J68j59n4R5n1%k62K29J51r2l07
4303a66Q3L81l72L87k32k77L94j08Ok99O1J28J71l57M59Q8m18J45m5L6j59J65
4325G1j31Lk4K36l53J24L6p7R3k24J53K39p4pN5j73J71k62K85P5j78q9P7k55K46
4350A7P3j14r8J02j55K1L76j53j03j01K07n9q6k67K11K48j56l1K01k09q0K02j16
4373g0J23J10r7K27j04k34J06j43J79k35L30k87J46j9k20J66n5L7J85p3m4Q0j22
$$ plain form
4396 -14 -220 54 -114 259 -4 -44 -38 -200 25 -276 58 307 -36 -71 79 150 -175 48 52 -209 77 -204 -45
4419 -45 207 241 -107 104 -174 -116 -324 -13 50 225 53 153 3 156 -38 136 189 89 -86 -133 -165 217
4441 217 41 -170 -109 -101 -314 81 -77 58 -111 244 -17 -48 22 -44 -107 40 192 23 118 77 -87 -41 288
4464 288 85 -142 72 5 2 -208 33 -95 119 45 -131 28 94 92 -4 141 74 -102 68 417 244 -150 -125
4487 -125 61 -41 -175 -98 182 -167 -61 154 139 22 361 70 -81 -43 97 -119 73 30 -87 -223 -58
4508 -58 -171 -74 367 -208 71 -21 8 -30 159 -127 -89 71 -119 13 -127 -54 -80 -108 -201 74 -43 -73 -38 20
4532 20 -63 -27 322 -1 -254 144 45 -164 67 -24 150 163 57 -275 -244 190 168 28 -69 151 82 -18 -171
4555 -171 117 -17 217 -61 -220 -203 -97 94 -100 -230 89 53 -159 -63 87 17 256 108 139 82 57 -179
$$ packed form
4396a4k06K74j68L73k63m0Oj62K25l01L34K49l43l5J50P1l25K23Mk61K86k81J59
4419d5K52L4l48K11k78N8k08L11O3J75j72J00j50J53j94J74N3j00j75m7l2L82
4441B17j76k11O1Qk13L95j58J35j69L55k61l1P0o6o3J47J52j69R5m1j64M6L29
4464B88k03k27K14o7lk10K41j28K14p4j76J59O6kr6J45o7j76J70L49j73l94K5
4487a25J86j02j34P7K80l49J06K15j5j17L39k91j51L8J40k16J92m3j17j36J65
4508e8j13R7M41n75K79r2K9l8J89k86L8J60j90J32j40P3k6k8r3K75j17l0L5N8
4532B0q3L6L49l23k53L98r9k09K31r1J74J3j06l32L1M34k2j40r7K20o9j00j53
4555a71K88j34K34k78j59J7J06J91j94j30L19l6k12R6J50p0K39j48L1n7k5k36
$$ plain form
4577 -179 -225 15 -206 -265 -154 -259 -107 198 16 -159 -318 -187 -213 160 122 -111 47 7 -97 -160 17 -33
4599 -33 282 66 226 -140 6 -190 -41 -231 -58 -118 -271 -46 -38 -90 -4 249 351 229 -213 208 381 -41
4621 -41 321 -258 206 -87 -61 -46 145 53 42 28 21 143 66 265 -80 -23 6 222 14 -64 69 -9 -170 171
4645 171 -166 182 -37 -231 -130 -391 -7 -20 44 -30 -185 -95 140 25 212 198 -111 -31 -30 10 -30 -412 -129
4668 -129 -25 -244 55 -188 -112 -12 -56 -44 -118 70 -119 -140 -130 44 10 -11 -10 -299 -151 -202 -132 142 -48 -26
4692 -26 49 -28 14 -47 -72 151 46 -228 -263 55 -59 -91 214 17 46 138 11 -63 -51 256 21 -67 35 49 -209
4717 -209 39 -78 -44 -281 110 55 307 49 110 637 -68 121 -80 190 212 -257 98 -203 -167 35 -18 261
4739 261 122 65 -102 142 116 -222 58 159 210 23 44 -58 -44 176 73 -159 60 57 70 87 -216 -13 -40
$$ packed form
4577a79m6K40k21n9J11j05J52L05j82j75j59J31k6L73l8k33J58m0j04o3J77n0
4599c3L15k16J60l66J46j96J49j90J73o0j53K25Qn2Q6K53J02j22m42M21J73m22
4621d1L62n79M64k93K6J5J91r2j1j4pJ22p7J99l45N7K9K16k08p8J33p8j61L41
4645A71l37L48k19j94J01k61L84j3O4p4j55R0K35j15J87j4l09Q0JM0m0l82K83
4668a29J04k19K99k43P6J00m4J2p4J88j89k1J0J74l4k1Jk89J48n1P0K74j90K2
4692b6P5p7M2o1k5K23j05k74l5L18j14l2L05j97K9R2j27p4J2L07k35q8J02J4k58
4717b09K48j17L4k37L91n5K52k58O1N27p05J89k01K70K2m69L55l01L6K02n3K79
4739B61j39n7j67K44k6l38K80J01N1j87K1j02J4K20j03k32K19lJ3J7l03K03k7
$$ plain form
4762 -40 49 -3 114 28 76 128 61 -10 -31 -57 -20 27 300 -63 -185 -19 -71 -136 -123 96 -202 -323 -113 -26 -12 96
4788 96 89 41 344 -209 14 18 158 24 3 113 19 354 319 -119 51 114 -160 321 190 -115 -179 -77 -16 137
4812 137 -267 214 -36 -123 -149 -80 -63 260 -213 -44 140 -254 -217 -114 63 -44 164 -331 -74 -181 -77 32
4834 32 -20 67 116 194 -196 -183 41 216 116 -127 -184 158 -39 -168 -22 -40 -128 -190 -78 22 -70 -135 9 -99
4858 -99 -80 287 47 -275 110 49 -84 -33 235 -241 -306 26 124 -58 -174 -36 31 -4 -90 126 84 200 -53
4881 -53 35 -28 115 29 -3 263 12 -24 -111 92 -45 -194 247 -16 -123 211 302 77 166 72 -148 40 162
4904 162 24 216 -64 288 -23 -58 274 83 135 217 248 83 47 -123 -97 94 -71 198 59 -179 147 -171
4926 -171 92 -244 350 -11 141 -180 14 38 -97 12 135 -164 -124 124 -143 -261 -261 77 -42 167 -73
$$ packed form
4762d0Q9n2J17q6M8N2o7p1k1k6L7M7K73l63j22J66n2o5J3K19k98j21K10Q7J4J08
4788I6pm8L03n53K23MJ40j34k1J10r4L35l5m38J70O3k74M81j31l05o4J02O1J53
4812A37m04M81k50q7k6O9J7L23m73J69J84l94L7J03J77j07K08m95K57j07J04J09
4834C2n2Q7M9P8l90J3K24J75j00k43n7L42j97j29J46j8q8o2J12J00r2o5J44j08
4858i9J9L67k40l22L85o1j33N1K68m76o5L32R8j82j16J38O7l5q6K16m2J16k53
4881e3Q8o3J43q6l2K66k51l6q7K03j37j49M41k63j07L34R1k25Q9r4k20J88J22
4904A62j38J92k80L52l11l5L32j91N2Q2L1j65l6j70K6J91j65K69j39k38L26l18
4926a71K63l36N94l61J52l21J94K4j35J09J23k99M0K48k67j18%L38j19K09k40
$$ plain form
4947 -73 57 116 -210 36 61 -44 12 -139 46 -163 100 -93 -57 116 29 90 316 97 -93 149 -168 -234 -107
4970 -107 -48 55 96 -78 33 170 81 -62 -323 -109 90 -74 -38 119 28 195 353 83 33 -101 -54 -72 -203
4993 -203 158 266 -95 24 25 110 -119 -225 -106 -211 242 27 0 204 114 101 45 6 -190 377 -188 50 114
5016 114 203 299 340 119 -223 16 77 65 -54 210 -169 -54 -57 -145 108 -202 -96 28 129 -239 -11 -151 -103
5039 -103 -168 -130 110 86 -234 288 -55 -253 27 261 -126 -64 -151 -92 -39 -37 61 461 -94 -81 -128 128 330 -105
5063 -105 -20 141 -385 -95 338 32 110 111 -139 49 -56 -48 -11 -17 182 166 -54 25 163 -21 -54 -224 120 183
5087 183 -109 -55 -234 -113 -75 60 60 95 112 82 238 -38 92 377 295 85 34 188 10 162 104 11 87 83 20
5112 20 -24 -64 181 -214 -307 -93 84 -168 -163 15 183 173 153 187 -123 -411 -50 24 -283 12 -42 -236 6 269
$$ packed form
4947g3J30N9l26K46K5j05N6j51J85k09K63j93L6J73q7O1K26k19j90K42l17o6J27
4970a07N9J03M1j74J11J37q9j43k61K14J99j64L6J57r1J67J58k70n0j34M7j8j31
4993b03L61J08l61J19JQ5k29j06J19j05M53k15k7K04r0j3n6l9j96N67n65K38O4
5016A14Q9R6M1k21l42K39O1j2j19K64l79J15lq8K53l10J06J24J01l68K28j40M8
5039a03o5L8K40k4l20N22l43j98K80K34l87O2q7N9N3KR8M00n55J3m7K56K02m35
5063a05Q5J61n26K90M33l06P8Jk50J88j05QL7oJ99j6k20P9J38j84l3j70L44O3
5087A83k92N4j79J21L8J35%L5J7l0J56k76J30K85q2k10n1J54j78J52n8r3P6mo3
5112B0m4m0K45l95r3K14J77k52NJ78J68j0k0L4l10k88L61P4l07K95n4j94K42K63
$$ plain form
5136 269 -33 -93 -237 28 35 15 -103 203 86 90 -199 -186 145 -70 82 90 -16 245 114 143 427 0 -278
5159 -278 -60 27 -356 -96 119 44 -97 -151 400 221 -178 217 -53 200 45 83 -183 106 88 7 -211 89
5181 89 181 -83 41 56 23 -238 56 -118 15 79 -230 -58 65 -269 290 -78 74 -53 -13 32 -225 -23
5203 -23 4 -35 -129 53 -227 -131 0 116 -7 -18 -76 90 91 -179 -82 -85 -116 229 -455 -74 -86 -130 80 0 -31 -182
5229 -182 20 -91 196 -263 -71 -134 -162 99 -73 35 223 154 -285 -224 -32 -162 -61 176 -21 147 9
5250 9 85 213 -95 -97 59 68 41 45 30 -94 129 307 96 -173 -149 371 97 31 -10 -46 -232 84 -151 66 -87
5275 -87 18 16 49 61 -55 151 14 224 55 282 71 48 -6 -175 241 211 156 -43 119 -367 -91 -130 -74 -204
5299 -204 -59 -178 -67 -12 -67 73 -174 45 9 -22 -5 -108 185 -39 51 -69 -153 -87 117 144 -140 -162 163
$$ packed form
5136B69l02o0j44K65Pk0j18L06j17Mk89J3L31k15J52Qj06K61j31K9K84m27k78
5159b78K18Q7l83K60K15p5j41n4N51j79l99L95k70K53j55L8k66K89j8q1k18L00
5181H9R2k64J24J5l3k61K94j74J33O4l09J72J23l34N59l68J52j27M0M5k57K02
5203b3K7l9r4J82k80R6J31J16j23j1n8J66Jk70R7ll1L45o84L81j2m4K10q0l1j51
5229a82K02j11K87m59J92o3k8K61j72J08J88o9m39O1J92j30J01K37j97J68j38
5250IP6J28l08kJ56Rk7Mj5j24K23J78k11k69K4N20k74o6m1l6j86L16k35K17j53
5275h7J05kL3J2j16K06j37K10j69K27k11k3n4j69M16l0n5j99J62m86K76l9N6j30
5299b04J45j19J11N5n5J40k47K19l6l1J7j03K93k24R0j20q4O6K04K7k84k2L25
$$ plain form
5322 163 87 -136 13 -76 -365 28 -43 9 -3 90 93 139 111 -188 2 -260 -63 -15 55 39 37 189 -103 -95 -84 -180
5348 -180 49 -242 -48 -121 328 -322 -201 113 213 -259 105 -190 -71 73 -173 79 1 63 -229 -234 119 -137
5370 -137 34 197 -94 -180 -251 -13 -216 -15 78 -207 167 -339 -27 81 -64 62 226 -145 -70 -20 64 -65
5392 -65 -28 55 65 -75 -42 -63 105 7 -91 129 -40 -109 -2 -20 -53 -276 -212 243 -113 -86 2 -208 -197 201 -199
5417 -199 -144 -49 232 -120 293 -190 -79 149 131 -63 -281 39 -288 -109 129 75 -187 -115 -181 -382 128 11
5439 11 -65 -105 139 218 127 35 41 70 -67 -79 -78 123 -89 128 64 -241 229 -101 -206 -185 -118 -15 -55 -137 207 29
5465 29 -155 21 -107 -75 58 151 26 278 -218 168 -175 -139 -449 -18 146 -479 13 -339 96 229 330
5486 330 94 -285 -51 146 205 -96 131 -168 192 -118 -366 -143 -146 -67 -27 38 247 220 266 -23 25 38 162
$$ packed form
5322A63p6k23J49q9k89L93p1N2j2R3LM6k8k99J90k62J97M8P0j6kJ52k92QJ1r6
5348a80K29k91J94p3M49o50J21L14J00m72L64k95J19J44k46K52p8O2k92nL53k56
5370a37J71J63k91q6p1K38k03K01R3k85L74n06L12J08j45J26J64l71P5N0Q4j29
5392f5L7Q3J0j40L3k1J68r8r8K20j69o9J07j8l3k23O4M55l56K7Q8k10J1L98m00
5417a99N5R5K81l52M13m83J11K28j8j94k18L20l27J79K38n4k62P2o6k01N10j17
5439A1p6m0K44P9r1r2OK9j37j2JK01k12K17o4l05M70l30j05K1O7J03m0q2L44j78
5465B9j84J76j28L2J33R3j25K52m96L86l43L6l10M31J64o25M92l52M35J33J01
5486C30k36l79K34J97N9l01K27k99L60l10k48K23lP9M0O5K09k7M6k89M8J3J24
$$ plain form
5509 162 43 -102 154 -163 -145 -62 -3 19 269 35 -89 -12 -45 -125 167 -8 -288 -2 -162 29 11 127 -47
5532 -47 -107 106 -2 -157 -55 88 -54 -267 120 147 30 140 -36 167 349 179 328 -8 82 129 -14 -64
5554 -64 218 139 99 104 -152 -17 -55 52 71 16 -101 -83 -70 -34 188 -32 -214 -25 197 -68 -93 80 103 156 185
5579 185 -188 -7 -31 -11 55 -48 -195 -229 37 -161 175 -263 -151 105 3 -107 4 123 112 405 5 335
5601 335 11 -418 -89 -206 -106 82 43 81 46 285 93 63 73 59 -31 310 126 -81 -20 3 -68 329 129
5624 129 87 208 -298 -200 -78 68 -88 117 -125 -98 68 12 -204 56 82 -9 181 -33 172 -79 -34 78
5646 78 55 143 151 -7 -41 -51 -183 -187 -35 143 -54 65 48 -38 38 -3 -39 -10 272 31 -101 134 18 -87 8
5671 8 -79 -83 2 -404 -142 -135 -83 -8 84 14 -242 -111 163 5 10 -58 -123 29 198 257 68 -265 -72 71 -34 -85
$$ packed form
5509A62j19j45K56l17J8Q3N9K2K50k34j24P7l3q0K92j75k80K86j60J91j8J16j74
5532d7o0K13j08j55J02J43j42k13L87K7j17J10j76K03J82j70J49l36R0M7j43n0
5554f4K82p9m0Nk56J35l8J07J9n5j17J8J3L6K22k20j82J89K22k65k5J73K3N3K9
5579A85l73J81k4K0O6j03j47l4K66j98L36m38J12K56j02j10J11J19j1K93m00L30
5601C35l24m29L29j17J00J88l9L8l5K39j92l0J0j4r0L41j84k07O1K3p1L97k00
5624A29m2J21n06R8J22J46j56K05k42K7J66n6k16K60K6r1J90k14K05k51M5J12
5646G8k3Q8Qj58l4j0j32mJ52J78j97J19j7q6P6m1l6K9K82k41j32K35j16j05R5
5671Hq7mQ5m06K62PN2P5R2p0k56J31K74j58No8o5J52J69N9j89l33J93J43j05n1
$$ plain form
5697 -85 -249 163 -42 20 -17 125 201 -178 -23 -66 17 102 193 44 -61 -126 -102 -108 -221 -56 232 -437 -64 64
5721 64 107 129 200 -49 -246 -75 -11 -33 48 306 -148 -294 105 93 -56 -212 -152 146 -149 -6 139 -152 -221
5744 -221 127 36 51 -158 195 57 -193 -162 -105 84 74 -18 -48 -34 -76 173 -82 -126 -148 346 202 -17 58 -201
5768 -201 423 -255 52 -17 58 393 -81 -35 64 -24 -11 3 -145 -90 84 -24 -176 84 184 210 -131 14 67
5791 67 -134 -86 7 62 121 6 201 -136 -78 79 247 -166 -18 -156 -172 -116 173 -100 -59 -130 -197 -115 -4 -91
5815 -91 193 267 307 229 87 126 -166 120 -275 -80 104 76 -150 -61 -166 -218 -179 24 180 -67 -77 98 83 160
5839 160 1 198 212 123 246 183 97 158 551 177 -157 90 -152 -26 90 -147 76 98 57 9 267 -218 78
5862 78 49 59 4 -40 110 196 22 -35 358 -177 -332 -111 124 -97 -95 223 -91 -103 -23 31 124 87 118 8 -226
$$ packed form
5697h5j64M12k05O2l7J42P6l79J55m3Q3Q5R1j49j05o5K4oj13J65K88o69L73J28
5721F4M3K2P1k49j97J71O4k2Q1K58m54j46L99j2j49j56O0K98k95J43J45k91o9
5744b21L48r1J5k09L53j38k50L1N7J89j0r2l0J4m2K49k55m4k2M94j44k19P5k59
5768b01O24o78L07o9P5L35m74M6R9q8J3J4j48N5J74j08j52K60J00K6l41J45N3
5791F7k01M8R3N5N9j15J95l37N8J57J68m13J48j38j6N6K89k73M1p1o7Q2J11q7
5815i1K84P4M0p8j42L9k92K86l95J95J84k8k26Q9j05n2L9K03J56k47j0J75j5P7
5839A60j59J97J4q9J23o3q6O1L93l74l34K47k42J26J16k37K23K2m1m8K58m85K96
5862G8k9J0n5m4J50Q6j74n7L93n35j55K21K35k21KL18l14j2Q0N4R3l7L1j10k34
$$ plain form
5887 -226 -17 46 -12 28 90 -161 27 115 -101 -49 -45 406 27 167 -230 137 271 -124 -231 53 -287 -161 -22
5910 -22 -56 15 50 21 -260 -105 22 242 -103 -19 37 94 105 38 375 133 -174 -9 243 141 -48 52 374
5933 374 212 -64 381 -161 170 -74 2 -103 196 -401 -228 -171 -160 -229 -400 -66 -43 2 117 127 86 -110 149
5956 149 105 -83 130 -78 -144 -245 -269 -317 93 71 -316 224 -147 218 -70 220 -67 101 -38 328 27 -280
5978 -280 -155 188 -91 244 -97 100 59 -30 316 163 -127 -291 -93 -113 -107 -90 124 -102 216 8 251 11
6000 11 -122 163 -96 60 -165 8 -88 24 -180 88 84 70 237 162 -28 42 124 -118 -75 220 0 64 -44
6023 -44 291 -139 -8 88 134 11 30 -111 -158 111 101 208 -102 191 -168 -55 -197 -77 70 209 51 149
6045 149 270 -74 129 -287 -53 -154 -24 85 169 -47 151 28 208 176 -72 -361 49 30 252 375 -114
$$ packed form
5887b26K09O3n8M0O2k51J88Q8k16N2MM51l79J40l97L67J34l95j07K84l40J26J39
5910b2l4P1L5k9k81J55J27K20l45Q4N6N7J1o7L37k42l07J65K52j02j89J00L22
5933C74j62k76M45n42L31k44P6j05K99n97J73N7J1o9j71L34K3M5J15J0m1j96K59
5956A49m4j88K13k08o6j01k4m8M10k2l87N40l71L65k88K90k87J68j39L66l01l07
5978b80J25L43k79L35l41J97m1q9L46j53k90j64J98k0OJ7K14k26L18k08K43k40
6000A1j33K85k59J56k25J73r6J12k04K68mj4J67p5j90P0Q2k42M3K95k20O4j08
6023d4L35m30J31R6M6j23J9j41m7K69j0J07l10K93l59J13j42J20J47J39j58R8
6045A49J21l44K03m16K34j01J30J09Q4k16J98j23J80l2k48k89M10j9K22J23m89
$$ plain form
6066 -114 -70 -131 -46 -406 -275 -197 160 -209 -176 -38 -125 -81 26 57 -114 67 -238 -145 -152 -301 -310 -114 113 112 -88
6091 -88 315 -107 -185 93 111 -309 -242 -41 -132 -56 202 -74 -29 176 -22 -241 -254 181 -24 15 -75 141 -59
6114 -59 -191 114 -386 -123 92 131 -312 -204 -308 -98 -109 -76 -303 59 37 78 212 300 81 4 32 -252 7
6137 7 39 -169 105 73 135 -75 47 -77 -4 -182 118 -197 -32 -162 -304 75 -50 -98 94 -65 29 -52 -231
6160 -231 19 -263 98 -6 -121 43 -14 140 -71 81 310 127 51 68 62 41 215 138 -112 -115 362 -2 -142
6183 -142 178 -98 -87 -48 464 -65 -140 12 -24 6 51 -101 160 178 123 129 -50 141 -150 -280 267 147 157 105
6207 105 -148 -152 -81 3 -10 217 76 161 -30 -39 -109 127 -96 -125 -107 -21 252 -55 64 -67 211 60 -73 269
6231 269 119 50 -213 -344 41 57 41 -51 78 75 -58 186 -95 -221 -309 15 53 176 -278 72 -172 -21 60
$$ packed form
6066a14M4o1Q5l60J31P8L57l69L3J38q7M4J07L1j71J81l05R3pj49rJ96K27jk00
6091h8M03m22p8K78J8m20O7K01r1P6K58k76M5K05j98k19j3M35k05L9r0K16k00
6114e9j32L05n00K63K15L9m43J08j04K10j1L3k27L62k2M1J34Q8k19p7K8k84K59
6137GL2k08K74l2O2k10J22j24P3j78L00l15J65j30j42L79j25m8J92j59R4q1j79
6160b31K50k82L61j04j15J64n7J54k11J52K29j83p6J7ok1J74p7k50lM77l64j40
6183a42L20k76J1L9N12n29p5J52l6L0M5j52K61J8n5Oj79J91k91j30N47j20J0n2
6207A05k53mP1Q4j3K27j41Q5j91rp0K36k23k9J8Q6K73l07J19j31K78j51j33L42
6231B69j50o9k63j31L85J6j6r2J29lj33K44k81j26q8L24L8J23m54L50k44J51Q1
$$ plain form
6254 60 -10 289 -218 -136 32 -95 6 148 -6 167 -49 43 105 126 76 -168 -25 -155 -35 -96 100 140 248
6277 248 -66 251 -168 10 -149 72 180 -11 201 171 -87 -169 235 351 -46 -6 174 18 38 -134 -341
6298 -341 -182 -59 345 -82 17 123 33 -186 -178 8 180 187 17 -270 -186 144 284 43 -115 -59 -5 -114 26
6321 26 166 9 58 -176 -188 12 -96 -165 -83 -147 -172 90 4 69 296 66 -36 141 120 -203 152 118 -173 73
6345 73 -1 -166 -88 127 -191 268 -24 66 306 100 53 -351 80 9 -167 -305 179 -210 -12 219 -106 -81
6367 -81 133 1 -65 151 -156 -4 -36 -6 328 193 218 -63 54 31 78 -59 -126 243 -4 -34 83 -77 -21
6390 -21 45 40 -23 -96 77 10 -108 48 -3 53 52 -58 293 7 117 145 -157 169 -248 94 -169 -175 160 -97 102
6415 102 -162 174 -29 -177 55 -9 -172 43 124 -30 -302 -94 -35 -297 -72 -31 35 36 194 124 -161 -35 -220
$$ packed form
6254F0p0K99n07Q2J68j27J01J42j54J73k16R2O2K1n0k44J43j30J20o1J96M0J08
6277B48l14L17m19J78j59K21J08j91K12l0k58q2M04J16l97M0J80j56K0j72k07
6298c41J59J23M04m27R9J06r0k19QJ86J72Pj70k87Q4L30J40k41j58N6N4j09J40
6321B6J40j57M9k34j2K00j08o9Q2o4k5K62q6O5K27k30j02J77k1l23L55l4k91K46
6345G3p4j65P8K15l18M59k92R0K40k06m7m04M31p1j76j38M84l89J98K31l25K5
6367h1K14j32o6K16l07J52l2L0L34j35K5k81J17k3M7j37o7L69k47l0J17j60N6
6390b1O6no3p3J73o7j18J56n1N6jj10L51k86J10K8l02L26m17L42k63oL35k57J99
6415A02k64L36k03j48K32o4j63K15Q1j54k72K08N9k62K25M1O6JJ58p0k85J26j85
$$ plain form
6438 -220 15 -241 -25 24 -34 -114 126 222 -65 259 -42 -180 -124 21 -78 -132 52 -160 32 225 -96 -29 -93
6461 -93 -90 -70 -176 104 -72 70 -55 -270 18 -96 228 13 -56 74 27 -52 185 -265 149 69 83 76 -28 -107
6485 -107 -116 355 -140 183 -27 1 -90 79 -162 314 -95 -141 107 -234 -58 -80 145 38 26 -270 -66 12 103
6508 103 -42 266 112 20 -54 123 426 57 89 212 128 14 19 -122 82 -83 53 -101 -111 -23 -92 95 -35
6531 -35 113 15 -136 -51 129 -247 83 25 -93 125 -16 -25 100 214 -251 63 -35 -206 20 424 176 -469
6553 -469 -1 -167 -9 -105 -79 -309 -21 -103 -236 -199 166 195 199 41 -145 89 120 -33 -51 162 -78 -170 217
6576 217 -262 -262 -8 204 -212 -53 -320 101 18 61 -159 56 261 247 150 -139 -1 77 -184 83 65 8 -137
6599 -137 128 81 384 140 -257 118 226 20 45 256 107 140 45 -84 -70 -159 107 -106 -9 -203 197 16
$$ packed form
6438b20K35k56K16M9n8q0K40R6k87L24l01j38N6J45r9n4J84k12J92J93l21O7o4
6461i3LK0j06K80j76J42j25k15K88j14L24k15o9J30m7p9K37m50M14q0J4pj04p9
6485a07rM71m95L23k10K8r1J69k41M76m09m6K48l41J76k2K25j07j2k96K04P8R1
6508A03j45L08j54r2p4J77L03l69L2J23q4j14Nj41K04j65J36j54j0Q8o9J87j30
6531c5J48r8j51Q5J80l76L30n8j18K18j41rJ25J14m65L14r8j71K26M04k48o45
6553d69M68j66J58r6K6k30K88q2j33L7L65K9Mj58j86K34L1j53j8K13k40r2L87
6576B17m79%K54K12m16J59k67M21q3M3k20K15K05j4r7k89J38P8k61K67j8n7j45
6599a37K65m7L03k44l97L75J08k06K5K11j49L3r5j29J4q9K66k13R7j94M00j81
$$ plain form
6621 16 112 241 11 68 -203 236 63 -78 -119 22 -183 -25 -87 19 -24 92 -164 139 -286 63 138 164 9
6644 9 -192 100 -101 128 -36 -37 194 -348 -13 66 -106 191 -125 -227 -238 54 -249 -33 -105 -208 -47 -20 -81
6667 -81 272 86 185 137 75 -78 -81 70 78 36 -206 -135 -18 -383 242 -92 63 -141 -290 -131 -197 31 -81 -52
6691 -52 -269 -89 -27 -38 15 -208 86 85 27 -103 -298 -74 -85 -84 7 -12 24 -153 -266 -63 157 146 1 -291 7
6716 7 69 -246 -45 148 -179 -345 -41 -149 134 -23 61 -118 -291 5 -241 30 85 53 -100 -21 21 19 -85
6739 -85 -102 76 109 147 -106 4 -233 72 -166 278 123 -287 437 271 -69 -36 -297 76 19 -189 -89 139
6761 139 229 92 -71 -25 -50 148 219 160 -40 145 -38 -16 -60 -70 54 230 81 -49 -152 -90 64 -166 -426
6784 -426 -125 -43 1 -105 -123 -309 -222 -6 -60 6 -121 -96 130 -212 -229 -250 49 53 -387 51 -35 165 48 -45
$$ packed form
6621A6R6J29k30N7k71M39j73j41m1J41k05J58o2J06m3J16k56L03m25L49P5K6j55
6644Ik01K92k01K29j64jK31n42L35P9j72K97l16j02j1K92l03K16p2j03J61K7o1
6667h1L53j86R9m8o2j53lJ51Qm2k42P1J17l65O25l34J55k04j49J59o6K28j12K9
6691e2k17J80O2j1N3k23K94jn8j30j95K24j1JR1j9L6j77j13K03K20j1j45k92K98
6716GO2l15K01J93l27j66L04j08K83j57Q4j79j73K96k46K71N5l2j53P9M2kj04
6739h5j7J78L3L8k53J10k37L05k38M44j55m10P24j66l40L3k61L73n7k08J00K28
6761A39R0j37j63M6k5J98P1n9k00J85j83K2m4j0J24J76j49j30j03O2J54k30k60
6784d26L01Q2M4j06j8j86Q7K16n4O6j27K5K26l42j7k1K99Mm40M38q6K00j17r3
$$ plain form
6808 -45 209 -114 74 230 139 -45 -201 -198 10 217 -346 61 -12 252 23 -93 -104 -287 -71 93 -58 41
6830 41 244 -33 -94 -216 -353 -62 34 -76 -28 258 41 -3 -172 -76 -96 -108 216 126 107 -17 23 -90 -79 96
6854 96 346 17 -54 237 -105 83 -35 -85 40 54 -188 -391 -62 31 10 -71 82 -32 -31 174 6 -24 118
6877 118 247 -2 -142 17 -407 -292 199 -18 -94 -164 127 -112 -57 22 74 112 -382 112 2 9 226 -77 -96
6900 -96 -58 -51 -98 58 -114 -220 25 74 -73 -182 358 99 -117 -51 54 87 121 105 -48 32 39 -219 80 -26
6924 -26 -84 -174 -134 264 -99 45 -58 139 21 -85 -199 -265 119 -14 -131 34 -119 112 -80 -81 6 -67 224
6947 224 -165 -152 -60 181 61 -232 138 -5 144 -107 98 298 165 -90 402 -55 72 -182 -8 -15 -74 151
6969 151 89 -107 46 -359 -32 251 239 -94 103 27 -250 -126 282 156 -209 157 59 -67 -120 153 -382 -258
$$ packed form
6808d5K54l23J88J56r1j84j56LK08K07n63M07p3K64k29j16j1j83K16J64j51R9
6830D1K03k77o1j22j37K91R6j10M8K86k17m4j69R6k0j2L24r0j9j24M0j13J1J75
6854I6K50l29p1K91l42J88j18n0J25J4k42k03L29R3k1q1J53j14JK05j68l0J42
6877A18J29k49j40J59m24J15M91k17p6p0K91k39N5P9N2L8m94M94j10PK17l03j9
6900i6L8Pm7J56j72j06K45M9j47j09N40k59k16O6J05L3L4j6j53Q0Pk58K99j06
6924b6n8r0M0L98l63J44j03J97j18j06j14o6L84j33j17J65j53K31j92jQ7p3K91
6947B24l89J3R2K41j20k93L70j43J49k51K05K00j33k55M92m57J27k54J74pn9K25
6969A51o2j96J53m05L27K83j2l33J97p6k77J24M08j26l65L66r8j26n3K73n35J24
$$ plain form
6991 -258 -128 -61 -53 77 -125 130 -86 139 44 -151 -51 -50 24 -165 3 -11 103 114 -154 -5 181 28 117
7014 117 189 -54 182 -73 172 60 36 -20 -221 52 296 290 114 28 247 -194 147 -248 41 -189 6 -169
7036 -169 -108 26 -59 -34 -49 -206 151 -146 -37 125 -71 57 -172 -32 56 23 -13 -120 144 -328 7 -29 -195
7059 -195 -40 -57 -13 32 42 -353 184 -65 -239 419 178 -46 -140 -60 -195 18 117 192 -52 -217 -88 17 -69
7082 -69 -94 -58 -127 93 33 87 -152 -35 -353 -55 108 165 265 -155 92 -75 255 -228 -143 -48 123 -122 45
7105 45 132 -196 -149 -124 -13 -29 -31 -69 126 -207 -64 -88 137 -114 -325 132 71 257 -7 273 -96 59 100 -49
7129 -49 -250 133 4 382 20 197 5 178 355 -84 -55 169 81 -117 -200 89 -36 -185 8 19 146 -121
7151 -121 14 138 235 44 -313 31 -131 137 31 -61 -27 83 -9 -23 6 -171 197 -126 -247 -148 47 170
$$ packed form
6991b58J30O7QJ30k02K55k16K25r5j95J00JP4j89J68j4J14J1k68J49J86j53Q9
7014A17P2k43K36k55K45j12k4n6k01K73K44oj76q6K19m41L41l95K89k30J95j75
7036a69O1J34q5K5j5j57L57k97J09J62j96J28k29J40Q8l3l6j07K64m72L35l6j66
7059a95J55j7M4M5J0l95N37k49j74O58k41k24r4Q0j35K13R9P5k44j65J29J05q6
7082f9k5L6o9K20o0N4k39J17l18K98J63N7J00m20K47j67L30m83Q5R5J71k45J67
7105D5Q7l28M7K5J11j6kl8J95l33J43k4K25k51k11M57o1J86k64K80l69J55M1j49
7129d9k01L83j29L78l62J77j92J73J77m39K9K24q8j98q3K89j25j49J93J1J27k67
7151a21J35J24R7j91l57L44j62K68j06r2L4J10r2j4K9j77L68l23j21R9J95J23
$$ plain form
7173 170 -24 12 -59 -294 302 51 93 87 74 -122 191 -125 50 169 22 42 232 175 -297 108 84 174 174 365
7197 365 -244 251 146 -197 -43 -33 0 12 117 -175 -74 56 264 -68 -186 81 -94 144 59 -60 9 -111
7219 -111 263 -139 23 -16 -28 -33 -33 113 -221 41 -71 -155 67 245 116 142 -1 177 -61 -146 22 -4 70 56
7243 56 -233 -104 137 -10 -116 225 -155 208 229 -317 54 -65 16 -152 -211 143 113 35 186 100 -35 -172
7265 -172 -141 -294 8 84 142 181 -60 38 -75 -195 272 -25 50 -243 25 -314 -308 28 18 21 -46 -10 -61 155 47
7290 47 97 44 70 -182 184 -66 30 -18 28 -162 6 40 -144 10 -5 -221 82 215 -139 209 -32 119 -42
7313 -42 -54 -27 -74 -237 13 71 -235 65 16 277 -49 111 192 195 -161 -85 35 -141 -153 39 -103 -43 -71 65
7337 65 60 -32 182 -23 -166 -35 98 209 -148 76 -111 -152 110 -156 27 -25 83 -70 1 -73 -36 167 131
$$ packed form
7173A70j94L6p1k35N96k51M2oj3j96L13l16J75J19j47K0J90n7m72M05k4R0%J91
7197C65o09M95j05l43J54J0L3J2J05k92J01J30K08l32j18K67j75K38q5j19O9j20
7219a11L74m02J62l9j2n%J46l34K62j12q4K22J78j29K6j43J78k38q5J68k6P4j4
7243E6k89J29K41j47j06L41l80L63K1n46L71j19Q1j68n9L54l0p8J51q6j35j37
7265a72L1j53L02P6N8L9k41R8j13j20M67k97P5k93K68l39OL36j0Lo7L6n1K16j08
7290D7N0n3K6k52L66k50R6m8M6j90J68L4j84J54j5k16L03J33l54L48k41J51j61
7313d2j2K7m7j63K50N8l06L00m9K61l26J60Q1Ll56P6J20j76j2J92j42O0k8J36
7337F5nr2K14k05j43J31J33J11l57K24j87m1K62k66J83n2J08j53P1p4L7K03l6
$$ plain form
7360 131 -120 -166 151 80 -139 190 258 2 -86 52 20 -52 -12 1 95 88 -72 -13 -292 -133 123 6 113 4
7384 4 312 -209 256 206 74 -156 -154 6 61 -76 62 65 220 254 -89 11 -57 -156 -58 306 194 144 62 -66 242
7409 242 -230 114 -109 -250 -167 -112 78 -88 -324 -238 93 -214 9 -139 191 81 -38 94 35 190 184 248
7431 248 -116 143 -23 128 -104 -7 -99 109 -75 -16 65 161 -98 25 -37 72 -135 10 97 151 167 67 180
7454 180 -167 52 -399 45 -105 -226 -114 39 -63 216 -83 173 -18 126 -76 65 304 -155 -71 -79 -40
7475 -40 63 -23 374 -95 2 42 -101 79 168 245 -13 106 286 -62 -53 -114 -34 -54 -85 85 -166 -28 -155 66
7499 66 226 86 -23 78 132 -151 405 -1 -338 -151 39 65 -81 154 63 233 -130 6 70 -156 -16 -245
7521 -245 56 15 -137 41 171 -87 71 50 135 197 -248 97 195 239 -204 47 -39 -46 55 44 71 -16 144 -46
$$ packed form
7360A31k51m6L17p1k19L29O8k56q8J38l2p2M0J3R4pj60N9k79J59K56j17J07j09
7384DL08n21M65n0j32k30KJ60N5j37J38LJ55L4l43J00o8r9R8L64j12n0q2j28L08
7409B42m72L44k23j41Q3N5J90j66k36Q6L31l07K23j48L30j10j19J32n9J55oO4
7431B48l64K59j66J51k32R7r2K08j84N9Q1R6k59J23o2J09k07J45Q7N4J6j00J13
7454A80l47K19m51M44j50j21J12J53j02K79k99K56j91J44k02J41K39m59Q4qL9
7475d0J03q6L97m69R7M0j43J80Q9P7k58J19J80l48Ro1Q0k0l1J70k51J38j27K21
7499F6J60j40j09J01N4k83N56m06l37J87J90K6j46K35r1J70l63J36O4k26J40k29
7521b45L01m1j52J78J30k58J58k1Q5O2m45L45R8M4m43K51q6pJ01j1K7q7J60j90
$$ plain form
7545 -46 173 -65 139 -255 53 -165 -212 65 -71 166 191 -112 65 -22 163 -7 -76 -104 78 86 -252 281 290
7568 290 76 -33 12 239 3 -16 19 57 108 343 3 23 38 14 111 -94 -180 177 -26 -73 112 -206 139 44
7592 44 247 153 39 -161 59 -31 -254 -71 85 16 53 228 -49 -158 -188 54 14 71 -143 -52 3 81 81 -19
7616 -19 212 -32 145 -286 98 58 -5 -165 -68 215 -17 -135 233 177 -28 93 -317 124 -49 -140 -131 -64 162
7639 162 -209 17 53 -79 -134 -44 -236 164 136 132 109 -305 -5 32 87 96 43 -236 43 -102 77 121 4 111
7663 111 -32 -29 114 -99 -6 0 -45 -32 -75 20 -389 48 -163 -135 119 -111 64 87 -33 -124 56 133 -19 131
7687 131 -170 253 89 -29 206 40 193 50 -168 -7 -87 -111 103 -180 49 -95 -301 -78 -39 -38 21 132
7709 132 -121 23 116 29 -159 -191 238 151 71 20 27 -30 10 -8 -104 110 135 440 -67 62 174 95 -60 192 -195
$$ packed form
7545d6K19k38K04l94L08k18m7K77j36K37K5l03J77q7J85j70o9k8J82Ql38N33R
7568B90k14j09M5K27k36j9L5L8N1K35l40K0J5k4R7k05q6L57k03m7J85l18L45r5
7592D4K03r4j14k00K20r0k23J83J56o9L7J75k77j09l0K42m0N7k14R1N5P8%j00
7616a9K31k44J77m31L84m0o3j60R7K83k32j18L68n6k05J21m10M41j73r1RO7K26
7639A62l71K26L6j32n5R0j92M00k8mk3m14L00L7N5Rn3k79K79j45J79M4j17J07
7663A11j43LJ43k13R3Om5J3m3R5m09M37k11K8K54k30J75K3j20r1J80P7j52J50
7687A31l01M23j64j18K35j66J53j43k18J61q0k4K14k83K29j44k06K23L9JN9J11
7709A32k53J44R3q7j88l2M29q7q0n1Pn7M0j8r6K14K5L05n07J29J12p9j55K52l87
$$ plain form
7734 -195 -71 -24 -199 -290 259 -264 13 180 -111 -259 -46 -29 -111 193 -10 -183 186 42 79 132 -179 125
7756 125 93 -7 33 119 147 -256 206 -234 -1 -139 106 -29 -88 356 -159 -126 101 -11 218 58 -177 -50
7778 -50 24 -31 192 203 -36 19 -259 150 -281 29 2 59 -117 -107 -33 -189 2 -13 7 -179 51 -32 143 52
7802 52 -169 351 -167 -248 -27 -166 35 120 301 -24 -139 25 -349 212 -117 -189 222 104 -141 -6 -12 -144
7824 -144 70 -94 203 -150 67 -81 -49 -189 34 -133 19 313 29 32 -38 387 42 152 -162 -97 99 -198
7846 -198 73 162 -230 174 62 48 -227 151 112 106 168 85 167 331 73 -92 -357 -229 297 150 -68 39 235
7869 235 -4 -30 -161 -236 158 41 19 -245 33 151 115 -27 73 397 -181 -47 -75 -47 171 123 -284 146
7891 146 -96 -129 -121 20 8 84 220 -107 -113 141 83 -110 -136 45 -86 536 191 -119 21 -129 143 -132 2
$$ packed form
7734a95J24M7j75r1N49n23K77J67k91j48K13J7q2L04k03j73L69j44L7N3l11L04
7756A25l2j00M0Q6K8m03M62m40K33j38K45j35n9M44n15L3K27j12K29j60k35J27
7778e0P4n5K23J1k39N5k78M09m31L10k7N7j76J0P4j56J91j5K0j86K30q3J75r1
7802E2k21N20n18q1K21j39K01Q5J81l25j15J64l74N61l29p2M11j18k45J35oj32
7824a44K14j64K97l53K17j48L2j40K23j67J52K94k84Lp0M25l45J10l14O5J96k97
7846a98K71Q9l92M04j12j4k75L78l9oO2q3Q2J64k58j65k65J28N26j47k18J07J96
7869B35k39k6j31p5L94j17k2k64K78J18l6j42J00L24n78J34k8K8K18m8m07M30
7891A46k42l3QJ41j2P6J36l27oK54n8j93k6J81j31O22l45l10J40j50K72k75J34
$$ plain form
7914 2 -117 -188 -37 -77 -318 86 -8 -5 46 -130 171 146 146 -135 -186 77 175 38 -28 -112 -110 24 -142 -355 -28 -92
7940 -92 -251 118 -53 -241 67 8 126 87 -296 311 -69 19 234 9 -84 66 -126 -270 -188 -267 129 -103
7962 -103 375 85 36 -2 166 291 167 -39 81 -34 -122 -107 -316 -154 -420 -59 103 -38 -151 189 -158
7983 -158 -29 29 -11 -153 42 -406 -148 -127 -27 -163 -43 26 -261 56 -390 -36 192 -176 60 -160 -225 -29
8005 -29 -103 111 67 190 -69 162 -49 -52 -315 101 -40 -141 -117 -96 -356 -55 -253 -148 9 -336 -1 -208
8027 -208 -3 -27 -51 -30 -70 14 -132 9 45 -27 112 188 104 172 -45 -37 -436 -342 206 87 83 -20 -17 -219 143 11
8053 11 -28 -230 98 -212 -76 -67 122 -207 -217 -125 -62 101 -260 36 -51 -78 -178 80 -111 -75 152 -213 -239 -37
8077 -37 33 77 -68 -30 -123 26 76 -203 156 210 -89 38 -105 -75 122 161 210 -246 -198 103 -207 26 -45 -142
$$ packed form
7914Bj19p1J51m0k41M04r4LN1j76L01k5%k81n1K63R8j37o6q4KJ34j66k13L27o4
7940i2j59L69j71j88L08n9J18l9l83O07l80Q8K15k25r3J50j92j44Q2p9L96k32
7962a03M78k90m9l8J68J25j24k06J20j15q8J5k09J62k66L61J62j41j13L40l47
7983a58J29N8m0j42J95m48K58K1J00j36J20O9k87L17m46L54K28l68K36k20o5J96
8005b9p4K14m4J23k59K31k11lk63M16j41j01K4K1k60L01j98J05J57l45L35k07
8027b08K05k4k4K1m0Q4j46J41L6p2J39P6q4O8k17Ql99R4N48j19mj03Lk02L62j32
8053A1l9k02L28l10J36RJ89l29j0R2O3J63l61K96q7k7j00K58j91L6K27l65k6K02
8077c7P0M4j45L8r3J49N0k79L59N4k99J27j43L0J97L9M9m56M8L01l10K33p1r7
$$ plain form
8101 -142 155 -251 21 -121 153 -324 24 226 6 -222 -136 -49 -133 -98 -106 -102 336 -160 -94 -120 15 -199 -213 61
8125 61 227 215 -18 120 -38 -39 -85 384 -149 42 -85 95 252 332 -40 53 129 -173 -123 106 178 102 144 134
8149 134 24 -138 122 -92 -154 -32 -174 32 -59 -112 -8 89 -77 -81 -69 102 -8 89 59 -64 202 -13 20
8172 20 -325 -195 135 86 -123 36 -84 97 -3 -86 -122 18 127 113 -246 322 -158 -134 -51
$$ packed form
8101a42K97m06K72j42K74m77L48K02k20k28Q6Q7q4L5qMM38m96O6k6J35k14j4K74
8125F1J66j2k33J38j58jm6M69n33J91j27J80J57Q0l72R3P6l02N0K29P2p6M2j0
8149A34j10j62K60k14o2J22j42K06r1n3J04R7j66mJ2J71j10R7l0j23K66k15L3
8172B0l45J30L30m9k09J59j20J81j00q3l6J40J09j4l59N68m80K4Q3
8191e1
$$ Imaginary data points
##PAGE= N=2
##DATA TABLE= (X++(I..I)), XYDATA
$$ plain form
0 0 0 0 0 0 0 0 0 0 0 0 0 0 0 -8 8 -8 8 -8 16 -16 16 -24 24 -32 38 -41 49 -56 65 -75 88 -98 113 -128 144
35 144 -163 181 -204 228 -253 283 -315 348 -387 427 -472 520 -574 633 -696 767 -844 932 -1030
54 -1030 1136 -1260 1397 -1558 1744 -1964 2227 -2550 2958 -3494 4229 -5307 7043 -10332 18838
69 18838 -96461 -166644 -58614 -29092 -8470 -21394 -7359 4843 35653 55214 74033 65553
81 65553 46877 23528 30719 60286 93089 88597 46705 -14306 -54758 -66442 -54942 -45488 -45473
94 -45473 -56585 -61994 -52370 -20428 20328 50578 50281 27197 174 -5112 13573 38946 46323
107 46323 27554 -6351 -33912 -41018 -28618 -11064 -6700 -19736 -38076 -43587 -26016 7303 36602
120 36602 43319 29055 11145 8197 26624 54388 71231 61653 29272 -8044 -32318 -36753 -32116
$$ packed form
0@%%%%%%%%%%%%%qJ6j6J6j6K4l2L2m0M8n6P0p9R0j05J21j40J63j86K11k41K72
35A44l07L44l85M32m81N36n98O63p35Q14q99R92j094J207j329J463j611J776j962
54a030K166k396K657k955L302l708M191m777N508o452P723r536J2350j7375K9170
69A8838j15299p0183J08030K9522K0622j2924J4035J2202L0810J9561J8819q480
81F5553j8676k3349P191K9567L2803m492m1892o1011m0452j1684J1500R454J5
94d5473j1112n409R624L1942M0756L0250k97k3084k7023n286J8685K5373P377
107D6323j8769l3905k7561p106J2400J7554M364j3036j8340n511J7571L3319K9299
120C6602O717j4264j7910k948J8427K7764J6843r578l2381l7316k4274m435M637
$$ plain form
133 -32116 -33532 -49013 -68914 -75602 -57755 -21448 15069 31788 23989 2769 -11091 -4903 18261
146 18261 42882 54027 47870 34522 28279 32885 40011 34294 7864 -32923 -66876 -77269 -61146
159 -61146 -31258 -6156 2809 -2385 -8476 -4654 8385 21179 22198 8595 -8677 -15057 -2210
172 -2210 22464 41964 43143 23020 -4477 -24037 -26950 -18818 -10185 -10646 -19074 -25089 -18728 710
186 710 22984 34437 28762 11121 -4234 -6501 4330 17826 20652 9444 -8994 -22556 -22422
199 -22422 -11171 163 800 -8666 -19963 -23292 -13543 2775 14116 13929 2773 -8175 -8152 5446
213 5446 24655 35924 32506 16484 -753 -9332 -8194 -4255 -6093 -15436 -26018 -28402 -17340 2148
227 2148 19149 22800 11066 -6595 -18083 -17033 -5698 6442 11046 8965 5594 7665 15784 23016
$$ packed form
133c2116j416j5481j9901o688J7847L6307L6517J6719p799k1220j3860O188K3164
146A8261K4621J1145o157j3348o243M606P126n717k6430m0787l3953j0393J6123
159f1146K9888K5102Q965n194o091L822J3039J2794J019j3603j7272o380J2847
172b210K4674J9500J179k0123k7497j9560k913Q132Q633m61q428o015O361J9438
186G10K2274J1453n675j7641j5355k267J0831J3496K826j1208j8438j3562J34
199b2422J1251J1334O37r466j1297l329R749J6318J1341j87j1156j0948K3J3598
213E446J9209J1269l418j6022j7237q579J138L939j838r343j0582k384J1062J9488
227B148J7001L651j1734j7661j1488J050J1335J2140M604k081l371K071Q119P232
$$ plain form
241 23016 21551 7534 -13302 -29673 -33535 -22588 -5826 6609 9233 4622 971 2228 7899
254 7899 11367 7664 -2990 -14119 -15679 -6755 8587 20485 21103 12101 -748 -9165 -9296 -4833
268 -4833 -2124 -5409 -12178 -15838 -11838 -367 11601 16701 11588 1264 -5838 -4821 2793 9994
282 9994 10518 3684 -5629 -10558 -7291 639 7646 7048 347 -7716 -10465 -6163 1078 4745 1764 -5659
298 -5659 -11161 -8957 1016 12453 18449 15309 6920 -1160 -4167 -2597 -438 -1779 -7276 -12566 -12560 -4849
314 -4849 6144 13926 13182 4504 -6131 -12286 -10664 -4302 1569 3509 1987 1192 3963 10419 15104
329 15104 13362 3964 -8684 -17767 -18710 -11591 -2349 3684 4253 1271 146 2326 6724 8810 5182
344 5182 -2333 -8792 -9926 -3575 5914 12499 12312 6438 -470 -4184 -2798 66 -436 -5326 -11310 -14084
$$ packed form
241B3016j465j4017k0836j6371l862J0947J6762J2435K624m611l651J257N671
254G899L468l703j0654j1129j560Q924J5342J1898O18r002j2849q417j31M463
268d833K709l285o769l660M000J1471J1968N100n113j0324p102J017P614P201
282I994N24o834r313m929L267P930P007n98o701q063k749M302P241L667k981p423
298e659n502K204R973J1437N996l140q389q080l007J570K159j341n497n290OP711
314d849J0993P782p44q678j0635o155J622O362N871J940j522p95K771O456M685
329A5104j742r398j2648r083r43P119R242O033N69k982j125K180M398K086l628
344E182p515o459j134O351R489O585j87n874o908l714J386K864n02m890n984k774
$$ plain form
360 -14084 -10983 -2552 5515 8843 5958 210 -2766 -990 3822 7516 6323 936 -4292 -5344 -932
375 -932 5645 10186 8643 2642 -2964 -4903 -2922 386 988 -2932 -8415 -10369 -6958 324 7005 9598
391 9598 5950 -749 -5377 -5915 -3071 -327 -650 -3486 -6007 -4527 1652 8579 12829 10709 4008 -2403
407 -2403 -5227 -3160 735 3188 2384 -373 -1663 363 4687 7542 5868 -443 -8555 -13108 -12156 -6941
423 -6941 -1872 141 -815 -2848 -2236 1756 6138 7785 4588 -1301 -6091 -6361 -1763 4331 8194 8049
439 8049 4732 1995 2174 4608 6457 4391 -1054 -6917 -9609 -7818 -2245 2684 3838 861 -2682
454 -2682 -4697 -4162 -1792 -1355 -3416 -7484 -9776 -7650 -1679 5508 9987 9575 6477 3100 2138 3712
470 3712 5783 5321 2301 -1484 -2618 -173 3834 6711 5145 516 -5575 -9146 -9314 -6786 -4559 -4857
$$ packed form
360a4084L101Q431Q067L328k885n748k976J776M812L694j193n387n228j052M412
375i32O577M541j543o001n606j939J981L308O02l920n483j954L411P282O681K593
391I598l648o699m628n38K844K744l23k836k521J480O179O927M250k120o701o411
407b403k824K067L895K453q04k757j290K026M324K855j674o311q112m553R52N215
423f941N069K013r56k033O12L992M382J647l197n889m790k70M598O094L863j45
439H049l317k737J79K434J849k066n445n863k692J791N573M929J154k977l543
454b682k015N35K370M37k061m068k292K126N971P187M479m12l098l377r62J574
470C712K071m62l020l785j134K445M007K877j566m629o091l571j68K528K227k98
$$ plain form
486 -4857 -6424 -6609 -4779 188 5062 7030 5333 1277 -1929 -1896 947 4408 5231 3163 693 -311
502 -311 1097 4158 6794 5442 1611 -2813 -5110 -4184 -1596 761 155 -2062 -3809 -3255 -109 2930
518 2930 3557 795 -3906 -7829 -8387 -6058 -2627 34 547 -47 939 3698 6615 8634 7041 2733
534 2733 -1770 -3052 -1571 2196 5532 6420 4787 1977 277 -408 -1003 -2981 -6262 -10122 -11429 -9619
550 -9619 -4237 1115 4200 4343 2229 186 -506 473 1520 1466 465 -348 470 3496 6670 7939 6251
567 6251 2335 -2142 -4355 -3829 -2335 -423 -442 -1662 -2434 -1760 638 2051 2504 339 -2250 -3678 -3524
584 -3524 -1026 1123 1410 -144 -2367 -3139 -1664 1023 2915 2980 2133 316 -243 833 1763 2336 1170
601 1170 -683 -1338 -464 2445 4546 5154 2994 -671 -3878 -5237 -5097 -4145 -3412 -2707 -2504 -927 1300
$$ packed form
486d857j567j85J830M967M874J968j697m056l206L3K843L461Q23k068k470j004
502c11J408L061K636j352l831m424k297R26K588K357o06k217j747N54L146L039
518B930O27k762m701l923n58K329L431K661N13n94R86K759K917K019j593m308
534B733m503j282J481L767L336Q88j633k810j700o85n95j978l281l860j307J810
550i619N382N352L085J43k114k043o92R79J047n4j001q13Q18L026L174J269j688
567F251l916m477k213N26J494J912j9j220p72O74K398J413M53k165k589j428J54
584c524K498K149K87j554k223p72J475K687J892O5q47j817n59J076R30N73j166
601A170j853o55Q74K909K101O08k160l665l207j359J40R52P33P05K03J577K227
$$ plain form
618 1300 4089 5113 3032 -396 -3409 -4523 -3444 -477 2757 4717 4580 4385 3556 2918 1599 -286
634 -286 -3762 -6103 -6512 -4346 -944 2743 4364 3679 1887 -289 -1288 -1803 -1698 -1975 -2113 -1984 -488
651 -488 2300 4114 4996 3186 -35 -2642 -3833 -3273 -1662 -10 591 236 31 443 1369 1933 1375 4
669 4 -1418 -1453 -162 1337 2454 2041 192 -1438 -2712 -2013 -852 136 514 156 -92 77 244 487 106
688 106 -1380 -2247 -1929 -488 2037 3829 4683 3893 1353 -787 -2096 -2753 -2876 -2436 -2282 -1582 -300 2171
706 2171 3627 3335 1556 -1230 -3634 -4392 -3023 -767 1221 2852 3480 3629 3352 2599 1389 -1007 -3233
723 -3233 -4895 -5271 -3255 -400 2108 3171 2685 1294 -71 -997 -1171 -1308 -1327 -1103 -269 1348 3153
740 3153 3979 3541 1613 -637 -2966 -3607 -2815 -1672 -604 -70 -368 -103 33 733 808 141 -241 -926 89
$$ packed form
618A300K789J024k081l428l013j114J079K967L234J960j37j95q29o38j319j885
634b86l476k341m09K166L402L687J621o85j792k176r99n15J05k77j38J29J496
651d88K788J814Q82j810l221k607j191N60J611J652O01l55k05M12R26N64n58j371
669Dj422l5J291J499J117m13j849j630j274O99J161R88L78l58k48J69J67K43l81
688A06j486q67L18J441K525J792Q54p90k540k140j309o57j23M40J54P00J282K471
706B171J456k92j779k786k404p58J369K256J988J631O28J49k77p53j210k396k226
723c233j662l76K016K855K508J063m86j391j365r26j74j37j9K24Q34J617J805
740C153Q26m38j928k250k329o41P92J143J068N34k98K65J36P00P5o67l82o85J015
$$ plain form
759 89 1309 2627 3137 2868 954 -780 -1952 -1779 -1218 -657 -354 -311 -147 -311 -68 -506 -929 -1931 -2639
778 -2639 -1995 -619 1617 3108 4079 3458 2032 451 -1045 -1867 -2128 -2199 -1862 -964 679 2037 3028 2781
796 2781 979 -1171 -2962 -3346 -2245 -655 434 1851 2520 2433 2258 1606 432 -1316 -3145 -4268 -3872
813 -3872 -2031 84 1925 2794 2662 1276 600 22 -394 -378 -333 -102 784 1632 2625 3282 2377 544 -1274
832 -1274 -2767 -3376 -2750 -1705 -1119 -765 -620 -699 -414 -278 -152 -570 -1143 -1282 176 1350 2526 2669 2323
851 2323 1240 36 -513 -460 273 694 326 742 849 974 893 125 -951 -2194 -3000 -2175 -1112 54 1444
870 1444 1442 1004 -12 -1154 -1601 -1898 -1937 -1728 -1321 76 1447 3111 3716 3370 1897 478 -808 -1189
888 -1189 -887 131 709 1448 1842 1731 1547 448 -593 -2327 -3426 -4326 -3611 -2162 -438 550 1219 1016
$$ packed form
759H9J220J318N10k69j914j734j172J73N61N61L03M3J64j64K43m38m23j002p08
778b639O44J376K236J491R71o21j426j581j496q22k61p1L37Q98J643J358R91k47
796B781j802k150j791l84J101J590J089J417O69q7j75o52j174j748j829j123L96
813c872J841K115J841Q69j32j386o76n78m16J6M5K31Q86Q48R93O57r05j833j818
832a274j493o09O26J045N86L54J45p9K85J36J26m18n73j39J458J174J176J43l46
851B323j083j204n49N3P33M21l68M16J07J25q1p68j076j243q06Q25J063J166J390
870A444km38j016j142m47k97l9K09M07J397J371J664O05l46j473j419j286l81
888a189L02J018N78P39L94j11j84j099j041j734j099r00P15J449J724R88O69k03
$$ plain form
906 1016 453 52 -208 -538 -441 -445 -196 711 1653 2689 3323 2124 1330 -64 -464 -657 -305 25 298 204
926 204 -181 76 -459 -427 -955 -1837 -1968 -2024 -1427 -474 600 762 85 -719 -1070 -809 -615 287 955 1206 1364
947 1364 1794 2248 2078 1288 524 -277 -772 -895 -35 811 1166 1055 193 -648 -974 -1748 -2320 -2369 -2626 -1892
967 -1892 -1114 9 1345 1745 1248 426 -419 -663 -781 -53 275 1071 1301 1743 1913 2109 1369 311 -513
986 -513 -1914 -2137 -1639 -794 175 681 528 296 -83 -176 -930 -799 -1303 -1302 -1393 -371 587 1225 1292 926 448
1007 448 -404 -451 -210 455 300 481 466 681 540 642 625 428 -254 -732 -651 -162 322 567 104 -189 -872
1028 -872 -1067 -1262 -668 -697 -472 -113 165 514 594 706 695 151 -533 -473 -239 425 1129 1199 1461 794 331 7
1050 7 -437 -976 -884 -1193 -987 -598 338 554 751 666 186 -518 -593 -601 -333 19 363 394 582 658 926 993 520
$$ packed form
906A016n63m01k60l30R7mK49R07R42J036O34j199p94j394m00j93L52L30K73r4
926B04l85K57n35L2n28q82j31n6N97R53J074J62o77q04l51K61J94R02O68K51J58
947A364M30M54j70p90p64q01m95j23Q60Q46L55j11q62q41l26p74n72m9k57P34
967a892P78J123J336M00m97q22q45k44j18P28L28P96K30M42J70J96p40j058q24
986e13j401k23M98Q45R69N06j53k32l79r3p54J31n04Jr1J022R58O38O7l66m78
1007D48q52m7K41O65j55J81j5K15j41J02j7j97o82m78Q1M89M84K45m63k93o83
1028h72j95j95N94k9K25L59K78L49Q0J12j1n44o84O0K34O64P04P0K62o67m63l24
1050Gm44n39R2l09K06L89R36K16J97q5m80p04p5qK68L52L44L1J88P6K68O7m73
$$ plain form
1073 520 -302 -1039 -1136 -1068 -502 106 440 373 -155 223 358 20 -55 -294 -426 -378 50 445 676 888 534 94
1095 94 -529 -366 -236 -673 -181 -497 -375 -643 -332 101 249 344 266 284 62 542 781 713 482 226 -392 -356
1117 -356 -374 -255 -101 170 -481 -712 -384 -209 67 -124 -7 -203 -387 91 652 646 729 907 462 320 150
1138 150 -68 -157 -420 -835 -813 -318 -160 100 223 149 144 -225 -80 -25 -130 412 576 245 467 504 530 421 230
1161 230 -264 -804 -666 -1015 -792 -400 -309 -386 -22 160 347 543 817 823 581 329 274 514 740 440 -100 30
1183 30 -265 -58 -303 -345 -864 -950 -1137 -1260 -844 -455 -264 293 708 230 441 947 879 728 399 405 237 231 368
1206 368 462 692 62 -238 -211 -591 -731 -668 -424 -610 -495 -426 -89 101 201 184 -161 26 -524 -133 149 -2
1228 -2 261 -28 -347 -2 -123 -327 497 165 155 527 423 680 819 1138 867 239 -62 45 194 -66 -60 -337
$$ packed form
1073E20q22p37r7O8N66O08L34o7n28L78J35l38p5k39j32M8M28L95K31K12l54m40
1095I4o23J63J30m37M92l16J22k68L11M33J48R5p8J8k22M80K39o8k31k56o18L6
1117c56j8J19J54K71o51k31L28J75K76j91J17j96j84M78N61oQ3J78m45j42j70
1138A50k18q9k63m15K2M95J58K60J23p4nl69J45N5j05N42J64l31K22L7K6j09j91
1161B30m94n40J38l49K23L92R1p7L64J82J87J96K74Ok42k52n5K40K26l00n40J30
1183C0k95K07k45m2n19q6j87j23M16L89J91N57M15m78K11N06o8j51l29Oj68oJ37
1206C68R4K30o30l00K7l80j40O3K44j86J15O9L37J90J00j7l45J87n50L91K82j51
1228bK63k89l19L45j21k04Q24l32j0L72j04K57J39L19k71o28l01J07J49k60Ok77
$$ plain form
1250 -337 -835 -1289 -804 -954 -1127 -1261 -1154 -1074 -701 -40 295 827 800 551 778 817 737 920 1003 1216 1224 1076
1272 1076 894 576 685 -66 -566 -1312 -1322 -824 -876 -401 -989 -916 -505 -872 -648 -210 -344 -403 -199 -182 346
1293 346 868 946 1222 986 528 50 253 65 43 207 227 84 296 378 296 208 -105 -587 -859 -599 -595 -189 -335
1316 -335 -185 -377 -644 -739 -860 -728 -864 -773 -329 -6 290 760 898 867 905 575 897 984 791 1009 1036 759
1338 759 455 28 -155 -467 -821 -1487 -1697 -1855 -1688 -964 -618 -602 -282 -457 -507 -142 410 374 344 917 951 1224
1360 1224 1336 1414 1116 587 86 -473 -615 -472 -199 6 147 -230 -134 -505 -161 -307 -484 -627 -661 -109 333
1381 333 280 385 636 -13 -567 -791 -937 -615 -399 -96 -150 235 315 728 936 800 792 316 -40 490 615 513
1403 513 808 446 38 -381 -613 -891 -1010 -1279 -1411 -1332 -954 -481 221 338 367 -49 -23 140 437 898 873
$$ packed form
1250c37m98m54M85j50j73j34J07Q0L73O61L35N32k7k49K27L9q0J83Q3K13Qj48
1272A076j82l18J09p51n00p46j0M98n2M75n88P3M11l67K24M38j34n9K04J7N28
1293C46N22P8K76k36m58m78K03j88k2J64K0j43K12Q2q2q8l13m82k72K60MM06j46
1316c35J50j92k67r5j21J32j36R1M44L23K96M70J38l1L8l30L22Q7j93K18K7k77
1338G59l04m27j83l12l54o66k10j58J67P24L46J6L20j75n0L65N52l6l0N73L4K73
1360A224J12P8k98n29n01n59j42J43K73K05J41l77R6l71L44j46j77j43l4N52M42
1381C33n3J05K51o49n54k24j46L22K16L03n4L85Q0M13K08j36qm76l56N30J25j02
1403E13K95l62m08m19k32k78j19k69j32P9L78M73P02J17K9m16K6J63K97M61k5
$$ plain form
1424 873 1075 912 1145 696 439 156 -502 -857 -840 -840 -803 -170 -21 475 321 70 -536 -142 62 -139 -176 -106
1446 -106 471 223 887 609 378 -220 -347 -953 -851 -620 -446 -54 88 397 318 142 192 2 74 -397 -215
1467 -215 -285 16 503 841 567 187 -178 -606 -493 -642 -339 -243 -21 161 161 656 269 129 -141 -288 -295 20
1489 20 2 518 820 591 569 88 -232 -307 -441 -353 -362 -233 -10 376 553 418 255 -84 -180 -517 -298 -206 250
1512 250 258 372 393 357 -117 -107 -284 -527 -460 -366 -96 375 495 807 380 -50 -107 -536 -499 -347 -360 -3 -274
1535 -274 16 291 302 431 56 -11 -523 -206 -159 146 320 192 463 458 156 -248 -498 -200 -475 -393 -158 -278
1557 -278 324 390 604 217 164 25 -495 109 143 313 343 241 218 154 164 -436 -480 -507 -838 -549 -170 -44 153
1580 153 189 156 -10 126 73 -176 238 100 431 722 431 744 640 171 -143 -125 -615 -860 -503 -266 -191 -251
$$ packed form
1424H73K02j63K33m49k57k83o58l55J7%L7O33J49M96j54k51o06L94K04k01l7P0
1446a06N77k48O64k78k31n98j27o06J02K31J74L92J42L09p9j76N0j90P2m71J82
1467b15p0L01M87L38k74l80l65m28J13j49L03R6K22J82%M95l87j40k70j47pL15
1489B0j8N16L02k29k2m81l20p5j34Q8rJ29K23L86J77j35j63l39r6l37K19R2M56
1512B50QJ14K1l6m74J0j77k43O7R4K70M71J20L12m27m30n7m29L7J52j3L57k71
1535b74K90K75J1J29l75o7n12L17M7L05J74j28K71nl02m04k50K98k75Q2K35j20
1557b78O02O6K14l87n3j39n20O04L4J70L0j02k3o4J0o00m4k7l31K89L79J26J97
1580A53L6l3j66J36n3k49M14j38L31K91k91L13j04m69l14J8m90k45L57K37P5o0
$$ plain form
1602 -251 4 -88 -221 -258 -202 45 -198 10 -69 507 500 326 529 160 -235 -321 -134 -151 -86 54 147 41 137 389
1626 389 289 299 66 -353 -252 -195 -65 -117 201 -183 -169 -472 -702 -577 -675 -868 -606 -179 72 383 652 559
1648 559 618 154 169 194 421 541 466 554 542 351 202 -53 -280 -308 -641 -589 -616 -639 -436 -181 -222 -29 -488 -268
1672 -268 -157 40 -63 150 224 487 481 674 656 606 469 150 157 -102 106 236 278 207 242 5 31 -156 -188 -510
1696 -510 -252 -607 -709 -410 -337 -202 -252 -280 -369 -512 -289 123 131 438 416 475 580 700 655 878 273 300 251 211
1720 211 252 536 9 338 -185 -672 -353 -568 -872 -573 -765 -680 -770 -445 -188 -21 -47 -92 -309 69 355 85
1742 85 213 758 779 640 251 435 495 366 382 114 -132 10 -162 91 -146 -178 -358 -447 -708 -653 -442 -349 -318
1765 -318 -287 -37 -141 -89 279 159 117 132 135 101 117 416 563 246 154 394 369 140 489 256 -101 70 -231
$$ packed form
1602b51K55r2j33l7N6K47k43K08p9N76pj74K03l69l95q6J87j7O5J40R3j06R6K52
1626C89j00J0k33m19J01N7J30n2L18l84J4l03k30J25r8j93K62M27K51L11K69r3
1648E59N9m64J5K5K27J20p5Q8j2j91j49k55k27k8l33N2k7k3K03K55m1J93m59K20
1672b68J11J97j03K13P4K63oJ93j8n0j37l19Pk59K08J30M2p1L5k37K6j87l2l22
1696e10K58l55j02K99P3J35n0k8q9j43K23M12QL07k2N9J05J20m5K23o05K7m9m0
1720B11M1K84n27L29n23m87L19k15l04K99j92Q5r0L25K57J67k6m5k17L78K86k70
1742H5J28N45K1j39l89J84O0j29J6k68k46J42j72K53k37l2j80q9k61N5K11R3L1
1765c18L1K50j04N2L68j20m2J5Ll4J6K99J47l17r2K40k5k29L49k33l57J71l01
$$ plain form
1788 -231 -112 53 -102 -21 -397 -712 -545 -384 -274 -206 -521 -286 -51 -391 -170 11 109 201 49 299 487
1809 487 723 840 528 490 144 331 329 297 -133 -279 -17 -322 -424 -237 -210 -132 -230 -346 -387 -425 -206 -48 224
1832 224 96 -76 265 291 495 336 244 155 136 260 122 293 93 61 -166 -166 -287 32 140 69 -100 -199 -373
1855 -373 169 201 147 420 -147 -203 -173 -226 67 -333 -26 -38 -262 -191 -36 92 143 48 161 49 78 236 543
1878 543 535 212 391 33 25 -69 -204 -293 -267 -291 -526 -330 -403 -95 18 -228 -412 -111 222 321 350 404 210 541
1902 541 441 227 249 35 -12 -55 -238 -325 -422 -189 -344 -450 -324 -30 182 247 157 294 390 198 -26 88 577
1925 577 -105 237 269 -96 -497 -73 43 16 -174 -284 -51 -400 31 110 10 -38 2 125 72 318 113 240
1947 240 -44 217 -108 102 100 -46 -64 -209 -226 -287 -86 -64 -122 255 9 -147 88 351 84 292 473 343
$$ packed form
1788b31J19J65j55Q1l76l15J67J61J10O8l15K35K35l40K21J81R8R2j52K50J88
1809D87K36J17l12l8l46J87kl2m30j46K62l05j02J87K7P8r8j16m1l8K19J58K72
1832B24j28j72L41K6K04j59r2q9j9J24j38J71k00l2k27%j21L19J08p1j69r9j74
1855c73N42L2n4K73n67n6L0n3K93m00L07j2k24P1J55J28N1r5J13j12K9J58L07
1878E43ql23J79l58qr4j35q9K6k4k35J96p3L08J13k46j84L01L33R9K9N4j94L31
1902E41j00k14K2k14m7m3j83q7r7K33j55j06J26K94K12O5r0J37R6j92k24J14M89
1925E77o82L42L2l65m01M24J16k7j90j10K33l49M31P9j00m8M0J23n3K46k05J27
1947B40k84K61l25K10kj46j8j45j7o1K01K2n8L77k46j56K35K63k67K08J81j30
$$ plain form
1969 343 229 147 102 -63 -213 -59 -506 -326 -322 -359 -314 -289 -79 26 -160 3 202 357 368 298 300 104 66 319
1993 319 391 155 -102 -245 -180 -296 -167 -290 -240 -111 -80 9 8 202 189 339 22 537 324 481 275 90 -390
2016 -390 -220 -104 -431 -237 -193 -390 -525 -144 -486 -52 188 -61 29 122 320 458 377 374 434 607 584 106 123
2039 123 -357 -223 -142 -285 -566 -33 -205 -81 9 -163 77 -258 -18 60 153 423 357 231 351 249 58 -147
2061 -147 -147 -83 -158 -374 -313 -208 -229 49 -136 -103 -89 304 487 245 572 102 449 371 72 227 -169 -36 -265
2084 -265 -314 -284 -608 -475 -229 -168 -671 -265 77 198 419 29 281 204 728 472 380 464 440 325 2 -167
2106 -167 -542 -259 -480 -827 -654 -740 -550 -97 -202 -36 125 131 319 110 454 265 761 591 482 464 179
2127 179 73 48 -8 -176 -539 -254 -426 -153 -11 -106 -5 -71 212 -67 243 93 -87 10 305 -99 53 -159
$$ packed form
1969C43j14q2m5j65j50J54m47J80Ml7M5K5K10J05j86J63J99J55J1p0Kj96l8K53
1993C19P2k36k57j43O5j16J29j23N0J29L1Q9jJ94j3J50l17N15k13J57k06j85m80
2016c90J70J16l27J94M4j97j35L81l42M34K40k49R0R3J98J38q1lO0J73k3m78J7
2039A23m80J34Q1j43k81N33j72J24R0j72K40l35K40P8R3K70o6j26J20j02j91k05
2061a47%O4p5k16O1J05k1K78j85L3J4L93J83k42L27m70L47p8k99J55l96J33k29
2084b65m9L0l24J33K46O1n03M06L42J21K21l90K52p7N24k56r2Q4k4j15l23j69
2106a67l75K83k21l47J73q6J90M53j05J66J61OJ88k09L44j89M96j70j09j8k85
2127A79j06k5n6j68l63K85j72K73J42r5J01o6K83k79L10j50j80R7K95m04J52k12
$$ plain form
2149 -159 -275 -202 -251 -418 -351 -342 -495 -183 -102 -36 404 467 373 489 405 427 695 504 361 434 79 -38 -96 -170 -382
2174 -382 -170 -655 -480 -748 -264 -204 -211 -433 21 182 95 -44 303 391 507 470 434 268 222 80 37 160 -135
2197 -135 -206 -353 -116 -187 -88 -330 170 -112 -108 -153 -3 215 128 -153 166 -103 121 -161 -179 -32 -69 -250 -327
2220 -327 -439 -128 -69 -79 -43 178 285 182 17 239 553 265 340 419 207 164 347 9 -461 -461 -283 -493 -350
2243 -350 -164 -468 -8 -190 -17 74 16 153 158 206 379 601 335 222 474 -43 31 99 35 -402 -380 -148 -386
2266 -386 -242 -207 -54 97 -67 -172 -126 58 368 353 167 423 424 220 -56 44 -338 124 -75 -678 -290 -144
2288 -144 -158 58 -4 -28 75 220 -50 -93 327 225 366 67 218 314 -54 -123 -44 -236 -100 -564 -356 -332 -362
2311 -362 37 -162 -134 -138 -281 59 -47 286 107 7 229 20 315 247 80 -152 -275 -168 -293 -122 -158 -231
$$ packed form
2149a59j16P3m9j67O7Rj53L12Q1O6M40O3r4J16q4K2K68j91j43P3l55j17n8p4k12
2174c82K12m85J75k68M84O0pk22M54J61q7j39L47Q8J16l7l6j66m6j42m3J23k95
2197a35p1j47K37p1R9k42N00k82Mm5J50K18q7k81L19k69K24k82j8J47l7j81p7
2220c27j12L11N9j0L6K21J07j03j65K22L14k88P5P9k12m3J83l38m70%J78k10J43
2243c50J86l04M60j82J73R1n8J37NM8J73K22k66j13K52n17P4O8o4m37K2K32k38
2266c86J44L5J53J51j64j05M6J84L10j5j86K56Jk04k76J00l82M62j99o03L88J46
2288a44j4K16o2k4J03J45k70m3M20j02J41k99J51R6l68o9P9j92J36m64K08K4l0
2311c62L99j99K8mj43L40j06L33j79j00K22k09K95o8j67k32j23J07j25J71l6p3
$$ plain form
2333 -231 -305 -299 -329 -116 116 138 327 79 267 87 282 358 133 239 -66 -9 153 59 -214 -369 -283 -207 12
2356 12 -95 -49 -290 126 -120 112 263 292 510 445 505 401 225 -100 -72 -119 57 -226 -279 -194 5 -604 -153
2379 -153 -122 -48 -129 -114 200 156 -44 166 235 345 193 365 -54 -41 -9 -225 -418 -214 -484 -150 -130 -471 65
2402 65 -174 52 -59 26 331 200 359 414 263 51 355 125 -6 -135 -298 41 -403 -131 65 -51 -242
2423 -242 -37 -229 -40 143 43 47 54 279 377 244 368 247 169 -179 -44 -106 -302 -118 -245 -378 -328 41 41
2446 41 278 129 82 -347 321 294 -34 140 -3 76 121 92 150 41 -136 -156 -300 -163 -268 -138 -149 -35 161
2469 161 111 87 142 -30 292 258 254 345 244 530 214 21 119 -106 78 -124 -418 -6 -296 -77 -6 155 -279
2492 -279 136 219 4 54 -109 -152 134 167 202 -86 4 -369 136 -274 -334 -288 -101 -164 -75 330 -78 44 133 461
$$ packed form
2333b31p4Ol0K13K32K2J89k48J88j80J95P6k25J06l05N7J62r4k73j55Q6P6K19
2356A2j07M6k41M16k46K32J51K9K18o5O0j04j76l25K8m7J76k83n3Q5J99o09M51
2379a53L1P4q1J5L14m4k00K10O9J10j52J72m19J3L2k16j93K04k70L34K0l41N36
2402F5k39K26j11Q5L05j31J59N5j51k12L04k30j31j29j63L39m44K72J96j16j91
2423b42K05j92J89J83j00MPK25R8j33J24j21p8l48J35o2j96J84j27j33N0L69%
2446D1K37j49m7m29O68k7l28J74j43P9M5k9N8j09j77k0j44J37j05J30j1J14J96
2469A61n0k4N5j72L22l4mR1j01K86l16j93R8k25J84k02k94M12k90K19P1J61m34
2492b79M15Q3k15N0j63m3K86L3L5k88R0l73N05m10o0M6J87o3Q9M05m08J22Q9L28
$$ plain form
2516 461 -141 209 243 -116 140 -81 180 187 -96 -55 -54 223 -356 -340 -536 -76 -158 -102 -160 -186 -64 425 223 94
2540 94 194 287 258 370 399 99 -33 -103 198 -214 7 -230 -153 -176 -211 -113 -29 -107 139 110 204 216 -37 102 95
2565 95 -96 -85 -130 158 -85 295 83 -4 -240 -65 -81 -36 33 216 -264 218 101 -70 277 35 205 250 112
2588 112 19 140 253 284 -6 -130 -182 70 -57 60 -477 -114 -192 -17 -173 -130 202 49 287 201 171 81 101
2611 101 -29 297 -44 64 186 121 -74 38 1 -123 -151 -151 -70 -186 -192 169 42 -104 -104 36 80 86 -35 -28 233
2636 233 67 -204 -136 24 0 -125 -206 -58 -136 -29 38 -170 94 50 -138 129 214 88 92 -7 44 -22 20 -21 -50
2661 -50 12 -134 -272 94 -198 -13 101 -37 -36 84 139 41 -141 208 -17 159 53 -8 173 105 85 34 252
2684 252 94 95 -100 -115 -32 -285 -314 444 -108 -148 121 116 -92 148 35 -39 138 37 -113 197 -154 137 14
$$ packed form
2516D61o02L50L4l59K56k21K61Pk83M1JK77n79J6j96M60q2N6n8k6J22M89k02j29
2540I4J00R3k9J12K9l00j32p0L01m12K21k37P7k3l5R8Q4p8K46k9R4J2k53J39p
2565I5j91J1m5K88k43L80k12q7k36J75j6M5O9J83m80M82j17j71L47k42J70M5j38
2588A12r3J21J13L1k90j24n2K52j27J17n37L63p8J75j56M3L32j53K38q6l0r0K0
2611A01j30L26l41J08J22o5j95J12l7j24k8%Q1j16oL61j27j46%J40M4Oj21PK61
2636B33j66k71O8J60k4j25q1J48p8J07O7k08K64m4j88K67Q5j26Mr9N1o6M2m1k9
2661e0O2j46j38L66k92J85J14j38JJ20N5r8j82L49k25J76j06o1J81o8k0n1K18
2684B52j58Jj95j5Q3k53k9P58n52m0K69nk08K40j13p4J77j01j50L10l51K91j23
$$ plain form
2707 14 -153 48 -238 -122 -32 218 -153 -120 99 206 28 -139 -60 310 193 103 -161 313 73 -109 -74 57
2729 57 -9 -118 82 74 -208 260 92 -27 256 9 103 -195 -213 2 -97 -23 0 63 -232 -157 228 230 -3 113
2753 113 -104 -6 60 94 38 -134 207 89 -67 -164 208 -93 -26 209 -126 143 39 53 -194 -79 165 87 -242
2776 -242 -91 21 125 -137 7 -98 92 -85 92 146 8 -56 -26 63 -12 114 14 111 101 -36 125 23
2798 23 -12 -22 37 5 55 -99 -127 -50 -182 147 219 33 202 -95 -27 169 -250 -68 3 -26 -182 -73 -109 322
2822 322 -221 -3 -30 -28 12 102 81 -137 206 158 173 40 -32 134 -208 -98 -178 -78 -82 111 -188 -172 -77 33 -163
2847 -163 150 9 -105 221 -312 22 139 112 -111 140 -47 139 -25 -96 -35 -218 13 -140 -358 -143 -155
2868 -155 -112 -39 -69 -189 -125 17 49 253 -113 -25 -17 -15 43 -151 -62 -28 -42 -163 -2 27 131 474 59 -162 -12
$$ packed form
2707A4j67K01k86J16R0K50l71L3K19J07j78j67P9L70j17r0k64M74k40j82L5J31
2729E7o6j09K00qk82M68j68j19K83k47R4k98j8K15r9P4K3O3k95P5L85Kk33J16
2753A13k17R8O6L4n6j72L41j18j56r7L72l01O7K35l35K69j04J4k47J15K44p8l29
2776b42J51J12J04k62J44j05J90j77J77N4j38o4L0Q9p5J26j00R7j0j37J61j02
2798B3l5j0N9l2N0j54k8P7j32L29P2j86J69k97O8J96m19J82P1k9j56J09l6M31
2822C22n43K18k7KM0R0k1k18L43m8J5j33p2J66l42J10q0J00mJ93k99J6R5J10j96
2847a63L13j41j14L26n33L34J17k7k23K51j87J86j64p1O1j83K31j53k18K15j2
2868a55M3P3l0j20O4J42L2K04l66Q8QKN8j94Q9L4j4j21J61K9J04L43m15k21J50
$$ plain form
2893 -12 26 194 -407 164 -121 139 -108 -237 -208 252 -52 -190 -251 -8 -106 184 -121 -32 -206 -213 91 -69 -173
2916 -173 -64 -227 50 -45 -209 47 -368 -124 -248 30 63 225 -122 32 345 124 -266 -128 104 6 -172
2937 -172 143 -230 -238 -66 54 -88 190 -40 32 196 -122 -28 3 140 240 110 15 -164 -215 -129 -97 141 -200
2960 -200 -23 -114 51 144 101 -98 96 -53 -3 166 -155 -127 36 212 83 -140 189 -51 140 9 -79 52
2982 52 -249 202 -14 -125 -150 23 213 -121 -140 -128 -55 -56 114 -107 173 -45 -173 -110 -26 -14 -145 -184 -208 45
3006 45 102 287 134 -95 -319 -54 259 -161 107 39 22 -237 -65 200 -21 92 -63 68 100 -15 -22 6 135
3029 135 -171 31 -239 44 229 -393 117 257 -259 117 5 124 -49 -11 232 95 -98 -109 95 90 187 -26
3051 -26 271 5 86 -93 -63 -199 77 10 113 14 352 -65 15 -164 -85 -153 2 -13 112 -61 -192 -43 297
$$ packed form
2893a2L8J68o01N71k85K60k47j29K9M60l04j38o1K43r8K90l05Q9j74pL04j60j04
2916a73J09j63K77r5j64K56m15K44j24K78L3J62l47J54L13k21l90J38K32r8j78
2937a72L15l73qJ72J20j42K78k30P2J64l18R4L1J37J00j30r5j79n1Q6L2K38l41
2960b00J77r1J65R3m3j99J94j49N0J69l21K8J63J76j29k23L29k40J91j31q8J31
2982E2l01M51k16j11k5J73J90l34j9J2P3jJ70k21K80k18j28O3Q4J2j31l9k4K53
3006D5N7J85j53k29k24K65L13m20K68o8j7k59J72K65k21J13j55J31L2j15pK8J29
3029A35l06K02k70K83J85o22N10J40n16L76j12J19j73L8K43j37j93j1K04nR7k13
3051b6K97k66Q1j79L0j36K76o7J03r9L38m17Q0j79P9o8J55j5J25j73j31J49L40
$$ plain form
3074 297 -134 -140 -55 104 -77 203 -85 225 -15 209 -84 -78 238 -111 -113 18 -187 336 -10 -108 202 -255 111
3097 111 -43 -76 101 51 -110 -56 104 356 -168 131 162 99 210 -218 -155 111 -57 -162 57 129 1 102
3119 102 15 146 77 35 160 75 371 94 -19 28 40 138 143 -22 -30 -18 16 -189 180 -146 212 153 149 -249 19
3144 19 2 -62 207 -167 269 92 183 147 -76 -9 66 44 -185 -282 -116 -250 292 257 -110 22 -40 30 513 -28
3168 -28 -14 -77 -121 -28 52 264 -2 52 174 -69 -496 186 -159 7 404 52 56 109 -17 -24 -169 -28 -101 123
3192 123 -333 360 133 -115 -46 -137 298 18 -39 -341 -114 -105 -61 236 135 -138 -20 -157 46 -85 64 -92
3214 -92 1 82 423 -89 171 87 179 -62 -166 -238 129 -177 -267 346 -180 -103 178 -56 177 11 -11 304 -209
3237 -209 109 -188 96 22 -389 -3 125 -204 -192 163 -115 65 -101 -239 115 196 -7 106 261 -28 75
$$ packed form
3074B97m31oQ5J59j81K80k88L10k40K24k93OL16l49kJ31k05N23l46r8L10m57L66
3097A11j54l3J77n0j61N4J60K52n24K99L1o3J11m28O3K66j68j05K19P2j28J01
3119A02q7J31o9m2J25q5K96k77j13M7J2R8Nj65qJ2L4k05L69l26L58n9ml98K68
3144A9j7o4K69l74M36j77R1l6k23O7P5k2k29r7J66j34N42l5l67J32o2P0M83n41
3168b8J4o3m4R3Q0K12k66N4J22k43m27O82l45J66L97l52MN3j26pj45J41p3K24
3192A23m56O93k27k48O9r1M35k80n7l02K27RM4K97j01k73J18j37K03j31J49j56
3214i2R3Q1L41n12K60q4R2k41j04p2L67l06r0O13n26P7K81k34K33j66k2L15n13
3237b09L18k97K84p4m11L86J28l29J2L55k78J80j66j38L54Q1k03J13J55k89J03
$$ plain form
3258 75 -80 -113 335 -33 -203 -138 -47 76 239 -112 94 61 -49 110 70 -175 50 -10 93 -70 284 -62
3280 -62 -30 304 -149 -32 62 279 -67 -123 -292 -37 84 20 32 9 153 -79 -148 -149 78 220 222 120 45 89 165
3305 165 144 -127 -119 -138 97 -255 -231 -35 -186 -186 81 -12 -152 -88 30 -163 40 -217 41 89 -85 156 86 -117
3329 -117 -1 -111 -94 109 32 157 -14 19 121 9 -2 194 205 40 70 -62 -176 -45 -8 117 32 -25 -98
3352 -98 107 -9 9 252 -37 108 -58 145 -9 80 -98 -150 -122 -118 -122 27 34 -76 -74 181 -100 25 5 59 6
3377 6 5 81 156 -114 2 40 -103 196 38 60 195 31 135 -57 143 49 48 -178 208 -13 255 337 -107 179
3401 179 188 -92 -89 -15 51 -44 -16 2 -101 141 -124 -48 -54 129 -129 -289 -121 76 3 -29 -94 -103 54 -117 -60 -9
3427 -9 -116 56 -172 199 -84 -28 -122 -110 81 106 -118 221 -118 36 243 251 45 156 22 -116 234 77 -23
$$ packed form
3258G5j55l3M48l68j70O5R1J23J63l51K06l3j10J59m0k45K25o0J03j63L54l46
3280f2L2L34m53J17R4K17l46n6j69K55J21o4J2k3J44k32o9jK27J42Kj02p5M4P6
3305A65k1k71Qj9K35l52K4J96j51%K67r3j40O4J18j93K03k57K58M8j74K41p0k03
3329a17J16j10J7K03p7J25j71L3J02j12j1J96J1j65L0j32j14J31L7J25q5n7p3
3352i8K05j16J8K43k89J45j66K03j54Q9j78n2K8MmJ49Pj10KK55k81J25k0N4n3
3377FjP6P5k70J16L8j43K99j58K2J35j64J04j92K00r4jk26L86k21K68Q2m44K86
3401A79Rk80LP4O6r5K8J8j03K42k65P6oJ83k58j60J68J97p3l2o5rJ57j71N7N1
3427ij07J72k28L71k83N6r4J2J91K5k24L39l39J54K07Qk06J11j34j38L50j57j00
$$ plain form
3450 -23 71 -117 53 -21 75 -183 50 -19 78 -53 10 -91 191 120 20 111 -178 -37 -47 290 -124 57 -34 265
3474 265 15 112 85 80 48 -57 -145 -138 -43 -66 58 -305 -3 103 114 37 -170 -100 77 -186 -117 -5 152 165 63
3499 63 -121 -324 82 119 -44 215 188 -8 -29 94 130 30 -33 13 144 64 184 -6 124 -4 212 -196 -202
3522 -202 -176 -237 140 121 -271 105 -204 22 230 92 111 63 83 -78 115 133 -337 -203 115 -135 68 -84
3544 -84 121 17 59 237 129 68 -39 239 335 196 19 254 270 218 60 -89 -242 -231 -300 81 -100 -64 18
3567 18 -2 148 -98 225 57 -64 -33 1 34 126 -124 18 -111 -203 -63 -134 -224 93 68 -135 -142 -69 34 35 -183
3592 -183 181 -112 176 -209 -174 238 272 209 12 67 -97 -153 80 -65 58 -73 128 -49 62 -12 116 134
3614 134 75 257 115 -190 -69 -131 77 -14 -154 67 -186 -72 -99 -135 -46 239 12 -107 75 69 -8 334 171
$$ packed form
3450b3R4j88J70p4R6k58K33o9R7j31O3j01K82p1j00R1k89J41j0L37m14J81r1K99
3474B65k50R7k7nl2j05q8PR5k3J24l63L02J06J1p7k07P0J77k63O9J12J57J3j02
3499F3j84k03M06L7j63K59k7j96k1J23L6j00o3M6J31q0J20j90J30j28K16m08o
3522b02K6o1L77j9l92L76l09K26K08j38J9m8K0j61J93J8m70J34L18k50K03j52
3544h4K05j04M2J78j08o1j07K78R6j39j77K35J6n2j58j49j53J1o9L81j81L6Q2
3567A8k0J50k46L23j68j21L1L4L3R2k50J42j29r2J40p1r0L17k5k03pP3J03Jk18
3592a83L64k93K88l85L5M12L4o3j97N5j64n6K33j45J23j31K01j77J11p4J28J8
3614A34n9J82j42l05J21o2K08r1j40K21k53J14k7l6Q9K85k27j19J82op7L42j63
$$ plain form
3637 171 119 242 -27 -391 -37 205 -263 -247 13 -81 -171 76 -182 63 -73 185 359 -217 239 -70 22 -94
3659 -94 -288 -227 -133 -179 -16 -17 -38 -205 77 -12 14 -253 -156 46 181 9 -77 -101 -124 247 142 72 29 206 -18
3684 -18 81 245 32 164 -136 68 -131 -50 -92 -52 -281 -228 -240 2 32 50 45 27 -59 -150 8 -145 131 80 133
3709 133 73 93 -224 37 1 -82 162 -218 -135 174 30 -170 -134 40 49 187 97 53 115 -81 -174 -38 -125 -40 169
3734 169 166 -88 256 -234 61 -51 73 -37 118 23 -168 -34 154 161 -139 204 110 89 71 86 99 -14 75 41
3758 41 -224 -93 -125 -47 -185 -40 -86 38 57 125 147 114 130 -230 -191 -87 -12 131 -62 156 190 217 25 -305
$$ packed form
3637A71n2J23k69l64L54K42m68J6K60r4r0K47k58K45j36K58J74n76M56l09R2j16
3659i4j94O1R4m6J63jk1j67K82q9K6k67R7K02J35j72q6k4k3L71j05p0m3J77k24
3684a8R9J64k13J32l00K04j99Q1m2M0k29N3j2K42L0J8nj8q6r1J58j53K76n1N3
3709A33o0K0l17K61l6q3K44l80Q3L09j44k00L6J74RJ38r0m4O2j96r3J36q7Q5K09
3734A69lk54L44m90K95j12J24j10J55r5j91J34J88Pl00L43r4k1j8J5J3j13Q9l4
3758D1k65J31l2P8j38J45m6J24J9O8K2l3J6l60L9J04P5J43j93K18L4K7j92l30
$$ [...]
8191a83
##END NTUPLES=NMR FID
##END=
