##TITLE=1H_LRR-14
 CDCl3, 8 sc, 
 3.6.2019
##JCAMPDX= 6.0         $$ Bruker NMR JCAMP-DX V2.0
##DATA TYPE= NMR FID
##DATA CLASS= NTUPLES
##ORIGIN= UXNMR, Bruker Analytische Messtechnik GmbH
##OWNER= root
$$ XWIN-NMR		Version 3.5
$$ Mon Jun  3 14:46:49 2019 Russian Standard Time (UT+4h)  she@DPX200
##.OBSERVE FREQUENCY= 200.13155
##.OBSERVE NUCLEUS= ^1H
##.DELAY= (6, 6)
##.ACQUISITION MODE= SIMULTANEOUS
##.ACQUISITION SCHEME= undefined
##.AVERAGES= 8
##.DIGITISER RES= 18
##SPECTROMETER/DATA SYSTEM= spect
##.PULSE SEQUENCE= zg30
##.SOLVENT NAME= CDCl3
##.SHIFT REFERENCE= (INTERNAL, CDCl3, 0, 15.7039)
##AUDIT TRAIL= $$ (NUMBER, WHEN, WHO, WHERE, WHAT)
$$ ##TITLE= Audit trail, XWIN-NMR		Version 3.5
$$ ##JCAMPDX= 5.01
$$ ##ORIGIN= Bruker BioSpin GmbH
$$ ##OWNER= she
$$ F:/spectra/data/she/nmr/H-F/1/audita.txt
$$ ##AUDIT TRAIL=  $$ (NUMBER, WHEN, WHO, WHERE, WHAT)
(   1,<2019-06-03 14:45:32.32 +0400>,<she>,<DPX200>,
      <created by zg, POWCHK disabled, PULCHK disabled
       configuration hash MD5:
       00 E9 B6 7A A2 85 ED C7 34 08 36 98 17 FE 4E 26
       data hash MD5: 16K
       3C A1 CC 1B AB FD 30 76 BA 2E C4 4B D9 65 F2 98>)
$$ ##END=
$$ 
$$ hash MD5
$$ A0 63 B8 A0 6B E6 27 63 FE 0C CF 69 0B 30 D3 A2
##$RELAX= 
##$RELAX= 
##$RELAX= 
##$RELAX= 
##$RELAX= 
##$RELAX= 
$$ Bruker specific parameters
$$ --------------------------
##$DU= <F:/spectra>
##$EXPNO= 1
##$NAME= <H-F>
##$PROCNO= 1
##$TYPE= <nmr>
##$USER= <she>
##$AMP= (0..31)
100 100 100 100 100 100 100 100 100 100 100 100 100 100 100 100 100 100 
100 100 100 100 100 100 100 100 100 100 100 100 100 100 
##$AQSEQ= 0
##$AQ_mod= 1
##$AUNM= <au_zg>
##$AUTOPOS= <>
##$BF1= 200.13
##$BF2= 200.13
##$BF3= 200.13
##$BF4= 200.13
##$BF5= 200.13
##$BF6= 200.13
##$BF7= 200.13
##$BF8= 200.13
##$BYTORDA= 1
##$CFDGTYP= 0
##$CFRGTYP= 5
##$CHEMSTR= <none>
##$CNST= (0..31)
1 1 145 1 1 1 1 1 1 1 1 1 1 1 1 1 1 1 1 1 1 1 1 1 1 1 1 1 1 1 1 1 
##$CPDPRG= <>
##$CPDPRG1= <>
##$CPDPRG2= <>
##$CPDPRG3= <>
##$CPDPRG4= <mlev>
##$CPDPRG5= <mlev>
##$CPDPRG6= <mlev>
##$CPDPRG7= <mlev>
##$CPDPRG8= <mlev>
##$CPDPRGB= <>
##$CPDPRGT= <>
##$D= (0..31)
0 1.2 0 0 0 0 0 0 0 0 0 0.03 0 0 0 0 0 0 0 0 0 0 0 0 0 0 0 0 0 0 0 0 
##$DATE= 1559558731
##$DBL= (0..7)
120 120 120 120 120 120 120 120 
##$DBP= (0..7)
150 150 150 150 150 150 150 150 
##$DBP07= 0
##$DBPNAM0= <>
##$DBPNAM1= <>
##$DBPNAM2= <>
##$DBPNAM3= <>
##$DBPNAM4= <>
##$DBPNAM5= <>
##$DBPNAM6= <>
##$DBPNAM7= <>
##$DBPOAL= (0..7)
0.5 0.5 0.5 0.5 0.5 0.5 0.5 0.5 
##$DBPOFFS= (0..7)
0 0 0 0 0 0 0 0 
##$DE= 6
##$DECBNUC= <off>
##$DECIM= 24
##$DECNUC= <off>
##$DECSTAT= 4
##$DIGMOD= 1
##$DIGTYP= 9
##$DL= (0..7)
0 120 120 120 120 120 120 120 
##$DP= (0..7)
150 150 150 150 150 150 150 150 
##$DP07= 0
##$DPNAME0= <>
##$DPNAME1= <>
##$DPNAME2= <>
##$DPNAME3= <>
##$DPNAME4= <>
##$DPNAME5= <>
##$DPNAME6= <>
##$DPNAME7= <>
##$DPOAL= (0..7)
0.5 0.5 0.5 0.5 0.5 0.5 0.5 0.5 
##$DPOFFS= (0..7)
0 0 0 0 0 0 0 0 
##$DQDMODE= 0
##$DR= 18
##$DS= 0
##$DSLIST= <SSSSSSSSSSSSSSS>
##$DSPFIRM= 0
$$ [...]
##$SUBNAM2= <"">
##$SUBNAM3= <"">
##$SUBNAM4= <"">
##$SUBNAM5= <"">
##$SUBNAM6= <"">
##$SUBNAM7= <"">
##$SUBNAM8= <"">
##$SUBNAM9= <"">
##$SW= 24.9336996594482
##$SWIBOX= (0..15)
0 0 2 0 0 0 0 0 0 0 0 0 0 0 0 0 
##$SW_h= 4990.01996007984
##$TD= 16384
##$TD0= 1
##$TE= 0
##$TE2= 300
##$TE3= 300
##$TEG= 300
##$TL= (0..7)
0 120 120 120 120 120 120 120 
##$TP= (0..7)
150 150 150 150 150 150 150 150 
##$TP07= 0
##$TPNAME0= <>
##$TPNAME1= <>
##$TPNAME2= <>
##$TPNAME3= <>
##$TPNAME4= <>
##$TPNAME5= <>
##$TPNAME6= <>
##$TPNAME7= <>
##$TPOAL= (0..7)
0.5 0.5 0.5 0.5 0.5 0.5 0.5 0.5 
##$TPOFFS= (0..7)
0 0 0 0 0 0 0 0 
##$TUNHIN= 0
##$TUNHOUT= 0
##$TUNXOUT= 0
##$USERA1= <user>
##$USERA2= <user>
##$USERA3= <user>
##$USERA4= <user>
##$USERA5= <user>
##$V9= 5
##$VALIST= <valist>
##$VCLIST= <CCCCCCCCCCCCCCC>
##$VD= 0
##$VDLIST= <DDDDDDDDDDDDDDD>
##$VPLIST= <PPPPPPPPPPPPPPP>
##$VTLIST= <TTTTTTTTTTTTTTT>
##$WBST= 1024
##$WBSW= 4
##$XGAIN= (0..3)
0 0 0 0 
##$XL= 0
##$YL= 0
##$YMAX_a= 265212
##$YMIN_a= -263894
##$ZGOPTNS= <>
##$ZL1= 120
##$ZL2= 120
##$ZL3= 120
##$ZL4= 120
##$ABSF1= 10
##$ABSF2= 0
##$ABSG= 5
##$ABSL= 3
##$ALPHA= 0
##$AQORDER= 0
##$ASSFAC= 0
##$ASSFACI= 0
##$ASSFACX= 0
##$ASSWID= 0
##$AUNMP= <proc_1d>
##$AZFE= 0.1
##$AZFW= 0.1
##$BCFW= 1
##$BC_mod= 2
##$BYTORDP= 1
##$COROFFS= 0
##$CY= 11.3945322036743
##$DATMOD= 1
##$DC= 2
##$DFILT= <>
##$DTYPP= 0
##$F1P= 18.9103706918063
##$F2P= -1.10871071338519
##$FCOR= 0.5
##$FTSIZE= 0
##$FT_mod= 4
##$GAMMA= 1
##$GB= 0.15
##$INTBC= 1
##$INTSCL= 1
##$ISEN= 128
##$LB= 0.24
##$LEV0= 0
##$LPBIN= 0
##$MAXI= 10000
##$MC2= 0
##$MEAN= 0
##$ME_mod= 0
##$MI= 1.114404
##$NCOEF= 0
##$NC_proc= 0
##$NLEV= 6
##$NOISF1= 3.799351
##$NOISF2= 2.8
##$NSP= 1
##$NTH_PI= 0
##$NZP= 0
##$OFFSET= 15.70392
##$PC= 1
##$PHC0= -8667.955
##$PHC1= 30.40022
##$PH_mod= 1
##$PKNL= yes
##$PPARMOD= 0
##$PSCAL= 0
##$PSIGN= 0
##$REVERSE= no
##$SF= 200.130013532006
##$SI= 16384
##$SIGF1= 3
##$SIGF2= 2
##$SINO= 400
##$SIOLD= 16384
##$SREGLST= <1H.CDCl3>
##$SSB= 0
##$STSI= 0
##$STSR= 0
##$SW_p= 3612.71676300578
##$SYMM= 0
##$S_DEV= 0
##$TDeff= 0
##$TDoff= 0
##$TI= <>
##$TILT= no
##$TM1= 0
##$TM2= 0
##$TOPLEV= 0
##$USERP1= <user>
##$USERP2= <user>
##$USERP3= <user>
##$USERP4= <user>
##$USERP5= <user>
##$WDW= 1
##$XDIM= 8192
##$YMAX_p= 0
##$YMIN_p= 0
$$ End of Bruker specific parameters
$$ ---------------------------------
##NTUPLES= NMR FID
##VAR_NAME=  TIME,          FID/REAL,        FID/IMAG
##SYMBOL=    X,             R,               I
##VAR_TYPE=  INDEPENDENT,   DEPENDENT,       DEPENDENT
##VAR_FORM=  AFFN,          ASDF,            ASDF
##VAR_DIM=   8192,          8192,            8192
##UNITS=     SECONDS,       ARBITRARY UNITS, ARBITRARY UNITS
##FACTOR=    0.0002004,     1,               1
##FIRST=     0,             0,               0
##LAST=      1.6414764,     0,               0
##MIN=       0,             -263894,         0
##MAX=       1.6414764,     265212,          0
$$ Real data points
##PAGE= N=1
##DATA TABLE= (X++(R..R)), XYDATA
0@%%%%%%kJ0j6J6k4L2l3M1n3O3p7R2j08J32j55J79k10K42k77L19l66M16m73N36
30B84o03O78p60Q50r52J061j181J316j461J619j792J983k197K434k696K990l320
47a747L692m121M615n191N885o725P766r111J0919j3488J7464k4507M0709j43502
61a17342l9190L18334J03410j26332k83492j19282J23785K68635J26022j14519
71A40029k54808j28558J03316K39043J29076q9031k20566j27977P3301K00225
81F4050J25618n5216j76343j22667L3824J50996J21746j0022j26485j22194j3497
92a30190J02741J21928L6480p8187j21428o0912N3026J21647Q5685k9311j23132
103b1653j10215O152J24569J33991J5522j27305j57347l4981J30529J77691N1666
$$ plain form
0 0 0 0 0 0 0 0 -2 8 -8 8 -16 16 -17 24 -29 34 -43 49 -59 73 -82 97 -113 129 -148 171 -195 221 -252 284
30 284 -319 359 -401 449 -503 558 -623 693 -768 851 -941 1042 -1155 1279 -1417 1573 -1747
47 -1747 1945 -2176 2439 -2752 3133 -3592 4174 -4937 5982 -7506 9958 -14549 26160 -117342
61 -117342 -156532 161802 265212 138880 -144612 -263894 -140109 128526 254548 140029
71 140029 -114779 -243337 -140021 99022 228098 139067 -81499 -209476 -136175 64050
81 64050 189668 134452 -41891 -164558 -130734 20262 142008 131986 5501 -116693 -130190
92 -130190 -27449 94479 130959 52772 -68656 -129568 -76542 45105 130790 101479 -21653
103 -21653 -131868 -125716 -1147 132844 148366 21061 -136286 -171267 -40738 136953 188619
114A88619j32718j95493o7565J33894K11836Q1992j35433k25762r3340J36556
124i7414K36299J02471j35957k43142j09568J34820K47085J14353j31975k46448
134a29476j16621J26808K42408J18626j19340k35694j19128J10869K26191J18229
144B22872j00562k13365j16013Q7713J97749J13956p3388j80377j11600N6787
154a16228J60940J09364l8625j40667j08237J8789J19660J07274J263r8570j06553
165i1590k2583P6519J06395M4577n4936j07374o6960L4210J08867Q8728j4118
176A01735j10736j10066m780J13404J30549K1895j15557j48972l7708J17710J66133
187A23607N2701j19389j81593o5405J21711J94772P5615j22644k04336q4205J22622
$$ plain form
114 188619 55901 -139592 -207157 -73263 138573 220565 85132 -140630 -233970 -97414
124 -97414 138885 241356 105399 -137743 -247311 -112491 134594 248947 116972 -129476
134 -129476 -246097 -119289 123119 241745 122405 -113289 -232417 -121548 104643 222872
144 222872 122310 -91055 -207068 -119355 78394 192350 118962 -61415 -173015 -116228
154 -116228 44712 154076 115451 -25216 -133453 -114664 4996 112270 113533 14963 -91590
165 -91590 -114173 -37654 68741 113318 58382 -48992 -115952 -81742 27125 115853 101735
176 101735 -9001 -119067 -123847 -10443 120106 142001 26444 -122528 -160236 -42526 123607
187 123607 176308 56919 -124674 -190079 -68368 126404 202019 79375 -124961 -209166 -86544
198h6544K11548R1283j21684k15820r6163J19483K16603R9280j15352k14492j01704
209b13562J09691K09887J02152j03040k02294j01622R4034J91283J00356q3075
219A03810j78677r9344P0492J64236R7519n6747j47954r5836M0941J30356R4815
230A23611k4005j12436r3943O430R3737R3404J2330p4272r3425l1972N5679R4560
242D9698N1762l7392r5755p0821J9732R7478R0008k511r9583j08390j2900J01924
254a6750J25373K7470j03875j41008m0799J05860J55282N2312j07911j67383o2122
265a73551J09053J76728P0092j09308j83931p6912J08497J88442Q1723j07039
275H3794j90492q5326J04099J89671Q7386j00136j86516q8215R4641J80553Q7898
$$ plain form
198 -86544 125004 216287 94603 -121217 -217380 -97897 118706 217986 102634 -111858 -213562
209 -213562 -103871 106016 208168 105128 -97166 -198788 -104754 86529 186885 103810
219 103810 -74867 -174211 -103719 60517 158036 101289 -46665 -142501 -101560 28796 123611
230 123611 99606 -12830 -106773 -100343 -6606 86798 99128 24856 -68569 -100541 -44862 49698
242 49698 101460 64068 -31687 -102508 -82776 14702 104710 102199 2616 -105774 -118674 -16750
254 -16750 108623 136093 32218 -108790 -149589 -43729 111553 163865 55954 -111429 -173551
265 -173551 -64498 112230 182322 73014 -110917 -187829 -79332 109110 190833 83794
275 83794 -106698 -192024 -87925 101746 189132 88996 -97520 -185735 -91094 89459 177357
286A77357q7456j72066q7120P8497J61836Q6294o8110j49802q5008N6475J36451
297D7348Q3917m3170j21540q2774K8818J05965Q2159j2864q9486q2056l684P2997
309a4370Q2702K1100n6693q3726l8314M0428Q5105N5664k4727q6734p3000R390
321h3175Q8740Q9621M790r1106j05568j8095R3105J19952L0134r5332j33110m0839
333a40883R6720J44377N0135r7960j53828n8146R8412J61001O4682r8113j66136
344i9739o9653R7055J68753P3436r4778j69040p5819R1745J67040P7233q7114
355G9119j62603p7436Q1197J56460P7328p3863j47997p6781O5407J38269P5852
366A34952n5316j26845p4822M3936J14116P4192l1356j00659p3641J7502Q6229
$$ plain form
286 177357 89901 -82165 -169285 -90788 71048 157342 89232 -60570 -145578 -89103 47348
297 47348 131265 88095 -33445 -116219 -87401 18564 100723 87859 -1627 -83683 -87367 -14370
309 -14370 68332 89432 32739 -50987 -89301 -48873 36232 91896 67169 -19565 -92565 -83175
321 -83175 5565 95186 99976 8870 -96698 -114793 -21688 98264 128398 33066 -100044 -140883
333 -140883 -44163 100214 150349 52389 -101439 -159585 -61173 99828 164510 66397 -99739
344 -99739 -169392 -72337 96416 169852 75074 -93966 -169785 -78040 89000 166233 79119
355 79119 -83484 -160920 -79723 76737 154065 80202 -67795 -144576 -79169 59100 134952
366 134952 79636 -47209 -122031 -78095 36021 110213 78857 -21802 -95443 -77941 8288
377H288P3623k788p1816p4319j2644N7150P5097K8019m2559p6354m4002K8043
389e4262P7753N9721j4271p9754p5092J087Q1689Q9620J1227q3828j03139k2263
401a11512Q5668J15318L2528q7084j26000m1374Q8117J35338M9257q8757j42484
412i0985n5583Q9092J47864O0660q8259j51079o4257Q6776J52299O7014q4137
423F9405j51335o8727Q0483J48427O9606p5691j43687o9901O9702J37171O9318
434A34771o2538j28894o8862N3838J19028O8138m3930j08274o7752L2642R6332
445B4499O7402k0683q3812o7471P683P0690O7698N918n7279o8220k0295M3963
457b9907O9240L4797l0587p0614m9149J7847P2283O3313n563p3884p6688n872
$$ plain form
377 8288 81911 79123 7307 -67012 -79656 -22506 52591 80610 38051 -38303 -82305 -54262
389 -54262 23491 83212 68941 -10813 -85905 -84818 -3129 86491 97718 13890 -89249 -111512
401 -111512 -25844 89474 122002 34918 -91082 -132456 -44339 90999 140256 51499 -90985
412 -90985 -146568 -57476 90388 151048 62789 -88290 -152547 -65771 86528 153542 69405
423 69405 -81930 -150657 -70174 78253 147859 72168 -71519 -141420 -71718 65453 134771
434 134771 72233 -56661 -125523 -71685 47343 115481 71551 -36723 -104475 -71833 24499
445 24499 91901 71218 -12594 -80065 -72382 -1692 66006 71924 14645 -53575 -73870 -29907
457 -29907 39333 74130 43543 -27071 -76220 -58373 13910 77223 71660 -2224 -78912 -84784
469h4784P5734Q9512J6584p7256j00881k6211P8725J11240L4934p9813j20090
480h2306m2394Q0667J27363M8656q1019j32869n3588Q0468J36417N7433p9293
491E9535j38358o0497P7243J38190O2448p4449j36537o3729P0474J32953O4076
502A31349o5692j27824o3919N9469J20882O3445n2183j12509o2946M3502J03119
513C6693O2648l3846r2781o2259K3468Q1584O1964j1714o9580o1934o10N7427
525h940O2584J3715m5041o3287k6892L2855O4493M0208k0871o5850n3072R484
537f0614O7348O5531J411o8742p7564j1636P0217Q8664K0710p1896r8495k8935
549a04001P3043J06997L5824p4050j14115m2000P4405J19764M6769p4550j23827
$$ plain form
469 -84784 -9050 80462 97046 19790 -81091 -107302 -28577 82663 117597 37784 -82306
480 -82306 -124700 -44033 83330 131986 50967 -81902 -135490 -55022 81395 138828 59535
491 59535 -78823 -139320 -62077 76113 138561 64112 -72425 -136154 -65680 67273 131349
502 131349 65657 -62167 -126086 -66617 54265 117710 65527 -46982 -109928 -66426 36693
513 36693 99341 65495 -27286 -89545 -66077 15507 77471 65757 -3823 -65757 -66367 -8940
525 -8940 53644 67359 22318 -40969 -67861 -35006 29487 69695 48824 -17026 -70098 -60614
537 -60614 6734 72265 73676 4934 -72630 -84266 -14049 74615 95325 23429 -75066 -104001
549 -104001 -30958 76039 111863 37813 -76302 -118302 -43897 75867 122636 48086 -75741
560g5741n0691P3667J26260N3728p2377j27093n5836P0408J26091N7096o7369
571E8143j23544n7531O3341J19355N7977n8153j13716n7690N1777J07028N7498
582A04485m4296r8671n7127L5823Q9627N6842k6215p9580n6540J5804O8751N6749
594F5652m487n7532n7201p391M6185N7844J9487l4930n8863l1836K3715N9910
606B0553M3872j3107o1212n5618K537O2485O6964P003o4208p7643j5667O5707
618a8334Q7040K3281o6924r5362l0215O7982J02395L6186o8656j08210m0966O9054
630d2729J12629M4902o8645j15608m7922O8127J17135N0012o6551j16644n1268
641a16562O4045J14917N2380o0475j11891n2802N6353J07333N2768n0958j01366
$$ plain form
560 -75741 -126432 -52765 73495 127223 54846 -72247 -128083 -57675 68416 125512 58143
571 58143 -65401 -122932 -59591 59764 117741 59588 -54128 -111818 -60041 46987 104485
582 104485 60189 -38482 -95609 -59786 29841 86683 60468 -19112 -75652 -59848 8903 65652
594 65652 61165 3633 -53568 -60959 -14774 43070 62557 27627 -31236 -63072 -39357 20553
606 20553 64425 51318 -9894 -65512 -62975 -490 66474 73477 9269 -68374 -84041 -18334
618 -18334 68706 91987 25063 -70299 -100514 -32532 69863 106049 37393 -70817 -111783 -42729
630 -42729 69900 114802 46157 -69451 -117373 -49246 67889 117901 51350 -65294 -116562
641 -116562 -52517 62400 114780 54305 -57586 -110388 -54035 53298 106066 55108 -46258
652d6258n2696M4374R4459N2382l7016q6479n1996K8537P7235N1669j9062o7507
664a2358n2027Q669N7613N2197J690m7161n2634j2912L6421N3309K4466k6061
676C1212n4584l5825J5972N5854M6703o179n7025n7541k940N8752O7751J1090
688G3240o0245p6601j8333O1391Q4725K5374o2421r2079l0952O3737R8017L5645
700A01498o4271j02469l9355O4197J05810M2646o3880j07686m4925O2886J07944
711F2395M6372o0727j07064m7572N7762J04951M8193n4514j01429m8346M9956
722e0023R6227M8068m4162r0224m8191L7560Q3216M7850l0209p5090m7664K1532
734e1110O6173M7885j2250n7074m8073K669M7431M8307P646l7319m8663j8401
$$ plain form
652 -46258 -98954 -54580 39879 92261 55245 -31234 -83230 -54693 22542 74211 55149 -12358
664 -12358 -64385 -55716 1897 54094 55784 8623 -44011 -56923 -20502 32807 57273 31212
676 31212 -23372 -59197 -43225 12629 59332 53153 -3872 -61413 -64353 -5601 62150 73240
688 73240 12995 -63606 -81939 -20548 64177 89551 27130 -64949 -95901 -32164 65853 101498
700 101498 37227 -65242 -104597 -40400 65410 108056 44176 -63510 -108435 -45549 62395
711 62395 108767 48040 -59024 -106596 -48834 56117 104310 49796 -51633 -99979 -50023
722 -50023 46204 94272 50110 -40114 -88305 -50745 32471 80321 50112 -24978 -72642 -51110
734 -51110 15063 62948 50698 -6376 -54449 -51780 -4349 43958 51604 14285 -34378 -52779
746e2779K7497M9816K9105j7955n0788l9430Q905N1948M9571J0n3339n9105p799
759f4343N4750O7923J4930n5878p5850k1612N7215Q2953K7248n8472q9042l1785
771i1963N9184R3618L5558n9442r7209l8973N9284R9492M1205n8625j00611m2913
783a01395N7053J00199M4196n4934r8835m4842N1963R5832M5090m8001r1535m5138
795i0347M2997Q6203M5307l7144p9995m4914L0475P2710M4801k2806o4583m4495
807f1791J4466N6124M4549n621m6898m4423l877L7509M4871J3836k8298m5429
819b4982k3685J9230M6275L3216j0364m7144m2916J922M8358N2012N584m9651
831G855o0479j2737N0802O8264J9071n2336p5473k4462N3704Q1209K8787n4493
$$ plain form
746 -52779 -25282 24534 53639 35684 -15104 -54534 -45629 6319 55890 55900 2561 -56544 -64343
759 -64343 -9593 58330 73260 17382 -58468 -80080 -22865 60088 87336 28864 -60178 -91963
771 -91963 -32779 60839 96397 36955 -60254 -99227 -39943 59549 100754 42129 -58482 -101395
783 -101395 -44342 55857 100053 45119 -53716 -98558 -46595 49237 94327 46326 -45209 -90347
795 -90347 -47350 38853 84160 47016 -32979 -77893 -47418 25292 70093 47287 -17296 -61791
807 -61791 -47325 8799 53348 47727 829 -43594 -47471 -9962 34909 48745 20447 -24982
819 -24982 -48667 -29437 16838 50054 39690 -7454 -50370 -48448 -90 51922 57506 7855
831 7855 -52624 -65361 -14559 53705 72776 20440 -55033 -79495 -25791 55418 84205 29712
843B9712q6083l2744N4872Q9993L6050n5345r2704l8156N4987R4073L9910n3953
855D0612r4140m1183N2332R3346M1851m9966r0774m1920M6503Q7150M2294m2026
867D4079q2695m2213L7205P7241M1685l1251p0432m1276K4345O3082M1034j6838
879D3966n5149m0935Q718M6739M0721r0l7873m1238r150K9466M1637J8079k1123
892B3768m2257k7303J2628M3173L6335m677m4615m5225k537M6050N3338R080m7330
905A0428o1041j5092M8909O8041K0228n0282p3953k4543N1410P8976K8546n2179
917B9448q3077l1494N2685Q6111L4039n2826q7670l5624N2074Q8297L6988n0591
929C8360q7686l7882M8513Q5828L8427m5536q2926l8678M1693P9033L8632l7346
$$ plain form
843 29712 -56371 -89115 -34243 55750 91800 36455 -56249 -94405 -39418 54655 94565 40612
855 40612 -53528 -94711 -42379 50967 92818 42852 -47922 -89842 -43339 43811 86105 44079
867 44079 -38616 -80829 -43624 33617 75302 44051 -26381 -67657 -43312 19770 60804 43966
879 43966 -11183 -52118 -43400 3339 44060 43970 6097 -35141 -44291 -14825 26812 44891 23768
892 23768 -18489 -45792 -33164 10009 46344 41667 -2948 -48173 -50710 -4660 48678 57758 10428
905 10428 -50613 -65705 -16796 51245 71473 21191 -52762 -77305 -25895 53081 81627 29448
917 29448 -53629 -85123 -32438 53673 87712 34886 -52784 -88408 -36334 51963 88951 38360
929 38360 -49326 -87208 -38695 47133 85560 40024 -42902 -81580 -39887 39146 77778 40432
941D0432p4005l8468L1832O8081L8024k5713o1266l8013J8682N4010L7790j1258
953D0128m6347l7712L108L8306L7793N187l0189l8103j3650K1982L8647K2385
965D1535j3964l9563l0989O459M0807L9510M96m2081m7296o894M3520N4832J2770
978E9142m4949o1477j7838M6452O7544K2258m7557p2763k6031M8643P7040K9040
990G9504m9446q0103l1399M9499Q2146L3288m9166q3120l4715M7992Q2897L5613
1002H2990m6385q1604l6305M3861P9257L6283m0615p5866l6334L6695P1228L5988
1014F9193l1789o5862l5702K6181N9680L5561j9958n2982l5222J3178M5825L5045
1026D3148n838l8169l4933j854L0579L5181R980k2927l5563j7993J5461L6375
$$ plain form
941 40432 -33573 -72041 -40209 27872 65896 40183 -21083 -59096 -40414 13596 51386 40128
953 40128 -6219 -43931 -40823 -2517 35276 40463 10274 -27829 -41479 -19497 19150 41535
965 41535 27571 -11992 -42981 -36522 4285 43795 44291 2210 -45086 -51980 -8460 46372 59142
978 59142 14193 -47284 -65122 -18670 48874 71132 23575 -49188 -75219 -26576 50464 79504
990 79504 30058 -50045 -81444 -31945 50201 83489 34323 -48797 -83512 -35520 47377 82990
1002 82990 36605 -44999 -81304 -37443 41814 78097 37482 -38384 -74718 -38023 33205 69193
1014 69193 37404 -28458 -64160 -37979 21701 57262 37304 -15678 -50900 -37722 8103 43148
1026 43148 37310 -859 -35792 -37646 -7067 28114 38094 15167 -20396 -38389 -22928 13447
1038A3447K6161q169l7404l4177J591L8675M1658M681l9896m8954j0406M1363
1050a1430N5572J5453m2842o1711j9826M4090O6834K3461m5336p1161k6602M6114
1062b7384P4387K9038m6476p6811l1052M6354P7892L2590m5524p8289l3408M4068
1074c4615P7411L3971m2032p5287l4265L9193P2392L4234l5569o8276l4052L1277
1086c5618O3539L3865k6265n7902l3507K0753N1938L3094j4510m5266l2713P863
1098c4729L8161L2605o89l0889l2725o774K3722L3087J4284j6798l3738k1833
1110c6316R860L4512K9372l483l5716l6769k601L7019M3660Q028l8454n0329j2880
1123e4097L9885N6149J7201m1307o1367k0864M2473O5724K3976m3344o9278k6402
$$ plain form
1038 13447 39608 31439 -5965 -40142 -38551 124 41782 46463 6567 -42387 -52793 -11430
1050 -11430 44142 59595 16753 -44958 -64784 -20694 46140 69601 24265 -46896 -73498 -27384
1062 -27384 47003 76041 29565 -47246 -78298 -31944 45948 78538 33014 -45275 -78683 -34615
1074 -34615 42796 76767 34735 -40552 -74817 -35624 36768 71002 35433 -32843 -66895 -35618
1086 -35618 27921 61786 35521 -22381 -55888 -35135 16803 49897 35387 -9879 -42592 -34729
1098 -34729 3432 36037 35348 4459 -28266 -35040 -11318 21769 36053 19255 -14483 -36316
1110 -36316 -26456 8056 37428 33945 -1771 -38540 -41141 -4122 39538 47566 9112 -41217 -54097
1123 -54097 -14212 41937 59138 17831 -43536 -64400 -21927 43797 67773 24429 -44849 -71251
1135g1251M3885P1741K8538m3870p3298k9970M3538P3750L1041m2276p3153l1546
1147g2871M0505P1586L2019l8011o8926l2131L4841O5530L1948l0930o1192l1788
1159e9420K6456N6334L1312k1453n0672l0937J5724M4483L0539r631l7955l0553
1171c5773K982L1343L0612L718k4762l0877j0865J8176L1306J7848j1605l2181
1183a0078k5002N351L3185L2127M29l4431l8893n661L5832M5327J0453l7249n0995
1196c9605j4684L8640N6214J8471l9771o0611k1615M0835O4335K4229m1468o7013
1208d2043k6224M1754O8766K7724m1309o9598k8801M0462O9249K9595l8900o8098
1220c7423l0047L6557O6005L0178l3913o3012l0165L0500N9162K9755k6508n4658
$$ plain form
1135 -71251 -27366 44375 72913 29043 -44255 -74225 -30687 43063 74104 31828 -41325 -72871
1147 -72871 -32366 39220 71239 33228 -35698 -67829 -32988 32542 64490 33560 -27632 -59420
1159 -59420 -32964 23370 54682 33229 -17443 -48380 -32656 11827 42366 32735 -5220 -35773
1171 -35773 -32791 -1448 29164 32882 8120 -22757 -33622 -15446 15860 33708 22103 -10078
1183 -10078 -35080 -29729 3456 35583 36012 1581 -37312 -42973 -7141 38186 48639 11390 -39605
1196 -39605 -54289 -15649 40565 59036 19265 -41346 -62961 -22126 42209 66438 24970 -42043
1208 -42043 -68267 -26513 42253 69977 28668 -40930 -69731 -29269 39980 69575 30675 -37423
1220 -37423 -67470 -30913 35092 65270 31357 -31655 -61820 -31320 27842 57597 31089 -23569
1232b3569k9506K1911M9414K9193j6938m3857k8817J1217L7948K8740n279l1861
1244a404k8721r80K5636K8888P603j9280k9363j4355J3338L0096K1236p409l1051
1257e766k7806J890L2327L4336L219l3628m0400p822L5007M6090J2153l6408n1281
1270c8089j5802L7575N5951J8888l8857n9610k1361L9460O2423K3485l9994o4457
1282d0388k5059L9833O5464K6007l9167o5524k6890L7883O4667K7405l6251o3057
1294c5077k7523L3945O0320K7458l0895n6956k7296K7285N3104K6993k3100m8537
1306b0279k6696J8546M3438K6662j3344l8051k6615P926L2616K6655k068k6660
1318B130k6881m222K0894K7558J0673j5284k8269j7124R790K9305K3363m420l0457
$$ plain form
1232 -23569 -53075 -31164 18250 47443 30505 -13352 -42169 -30952 6996 35736 30457 -1404
1244 -1404 -30125 -31105 -5469 23419 31022 11742 -17621 -31976 -18638 11458 32694 25285 -5766
1257 -5766 -33572 -31682 645 34981 38200 4572 -35828 -43650 -8643 37447 49600 13192 -38089
1270 -38089 -53891 -16316 39635 58523 19666 -39944 -61305 -21845 40578 64063 24069 -40388
1282 -40388 -65447 -25614 39850 65857 26690 -38834 -65724 -27841 36826 64231 27980 -35077
1294 -35077 -62600 -28655 31665 59123 28228 -28728 -56024 -28739 24365 51358 28258 -20279
1306 -20279 -46975 -28429 15009 41671 28327 -9724 -36339 -28413 4203 30858 28790 2130
1318 2130 -24751 -28973 -8079 19479 30152 14868 -13401 -30525 -20735 8570 31933 27513 -2944
1331b944k9815m88L1886L5774M797l3285m1415r018L4712M6424J2667l6135n1201
1344c8041j5646L7357N4909J8029l8136n7842k0292L8534O0124K1976l8652o1511
1356c9191k3171L8331O1775K4164l7292o1423k4567L5831O0107K5017l3896n7869
1368c2184k4837L1095N5106K4980k7916n1627k4838K4374M7581K4717k0115m3095
1380a6759k4557J5397L8139K4624j0238l3078k4865M841K7759K5142J052k2521
1392D936k5811p216J7237K6719J3148j2227k7667j9359P084K8913K5432k407l0298
1405a516l1403k029L1727L6955N940l3088m2005r653L4590M6559J2739l5703n0411
1418c7298j5347L6569N3702J7689l7108n6165j9358L7388N7821K0792l7243n8296
$$ plain form
1331 -2944 -32759 -33247 -1361 34413 39210 5925 -35490 -44508 -9796 36628 49295 13160 -38041
1344 -38041 -53687 -16330 38579 56608 18472 -39370 -59662 -21128 38996 60972 22320 -39191
1356 -39191 -62362 -24031 37744 61908 24616 -36807 -61374 -25543 34564 59581 25685 -32184
1368 -32184 -57021 -25926 29180 54160 26244 -25383 -50221 -25847 21734 46451 26336 -16759
1380 -16759 -41316 -25919 12220 36844 26606 -6472 -31337 -26496 1263 26405 27457 4936
1392 4936 -20875 -28091 -10854 15865 29013 16786 -10881 -30240 -23156 5757 31189 28782 -1516
1405 -1516 -32919 -34948 -3221 33734 39674 6586 -35419 -45072 -10482 36077 48816 13113 -37298
1418 -37298 -52645 -16076 37626 55315 18207 -37958 -57316 -19928 37893 58685 21442 -36854
1430c6854k1837L6409N8417K2438l5170n7315k2854L3358N5593K3096l0910n3218
1442b8847k3374K8054N0335K3170k4866m6602k3128K0774M2616K2993j6490l8218
1454a3583k3180J1752L3454K3390o736k8586k3797J140K3655K4490M394j8794
1466G599k5151j0114J3829K6097J5979q933k7209k1937M354K8693K7628j02k9845
1479H88l2931l914L1201L8050P638l2512m2555j0775L3729M6471J3568l4384m9860
1492c5386j6080L5153N2603J7773l5497n4350j9162L5490N5055K0261l4829n5435
1504c4404k1122L3984N4734K1457l2453n3431k1807L0381N1407K1816k7873m8867
1516b6178k1936K4960M5682K1783k1502m1923k1838J7411L7955K2089j3009l3817
$$ plain form
1430 -36854 -58691 -22282 36135 58573 23403 -33912 -56766 -23408 32185 55281 24371 -28847
1442 -28847 -52221 -24167 26168 49338 24472 -22130 -45258 -24484 18132 41125 24635 -13583
1454 -13583 -36763 -25011 8443 31833 25097 -3489 -27286 -26146 -2491 21999 26393 7599
1466 7599 -17552 -27666 -13837 12260 28239 19306 -7903 -29840 -25486 3207 30835 30733 888
1479 888 -32043 -35957 -4756 33294 40932 8420 -34135 -44910 -11181 35290 48858 14474 -35386
1492 -35386 -51466 -16313 36290 54063 18566 -35784 -54946 -19456 35599 55860 21031 -34404
1504 -34404 -55526 -21542 33192 54649 22196 -31235 -53042 -22661 28746 50562 22689 -26178
1516 -26178 -48114 -23154 22528 44311 22809 -19114 -40952 -23541 14414 36503 23494 -10323
1528a0323k2283Q459K9215K2654l283k4391k3190k169J9847K4029P556j5034k4737
1541a3650j3173J0395K5760J8894n886k6813k4403J636K8075K9500K378k9167
1553C546l4459o102L0290L8998R338l1401m2957j2171L2178M6278J4612l2897
1565A5253m9106j6673L3366N0904J8113l3341n2060j9406L2935N2524K0147l2196
1577B0460n2395k0620L1133N1376K0817k9316m9700k1077K7269M7495K1114k4613
1589B1943m4658k1068K1542M1448K1091j7867l7732k1227J3967L3862K1417r568
1601B3150k9590k1579M868K5194K2098J4k0662k2738n255J6236K3370J0624j1800
1614A3930k4293j5982P356K5396K1034l361k6279k6117p88K7359L0961M352k8480
$$ plain form
1528 -10323 -32606 -24147 5068 27722 24439 48 -23142 -25311 -5464 18565 26121 11087 -13650
1541 -13650 -26823 -16428 9332 28226 22340 -4473 -28876 -27240 835 30335 32713 3546
1553 3546 -30913 -37015 -6725 32273 41611 10210 -32747 -44918 -12740 33538 48150 15253
1565 15253 -33853 -50526 -17160 33744 51857 18516 -33544 -52950 -20015 32509 52656 20460
1577 20460 -31935 -52555 -21422 29954 50771 21455 -28245 -49322 -22053 25442 46556 21943
1589 21943 -22715 -43783 -22241 19207 40298 22431 -15301 -36528 -22561 11301 32718 23150
1601 23150 -6440 -28019 -23151 2043 24141 24155 3493 -19245 -24500 -8264 15106 25730 13930
1614 13930 -10363 -26345 -18989 6407 27441 24080 -2199 -28316 -29104 -1745 29216 33568 5088
1627E088l5510p539K9487L9336J0407l0372m2733j2947L1032M5543J5002l1522
1639A5272m7554j6624L1598M9076J7988l1379m9854j8912L1001M9883J9362k9879
1651A9978m9085j9754K8498M7920J9980k6659m5941k0058K4408M3513K0126k1631
1663B1295m0641k0080J8364L7353K0228j4873l3787k0261J0729K9828K0486o434
1675B2207k5661k0948J715K1389K1486L039j7127k2250q048J2927K2839J3130
1687B4698q775k3751j8065M675K4585K2990p55k5674k7590k695K6668L1905N950
1700C4166k7652l5756q722K8535L9161J1308k9177m2038j3368K9826M4322J5055
1712D5660l0071m5918j6326L0126M6955J7212k9783m7200j7880K9036M6839J8261
$$ plain form
1627 5088 -30422 -37961 -8474 30862 41269 10897 -31836 -44783 -13751 31792 46794 15272
1639 15272 -32282 -48906 -17308 31768 49756 18377 -31477 -50389 -19388 30495 49857 19978
1651 19978 -29107 -48861 -20363 27557 47537 20878 -25063 -45121 -20713 22800 42926 21295
1663 21295 -19346 -39426 -21062 16291 36519 21646 -12141 -32402 -21673 8155 28641 22207
1675 22207 -3454 -24402 -22687 -1298 20188 23227 6100 -16150 -24198 -11271 11568 24698
1687 24698 15923 -7828 -25893 -21218 3367 26357 25602 -72 -27662 -30357 -3689 28216 34166
1700 34166 6514 -29242 -37964 -9429 29732 41040 11863 -30175 -43543 -13717 30605 45660
1712 45660 15589 -30329 -46655 -16529 30426 47638 17855 -29345 -47225 -18189 28650 46911
1724D6911k7912m5855j8604K6351M4382J8654k4442m2332j8755K2024L9699J8754
1736C8875j9113l6798j8882J5689L3470J9008j1935k9946j9323P922K6109J9713
1748B4789l614k2156k0191j096J8236K0777N758j3954k1600j0496J0055K2370
1760H878J5293n961k3253j9962K352K4185K4470J217k5110k8643m329K5995L2447
1773B7579P244k6761l5881r746K7464L8763J1914k8100m1176j3575K8364M2962
1785B9051J4880k8559m4088j5985K8328M4631J6667k7818m4693j7184K6901M3991
1797B6122J7505k5631m2789j7744K3950M1095J7765k1920l8722j7853J9361L6062
1809A7201J7902j6307l3065j7983J2834K9931J8334r212k6265j8623N195K2614
$$ plain form
1724 46911 18999 -26856 -45460 -19109 25273 43927 19485 -22847 -41602 -19578 20121 38875
1736 38875 19762 -17036 -35918 -20229 13241 32249 20314 -9632 -28955 -21033 5076 24789
1748 24789 21175 -981 -21172 -22268 -4032 16745 22503 8549 -13051 -23547 -13492 8878
1760 8878 24171 18210 -5043 -25005 -22653 1532 26002 27219 2109 -26534 -30863 -4868 27579
1773 27579 34823 8062 -27819 -37565 -10101 28662 40576 12476 -28700 -42275 -13911 29051
1785 29051 43931 15372 -28716 -44701 -16373 28258 44925 17107 -27586 -44770 -17869 26122
1797 26122 43627 17996 -24793 -42537 -18587 22508 40273 18353 -20369 -38222 -18861 17201
1809 17201 35103 18796 -14269 -32252 -19418 10513 28847 19635 -6630 -25253 -20058 2556
1821B556J9022q62j8794j9494l572J4955K0270Q168j1182k1034j2780P575K1906
1834F734J7208m056k2879k1478P16K3848K5472K356k4812k9311n128K5576L2728
1847B6974P559k6527l5709r581K7142L8083J1271k7689m0038j2578K7970M1274
1859B8151J3704k8015m2107j4478K7808M2214J5092k7104m1999j5270K6061M1131
1871B5188J5549k4565l9635j5719K2729L7828J5816k0295l5386j6069J7597L2687
1883A5725J6377j4345k9695j6754J0814K6430J7125o910k2977j7699K867J9329
1895B87J8304J543j5895j9032n918J2170J9829J0330q762k0750j4653N268K1623
1908D344J8878k181k2544k2812q78K3468K6487L605k4369k9926n793K5217L2705
$$ plain form
1821 2556 21578 20716 1922 -17572 -21144 -6189 14081 22249 11067 -9967 -22747 -15172 6734
1834 6734 23942 19886 -2993 -24471 -23755 93 25565 27921 3109 -26202 -31330 -5754 26974
1847 26974 34533 8006 -27703 -37284 -10142 27941 39212 11523 -28515 -41093 -13123 28151
1859 28151 41855 13840 -28267 -42745 -14937 27277 42369 15265 -26734 -42004 -15943 25188
1871 25188 40737 16172 -23463 -39182 -16453 21375 37191 16896 -18490 -34559 -16962 15725
1883 15725 32102 17757 -11938 -28692 -17878 8552 25677 18767 -4210 -21909 -19042 287
1895 287 18591 20134 4239 -14793 -20711 -8541 11288 21618 12856 -7894 -22547 -17279 4344
1908 4344 23222 21041 -1503 -24315 -25193 -1725 24762 28367 3998 -25928 -31721 -6504 26201
1921B6201P984k5935l5290r629K6582L7261J1159k6950l8804j2148K7137L9781
1933B7349J2983k6864m0166j3685K6507M0103J4043k5599l9417j4278K4264L8337
1945B3577J4542k2651l6624j4816K0432L4720J5024j8066l2319j5190J5035K9421
1957A3085J5538j1766k6436j6060Q149K3200J6451m292j9795j7113Q9J6478J7837
1970A5365L952j3068j8634q043R659J9443J2304o449k0336j6308L380K1354K0269
1983B2888o98k2146k3767k023K3242K7082M384k4120l0013o223K4876L2435Q080
1996C3997k5434l4670r475K6005L6282J0592k6260l7417j1426K6295L7943J2116
2008C8548k6005l8163j2604K5274L7793J2853k4234l6822j3319K2706L5484J3495
$$ plain form
1921 26201 34185 8250 -27040 -36669 -10087 27174 38333 11383 -27421 -39569 -12432 27349
1933 27349 40332 13468 -26698 -40383 -13876 26227 40270 14671 -24746 -39024 -14760 23577
1945 23577 38119 15468 -21156 -35972 -15540 19180 34204 16138 -16181 -31371 -16336 13085
1957 13085 28623 16857 -9579 -25639 -17490 5710 22161 17869 -1926 -19039 -18950 -2472 15365
1970 15365 19317 6249 -12385 -20428 -10769 8674 20978 14529 -5807 -22115 -18735 2619 22888
1983 22888 22190 44 -23723 -25746 -2504 24578 28962 4842 -25171 -31394 -6518 25917 33997
1996 33997 8563 -26107 -35582 -9577 26705 37297 11037 -26380 -37806 -11511 26432 38548
2008 38548 12543 -25620 -38224 -12950 24843 37696 13462 -23360 -36679 -13973 21511 35006
2020C5006k0821l3769j3725J8593L1382J3995j5804k8976j4289J2676K6215J4775
2032B5258r315k3190j5285N700K0118J5877j794j6918j6541k211J3915J7346O162
2045A9122j0536j8229j0122P520J9212J4002m617k0184j7741J981K1095K1219
2057B2722N58k2125k4388k830K3016K7282M767k3804k9925o408K4373L2133P828
2070C3199k5080l3855r042K5385L4978J0015k5319l5908j0820K5173L6167J1338
2082C6231k4585l5982j1914K3709L5296J2318k2289l4233j2612K0598L2712J2882
2094C2131j8466l0671j3113J5854K8411J3713j3044k5932j3992R997K3062J4563
2106B2513o500k0126j5098K883J7092J5685R08j4170j6305m630J0978J7172Q398
$$ plain form
2020 35006 14185 -19584 -33309 -14716 16666 30661 14857 -14119 -28408 -15732 10483 25258
2032 25258 15943 -7247 -22532 -16832 3286 19163 17369 451 -16090 -18301 -4386 12960 19122
2045 19122 8586 -9643 -19765 -12245 6967 20969 16352 -3832 -21573 -19592 1503 22722
2057 22722 23280 1155 -23233 -26063 -3047 24235 29002 5198 -24727 -31135 -6762 25371 33199
2070 33199 8119 -25736 -34778 -9393 25585 35600 10281 -25627 -36447 -11274 24893 36231
2082 36231 11646 -24336 -36250 -12541 22755 35073 12784 -21449 -34061 -13463 19249 32131
2094 32131 13665 -17006 -30119 -14265 14146 27859 14815 -11117 -25109 -15112 7950 22513
2106 22513 16013 -4113 -19211 -16328 764 16449 17357 3187 -13118 -17748 -6770 10402 18800
2119A8800q058j8018j2175N345J8875J5632k700j9840j8959J81K0601K2286J890
2132B3860k1707k5090l746K2350K7615N505k3130k9824p003K3730L1726Q107k4214
2145H179l2823r089K4110L3885J0109k4147l4387j0582K3730L4520J0969k2954
2157A1520l3885j1375K1742L3049J1873k0264l1719j2145J8391K9993J2491j6088
2169A3583k7917j2858J3426K5650J3216j0733k2934j3600P473K0147J4030l958
2181A5525j7381j4742N00J4504J5300L066j1742j5993o689Q829J6927J0124o238
2194A1990j7763j3548L689J8659J6843j506j9496j9888o52K0582K2761K464k1402
2207B733k5272m066K2145K7573N550k2758k9343o869K3285L0820P951k3474l1858
$$ plain form
2119 18800 10742 -7276 -19451 -14106 4769 20401 17701 -2139 -21098 -20917 -316 21970 23860
2132 23860 2153 -22937 -26683 -4333 23282 28787 5657 -24167 -31170 -7440 24286 32393 8179
2145 8179 -24644 -33733 -9623 24262 34371 10224 -24163 -34745 -11015 23505 34474 11520
2157 11520 -22365 -33740 -11998 21051 32924 12660 -19059 -31204 -12813 17180 29671 13583
2169 13583 -14334 -27192 -13766 11884 25100 14367 -8567 -22167 -14694 5453 19483 15525
2181 15525 -1856 -16598 -16098 -1594 13706 16772 5030 -10963 -17652 -8823 8104 18228 11990
2194 11990 -5773 -19321 -15632 3027 19870 18364 -1132 -21020 -21672 -1090 21671 24135 2733
2207 2733 -22539 -26605 -4460 23113 28663 5905 -23438 -30307 -7022 23798 31749 8275 -23583
2220b3583q771K3498L2547R361k3098l2680j0056K2451L2416J0472k1333l1758
2232b0534j0941K0021L0632J1228j8350k9125j1594J6199K7287J1946j3952k5164
2244a2347j2334J1267K2737J2555q132k0229j3143N125J7538J3665j857j4851
2256fj4319j537J2238J5034M968r613j5836q238P149J6578J1666m697j7534j4781
2270a8928K458J8592J7816m69j9545k0511j248K0263K3113L021k1128k5367m419
2283b6352K1726K7345N665k2235k8910o717K2537K9963P631k2643l0758q464K2515
2296h697L1000R005k1901l0965r619K1010L0464J0000j9854k9589j0313J8373
2308a1086K8158J0697j6476k6610j1002J4280K4690J1404j1755k2577j1766R105
$$ plain form
2220 -23583 -32354 -8856 23691 33052 9954 -22726 -32782 -10331 22085 32557 11224 -20534
2232 -20534 -31475 -11454 19178 30406 12056 -17069 -28663 -12464 14823 26769 12817 -12347
2244 -12347 -24681 -13414 9323 21878 13746 -6483 -19626 -14501 3037 16702 14845 -6
2256 -6 -14325 -15862 -3624 11410 16378 6765 -9071 -17309 -10160 6418 18084 13387 -4147 -18928
2270 -18928 -16470 2122 19938 19469 -76 -20587 -21835 -1572 21541 24562 3434 -21933 -26352
2283 -26352 -4626 22719 28384 6149 -22761 -29478 -6941 23022 30653 8010 -22748 -31212 -8697
2296 -8697 22303 31308 9407 -21558 -31177 -10167 20297 30297 10443 -19146 -29459 -11086
2308 -11086 17072 27769 11293 -15317 -26319 -12039 12651 24055 12300 -10277 -22043 -12938
2320a2938K0182J2332o284j7581j2813L134J5247J3368K7j2556j3993l489J0284
2333e080J4760O678p813j5597r794N410J6540J2930l315j7485j5816J299J8389
2346A106J8540L73j9212k1052k141K0027K3299L570k0770k5295m894K1333K6845
2359B1729N926k1641k8145o845K1687K9045P634k1542k9490q325K1139K9513Q899
2372B9584k0305k9222r326J9250K8570R745j7986k7292j0088J6273K5922J0468
2384B5593j4306k4191j0731J2089K2212J1182r592k0052j1532O918J7758J1935
2396A7283m077j5343j2432R85J2957J3009K034j0534j3858n119Q213J4623Q147
2409A5888o061j5481j1107L930J6268J3971j981j7240j6715K08J8054J9268J376
$$ plain form
2320 -12938 7244 19576 13292 -4289 -17102 -13968 1279 14647 14674 2118 -11875 -15364 -5080
2333 -5080 9680 16358 8545 -7052 -16846 -11436 5104 18034 14719 -2766 -18582 -17283 1106
2346 1106 19646 20019 807 -20245 -22386 -2359 20940 24510 3740 -21555 -26449 -5116 21729
2359 21729 27655 6014 -22131 -28976 -7289 21756 29390 7848 -21642 -29967 -8828 20685 29584
2372 29584 9279 -19943 -29269 -10019 18551 28296 10310 -16982 -27070 -10797 15125 25593
2384 25593 11287 -12904 -23635 -11546 10666 21848 12256 -7796 -19328 -12410 5348 17283
2396 17283 13206 -2137 -14569 -13584 -627 12382 14416 3882 -9976 -15095 -6882 7741 15888
2409 15888 9827 -5654 -16761 -12831 3437 17408 15427 -1813 -18528 -18320 -266 19002 20378
2422B0378j8850k1449k868J9563K3485M137k0103k5104n326K0598K6389O296k0598
2435F548k7392p093K0548K7941P875k0173k8137q385J9475K8064Q884j8677k7400
2448a7922r323J7534K6508R663j5984k5264j0014J4189K3784J0224j2246k1900
2460a0751j0547R869J9929J0842p584j7709j1277M893J5489J1713k060j3295j2242
2473a2730q46J0978J2885L684q795j3584o616O611J4449R546m609j5206j2308
2486a6541K638J6157J4938q16j7024j7439o16J7770J9646K211j8450k1699l413
2499b2638J9009K3412M654j9448k4787n672J9715K5850O472j9610k6623p190J9417
2512g439K6853P832j9013k6739q355J8154K6396Q662j7121k5629r105J5813K4581
$$ plain form
2422 20378 1528 -19921 -22789 -3226 20259 24396 4293 -20811 -26137 -5539 20850 27146 6548
2435 6548 -20844 -27937 -7389 20552 28427 8254 -19883 -28268 -8793 19271 28155 9478 -17922
2448 -17922 -27245 -9711 16797 26460 10476 -14788 -24802 -10613 13171 23395 11149 -10751
2460 -10751 -21298 -11429 8500 19342 11758 -5951 -17228 -12335 3154 14867 12807 -488 -12730
2473 -12730 -13576 -2598 10287 13971 5176 -8408 -15024 -8413 6036 15582 10973 -4233 -16541
2486 -16541 -13903 2254 17192 16376 -648 -18087 -18703 -933 18713 20924 2474 -19225 -22638
2499 -22638 -3629 19783 24437 4989 -19798 -25470 -5755 20095 26567 6957 -19666 -26856 -7439
2512 -7439 19414 27246 8233 -18506 -26861 -8707 17689 26351 9230 -16399 -25504 -9691 14890
2525A4890R277j4306k3197r569J2501K1599R764j0555j9604j0127Q219J7737J0486
2538A7115n821j5667j0777L148J3519J1401n22j1347j1993k243R330J2678N102
2551A3923p178j3418p916N249J4248J0685l449j5057j3268J716J5992J5673j27
2564A7073j6741j7967j333J7525J9826K691j8141k1711l789J8571K3092M796j8834
2577E058k4328n581J8904K5008O307j8793k5411o981J8479K5462P421j7914k5189
2590a7558p765J7008K4557Q056j5763k3775q306J4522K2556Q582j2915k1095q806
2603b0702J1147J9382R229r052j7629r563O791J5841R980m414j3771j0457J786
2616a1432J1846J1052P83r801j1725l450P789J2454O205n891j3366q858M223J4109
$$ plain form
2525 14890 24167 9861 -13336 -22905 -10404 11195 20959 10404 -9200 -19327 -11108 6629 17115
2538 17115 11294 -4373 -15150 -12002 1517 12918 12396 1049 -10944 -13187 -3857 8821 13923
2551 13923 6745 -6673 -14589 -9340 4908 15593 12144 -2913 -16181 -14465 1527 17200 17073
2564 17073 332 -17635 -18968 -1443 18383 21074 2933 -18778 -22567 -3996 19096 23892 5058
2577 5058 -19270 -24851 -5947 19061 25368 6575 -18836 -25817 -7338 18124 25545 7631 -17558
2590 -17558 -25323 -8315 16242 24298 8535 -15240 -23546 -9024 13532 22114 9199 -11896 -20702
2603 -20702 -9555 9827 19056 10004 -7625 -17188 -10397 5444 15424 11010 -2761 -13218 -11432
2616 -11432 414 11466 12249 2448 -9277 -12727 -4938 7516 13721 7830 -5536 -14394 -10171 3938
2630C938J1357k461j5052j3824R00J5721J6167M94j6655j8153j756J7218J9962
2643A7856K850j7710k1478l862J8047K2690M695j8199k3463n514J8203K4013O120
2656B4248j7909k4147o650J7410K4155P072j6721k3567p382J5725K2831P677j4462
2669H280k1778p913J2992K0584Q175j1343j9119q468R519J7437Q827p552j5650
2682f009r211N253J3822R640k791j2126j0157L07J0137J0778K300q299j1632m830
2696a2818O550J2350P299m748j3303r784L162J4035J2296j706j4875j4449K77
2709a5714J5703J6469J015j6386j8244k053J6932J9821L035j7347k0968l851J7573
2722d015K1862M644j7573k2545n186J7526K2797N755j7137k2814o039J6338K2488
$$ plain form
2630 3938 15295 12834 -2218 -16042 -15142 579 16746 17240 585 -17568 -19324 -2106 17856
2643 17856 20706 2996 -18482 -22344 -4297 18393 23088 4889 -18574 -24088 -5885 18128 24248
2656 24248 6339 -17808 -24458 -7048 17107 24179 7458 -16109 -23491 -7766 15065 22742 8280
2669 8280 -13498 -21411 -8419 12165 20340 8997 -10122 -18590 -9071 8366 17193 9641 -6009
2682 -6009 -15220 -9967 3855 13495 10704 -1422 -11579 -11272 -1135 9643 11943 3644 -7988 -12818
2696 -12818 -6268 6082 13381 8633 -4670 -14454 -11292 2743 15039 13333 -1542 -15991 -15714
2709 -15714 -11 16458 17473 1087 -17157 -19210 -2278 17543 20578 3231 -17737 -21588 -4015
2722 -4015 17847 22491 4918 -17627 -22813 -5287 17510 23265 6128 -16686 -22725 -6387 16101
2735A6101O469j5566k1943o781J4607K1024O978j3339j9928p388J1888J8638P601
2748A8361j0162j7348p838Q328J5520Q249o055j3959q871L840J2341R412j602
2761A0216j0492r974q81Q746J0698L390p006j1497n871N431J2353Q366l882j3147
2775c550j0669K404J4067J2904j151j4811j4798j24J5488J6604J301j6073j8240
2788a6648k217J6673J9352L033j6894k0449l654J6918K1128M322j6984k1547m787
2801b1754J6815K1547N092j6289k1366n508J5483K0894N917j4699k0259o087J3591
2814f623J9235O347j2190j8167o702J0696J6950P037q957j5410p433O935J3945
2827E663P955m822j2418q440K597J0815R179l14r105r858k095P598J0616M508
$$ plain form
2735 16101 22570 7004 -14939 -21720 -7113 13911 20889 7550 -12378 -19766 -7878 10760 18361
2748 18361 8199 -9149 -16987 -8659 6861 15110 9055 -4904 -13775 -9935 2406 11818 10216
2761 10216 -276 -10250 -11131 -2385 8313 11703 4697 -6800 -12671 -7240 5113 13479 9597 -3550
2775 -3550 -14219 -11815 2252 15156 14005 -806 -15604 -15728 -240 16364 17665 1592 -16648
2788 -16648 -18865 -2192 17160 20193 3299 -17150 -20804 -3886 17242 21564 4580 -16967 -21754
2801 -21754 -4939 16608 21700 5411 -15955 -21463 -5980 14914 20831 6132 -14127 -20214 -6623
2814 -6623 12612 18959 6769 -11398 -18100 -7404 9546 16583 7626 -7784 -15217 -8282 5663
2827 5663 13618 8796 -3622 -12062 -9465 1350 10529 10215 1110 -8748 -10843 -3245 7371 11879
2841A1879o064j1428o846M515J2394R070l127j3284j1250J888J3997J3275p62
2854A4257j4738j5079l66J5353J6648J288j6015j7920k037J6299J8954K714j6546
2867B812j9634l361J6547K0129L853j6352k0376m254J5981K0269M568j5336j9887
2880a5041m951J4644J9357N198j3571j8525n501J2370J7666N802j0898j6527o168
2893a6145R374J5163O666p499j3921p142N638J2403P773l560j0923q361J225R400
2907I1R158R36p983r881l202O418J0680N468m968j1531p831L642J2446R820k438
2922A0825j3278j1801J339J3983J3511j29j4773j5089n76J5215J6455J297j5628
2935A351j7422k050J5904J8409K503j6015j8854k902J5915J9108L332j5553j9207
$$ plain form
2841 11879 5815 -5613 -12459 -7944 4450 13520 10393 -2891 -14141 -12253 1744 15019 14257
2854 14257 -481 -15560 -15926 -573 16075 17363 1348 -16572 -18609 -2310 16644 19358 2812
2867 2812 -16822 -20183 -3636 16493 20346 3994 -16382 -20636 -4655 15614 20182 4846 -15041
2880 -15041 -19992 -5348 14009 19207 5636 -12889 -18390 -6020 11646 17448 6550 -9977 -16145
2893 -16145 -6771 8392 15058 7559 -6362 -13504 -7866 4537 12310 8750 -2173 -10534 -9309 91
2907 91 9249 10185 2202 -7679 -10881 -4463 6217 11685 6717 -4814 -12645 -9003 3443 13263 10825
2922 10825 -2453 -14254 -12915 1068 14579 14450 -323 -15412 -15988 -773 15682 16979 1351
2935 1351 -16071 -18121 -2217 16192 18695 2680 -16174 -19076 -3161 15947 19279 3726 -15481
2948a5481l690J5292J8913L937j4503j8429m373J3700J7835M616j2579j6952n125
2961a6839J1379J5982N359r761j4926n838Q101J3664O380o332j2386p010M345
2974g882J1011P628k252r628q348m3Q298R205K022o931r865m291N546J0752O466
2989A1688m279j1581q524L132J2450J0381j944j3199j2104J024J3831J3711j14
3002A4472j4419j5031n46J4843J6055J341j5238j6840j927J5471J7518K257j5342
3015B614j7939k683J5150J8006L098j4851j7940l423J4273J7545L743j3492j7043
3028a2942m204J2578J6288M549j1289j5555m922R904J4548N332q376j3442n843
3041a3374O622J2303O463m872j1026p011K810R801P759q48q379q549j111P133
$$ plain form
2948 -15481 -19171 -3879 15034 18971 4468 -13961 -18334 -4634 13201 17817 5238 -11714 -16839
2961 -16839 -5460 10522 15881 6120 -8806 -14644 -6543 7121 13501 7169 -5217 -12227 -7882
2974 -7882 3129 10757 8505 -1123 -9471 -9514 -1216 7989 10011 3080 -6785 -11076 -5530 5222 11688
2989 11688 7409 -4172 -12696 -9564 2886 13267 11323 -1876 -13980 -12956 875 14586 14472
3002 14472 53 -14978 -15524 -681 15374 16715 1477 -15363 -17290 -1819 15699 17956 2614
3015 2614 -15325 -18008 -2858 15148 18246 3395 -14545 -17968 -3695 13850 17593 4101 -12942
3028 -12942 -17146 -4568 11720 16269 4980 -10575 -15497 -5593 8955 14287 5911 -7531 -13374
3041 -13374 -6752 5551 12014 7142 -3884 -10895 -8085 1716 9475 8627 248 -8301 -9412 -2279
3055b279R218L274n854r939n332M631J0817P266l452j1607r068K425J2351J0802
3069A3253j605j3030j2276P15J3584J3638J9j4026j4811o16J4437J5599J157j4671
3083A367j6314j674J4749J6679K004j4589j6893k461J4395J6810K754j3964j6559
3096a3696l061J3289J6165L442j2435j5575l771J1322J4939M238j0178j3997m676
3109a3994Q726J3059N215p120j2017n693N353J0947O438l602r808p061J727Q629
3123G99P747J64p295q492k316O209R294M146n088j0053o041L958J0920P698l021
3138H629j1583r362K069J2308J0830j413j2789j2218O53J3298J3317pj3772j4197
3152a4237m06J3901J4974R99j4176j5483j394J4178J5685J809j3915j5834k002
$$ plain form
3055 -2279 6939 10213 4359 -5580 -10912 -6281 4536 11802 8350 -3257 -12325 -9900 2451 13253
3069 13253 11648 -1382 -13658 -12943 641 14279 14298 272 -14539 -15155 -718 14881 16038 1367
3083 1367 -14947 -16621 -1872 14807 16811 2222 -14671 -17132 -2737 14073 16827 2863 -13696
3096 -13696 -16757 -3468 12697 16139 3704 -11871 -15642 -4320 10619 14857 4679 -9318 -13994
3109 -13994 -5268 7791 13006 5886 -6131 -11824 -6471 4476 10914 7312 -2496 -9557 -7830 799
3123 799 8546 8710 1415 -7077 -9393 -3184 6110 10256 5168 -4885 -10926 -6968 3952 11650 8629
3138 8629 -2954 -12316 -10247 2061 12891 11478 -1311 -13529 -12876 422 13739 13732 -40 -14237
3152 -14237 -14643 -742 14232 15231 1055 -14428 -15822 -1644 14041 15850 1935 -13899 -15901
3165a5901J3489J5683K480j2960j5374k793J2252J4946L218j1309j4321l658J0192
3178d056J3582M067q803j2814m549P398J1781N242n892j0825n847M149R876O329
3192I638k395q729p022M81P667P752J337o510q566l165N416R343M829m374j0102
3207d400o581L494J0800Q126k579j1517r557J823J2150J0838j166j2499j2009
3220a3077N50J3042J2897n2j3319j3640m42J3637J4218P71j3539j4622j213J3480
3234a309J4838J497j3162j4717j932J2690J4598K222j2019j4243k704J1167J3758
3247A0684L093j0155j3103l588Q873J2474M017p647j1541m654O112J0707N219
3260A0491m628r726n782K946Q652O515j223p685p154m47O605P963K127n622q589
$$ plain form
3165 -15901 -2412 13271 15751 2791 -12583 -15376 -3124 11822 15040 3731 -10590 -14248 -4056
3178 -4056 9526 13593 4790 -8024 -12573 -5175 6606 11848 5956 -4869 -10716 -6567 3309 9638
3192 9638 7243 -1486 -8508 -8027 -360 7392 8729 2219 -6347 -9512 -4096 5247 10076 5702 -4400
3207 -4400 -10981 -7487 3313 11439 8860 -2657 -12214 -10391 1759 12597 11431 -1068 -13077
3220 -13077 -12527 515 13412 13360 41 -13599 -14041 -404 13814 14585 1046 -13576 -14789 -1309
3234 -1309 13529 15026 1864 -12853 -14785 -2095 12503 14725 2706 -11537 -14241 -3074 10684
3247 10684 13777 3622 -9481 -13069 -4196 8278 12295 4648 -6893 -11547 -5435 5272 10491
3260 10491 5863 -3863 -9645 -6699 1953 8468 7245 -440 -7594 -8041 -1436 6527 8654 3032 -5557
3275e557l885M748R276N511l817r978o975L003J0679Q356k221j1228r714J633
3289a0169J1778J0811j004j2300j1778N66J2682J2435n6j2835j3092m37J3010
3302c89J3497P53j2983j3811j086J2775J3838J362j2322j3756j830J1784J3506
3315A1338K173j0972j3226k597J0140J2588L115r046j2043l524P909J1200M135
3328A1190o479j0462m688N037R582N273l500q580n936J959P711O547k64o828p211
3343f649j228N869P890K802m965q540m476M187R329N783l328r939p248K765J0474
3358B726Q418k065j1021r664J449J1625J0505r06j2045j1415N74J2220J2055j91
3372A2265j2375j2542k52J2410J2846N86j2245j3046r22J1963J3001J361j1401
$$ plain form
3275 -5557 -9442 -4694 4582 10093 6276 -3702 -10677 -7674 3005 11361 9140 -2088 -11802 -10169
3289 -10169 1609 12420 11416 -884 -12662 -12096 586 13021 12965 130 -12962 -13399 -389
3302 -389 13108 13861 878 -12933 -14019 -1244 12594 13956 1634 -12122 -13952 -2168 11338
3315 11338 13511 2539 -10687 -13284 -3144 9444 12559 3513 -8530 -12054 -4145 7055 11190
3328 11190 4711 -5751 -10439 -5402 4180 9453 5953 -2627 -8563 -6604 1107 7654 7390 562 -6649
3343 -6649 -7877 -2008 5882 8684 3719 -4821 -9297 -5110 4219 10002 6674 -3265 -10513 -7748 2726
3358 2726 11144 9079 -1942 -11606 -10157 1468 11973 11067 -978 -12393 -11819 401 12456 12265
3372 12265 -110 -12652 -12904 -494 12352 12938 693 -12353 -13275 -1312 11689 13050 1649
3385A649j2933j718J0826J2584K197r980j2103k675Q967J1690L127p859j0955
3398g183l584O571J0167M298n276r472m783L891Q582N368k428p697n944Q85O757
3413A52O541O91n969p231k119N087P828L550m312q547m919L603R088O280k871
3428F852r778p381K201J0283Q566j752j0751r484J030J1262J0474p73j1448j1141
3442a1840L45J1648J1753P3j1739j2054m65J1689J2278Q20j1422j2370j110J1049
3456a345J2221J516j0515j1951j834R758J1496K300q769j1194k769P948J0481
3469G343L159o762r885l688N526R144M280m294q358m828K930P533N254j400o789
3484h35n991J56N986O565J244n193p134k701M436P781M008l706q380n262L038
$$ plain form
3385 1649 -11284 -13002 -2176 10408 12605 2625 -9478 -12153 -3186 8504 11631 3772 -7183
3398 -7183 -10767 -4196 5971 10269 4993 -4479 -9262 -5371 3211 8579 6151 -1546 -7490 -6605 152
3413 152 6693 7384 1415 -5816 -7935 -2848 4980 8530 4218 -4329 -9248 -5645 3443 9723 6852
3428 6852 -2926 -10307 -8106 2177 10743 8991 -1760 -11244 -10214 1048 11522 10749 -699 -11840
3442 -11840 -11495 153 11906 11979 240 -11814 -12279 -590 11688 12508 1086 -11284 -12394 -1345
3456 -1345 10876 12392 1877 -10074 -11908 -2150 9346 11646 2877 -8317 -11086 -3138 7343
3469 7343 10502 3740 -6145 -9833 -4307 4837 9117 4823 -3535 -8363 -5433 2100 7354 5954 -835
3484 -835 -6826 -6670 -684 5881 7125 1932 -5202 -7903 -3467 4314 8322 4616 -3764 -9026 -5988
3499e988R004O491k469r458p688K005J0049Q578j438j0480r369J053J0732J0128
3513A1150n36j1072j0729K44J1195J1131P0j1126j1402n25J1109J1524P72j0749
3527A056j1546j151J0240J1290J487r561j1083j781Q728J0698K188p937j0197
3540g569k610O836R559L221n815q927l686M707Q187M143l363p416m701K058O732
3555A356N266p64n948n864n24N258O395J974m562p077l144L885P737M336l281
3570E043q262n523K732Q808O687k222r424p628J849R767Q444j342j0127r265Q67
3585i596J0489R840n33j0739j0282K20J0666J0693M6j0575j0882m20J0303J0976
3599A0206O96r993j0754r96R309J0560J516q760j0240j917Q057R757K257o980
$$ plain form
3499 -5988 3016 9507 7038 -2420 -10108 -8103 1946 10524 9086 -1394 -10763 -9710 1022 11150
3513 11150 10614 -458 -11187 -10943 252 11383 11453 327 -11075 -11600 -491 11033 11805 1056
3527 1056 -10490 -11641 -1401 9889 11376 1815 -9268 -11049 -2321 8377 10565 2628 -7569
3540 -7569 -10179 -3343 6216 9437 3622 -5305 -8991 -4284 3903 8046 4683 -2733 -7434 -5376 1356
3555 1356 6622 5858 -90 -5954 -6478 -1220 5175 7149 2587 -4490 -7634 -3749 3988 8324 5043
3570 5043 -3219 -8742 -6010 2798 9485 7263 -2161 -9789 -7940 1827 10271 8929 -1198 -10463 -9596
3585 -9596 893 10733 10200 -539 -10821 -10601 65 10758 10804 229 -10653 -11073 -770 10206
3599 10206 10902 909 -9845 -10841 -1532 9028 10544 1784 -8456 -10373 -2316 7441 9698 2718
3613B718r272k684O037Q598L240m887q039l525L580P401M175k537o556m735J255
3628e231N903N337j07n247n789j210M563O394K492l941p090l655L396P591M821
3643H227k919q225n845K386Q793O788j984r234p688J620R494Q473j129r945r085
3658a0273P99J0144R604m81j0237r974J51J0206J0224J97j0106j0250m22R794
3672f24J0185P17r202j0065j064Q665R772J418p900r398j757P106Q860K218o177
3687B754q388k641N110P838L167m120p114l690K903O529M142j729n929m683O06
3702e245N179N226O90m647n905j823M103O484K921l580p061l982K983P596N168
3717H107k612q176o073K216Q712O826j722r046p668J352R489Q328j078r627q892
$$ plain form
3613 2718 -6554 -9238 -3201 5397 8637 3750 -4289 -7814 -4234 3167 7342 4805 -1751 -6486 -5231
3628 -5231 672 6009 5902 655 -5134 -6344 -1781 4613 7105 3164 -3926 -7581 -4185 3406 8227
3643 8227 5308 -2917 -8762 -6376 2417 9205 7221 -2013 -9701 -8081 1413 9886 8757 -1188 -10273
3658 -10273 -9474 670 10274 9793 -444 -10418 -10267 -61 10163 10360 254 -9996 -10418 -624
3672 -624 9561 10278 1076 -8989 -10053 -1388 8384 9802 1902 -7496 -9253 -2147 6713 8931 2754
3687 2754 -5634 -8275 -3165 4673 7840 3720 -3394 -7084 -4181 2348 6490 4761 -1168 -5851 -5245
3702 -5245 -66 5160 5850 1203 -4702 -6525 -2422 4062 6983 3403 -3658 -7640 -4657 2939 8107
3717 8107 5495 -2681 -8754 -6538 2174 9000 7278 -1768 -9436 -8084 1405 9733 8655 -972 -9864
3732i864P00R812R270l35r839r488L6R759R714J38r405r673m52Q942R562P98q567
3749A108r380j001P833Q968J479p145q586j805O222Q069K281n370p557k683M336
3764c231O932L104l178o382l683K170N752M190j011n205m725j31M582N377J284
3779E845m033n950k329L554O504L468l057p126m431K651P526N503k218q041o269
3794h403J766Q542P087j469q847p707J062R084Q276p37r238q739M19R271R047
3809I414j77r290r161q9Q971R274K79q719r042o78Q240Q901R58p739q582j211
3825h651O998Q152J610o216p858j845N437P300K323m531o729k787L556O200L294
3840F253k466n687l728J350N134M299k41m599m882p84M128N402J864l546o056
$$ plain form
3732 -9864 -9164 648 9918 9583 -256 -9744 -9708 51 9765 9903 498 -9175 -9627 -685 8877 9675 1108
3749 1108 -8272 -9273 -1440 7528 9007 1862 -6724 -8529 -2307 5762 8043 2673 -4884 -7567 -3231
3764 -3231 3701 6805 3627 -2755 -6438 -4268 1484 5674 4663 -542 -5267 -5398 -816 4561 5845
3779 5845 1812 -4138 -6467 -2913 3591 7059 4002 -3124 -7555 -4904 2622 8125 5907 -2134 -8403
3794 -8403 -6637 1905 8992 7523 -1324 -9031 -7969 1115 9391 8654 -584 -9323 -8904 367 9414
3809 9414 9237 -53 -9214 -9303 -332 8942 9221 502 -8540 -9218 -978 7923 8881 1142 -7440 -8651
3825 -8651 -1653 6499 8109 1893 -5965 -7810 -2373 4927 7250 2719 -4010 -6797 -3241 2959 6253
3840 6253 3787 -1900 -5628 -4278 856 5155 4914 315 -4567 -5351 -1223 4179 6043 2497 -3559
3855c559k869L112O533L816k617p023m938K301P547N683j819p997o544J567Q317
3870A510P093j172q602p692Q23Q825Q158o27q832q470L09Q784Q636Lq715q670
3886h639j72Q375Q659M89q073q486p37P550Q239J075o964p883j290O247P476J637
3902G503n424p052j992M614O571K359l650o092k836K686N578L422j716n081l957
3917e067P38M496M480K93m071m987j389L683N457K346l150o016l417K744O556
3932B696M205k246p150m973J920P415N906j607p833o475J263Q103P047r70q262
3947i61p620Q55Q374P876n10q382q083K21Q341Q212j5q057q178k04P796P936N40
3964H141p303p871p79O842P571J005o152p239j336N448O792J708m653o469k072
$$ plain form
3855 -3559 -6428 -3316 3217 7033 4416 -2607 -7545 -5244 2303 7986 6167 -1830 -8374 -6807 1510
3870 1510 8603 7431 -1171 -8863 -8040 785 8943 8316 -516 -8986 -8677 107 8743 8746 31 -8639
3886 -8639 -8811 -436 8223 8712 639 -7847 -8584 -1034 7205 8280 1316 -6567 -7857 -1610 5866 7503
3902 7503 2079 -4973 -6965 -2351 4220 6579 2929 -3163 -5999 -3313 2265 5687 3971 -1110 -5067
3917 -5067 -4329 167 4647 4940 869 -4118 -5507 -1824 3633 5979 2829 -3187 -6604 -3860 2696
3932 2696 6901 4655 -2495 -7468 -5548 1867 7773 6166 -1667 -8142 -6879 1224 8271 7301 -961
3947 -961 -8581 -7726 648 8524 8014 -368 -8451 -8230 111 8323 8308 251 -7927 -8131 -335 7601 8141
3964 8141 838 -7033 -7812 -970 6601 7606 1454 -5785 -7121 -1673 5119 6827 2174 -4295 -6367
3979f367L807N962K506k926n493l006J987N038L490j053m602l979P7M043M633
3994D117Q78l621n168j815L169N729K726k779o159l675K514O595M465k140o963
4009b127n253J796P440N853j505p620o482J254P883O915r83q006p268P45Q038
4024F80P482m70q031p583K68P794P637jp546p622k70P222P384N63o747p186q38
4041g264O173O883J102n532o546j434M773O183J844l986n872k238L170N406K695
4056E357k204m981l244J366M564L671l28m136m259n27L749M746J417l317n194
4071c320k342K939N753L206k601o171l993K242O592M667j956o968n293J738P150
4086A643N901j351p420o411J049P661O653p66p754o931O02P585P071l24p527p217
$$ plain form
3979 -6367 -2560 3402 5908 2982 -2511 -5517 -3530 1508 4998 3945 -657 -4636 -4559 -516 4117
3994 4117 4995 1374 -3794 -5609 -2440 3289 6015 3236 -2923 -6598 -4084 2511 6976 4836 -2127
4009 -2127 -7380 -5584 1856 7709 6204 -1416 -7898 -6644 1239 8154 7171 -835 -8103 -7358 680
4024 680 8162 7692 -339 -7922 -7654 140 7777 7776 230 -7392 -7662 -440 6944 7507 760 -6426 -7264
4041 -7264 -1091 5792 6894 1362 -5184 -6618 -1845 4338 6182 2196 -3676 -5914 -2744 2662 5357
4056 5357 3153 -1828 -5072 -3706 858 4529 4201 65 -4194 -4721 -972 3774 5191 1874 -3320
4071 -3320 -5662 -2723 3030 6236 3635 -2536 -6529 -4287 2305 6972 5016 -1952 -7245 -5507 1643
4086 1643 7544 6193 -1227 -7638 -6589 1072 7725 6959 -795 -7726 -7124 461 7532 7208 -319 -7536
4102g536J52P342P191j3o937p082l05O584O848O34o069o723q23N552O428J083
4118F326m766o097j482M094N644K029l307n408k381K500M979K841j554m563l433
4133d578Q46M170L908Ql713m467r02L391M880J787l013n439k620K730N724L479
4149F191k423o251m038K072O539M768j829o878n296J560P045N769j379p152o159
4164g461J098P385O366r21p318o534N55P353O641l83p060o665J48O764O650J51
4180F769o420o606k40N940O434N93n478o184q97M902N872J296m263n555j811L602
4196b046N315K094k734m943k543J827M612K982j078m180l520K05L833M097N22
4211D443l575m466j419L239M973K092k824n429k809K475N769L653k214o220m173
$$ plain form
4102 -7536 -7384 -42 7149 7136 199 -6883 -7188 -604 6244 6878 809 -5914 -6737 -1185 5243 6326
4118 6326 1560 -4537 -6019 -1925 3719 5748 2441 -2967 -5348 -2848 2131 4972 3418 -1145 -4578
4133 -4578 -3732 438 4346 4354 641 -3826 -4728 -1337 3543 5330 2317 -3122 -5742 -3012 2712 6191
4149 6191 3768 -2483 -6521 -4449 2090 6858 5029 -1849 -7145 -5585 1460 7229 5850 -1302 -7461
4164 -7461 -6363 1022 7388 6467 -851 -7385 -6830 523 7164 6781 -279 -6944 -6796 -32 6618 6769
4180 6769 349 -6257 -6497 -557 5877 6470 992 -5192 -6089 -1187 4685 5981 1718 -3837 -5648 -2046
4196 -2046 3269 5363 2629 -2314 -4857 -3030 1582 4564 3486 -694 -4214 -4009 -176 3921 4443
4211 4443 868 -3598 -5017 -1778 3195 5287 2463 -2966 -5775 -3300 2469 6122 3908 -2312 -6485
4226f485J927O496M706j703o610n186J418O884N594j254o948n877J032P013O030
4241G037p68o935o178N72O774O268l16o569o308J28O268O190J61n919o053m13
4257f061N399N895P43m885n702j156M318N446J411l576n190j827K934M790K332
4272D871k126m621k773J373M307L172o13l892l624k20L538M202R16l192m598j689
4288d969K827N022K429k488n414l105K310N776L679k063n989m228J782O213M723
4303F505j478o413n163J327O533N391j044o639n625Q16O599N811p03o443n898
4318f424M16O358N854j98o033n933l3N659N889K77n322n747n51M858N508R52m297
4335A233n428j221L683N082J732l076m827k079K414M504K554j678m186k928Q67
$$ plain form
4226 -6485 -4558 1938 6644 4941 -1669 -6855 -5437 1447 7041 5787 -1161 -7038 -6006 1007 7037
4241 7037 6269 -666 -6844 -6272 502 6770 6454 -115 -6423 -6295 -27 6163 6324 405 -5648 -6061
4257 -6061 -662 5233 5976 1091 -4611 -5767 -1449 3997 5408 1832 -3358 -5185 -2251 2539 4871
4272 4871 2745 -1876 -4649 -3276 1031 4203 3590 -302 -3926 -4146 -608 3594 4510 1318 -3280 -4969
4288 -4969 -2142 2880 5309 2821 -2593 -5698 -3388 2388 6067 4004 -1985 -6213 -4431 1782 6505
4303 6505 5027 -1386 -6549 -5222 1311 6702 5658 -981 -6606 -5790 809 6620 5917 -526 -6424
4318 -6424 -6008 350 6204 6006 -27 -5960 -5993 -334 5555 5832 510 -5237 -5788 -930 4578 5530 1233
4335 1233 -4195 -5416 -1733 3349 5081 2005 -2822 -4901 -2487 2017 4571 2893 -1293 -4221 -3354
4350c354L941L483k44l611l825n84L328M225J303k982m604j936K591M973K684
4365E388k393n367l224K137N640L769j902n976m102J568O209M480j501o176m929
4380f379J302O249N182j111o259n371Q51O243N456n99o124n522L53N866N640j19
4396E658n619n574j36N293N464L83m806n381p09M405N263J007l863m904j470L161
4412a828M802J847k556m590k112J920M263K524j208l937l071O08L556L492J38
4427C848l282l915q95L033M280J466k671m671k147K496M987K690k231n363l186
4442e561K104N427L661j720n770m066J652N760M474j421n917m738J230N998N066
4457F179j121n999n059P81N900N194n51n683n277K91N557N279j49n136n266k06
$$ plain form
4350 -3354 587 4070 3826 215 -3610 -4194 -866 3359 4662 1680 -2924 -4860 -2269 2704 5388
4365 5388 2995 -2372 -5596 -3459 2181 5950 4048 -1928 -6030 -4462 1747 6227 4726 -1450 -6379
4380 -6379 -5077 1172 6354 5243 -1016 -6387 -5536 707 6163 5564 -560 -6082 -5729 137 5777 5658
4396 5658 39 -5535 -5671 -378 5086 5469 663 -4718 -5427 -1022 4241 5248 1385 -3519 -4989 -1828
4412 -1828 2974 4821 2265 -2325 -4437 -2517 1746 4270 3062 -875 -3946 -3338 218 3710 3848
4427 3848 566 -3349 -4244 -1211 3069 4535 1864 -2807 -4954 -2458 2529 5219 2988 -2375 -5561
4442 -5561 -3457 1970 5631 3911 -1859 -5925 -4273 1487 5961 4540 -1377 -6115 -4885 1113 6179
4457 6179 5058 -941 -6000 -5219 681 5875 5324 -359 -5636 -5345 212 5491 5342 206 -5060 -5266
4473e266M863N142N58m465m991q65L914M877J135l420m688j470K789M391J941
4488D445k201m200k332J612L870K728r17l605l117K21L301L566M32l113l894j064
4504d268K881M196J725k644m614k185K424M851K777k161n136l207J939N369L590
4519E537j741n513l948J525N685M298j354n763m499J169N819M701j030n777m804
4534e695Q39N545M898m90n442n012L00N169M953p9m816m910k53M463M794O32m121
4551G75m617r01L479M500J273k974m313j623K426M122J936j802l880k387J282
4566b704L582K730n30l409l072n0L095L536O24k836l888j202K657M176J754k329
4582B134m602k332K265M827K763k047n060l146J884N222L457j737n271l870J564
$$ plain form
4473 -5266 -403 4739 5297 832 -4159 -5024 -1110 3767 4902 1482 -3206 -4676 -1887 2504 4445
4488 4445 2244 -1956 -4288 -2676 1194 3922 3005 -600 -3717 -3496 -195 3371 3803 690 -3204 -4268
4504 -4268 -1387 2809 4534 1890 -2724 -4909 -2485 2366 5143 2982 -2154 -5361 -3422 1947 5537
4519 5537 3796 -1717 -5665 -4140 1545 5843 4489 -1274 -5773 -4604 1215 5916 4886 -891 -5695
4534 -5695 -4856 689 5587 5097 -345 -5357 -5057 112 5065 4986 170 -4740 -4993 -530 4264 4896 775
4551 775 -3842 -4743 -1264 3236 4509 1535 -2778 -4401 -1975 2147 4083 2281 -1599 -3986 -2704
4566 -2704 878 3608 3078 -331 -3403 -3453 -358 3178 3802 966 -2922 -4124 -1467 2709 4463 2134
4582 2134 -2468 -4800 -2535 2292 5055 3008 -2052 -5198 -3314 1908 5365 3628 -1643 -5513 -3949
4597c949N408M186j438n513m309J162N479M525r43n485m538O41N316M663n00n046
4613c41m657J96M758M636P8m380m626l56M064M399O77l555m269r56L067M121J339
4630D195k525l963j682K004L767J980j321l619k372Q54L215K853k18l089l126
4645c047l83K874L550P86k658l826j429K477M192J813k245m423k359K059M782
4660B163K709j941m920l114J761N084L405j553n219l725J475N286L894j244n284
4675a223m122J015N296M237p96n192m246N66M950M357m04m662m325J40M334M428
4691D353J17m106m141m25L497M202P30l209l931j068K705L728J479k207l656j719
4707c651J616L488K013j040l269k423M70L010K786J31k905l151o10K662L569J018
$$ plain form
4597 -3949 1459 5645 4207 -1306 -5615 -4453 1026 5551 4608 -877 -5415 -4774 542 5205 4705 -341
4613 -341 -4998 -4802 -44 4592 4670 290 -4336 -4692 -628 3771 4448 893 -3376 -4332 -1265 2856 4195
4630 4195 1670 -2293 -3975 -1971 1796 3776 2455 -1164 -3536 -2682 533 3386 3168 79 -3047
4645 -3047 -3430 -556 2994 3780 1122 -2704 -4133 -1656 2536 4349 2104 -2319 -4678 -2619 2163
4660 2163 4872 2931 -1989 -5103 -3342 1742 5147 3594 -1625 -5350 -3875 1411 5305 4061 -1223
4675 -1223 -5345 -4330 966 5203 4407 -785 -5031 -4465 485 4842 4438 -224 -4549 -4409 -75 4353
4691 4353 4470 364 -3777 -4202 -705 3497 4227 1018 -2913 -3981 -1276 2452 3931 1724 -1932 -3651
4707 -3651 -2035 1453 3466 2426 -843 -3266 -2796 214 3000 3131 226 -2925 -3535 -873 2696 3714
4723C714k458l829j509K265M068J991k049m373k413J988M613K716j751m743l196
4738d966J629N022L312j423m958l638J276N040L823j081n075l956Q99M928M100
4753D932o62m797m194N48M518M136j85m352m098M8L914M074K26l597l981n51L079
4770i42L905Q87k647l744j229K219L514J535j767l310j820J183L183K140o89k964
4786e46k472J33K834K839L39k551l332o67K467L409J325k279l797j711K145M085
4802B221K057j933m318k413J788M472K829j680m727l031J544M789L219j361m747
4817a291l506J223M692L700j004m719l800P60M701L768n91m405l879L20M158L907
4833D034j47l826l864j27L505L839L16l129l668n87K742L465R81k283l391j267
$$ plain form
4723 3714 1256 -2573 -4082 -1817 2251 4242 2193 -2180 -4593 -2605 2008 4724 2973 -1770 -4966
4738 -4966 -3337 1685 4997 3574 -1384 -5022 -3746 1294 5117 4036 -1039 -4995 -4096 832 4932
4753 4932 4270 -527 -4721 -4173 345 4481 4296 -56 -4154 -4106 -192 3882 4108 511 -3470 -4021 -942
4770 -942 2963 3850 1203 -2541 -3770 -1551 1963 3498 1731 -1579 -3399 -2216 967 3107 2418 -546
4786 -546 -3018 -2885 -51 2788 3127 576 -2756 -3423 -956 2453 3778 1499 -2298 -4009 -1864 2221
4802 2221 4278 2345 -1973 -4386 -2598 1874 4703 3023 -1704 -4735 -3191 1598 4817 3456 -1291
4817 -1291 -4797 -3574 1118 4818 3814 -905 -4705 -3945 756 4524 3933 -472 -4351 -4031 127 4034
4833 4034 3887 61 -3803 -3930 -425 3414 3730 601 -3067 -3654 -912 2553 3534 1251 -2140 -3407
4849c407J845L172J673j444k965j958R42K828K253l83k682k615p3K591K832O49
4865C258k437l174j068K201L549J478k117l774j865J896M077K112j732m220k532
4880d348J624M415K755j526m529l012J397M539L281j202m584l480J142M538L485
4895D495r04m417l582O96M295L524m55m050l636L91L714L613m6l489l522j30L122
4912c81L432M48k763l338p11K331L220J032j899l087j287J472K889J699j079k816
4928h38j964O03K623K329k14k476k659k53K356K946O69k246l185j142K168L463
4944B180J437k015l720j814J901L993K046j693m197k393J697M225K700j565m305
4959a523k917J449M351K957j162m352l110J084M219L235p95m138l365P39L897
$$ plain form
4849 -3407 -1562 1610 3283 1839 -1126 -3084 -2142 686 2939 2556 -126 -2741 -2814 -223 2609 3258
4865 3258 821 -2353 -3421 -1220 2329 3807 1690 -2084 -3949 -2053 2024 4136 2404 -1816 -4348
4880 -4348 -2724 1691 4446 2920 -1609 -4621 -3224 1315 4596 3394 -1190 -4670 -3528 1010 4495
4895 4495 3591 -826 -4408 -3712 583 4107 3652 -398 -4034 -3643 71 3684 3638 149 -3373 -3503 -381
4912 -381 3051 3499 736 -2602 -3313 -982 2238 3270 1371 -1716 -3003 -1531 1358 3057 1978 -838
4928 -838 -2802 -2199 424 2753 2539 63 -2596 -2849 -493 2453 3122 876 -2309 -3451 -1283 2180
4944 2180 3617 1602 -2118 -3932 -2031 1962 4008 2315 -1882 -4275 -2578 1647 4347 2782 -1523
4959 -1523 -4440 -2991 1360 4317 3155 -1197 -4307 -3223 996 4231 3436 -702 -4067 -3328 569
4974E69L292l76l782l234K42L346L308l2l167l161k62K802L168M48k358l028q23
4991c048K064K870J062j608k794j352J135K696J641p78k558j936L29K436K262
5006B421J32k371k625m62K225K974P99k107l205j204K052L474J558j947l719j791
5022c796J809L821K124j616m019k392J600M088K570j406m170k778J324M129K886
5037D174j155m062k915R47L942L021p61l864l079O39L609L022l95l414k972J59
5053c104L099L003M0k808k957k70K397K858O32k102k781r08J787K661J195j393
5069A349k559j545J063K472J794n31k431k000P6K341K303L36k225k700o25K155
5085g27K933R42j994l184j284J859L423J692j858l608j830J606L726K190j590
$$ plain form
4974 569 3861 3485 -297 -3531 -3289 57 3365 3333 166 -2995 -3257 -455 2713 3161 803 -2225 -3048
4991 -3048 -984 1886 2948 1340 -1454 -2806 -1671 1025 2666 1888 -670 -2606 -2277 159 2421
5006 2421 2553 182 -2443 -2905 -680 2294 3093 986 -2219 -3423 -1371 2103 3661 1714 -2005 -3796
5022 -3796 -1987 1834 3958 2342 -1677 -4069 -2469 1619 4189 2783 -1387 -4165 -2841 1288 4174
5037 4174 3019 -1043 -3958 -3011 931 3952 3191 -673 -3752 -3113 496 3518 3123 -291 -3263 -3104
5053 -3104 -5 2998 3038 230 -2727 -2997 -600 2258 2890 788 -1993 -2901 -1114 1547 2742 1349
5069 1349 -1210 -2755 -1692 780 2574 2043 -388 -2388 -2312 29 2332 2668 443 -2257 -2882 -727
5085 -727 2206 3148 1154 -2030 -3314 -1455 1968 3660 1802 -1806 -3636 -2030 1696 3886 2296
5100B296l909k255J433L819K576j339l909k696J186L846K756r45l844k875R73
5115b887L553K851o36l480k823M69L215K831j85l002k842nK797K732K12k417k711
5132b328m40K126K619P58j805k516j021J397K539J147r15k403j636O47K413J876
5148B458l66k243k118l6K179K352M06j993k718q00J996K959J055j891l225j347
5164c332J776L371J657j746l489j829J616L458K177j519l664k277J366L804K280
5179C649j162l704k448J028L602K593q65l528k638P46L363K654n98l093k688M71
5195b618K862K613j54k659k662K7K378K506L23k116k491n47J788K457Q57j520
5211A044k366j113J114K386J387q45k261j674L97K262J975j51k158k264j55K033
$$ plain form
5100 2296 -1613 -3868 -2435 1384 3960 2621 -1288 -3984 -2798 1048 3804 2859 -985 -3860 -2887
5115 -2887 666 3517 2881 -599 -3422 -2953 262 3093 2908 -94 -2936 -2941 -144 2588 2800 383 -2328
5132 -2328 -2768 -642 1977 2735 930 -1586 -2607 -1210 1329 2476 1561 -842 -2478 -1831 582 2458
5148 2458 2092 -151 -2269 -2305 -126 2226 2632 639 -2079 -2879 -883 2076 3131 1240 -1985 -3332
5164 -3332 -1556 1815 3472 1726 -1763 -3592 -1976 1482 3659 2140 -1524 -3801 -2435 1369 3649
5179 3649 2487 -1217 -3665 -2637 965 3558 2693 -835 -3473 -2727 636 3290 2692 -401 -3089 -2618
5195 -2618 244 2857 2703 44 -2618 -2591 -213 2293 2616 500 -1991 -2538 -750 1707 2564 1044
5211 1044 -1322 -2435 -1321 1065 2452 1607 -654 -2328 -1931 331 2306 2155 -3 -2267 -2422 -389
5227c89K444N93j943k777q45J862K924J117j776l077j378J736L160J654j539l374
5243a608j794J396L436K054j394l429k139J295L365K286j096l426k389J070L275
5258I02K421q78l077k537O80L069K452m93k886k386K49K622K380J2k434k419j49
5275b472K212K274M10j863k375p08J619K327Q95j178k277j229Q90K274J483o55
5291A627k107j778K99K132J906J21k123k173l00J864K543O27j894k649q41J750
5307i96K841J171j695l060j311J638L029J641j517l233j772J489L135J977j261
5322B076l331k033J158L277K111j030l168k186Q88K963K339q04k867k334N49K781
5338C89K269k81k593k364J30K429K222J24k198k204k72J859K257N43j618k249
$$ plain form
5227 -389 2055 2648 705 -2072 -2917 -1055 1869 2986 1210 -1867 -3245 -1509 1651 3305 1766 -1608
5243 -1608 -3402 -2006 1430 3484 2090 -1339 -3478 -2183 1182 3468 2372 -1054 -3443 -2373 902
5258 902 3323 2445 -632 -3169 -2489 580 3032 2539 -347 -2733 -2484 138 2518 2530 96 -2323 -2472
5275 -2472 -260 2014 2424 561 -1814 -2522 -903 1424 2319 1141 -1136 -2365 -1475 799 2282 1627
5291 1627 -480 -2258 -1959 173 2079 2200 77 -2096 -2396 -532 2011 2638 744 -1905 -2746 -996
5307 -996 1845 3016 1321 -1739 -3050 -1412 1617 3258 1741 -1492 -3264 -1775 1360 3337 2076
5322 2076 -1255 -3288 -2130 1147 3258 2228 -940 -3126 -2238 725 3064 2260 -607 -2941 -2392 389
5338 389 2658 2377 -216 -2580 -2450 -21 2201 2325 127 -2077 -2349 -490 1767 2310 692 -1557
5354a557p67J339K217J060j072k146j207O50K135J529m46k003j818J48K028J967
5370B057J35j870k299m01J872K362P31j752k605r17J657K699J118j481k877j460
5386c031J507K980J568j362l059j697J199L118J819j104l127j875J041K987J969
5401B933q96k910k091P53K878K178p35k623k103L48K649K118l13k337k132N7K193
5418c3K163O2j821k123m01J631K196N26j381k103q72J169K024J218r75j988j337
5435b045N62J951J589l54j899j815L0J967J841L17j805k194n35J722K420P56j697
5452H11k480r99J548K649J199j489k735j311J368K764J591j343k887j612J200
5467a726K848J713j045k866j779R89K770J881q03k715j981P08K670J927n34k501
$$ plain form
5354 -1557 -2324 -985 1232 2292 1220 -926 -2133 -1483 652 2181 1735 -268 -2086 -1938 90 2057
5370 2057 2192 322 -1977 -2378 -506 1856 2587 835 -1770 -2687 -1030 1669 2787 1306 -1571 -3031
5386 -3031 -1524 1456 3024 1662 -1397 -3094 -1895 1223 3042 1938 -1189 -3064 -2023 964 2933
5401 2933 2037 -873 -2964 -2211 667 2845 2110 -513 -2616 -2268 381 2499 2186 -151 -2283 -2226 -33
5418 -33 2130 2192 371 -1752 -2153 -522 1674 2200 819 -1284 -2156 -987 1037 2255 1280 -708 -2045
5435 -2045 -1483 468 2057 1703 -196 -2011 -1981 -14 1827 2144 339 -1855 -2390 -668 1752 2508 811
5452 811 -1669 -2668 -1120 1529 2728 1239 -1496 -2807 -1439 1325 2916 1573 -1314 -2926 -1726
5467 -1726 1122 2835 1790 -1076 -2855 -1866 904 2785 1982 -733 -2714 -2006 664 2591 2057 -444
5483d44j997L76K276K051r6k214k013l2J983K014J98j642k073m92J531J996O50
5500B072j146k087q46R06J915J150o77j888j373L86J853J592j50j778j882q3J770
5517b66K062L11j724k107n33J583K313P81j471k501r94J487K489J220j371k635
5533a356j313J316K709J385j221k695j521J144K652J689r65k782j707Q64K697
5548H96J759p39k579j856N60K467J873l96k345j896K60K112J935p6j927j970j16
5565b038J742J951L55j569j969m53J289J872P67j017j922r85R06J798J170n13
5581A384j797j413K85J683J661Nj765j823r9J630J929M43j586k125o14J519K226
5598A543Q49j435k350j016J363K482J139j311k552j286J242K550J375j110k605
$$ plain form
5483 -444 -2441 -2065 211 2262 2166 -48 -2061 -2093 -110 1904 2102 460 -1613 -2105 -574 1422 2072
5500 2072 926 -1161 -2007 -1101 814 1964 1287 -601 -1974 -1588 265 1857 1707 -71 -1953 -2036 -266
5517 -266 1796 2107 383 -1724 -2257 -674 1639 2420 949 -1552 -2546 -1059 1430 2650 1279 -1356
5533 -1356 -2669 -1353 1356 2741 1520 -1175 -2696 -1552 1100 2789 1824 -958 -2665 -1801 896
5548 896 2655 1916 -663 -2519 -1959 508 2381 1985 -360 -2256 -1996 116 2051 1975 48 -1922 -2038
5565 -2038 -296 1655 2010 441 -1528 -1981 -692 1180 1947 930 -992 -1977 -1071 727 1897 1384
5581 1384 -413 -1826 -1541 142 1803 1808 43 -1780 -1879 -249 1680 2123 537 -1588 -2202 -683 1543
5598 1543 2392 957 -1393 -2409 -1046 1436 2575 1264 -1288 -2574 -1332 1218 2593 1483 -1122
5613a122j459R37K606J643r55k542j655P88K492J709p02k352j774N33K198J831
5629B176l60k133j756J78J901J906rj714j951q8J537J804M27j320j846o33J102
5646g79J827Q28q38j825j011O45J733J274l93j794j400J80J708J512P6j598j743
5663a598k75J516K025M61j604k096o02J440K197Q08j338k238j140J363K367J108
5679B394j191k468j189J151K404J387j024k517j431R68K440J525q08k404j608
5694b371O77K343J600n19k264j647M35K074J727k71j893j687rJ817J702J51j641
5711B24j720l28J434J723M76j152j731p12R78J729Q74p18j696j034M46J582J254
5728A629k40j603j449J9J523J646J52j430j799l82J439J935N17j347k024p55J335
$$ plain form
5613 -1122 -2581 -1644 962 2605 1650 -892 -2547 -1759 733 2442 1740 -612 -2386 -1853 345 2176
5629 2176 1816 -317 -2073 -1895 6 1912 1903 189 -1762 -1850 -313 1491 1918 598 -1248 -1881 -779
5646 -779 1048 1876 1038 -787 -1798 -1153 580 1854 1461 -333 -1733 -1553 155 1667 1743 145 -1598
5663 -1598 -1873 -357 1668 2129 525 -1571 -2173 -733 1464 2272 934 -1304 -2444 -1081 1286 2394
5679 2394 1203 -1265 -2454 -1303 1101 2488 1464 -1053 -2484 -1516 924 2449 1641 -763 -2371
5694 -2371 -1694 649 2249 1730 -534 -2181 -1746 328 2055 1784 -109 -1796 -1805 12 1714 1865 224
5711 224 -1496 -1824 -390 1333 1809 657 -1074 -1786 -808 921 1795 1077 -619 -1653 -1207 375 1629
5728 1629 1389 -214 -1663 -1644 -121 1525 1677 247 -1552 -1934 -495 1440 1957 610 -1414 -2169 -834
5745h34K209Q53j234k340r70J214K327J129j189k330j251J127K374J298r12k368
5761h97j386P71K362J472p08k291j514O03K122J628m43k058j668L07J829J675
5777A804p8j709j702o6J588J628K81j367j722l77J145J620O54j015j641p89O88
5794a058J685J056o05j565j106K93J558J280l6j590j511j4J427J640K76j403j766
5811a439m35J378J892O10j245k058q03J308K108Q95j227k148j103J223K172J125
5827B253j045k191j260R33K303J286q29k295j365P36K209J447o47k103j475L72
5843a671K141J515m45j836j564J95J740J580q9j551j519j30J356J568L02j161
5859D31j469o21J031J576P12q25j607p47N77J470J006l54j566j085J88J464J331
$$ plain form
5745 -834 1375 2228 994 -1346 -2316 -1102 1225 2354 1165 -1165 -2416 -1289 1085 2383 1471 -897
5761 -897 -2283 -1512 850 2322 1614 -677 -2191 -1588 534 2162 1719 -339 -2007 -1700 129 1804
5777 1804 1726 17 -1685 -1751 -163 1465 1746 379 -1343 -1720 -575 1045 1699 684 -957 -1746 -1058
5794 -1058 627 1683 1078 -487 -1593 -1300 258 1538 1502 -88 -1599 -1613 -186 1454 1730 327 -1439
5811 -1439 -1874 -496 1396 2006 761 -1297 -2100 -792 1316 2211 984 -1164 -2267 -1044 1128 2253
5827 2253 1208 -983 -2243 -1310 993 2279 1450 -845 -2210 -1474 735 2182 1535 -568 -2043 -1671
5843 -1671 470 1985 1540 -296 -1860 -1665 75 1655 1566 15 -1504 -1634 -278 1290 1592 431
5859 431 -1038 -1659 -628 948 1660 835 -772 -1519 -942 528 1534 1180 -386 -1471 -1283 181 1512
5876A512m0j348j562j05J304J659L48j349j738n58J270J897O67j256j918q79J212
5893h84K041R26j092k163r72J075K103J109r44k173j156Q48K035J309o80k244
5909h62j244O97J943J447n54j950j408L99J872J434k62j681j500J67J532J509
5925A539j3j360j483j62J098J572L69j026j420n69P98J435P89o54j438r31M50
5942a006J406J090l34j421j209Q6J436J379J15j449j466j81J246J616L76j322
5958C62j722n74J316J874O43j159j989p84J106K066Q85j099k020r84J050J971
5974I42J080q56k036j169Q09K029J202p24j952j336P01J837J344m86j765j367
5990a747K75J693J423j44j539j397K6J353J344K74j219j517k99J085J359N01q75
$$ plain form
5876 1512 1472 124 -1438 -1543 -239 1420 1768 419 -1319 -1877 -607 1290 1957 701 -1217 -2096 -884
5893 -884 1157 2083 991 -1172 -2144 -1069 1034 2143 1199 -974 -2130 -1282 753 2062 1382 -862
5909 -862 -2106 -1409 534 1981 1427 -523 -1931 -1532 340 1774 1512 -169 -1669 -1502 30 1539
5925 1539 1526 166 -1317 -1479 -381 1191 1560 534 -886 -1455 -657 778 1567 913 -525 -1456 -1006
5942 -1006 400 1490 1156 -265 -1474 -1388 48 1427 1542 93 -1373 -1554 -308 1308 1684 362
5958 362 -1360 -1934 -618 1256 1899 740 -1249 -2033 -927 1139 2024 925 -1095 -2079 -1029 942
5974 942 2022 1166 -870 -2039 -1230 799 2001 1277 -675 -2011 -1310 527 1871 1385 -380 -1747
5990 -1747 -1472 221 1644 1500 -39 -1436 -1410 -57 1287 1561 342 -1175 -1474 -389 970 1471 596
6007E96j475o21P74J358Q13n63j395q94L46J364J092j59j383j282M9J270J497
6024A387P0j303j503k77J264J679M06j243j757n79J268J758O82j097j907p51J049
6041h54J944R36j049j951r68R52J854J107q31j935j125P77J772J243o36j828j096
6058a688L64J751J283l35j690j257J57J548J282l1j361j400o9J203J378J91r81
6075C45j338m60R53J394M60o92j382o84O42J244Q94m19j300j046K23J363J172
6092A369j09j284j273n2J248J434K02j291j520l00J193J700M25j228j752n64J198
6109f04J785O65j097j812q25R86J869R08r12j925r62R67J888Q92p24j830j076
6126a807O31J756J158o26j606j161L98J531J231k82j460j170J37J317J265n4j163
$$ plain form
6007 596 -879 -1500 -726 632 1445 882 -513 -1407 -1061 303 1395 1236 -147 -1429 -1380 -110 1387
6024 1387 1457 154 -1349 -1626 -362 1317 1723 480 -1277 -1856 -588 1170 1852 755 -1152 -1903 -854
6041 -854 1090 2026 977 -974 -1942 -990 864 1971 1140 -795 -1920 -1143 629 1872 1236 -592 -1688
6058 -1688 -1324 427 1710 1375 -315 -1572 -1415 133 1415 1384 23 -1377 -1446 -243 1135 1326 345
6075 345 -993 -1453 -500 894 1354 662 -720 -1404 -762 482 1376 957 -343 -1389 -1166 197 1369
6092 1369 1260 -24 -1297 -1349 -101 1333 1535 244 -1276 -1576 -383 1317 1742 514 -1238 -1802 -604
6109 -604 1181 1846 749 -1063 -1888 -902 967 1875 963 -962 -1924 -957 931 1823 1099 -731 -1807
6126 -1807 -1176 580 1738 1112 -494 -1655 -1257 274 1505 1223 -237 -1407 -1270 47 1312 1258 95
6143I5j338m7J065J198L50r45j267m38P39J332N94o19j238q00M89J262Q74k78
6161A028j292j030J62J303J134o2j240j290r4J267J424J35j173j503l82J213J513
6178A113N28j123j650o33J143J664P21j085j720p70R46J771Q71q17j813q94P36
6195a012J796R23o96j649r74N27J597J091m32j519j127L43J391J208k83j260j207
6212a283J12J129J274J13j157j223j74R32J190L85q57j143n00N99J338N63n56
6229G42j226p88L86J246J048m20j240j044R0J251J187l8j152j275j07J082J443
6246A185K18j080j453l77J047J525N13j061j572o15J068J585P72j023j648p65
6262a681R23J598Q88q23j615q19N92J689R77o70j574j056M54J614R70l92j442
$$ plain form
6143 95 -1243 -1290 -225 973 1323 378 -889 -1327 -588 744 1338 719 -519 -1319 -830 432 1306 1028
6161 1028 -264 -1294 -1132 171 1305 1243 3 -1287 -1381 -114 1310 1445 272 -1231 -1613 -400 1113
6178 1113 1641 518 -1132 -1765 -622 1042 1763 678 -1042 -1812 -866 905 1776 959 -854 -1748 -1012
6195 -1012 784 1707 1011 -638 -1612 -1085 512 1603 1171 -348 -1475 -1132 259 1467 1184 -76 -1283
6212 -1283 -1171 -42 1232 1345 188 -1035 -1209 -277 913 1298 441 -702 -1202 -603 735 1298 742
6229 742 -484 -1272 -886 360 1408 988 -252 -1296 -1206 45 1232 1194 42 -1233 -1340 -258 1185
6246 1185 1403 323 -1130 -1507 -460 1065 1578 517 -1055 -1670 -602 983 1755 732 -916 -1681
6262 -1681 -758 840 1728 905 -710 -1529 -937 752 1729 1059 -515 -1571 -1117 497 1467 1075 -367
6279c67j005K02J343J102j72j158j073J4R92J129J79r90j153k74Q72J159L87p51
6297D36j128o44P11J193N76m60j108q00L18J162R45j36j270j056J20J180J121
6314A160Q8j182j262k10J223J332K09j062j346m07J066J527M14j000j528n57R23
6331f12J570N83q33j590p20Q24J612O86p05j468q83N85J530R05n43j420j015M77
6349a017J336R80k92j272j082K56J200J010rj106j054l6R52J120J24p84j162l07
6367a143Q12J055M31o14j154n60N01J110P73m47j123p49K35J098R73k03j067j049
6385a121jJ061J229J00j174j184k40J109J341L04j119j358l42R56J469M65r93
6402E02j390o02R16J401O48q04j496o71P70J382P50o02j360q83O11J397P79m12
$$ plain form
6279 -367 -1372 -1170 173 1275 1103 -55 -1128 -1114 -122 1007 1186 196 -957 -1231 -359 800 1187 436
6297 436 -692 -1336 -625 568 1144 684 -424 -1224 -906 256 1201 1065 -205 -1261 -1141 39 1160
6314 1160 1248 66 -1196 -1406 -183 1149 1358 296 -1050 -1457 -391 1136 1550 550 -978 -1535 -612
6331 -612 958 1541 708 -882 -1602 -778 834 1520 815 -653 -1536 -951 579 1484 941 -479 -1494 -1017
6349 -1017 319 1299 1007 -265 -1347 -1091 109 1119 1110 4 -1050 -1086 -134 986 1110 326 -836 -1143
6367 -1143 -331 724 1155 541 -613 -1173 -672 438 1211 764 -359 -1108 -873 225 1198 995 -72 -1121
6385 -1121 -1122 -61 1168 1268 94 -1090 -1330 -221 1120 1424 305 -1053 -1395 -439 1030 1495 502
6402 502 -888 -1490 -574 827 1475 671 -825 -1496 -726 656 1406 804 -556 -1439 -828 569 1348 936
6420I36j343r59L91J296Q76k34j204r37J40J087J068r2r74j056j35R38J130K03
6438A131p73j128l60P39J026N60o05j086o36M17J207O80m02j067r30K93J096R27
6456A089J1j228j008m1J105J121J56j123j228j92J031J312K95j012j302l83R21
6473d76J365M63q42j339n92P39J452O38o66j423p29O19J400P69n93j284q15M58
6491h56J298Q55l39j243r62L29J223R03k40j056r83L5J045R66L8r31r96j77Q35
6510b56J002L35p71j022m05N82J112N17n15r85p56L85J108Q26k88j133q44J54
6528i54J070R04j5r96j100J6R68J044K64j035j168j83R11J232L41r16j285m12
6546a314Q71J305N48r01j306n33P55J332O31o66j345o83O90J260O75n83j314n85
$$ plain form
6420 936 -407 -1366 -975 321 1197 963 -241 -1178 -1038 49 1117 1025 51 -1005 -1140 -202 928 1131
6438 1131 358 -770 -1130 -391 635 1195 590 -496 -1132 -715 492 1172 770 -297 -1227 -934 162 1089
6456 1089 1100 -128 -1136 -1177 -72 1049 1205 82 -1146 -1338 -307 1005 1300 288 -1014 -1397 -476
6473 -476 889 1352 510 -829 -1421 -682 770 1408 742 -681 -1410 -791 609 1378 785 -499 -1314 -856
6491 -856 442 1297 958 -285 -1247 -918 305 1208 968 -88 -1071 -1036 9 975 1013 82 -914 -1091 -256
6510 -256 746 1081 310 -712 -1117 -535 577 1094 579 -406 -1162 -777 331 1157 869 -264 -1108 -954
6528 -954 116 1020 1005 9 -1091 -1075 -107 937 1201 166 -1002 -1185 -274 958 1299 383 -902 -1314
6546 -1314 -443 862 1410 509 -797 -1330 -575 757 1388 722 -623 -1306 -616 644 1319 736 -578 -1163
6564a163L34J232Q11l75j202q22L14J041R10k07r82q79JR18R29J00q50r51k04
6583a045Q00R34L17o30r61m34N25J046M98l99j106o26L50J017P88k65r92r04J75
6602i12J036Q84Jr55j085q5J055J029K37j007j181j50Q38J262K01p48j320l49
6620a249P76J283M83q45j175n54P24J149O61o20j248o12N35J205O61n17j105p36
6638a184L46J248O83l29r92q26J89J014Q70o1r53r00j5Q51R19N0p21r61j69O99
6658b42Q89M04n96r60m05L86R62N98l96r76p18L42R91P49j95j058p96J46R22R17
6678I64O6j005r70q4Q44J152R0r14j057k31Q95J075K85p87j152l78P80J161M75
6697A209p18j231m79O65J263M24n69j220n02N27J115O67m31j126o82L87J072P23
$$ plain form
6564 -1163 -829 403 1214 839 -363 -1185 -871 170 1080 873 -109 -988 -987 -69 860 960 110 -841 -1045
6583 -1045 -245 689 1006 376 -585 -1019 -494 552 1050 651 -455 -1081 -731 286 1074 809 -183 -1087 -912
6602 -912 124 1008 1009 54 -1031 -1116 -61 968 1205 198 -983 -1133 -295 967 1168 420 -900 -1249
6620 -1249 -473 810 1293 448 -727 -1281 -557 592 1253 633 -615 -1227 -692 513 1174 657 -448 -1184
6638 -1184 -838 410 1093 764 -228 -1054 -865 149 1019 958 5 -895 -910 -59 860 910 189 -772 -941 -242
6658 -242 647 1051 455 -505 -910 -524 438 1036 640 -336 -1054 -712 279 1028 833 -225 -1021 -875 47 964
6678 964 1030 25 -945 -1029 -185 967 1057 143 -914 -1145 -250 825 1110 323 -829 -1207 -427 734 1209
6697 1209 491 -740 -1219 -554 709 1133 564 -656 -1158 -631 484 1151 720 -406 -1088 -701 371 1094
6715A094k72r83q23J63J002P40l0r04q81O4Q14Q22R5o91q57k67O24R53K97n32
6735D28r75m29M07R56O06l56r69n88J91Q90P55j00r33q26N3R52Q76k1q87r76o7
6756a013Q47J086P5p73j079k68Q84J056K65p44j097l42P51J111M05o86j170m10
6774a102O40J109N46o25j054n60M51J032O18m44r63o60L48R14P09k16r11p55J40
6793g83Q78P20L4q13p94p5P35Q01J29n82r03k99N73Q66M66n59q88m57L75Q73O70
6814I67l51q51o77K07Q79P50j24q49q35Q3Q61R19m0q59r16j31Q15R70J91q15j013
6835h19j88P48R74L91q07j023l29O37J096L86o10j034n24O40J051N02n78r87n91
6854a065L99J036N75l40r29p12L47R01P02k03r00o32LQ31P57J0p00p73j24O06
$$ plain form
6715 1094 822 -161 -984 -821 181 921 891 -13 -894 -830 -16 806 901 210 -647 -914 -290 663 960 428
6735 428 -547 -976 -569 387 993 637 -332 -920 -729 161 916 816 -117 -943 -890 62 938 917 30 -946 -1013
6756 -1013 -166 920 995 222 -857 -1125 -241 815 1080 336 -761 -1103 -352 759 1164 478 -692 -1102
6774 -1102 -462 647 1193 568 -486 -1046 -595 437 1055 611 -352 -1012 -664 250 959 743 -168 -923 -783
6793 -783 95 815 849 36 -758 -833 -98 703 832 250 -653 -952 -379 487 953 394 -494 -951 -576 297 967
6814 967 616 -235 -912 -705 174 924 800 -49 -884 -801 60 979 939 80 -836 -967 -152 818 1009 194 -819
6835 -819 -1007 -259 715 1106 299 -724 -1053 -416 680 1066 456 -578 -1102 -462 589 1091 513 -474 -1065
6854 -1065 -666 370 945 605 -324 -1036 -689 212 914 711 -189 -821 -818 13 770 780 80 -693 -817 -211
6874b11P78K63n51q53k73M79Q31M45m11p69o18L63P75O59k37q40p27K10Q45O99
6894H57p2p61q67j4Q24Q98O1r04q97o2Q64R37No83r87l04Q17R66L66q24r07l20
6916a007N20J111M32o70j032m13N60R96M49l78j025n67M31R16N69k92q56o48K28
6935f76Q23P24j89p30o67k2P05P26O0o07p31k59O17Q05K83n16p80l51L47Q29N34
6956I25m65p99n28L32Q19N78k29q07o81K00P97P25j56p64q28K2Q57P70J29q71
6976B6q66m9Q16Q11K18p17r76k17O63R93K55o35q96m27O01R45M48n57r53m03M41
6997d79R94M10m14q68n23K78Q69N91k20p83o27J56P46O80r9p31o58n9O62P44N7
7018G26n31p27k00M51P29L43m63p83l36L79P05M95l33p31n87K46Q30N99j87p05
$$ plain form
6874 -211 567 830 279 -574 -847 -368 463 908 497 -272 -890 -527 248 907 670 -170 -897 -687 158 857
6894 857 785 24 -843 -857 -33 865 926 22 -875 -937 -73 864 869 186 -801 -1105 -288 678 1044 220 -687 -1007
6916 -1007 -487 624 1056 386 -646 -1059 -499 497 946 568 -457 -1024 -593 323 892 600 -256 -904 -676
6935 -676 147 871 682 -48 -715 -737 -32 694 754 147 -584 -843 -226 579 862 346 -434 -785 -438 391 925
6956 925 460 -339 -867 -535 284 862 633 -174 -855 -655 142 867 711 -53 -881 -859 -2 768 897 26
6976 26 -840 -889 -73 738 956 239 -737 -954 -291 702 957 322 -574 -1001 -400 545 993 436 -517 -920 -479
6997 -479 515 925 511 -357 -880 -602 267 858 638 -145 -772 -616 130 810 711 -20 -678 -737 -75 669 726
7018 726 195 -532 -732 -281 448 791 328 -455 -791 -412 293 788 455 -276 -863 -617 213 812 625 -80
7038h0p91J52P89P41Lq05p63p6Q15P92N5p82p75j63P26Q34K52o22r79k55O90Q42
7060F00L49n63r12m17O37P77N02n51q65m30M21Q74M24l20q95m60K38P60O21j69
7080F21q03o21P6P60O39l6o01o97j18N73P55J57m74p45k97M52P69L42l93p93l99
7101h33M18P70M45k63o67o50J88Q26N63j19q00o45N5Q46O64N9q33p90JO90Q83
7122H08J0o87p83k56P60Q54J62o50q49k87O79P93K45n38q54k53N11Q06M06m35
7142D42q32m09L23Q10M76l14p58m97J98P31O13j30p48n92N5N92P16mo10n64k23
7163g25N80O64K56n37p03l12M70O74L82l69p24l84K73P78M88l02p23n52J88P76
7183A98N61r3q12o11Q5O99P08k7p58o53j34Q06O95J81p34p64j72O27Q30J91n46
$$ plain form
7038 -80 -871 -719 70 811 814 9 -754 -830 -15 777 832 50 -725 -888 -162 672 924 302 -677 -932 -242 600
7060 600 949 386 -526 -943 -306 471 973 422 -443 -873 -452 422 846 526 -369 -829 -591 169 790 621
7080 621 -182 -803 -727 33 672 636 35 -662 -780 -207 548 705 231 -514 -811 -359 410 752 359 -434 -833
7101 -833 -415 355 800 537 -130 -780 -592 234 797 678 -122 -767 -712 134 798 857 24 -766 -765 -75 808
7122 808 818 131 -652 -908 -148 706 868 218 -631 -918 -239 554 799 261 -593 -846 -335 471 877 442
7142 442 -390 -799 -476 334 810 496 -262 -759 -561 170 783 653 -95 -687 -632 -40 676 672 62 -502 -725
7163 -725 -145 519 775 238 -465 -777 -307 367 749 380 -344 -728 -455 323 811 509 -214 -766 -578 198
7183 198 759 666 -146 -757 -672 27 735 708 -50 -703 -837 -31 664 845 111 -653 -825 -198 632 823 277
7204B77q78k83N86Q32L10m65q28l69M35P71M58m18p70l36J74P69M97j63p52n55
7224g08J33O93O05j07n94o85Q1N05O48R0n40o48j11L95P20K04m62o47k95L67P59
7245D03L26k98p26m72L16O31N31k13o81n25J52P05N83j51o70o23M0P65O28p0o11
7266D0p20r0O86P02J21o01p60j61N85P93K11n19q48k18M62Q64J85l55p52l89L99
7287c65P21L70k92o83m88K75P16M29k14o77n03J37O28N46j20n20o04K1N55N93
7307E25P4m95n95j44L57P36J33l37o67k49K67O71M55l45o85l60K15P12M59j93
7327E34o65n56J23O74O20j24o74n98L3O62O60p7n84o59j02N99P40J30n39p33j62
7348f98N11O75K64n05o90k96M09O98L82m30p29k71K23P73L80k31p02m74J89P05
$$ plain form
7204 277 -601 -884 -298 534 844 379 -449 -818 -383 388 846 428 -342 -678 -504 265 762 599 -153 -708
7224 -708 -575 118 723 616 22 -663 -582 -77 571 661 121 -527 -638 -243 477 681 219 -428 -723 -356 403
7245 403 729 431 -295 -767 -451 180 711 498 -183 -708 -556 149 732 581 -89 -712 -672 93 721 651 40
7266 40 -680 -770 -84 618 739 138 -622 -783 -198 595 806 287 -561 -779 -317 547 732 377 -375 -764 -365
7287 -365 356 726 434 -249 -737 -462 254 683 469 -208 -711 -574 54 600 480 -40 -644 -623 -68 525
7307 525 599 104 -491 -635 -278 458 591 254 -413 -662 -395 276 731 386 -299 -659 -444 268 727 534
7327 534 -131 -687 -564 110 730 606 -68 -666 -633 29 689 612 28 -631 -733 -134 606 736 197 -536 -698
7348 -698 -187 488 752 247 -443 -739 -330 368 750 320 -409 -680 -457 316 696 465 -237 -711 -522 183
7368A83M54j30o55m47j4O63N84j5o19n02m4M34O23J18n14m67k74M48O33K12k98
7389C73o93k82K65P06L09k61o84l85K49O38M27j52p08m38M8P38M89Np09o21O1
7410f25O31O17M6n95o44j49O19P15R0n02o93k60N68O13K21l79p24k11K91P36L28
7431F93l24p45l26L13O38L91j91o17m78K29N78M25n4o11m65L4N67M71L4m96o11
7452e45K9L89N98R1m17n43j68L89O08K08l20o67k86K60O48L77k33p07l75J98O23
7473A57M12q4o02n09J16N53O13j15o05m98p4O31N91M7n58o52j05N70P04Q9n37
7494A44n80k20N10O20K12l37p63j90L29O11L05k95o51l09K11O44L56j74n77m06
7514e60J02N55M26l5n17n28L4M85N53O9n47n44q7M09O21J02l94n39k14L08O30
$$ plain form
7368 183 637 507 -148 -595 -609 54 638 623 4 -498 -542 -108 515 633 119 -348 -622 -174 459 671 373
7389 373 -320 -602 -337 369 678 417 -267 -652 -403 235 662 510 -198 -636 -588 150 639 644 -65 -686 -625
7410 -625 6 623 669 74 -570 -719 -100 615 705 203 -490 -750 -182 431 652 273 -451 -662 -371 365 693
7431 693 369 -376 -702 -389 249 640 449 -168 -646 -417 161 586 532 -79 -544 -510 57 528 562 66 -545
7452 -545 -516 -127 471 562 145 -398 -566 -177 431 639 319 -348 -634 -374 274 651 418 -289 -664 -466 157
7473 157 569 485 -117 -626 -510 43 656 541 -64 -562 -636 -5 586 633 75 -577 -682 -112 592 681 144
7494 144 -436 -656 -146 474 686 349 -414 -604 -275 336 641 346 -305 -614 -403 241 597 423 -154 -560
7514 -560 -458 97 523 488 -29 -557 -523 -38 515 584 37 -507 -594 -185 436 538 144 -395 -609 -301 329
7535C29K51k83n71l05J35O42M07k15o49l54J23P14L91j18n76n46P9O07N39k2n67
7556A1n73kN52N29Q6n04n96r8M37O83J65n26n79j84L86O43J36l54n28l78L61O99
7578C66K65l12o12l27K60N97L44j97n91l82J76N31L74j08l56n81M7M45N17Kl52
7599A06n18q4L59N17J73l28m93l51L75N14L36k97n88l24K13N88L95j63o14l89
7619e73J98N39N30j48o28n11Q3N51N32j14m70n22k4N20N39R4n56n16j44M59O15
7640D54J17l18p07j98M00N94K39l48o12k18K51O07L20k10o11l09K02N89K58j40
7660C60n22l46J53M70L40k4m79l98JM30N31J2m19m67j36L64M86K49m09n40j69
7681e13K56N65K75k33o32l10K12N84L04j50n05m00J16N54L70k0n84m50Q0M87N06
$$ plain form
7535 329 580 297 -274 -579 -444 198 605 390 -259 -613 -490 224 615 497 -79 -625 -546 61 600 578 11
7556 11 -562 -564 -12 517 603 99 -497 -595 -158 525 690 164 -415 -599 -213 430 566 212 -316 -694 -333 366
7578 366 631 319 -293 -620 -360 237 581 384 -207 -589 -413 118 492 384 28 -553 -506 -61 456 458 106
7599 106 -412 -496 -137 380 553 225 -268 -619 -244 270 606 309 -279 -603 -390 198 593 430 -184 -573
7619 -573 -375 164 694 546 -82 -593 -510 41 573 459 -11 -533 -557 -37 502 596 40 -476 -620 -161 454
7640 454 571 253 -454 -652 -252 342 581 233 -379 -597 -346 261 581 371 -240 -549 -347 242 500 360
7660 360 -162 -508 -355 115 455 431 -48 -446 -445 -15 516 528 109 -358 -494 -130 356 605 196 -344 -513
7681 -513 -257 308 583 350 -282 -592 -380 204 508 358 -147 -547 -431 123 493 473 -111 -561 -481 6 512
7702E12l7m59n48NM33N74O5m84n24j68N07N09J61l20n49k50L51N60K45l24n08
7723b49l45K87N71K89k06n43l01K20M59L12m4n69l41N9N04L51%m30n03P8M02M51
7745D52P2l75n33j31L44N77J08l57m90j71K18O19J32j57n38l99K33N33L74j36
7765C75n56m06P2N80L96nm41m95M9L99N44Jm44n37m4M50N72L2m39m94j30M26M69
7788C74J79l74m66k08L53N09J83k90n22k07J53N82K86k43m34l61J54M37L62n6
7808D11m54m25N0L89M07Ll89l72j45M27M66N8l08n42q6L42N03J61k57n03j93J47
7830c10N16L68k39n56l20J93N29M04k23m85l84J16M98M36n7n42m22L0M50M79%
7851D81m44m87j7M03M63R8m40m24j11L51M88J74l79m92j93L41M35K12k36m77k42
$$ plain form
7702 512 475 16 -532 -527 -94 480 545 61 -463 -631 -124 385 546 226 -323 -573 -222 338 583 259 -249
7723 -249 -594 -307 264 553 347 -196 -497 -277 182 494 450 -119 -460 -401 103 454 454 24 -479 -401 1 452
7745 452 524 149 -384 -515 -171 406 514 157 -333 -504 -286 333 465 308 -230 -629 -396 137 511 375
7765 375 -181 -587 -515 65 461 456 15 -480 -431 -32 512 513 69 -468 -512 -62 510 542 103 -391 -521 -95 374
7788 374 553 179 -287 -495 -142 367 550 260 -262 -469 -316 266 552 309 -125 -486 -332 105 467 411
7808 411 -43 -468 -418 -29 378 381 -8 -380 -525 -98 368 426 118 -424 -510 -168 335 496 239 -264 -457 -310
7830 -310 206 574 335 -221 -541 -348 181 585 362 -123 -507 -391 107 543 486 -56 -478 -448 2 481 481
7851 481 37 -450 -467 -64 399 497 57 -367 -478 -127 361 535 156 -336 -529 -188 247 459 223 -254 -496
7872d96K39M26L20k52m13k73J00M50L72q9m69l24J0M05M12j7l51m29r1L61M87
7893C78J38l35m53j84K73M74K23k20n91k25K33N34L34k88m49l32J59M15L14Ln28
7914a27l50Q0N20L87j73l57m13P1L65M30K3m25m46k3L56N24M6l83m74j34L69M64
7936C30J80l73l87k34K34M49K79k10n03k38J72M45L16j32m11l18J02L54L98n7
7956C96m17l10p8L93L55N2l04l69j62L80L41K34l48m50j77L14L95J81j52n16k50
7977d92J97M60L07k08l59l51P6M71L36q5m48l68RM44M66q6m45l52PM22L95j4l57
8000B5m47k5L47L88J23l36l53k18L48L70K01k59m01k57K48M12K53j71l94l42J79
8021c09L99L05k5m15l73J11K82M67l9l94l83k5L40L99R5l65l71j24L31L89R2j89
$$ plain form
7872 -496 -257 169 489 237 -176 -449 -349 101 473 384 -85 -409 -399 6 418 401 50 -379 -470 -109 378
7893 378 516 181 -272 -456 -183 291 514 294 -297 -522 -289 245 579 291 -158 -490 -331 84 398 401 -127
7914 -127 -477 -397 123 510 337 -20 -433 -362 3 433 456 31 -415 -438 -82 442 488 105 -369 -503 -134 330
7936 330 510 137 -250 -484 -250 199 478 268 -235 -473 -301 144 460 328 -83 -401 -299 55 453 396
7956 396 -21 -331 -409 -16 339 391 87 -282 -444 -64 277 511 163 -287 -464 -150 245 426 274 -242 -492
7977 -492 -295 165 472 264 -95 -446 -370 101 437 352 -96 -464 -455 -11 455 369 -76 -428 -421 1 396 382 25
8000 25 -422 -447 -100 288 411 75 -278 -496 -148 222 423 164 -237 -494 -246 166 419 248 -146 -488 -309
8021 -309 90 395 370 -45 -418 -307 -25 442 403 9 -374 -399 -59 340 435 70 -301 -425 -94 295 387 198
8043A98l82k27K39L72K80k45m33k25J47M01L15j57m39k90J17M53L52j09l91m26
8063d50P7M17K99P2l89m69LL63M39N4l75l79j05L02N02P5k96m19j52K72M42J30
8085D13k06l93k22P8M81K69j79l81k48R5L54K97j52k52l77P2L28L85o0k90l93
8106c81J4K60M67L3k80k86j80J59L75J88j33m77j87K18L83K70j87m48k13J12L80
8127H7L51j50m13k38K8L80L24Pm15l32j3M10L85J1l80l31p5K93L77R2l65l27j09
8150d03K86L76J66k56l87j94K25L96K21j59m01k37Q9M44K12j50l75k33J34L01
8170E5K83n6l05k89rK96L96k5k67m24j9L16L11N8j88l45j41K30K73K31j88
$$ plain form
8043 198 -184 -411 -172 200 480 235 -198 -423 -276 125 440 283 -156 -446 -329 124 476 367 -24 -450
8063 -450 -373 44 343 415 26 -443 -440 -77 362 416 41 -338 -443 -141 361 436 140 -279 -431 -159 283 413
8085 413 207 -186 -408 -330 151 420 241 -140 -388 -293 61 358 206 -46 -423 -351 -23 362 302 12 -381
8106 -381 -367 -107 360 393 113 -173 -353 -194 181 369 236 -241 -428 -210 173 443 256 -192 -405 -293 87
8127 87 438 288 -125 -363 -335 45 369 376 -39 -371 -384 26 411 422 42 -289 -364 -71 306 398 33 -294 -403
8150 -403 -117 259 425 169 -218 -412 -187 209 430 271 -130 -367 -278 166 378 228 -147 -380 -246 55
8170 55 338 282 -23 -312 -321 -25 371 346 79 -345 -364 -48 263 321 133 -212 -353 -123 150 381 193
8191A93
$$ Imaginary data points
##PAGE= N=2
##DATA TABLE= (X++(I..I)), XYDATA
0@%%%%%%%%%%%%%%%qJ2rJ3j6J6j6J6k0K8l2L2l7M2m7N5n8O5p5Q0q9J01j10J22
39F5j35J47j64J83k01K23k49K76l09L50l96M54n26O14p35R00j138J520k195L617
59B301p786M1485K10705j0073k44349k31481O468K33124K28365J654k20361k23359
71b13307r684K06167K15738J7263j88752k05457k5720J68918J93130L3991j46678
82D5609j78687m3327J20786J62468N5133r2750j48154o9291O5104J34308Q2595
93A33794l8022j20293r5930R816J05394J10192J8666r1969j25096m6542P9322
104f0668J39866P3644o7512j54770r9312N7561J69756J22482m9132j82345j42474
115a92904M0977J93296J61337l2777k03084j77565K6752K11356J90416k1232k16593
$$ plain form
0 0 0 0 0 0 0 0 0 0 0 0 0 0 0 0 0 -8 4 -5 8 -8 8 -8 8 -12 16 -16 16 -21 21 -26 29 -29 36 -39 41 -48 53 -57 65
39 65 -70 77 -87 96 -105 118 -131 145 -164 186 -210 244 -282 332 -403 497 -641 879 -1316 2301
59 2301 -5485 36000 246705 236632 -7717 -239198 -232730 394 228759 230413 10052 -213307
71 -213307 -222991 -16824 198914 216177 27425 -178032 -203752 -34834 158296 192287 45609
82 45609 -133078 -176405 -55619 106849 161982 69232 -78922 -148213 -83109 51199 133794
93 133794 95772 -24521 -120451 -110635 -5241 104951 123617 31648 -93448 -139990 -60668
104 -60668 79198 152842 85330 -69440 -168752 -111191 58565 181047 131915 -50430 -192904
115 -192904 -151927 41369 202706 169929 -33155 -210720 -183968 27388 217804 196572 -20021
126b0021j99836J6321K19440K06579j2170k19715k09254Q360K16103K08655l801
137B10661k09272k06323j576K00167K01335O173j88589j93761j1749J73592J83778
148A64436J8114j56206j73108k5790J36710J60805L4057j15028j48078m4109R1844
159e6353J35506N5120o8256j22726o6385M3914J09890P8668j8491r7324r1705
170i8142o593Q6053J05408L1345p5164j18775n4967O5227J32568P7721n6376j45362
182e7057r8325M8414J57052J17397m0638j67645j35040L3958J77441J49869k8732
193A56694j85228j61770K3741J90353J70986j9337j93754j77811J5252J94354
203A3480J81249j1587j92366j82180P044J87575J81106l106j80910j77371q75
$$ plain form
126 -20021 -219857 -203536 15904 222483 210313 -9402 -218656 -210296 5807 214462 210661
137 210661 1389 -204934 -206510 -6343 194992 201165 12576 -181185 -192934 -19342 164436
148 164436 182550 26344 -146764 -172554 -35844 124961 159018 43990 -104088 -148197 -56353
159 -56353 79153 134273 66017 -56709 -123094 -79180 30710 109378 90887 -6437 -98142
170 -98142 -104735 -18682 86726 118071 42907 -75868 -130835 -65608 66960 144681 88305 -57057
182 -57057 -155382 -106968 50084 167481 126843 -40802 -175842 -141884 35557 185426 156694
193 156694 -28534 -190304 -166563 23790 194776 175439 -18315 -196126 -180874 13480
203 13480 194729 183142 -9224 -191404 -184360 3215 184321 181215 305 -177066 -177941
214a77941J70938J71155N869j58257j63458j1869J43731J54754J8615j27309j44544
225a18316k5753J08992J33845L4572q8978j22924m3786O8540J11898N3911m6919
236F5082j00408o4641K4515Q9844P6656k368p9982q8630j9129P0401J00475M0352
248A12167o1507j12666o0762N3374J24269P9415m6148j35209r7078L9315J44889
259D0059J12828l3408j54162j26654K8451J61367J37723k4107j66537j46961J9775
270a51626J70101J53630j6083j71556j57744J2768J70830J59541r190j67739j59065
281a66133O065J62565J56516k393j54772j51682j480J44676J45659O617j32495
292A3143j38453j2138J18972J30397J8473j03516j21332k5761Q6695J11787L3951
$$ plain form
214 -177941 -7003 164152 170021 11764 -151694 -163563 -19832 134922 153537 26228 -118316
225 -118316 -144069 -35077 98768 133340 44362 -78562 -122348 -53808 58090 112001 65082
236 65082 -35326 -99967 -75452 14392 91048 88680 8698 -79932 -99061 -28660 71815 112167
248 112167 50660 -62006 -122768 -69394 54875 134290 88142 -47067 -144145 -104830 40059
259 40059 152887 119479 -34683 -161337 -132886 28481 166204 142097 -24440 -171401 -151626
270 -151626 18475 172105 156022 -15534 -173278 -160510 10320 169861 160671 -7068 -166133
281 -166133 -160068 2497 159013 156620 1848 -149834 -151314 -6638 139021 145638 13143
292 13143 -125310 -137448 -18476 111921 130394 26878 -94454 -120215 -33520 78267 112218
303A12218o8711j02221m3102M9551R2763N2986l0333q3825o3589J0699P5023P4190
315G5649Q451o6720q5241k7707N8814R6141M5962n1671j06903o3376M4958J17121
327D5478P9400l8962j26600r3884L3718J34888J06738k8806j41644j17634K4702
338a22606J47037J26703k0603j50739j33425J7227J52858J38231j3910j52857
348a2084j40533J0821J51088J41093p741j47054j39557M637J40827J36333q77
359A36953j33026j31746l349J23104J25960Q025j11763j19165j3627R8442J11449
370I1257J9789q3977j03502k7099O8163R4988L5153n1502q6947m4128L4393P8829
382B5417N3391j7010p0919o2933o67O3319P3027J8053n6066q3050l4847M9624
$$ plain form
303 112218 43507 -58714 -101816 -52265 40498 93484 63151 -20674 -84263 -73564 1459 75649
315 75649 84100 17380 -67861 -95568 -36754 59387 105349 53678 -53225 -116601 -71643 45478
327 45478 124878 85916 -40684 -134568 -100850 34038 140776 111970 -29674 -147308 -122606
338 -122606 24431 151134 130531 -20208 -153633 -136406 16452 154683 140773 -12084
348 -12084 -152617 -141796 9292 150385 142644 -4410 -143967 -139330 1497 137830 136953
359 136953 3927 -127819 -131168 -8064 117896 125921 14158 -105007 -118634 -20192 91257
370 91257 111046 27069 -76433 -103532 -35369 59619 94772 43270 -43677 -87805 -53412 25417
382 25417 78808 61798 -9121 -72054 -72721 -9402 63625 81678 25612 -57438 -92285 -42661
$$ [...]
8191c18
##END NTUPLES=NMR FID
##END=
