##TITLE=1H_LR-798-RM2
 200.13MHz, CDCl3,
 8 sc
 
 11.3.2025
##JCAMPDX= 6.0         $$ Bruker NMR JCAMP-DX V2.0
##DATA TYPE= NMR FID
##DATA CLASS= NTUPLES
##ORIGIN= UXNMR, Bruker Analytische Messtechnik GmbH
##OWNER= pz
$$ XWIN-NMR		Version 3.5
$$ Tue Mar 11 14:46:24 2025 Russian Standard Time (UT+4h)  she@DPX200
##.OBSERVE FREQUENCY= 200.1313
##.OBSERVE NUCLEUS= ^1H
##.DELAY= (6, 6)
##.ACQUISITION MODE= SIMULTANEOUS
##.ACQUISITION SCHEME= undefined
##.AVERAGES= 8
##.DIGITISER RES= 18
##SPECTROMETER/DATA SYSTEM= spect
##.PULSE SEQUENCE= zg30
##.SOLVENT NAME= CDCl3
##.SHIFT REFERENCE= (INTERNAL, CDCl3, 0, 14.3821)
##AUDIT TRAIL= $$ (NUMBER, WHEN, WHO, WHERE, WHAT)
$$ ##TITLE= Audit trail, XWIN-NMR		Version 3.5
$$ ##JCAMPDX= 5.01
$$ ##ORIGIN= Bruker BioSpin GmbH
$$ ##OWNER= she
$$ F:/spectra/data/she/nmr/H-C/1/audita.txt
$$ ##AUDIT TRAIL=  $$ (NUMBER, WHEN, WHO, WHERE, WHAT)
(   1,<2025-03-11 14:45:06.53 +0400>,<she>,<DPX200>,
      <created by zg, POWCHK disabled, PULCHK disabled
       configuration hash MD5:
       00 E9 B6 7A A2 85 ED C7 34 08 36 98 17 FE 4E 26
       data hash MD5: 16K
       8D 7B 3B 84 E2 D5 C4 A3 B5 CC F6 01 67 E3 8F F3>)
$$ ##END=
$$ 
$$ hash MD5
$$ C2 50 29 4D 14 6F F1 2B C3 B3 23 31 EC BB A8 73
##$RELAX= 
##$RELAX= 
##$RELAX= 
##$RELAX= 
##$RELAX= 
##$RELAX= 
$$ Bruker specific parameters
$$ --------------------------
##$DU= <F:/spectra>
##$EXPNO= 1
##$NAME= <H-C>
##$PROCNO= 1
##$TYPE= <nmr>
##$USER= <she>
##$AMP= (0..31)
100 100 100 100 100 100 100 100 100 100 100 100 100 100 100 100 100 100 
100 100 100 100 100 100 100 100 100 100 100 100 100 100 
##$AQSEQ= 0
##$AQ_mod= 1
##$AUNM= <au_zg>
##$AUTOPOS= <>
##$BF1= 200.13
##$BF2= 200.13
##$BF3= 200.13
##$BF4= 200.13
##$BF5= 200.13
##$BF6= 200.13
##$BF7= 200.13
##$BF8= 200.13
##$BYTORDA= 1
##$CFDGTYP= 0
##$CFRGTYP= 5
##$CHEMSTR= <none>
##$CNST= (0..31)
1 1 145 1 1 1 1 1 1 1 1 1 1 1 1 1 1 1 1 1 1 1 1 1 1 1 1 1 1 1 1 1 
##$CPDPRG= <>
##$CPDPRG1= <>
##$CPDPRG2= <>
##$CPDPRG3= <>
##$CPDPRG4= <mlev>
##$CPDPRG5= <mlev>
##$CPDPRG6= <mlev>
##$CPDPRG7= <mlev>
##$CPDPRG8= <mlev>
##$CPDPRGB= <>
##$CPDPRGT= <>
##$D= (0..31)
0 0.7 0 0 0 0 0 0 0 0 0 0.03 0 0 0 0 0 0 0 0 0 0 0 0 0 0 0 0 0 0 0 0 
##$DATE= 1741689905
##$DBL= (0..7)
120 120 120 120 120 120 120 120 
##$DBP= (0..7)
150 150 150 150 150 150 150 150 
##$DBP07= 0
##$DBPNAM0= <>
##$DBPNAM1= <>
##$DBPNAM2= <>
##$DBPNAM3= <>
##$DBPNAM4= <>
##$DBPNAM5= <>
##$DBPNAM6= <>
##$DBPNAM7= <>
##$DBPOAL= (0..7)
0.5 0.5 0.5 0.5 0.5 0.5 0.5 0.5 
##$DBPOFFS= (0..7)
0 0 0 0 0 0 0 0 
##$DE= 6
##$DECBNUC= <off>
##$DECIM= 32
##$DECNUC= <off>
##$DECSTAT= 4
##$DIGMOD= 1
##$DIGTYP= 9
##$DL= (0..7)
0 120 120 120 120 120 120 120 
##$DP= (0..7)
150 150 150 150 150 150 150 150 
##$DP07= 0
##$DPNAME0= <>
##$DPNAME1= <>
##$DPNAME2= <>
##$DPNAME3= <>
##$DPNAME4= <>
##$DPNAME5= <>
##$DPNAME6= <>
##$DPNAME7= <>
##$DPOAL= (0..7)
0.5 0.5 0.5 0.5 0.5 0.5 0.5 0.5 
##$DPOFFS= (0..7)
0 0 0 0 0 0 0 0 
##$DQDMODE= 0
##$DR= 18
##$DS= 0
##$DSLIST= <SSSSSSSSSSSSSSS>
$$ [...]
##$SUBNAM0= <"">
##$SUBNAM1= <"">
##$SUBNAM2= <"">
##$SUBNAM3= <"">
##$SUBNAM4= <"">
##$SUBNAM5= <"">
##$SUBNAM6= <"">
##$SUBNAM7= <"">
##$SUBNAM8= <"">
##$SUBNAM9= <"">
##$SW= 18.0517328524113
##$SWIBOX= (0..15)
0 0 2 0 0 0 0 0 0 0 0 0 0 0 0 0 
##$SW_h= 3612.71676300578
##$TD= 16384
##$TD0= 1
##$TE= 0
##$TE2= 300
##$TE3= 300
##$TEG= 300
##$TL= (0..7)
0 120 120 120 120 120 120 120 
##$TP= (0..7)
150 150 150 150 150 150 150 150 
##$TP07= 0
##$TPNAME0= <>
##$TPNAME1= <>
##$TPNAME2= <>
##$TPNAME3= <>
##$TPNAME4= <>
##$TPNAME5= <>
##$TPNAME6= <>
##$TPNAME7= <>
##$TPOAL= (0..7)
0.5 0.5 0.5 0.5 0.5 0.5 0.5 0.5 
##$TPOFFS= (0..7)
0 0 0 0 0 0 0 0 
##$TUNHIN= 0
##$TUNHOUT= 0
##$TUNXOUT= 0
##$USERA1= <user>
##$USERA2= <user>
##$USERA3= <user>
##$USERA4= <user>
##$USERA5= <user>
##$V9= 5
##$VALIST= <valist>
##$VCLIST= <CCCCCCCCCCCCCCC>
##$VD= 0
##$VDLIST= <DDDDDDDDDDDDDDD>
##$VPLIST= <PPPPPPPPPPPPPPP>
##$VTLIST= <TTTTTTTTTTTTTTT>
##$WBST= 1024
##$WBSW= 4
##$XGAIN= (0..3)
0 0 0 0 
##$XL= 0
##$YL= 0
##$YMAX_a= 385325
##$YMIN_a= -463070
##$ZGOPTNS= <>
##$ZL1= 120
##$ZL2= 120
##$ZL3= 120
##$ZL4= 120
##$ABSF1= 10
##$ABSF2= 0
##$ABSG= 5
##$ABSL= 3
##$ALPHA= 0
##$AQORDER= 0
##$ASSFAC= 0
##$ASSFACI= 0
##$ASSFACX= 0
##$ASSWID= 0
##$AUNMP= <proc_1d>
##$AZFE= 0.1
##$AZFW= 0.1
##$BCFW= 1
##$BC_mod= 2
##$BYTORDP= 1
##$COROFFS= 0
##$CY= -3
##$DATMOD= 1
##$DC= 2
##$DFILT= <>
##$DTYPP= 0
##$F1P= 0
##$F2P= 0
##$FCOR= 0.5
##$FTSIZE= 0
##$FT_mod= 4
##$GAMMA= 1
##$GB= 0.15
##$INTBC= 1
##$INTSCL= 1
##$ISEN= 128
##$LB= 0.25
##$LEV0= 0
##$LPBIN= 0
##$MAXI= 10000
##$MC2= 0
##$MEAN= 0
##$ME_mod= 0
##$MI= 1.114404
##$NCOEF= 0
##$NC_proc= 0
##$NLEV= 6
##$NOISF1= 3.799351
##$NOISF2= 2.8
##$NSP= 1
##$NTH_PI= 0
##$NZP= 0
##$OFFSET= 14.38212
##$PC= 1
##$PHC0= -470.6505
##$PHC1= 13.99221
##$PH_mod= 1
##$PKNL= yes
##$PPARMOD= 0
##$PSCAL= 0
##$PSIGN= 0
##$REVERSE= no
##$SF= 200.129724274929
##$SI= 16384
##$SIGF1= 3
##$SIGF2= 2
##$SINO= 400
##$SIOLD= 16384
##$SREGLST= <1H.CDCl3>
##$SSB= 0
##$STSI= 0
##$STSR= 0
##$SW_p= 3205.1282051282
##$SYMM= 0
##$S_DEV= 0
##$TDeff= 0
##$TDoff= 0
##$TI= <>
##$TILT= no
##$TM1= 0
##$TM2= 0
##$TOPLEV= 0
##$USERP1= <user>
##$USERP2= <user>
##$USERP3= <user>
##$USERP4= <user>
##$USERP5= <user>
##$WDW= 1
##$XDIM= 8192
##$YMAX_p= 0
##$YMIN_p= 0
$$ End of Bruker specific parameters
$$ ---------------------------------
##NTUPLES= NMR FID
##VAR_NAME=  TIME,          FID/REAL,        FID/IMAG
##SYMBOL=    X,             R,               I
##VAR_TYPE=  INDEPENDENT,   DEPENDENT,       DEPENDENT
##VAR_FORM=  AFFN,          ASDF,            ASDF
##VAR_DIM=   8192,          8192,            8192
##UNITS=     SECONDS,       ARBITRARY UNITS, ARBITRARY UNITS
##FACTOR=    0.0002768,     1,               1
##FIRST=     0,             0,               0
##LAST=      2.2672688,     0,               0
##MIN=       0,             -463070,         0
##MAX=       2.2672688,     385325,          0
$$ Real data points
##PAGE= N=1
##DATA TABLE= (X++(R..R)), XYDATA
0 0 0 0 0 0 0 0 0 0 0 0 0 0 0 0 0 -8 8 -8 8 -8 13 -16 16 -19 24 -24 30 -33 38 -45 51 -55 61 -70 80 -89 98
37 98 -111 121 -135 150 -165 182 -202 222 -244 270 -296 325 -357 393 -434 480 -531 590 -658 737
57 737 -831 944 -1084 1258 -1482 1784 -2210 2843 -3861 5691 -9626 21258 -120950 -463070
71 -463070 119751 212980 -272950 34704 373422 -105754 -229711 163309 14208 -216990
81 -216990 109114 187582 -130399 -76083 124975 -24801 -123014 25265 63705 -25751 -21647
92 -21647 50406 31550 -77615 -51148 82250 16155 -76960 87310 110602 -116754 -62604
103 -62604 99045 -72527 -100969 165460 79420 -150670 31972 92803 -190541 -90983 202182
114 202182 30072 -112085 99601 50450 -160118 -10305 114536 -42625 -30459 106185
124 106185 10079 -87588 10453 37622 -49153 -30694 50014 34856 -30568 -31287 6600 -15509
136 -15509 -42088 37900 78208 -30518 -46550 48792 -17334 -79098 70874 84308 -75423
147 -75423 -6661 94079 -65034 -94320 86375 25888 -107902 39285 102224 -75802 -57117
158 -57117 78443 -23666 -83872 63787 58057 -56464 12322 60999 -43990 -41381 46430
169 46430 11143 -30801 22683 28375 -31756 -30324 8078 3841 -8435 7505 15881 -9260 -32152
182 -32152 -6942 25048 3596 -4548 32561 8945 -38209 5996 29354 -26406 -8043 44439
194 44439 -7928 -36246 27775 12234 -52992 -6904 35894 -22394 -19572 42970 3658 -40502
206 -40502 15146 23828 -28204 500 37970 -4594 -17571 18882 6993 -20317 1405 14276
218 14276 -9899 -12393 7738 -2925 -18604 436 12941 -3936 -8254 7529 5682 -10845 -1978
231 -1978 16710 4239 -6898 13611 11087 -15976 -3992 12820 -9011 -12533 10494 2217 -14744
244 -14744 -422 4941 -12157 -5880 10567 -2745 -8271 13224 9300 -9472 2522 12698 -2789
257 -2789 -3146 8441 2380 -5857 -1287 788 -4017 -3346 163 -4413 -7141 -128 1493 -2567 -1196
272 -1196 1965 2001 3475 2419 2586 3214 1594 2513 2598 -1032 1028 2854 -5202 -7141 1146 2382 -5935
289 -5935 -7094 -353 532 -2235 770 440 -1244 5000 5225 -1671 3210 7725 -588 -2299 2800 1390
305 1390 208 591 -3980 -5993 -648 1191 -5385 -7124 -343 1570 -213 689 622 1687 4551 425
321 425 -1107 5257 5294 862 -251 3 1539 2069 -3776 -6485 -2963 -547 -1529 -2135 -2283 -941 203
338 203 996 -1005 -1803 4235 4974 178 1796 5975 3763 1135 -1483 -3655 205 1622 -3068 -4276
354 -4276 -1227 1718 -1089 -5254 -2637 324 -2190 -1382 2708 2871 2609 4915 3323 -772 -215 3898
370 3898 165 -5007 1698 4511 -3043 -2273 1420 -5806 -5967 1705 -2879 -6280 3042 6505 -2179 -1373
386 -1373 6872 2612 -4571 3266 5765 -2541 308 6713 -444 -4170 1976 582 -7490 -6305 1534
401 1534 -511 -4740 1326 4485 -3398 -1578 5750 -1269 -6106 5774 8815 -2104 677 10922
415 10922 763 -11127 610 5073 -8963 -3896 8926 -3367 -9608 5894 3196 -12179 -2584
428 -2584 10578 -2624 -7212 10493 7964 -8810 2652 14773 -5278 -9628 10144 2141 -15217
441 -15217 2205 14508 -7738 -11998 10217 1475 -18112 913 12541 -12031 -6892 21054 4991
454 4991 -15024 8574 12100 -15796 -5750 19954 773 -13865 10132 8509 -18504 -4037 15642
467 15642 -9764 -17409 11891 8701 -14242 1226 14693 -7068 -11919 12286 9304 -10857 2246
480 2246 15445 -6263 -11330 13103 7827 -14575 -2777 10401 -9819 -14298 10798 8624 -13427
493 -13427 698 15046 -11045 -17081 14176 10282 -12899 6069 19318 -9551 -12661 16058 4045
506 4045 -19246 4387 14051 -17487 -8676 24077 -235 -24172 5834 9167 -20831 -1503 26893
519 26893 -2915 -18626 14271 10113 -19973 3657 26524 -8782 -19483 14184 6542 -19570
531 -19570 4438 20222 -12556 -17579 12419 2316 -20668 4838 20750 -9842 -11767 17820
543 17820 3988 -18494 6487 16819 -11985 -7760 19378 2780 -16978 6793 11044 -18504
555 -18504 -10267 16189 489 -13652 7845 8254 -14560 -5567 13695 142 -9606 8025 9751
568 9751 -9832 -3707 15552 2005 -12882 4879 9464 -12661 -8115 13127 -1280 -14885 7819
581 7819 11107 -15134 -5629 15471 -6442 -14526 16114 12085 -14249 3927 15840 -12214 -10568
594 -10568 16862 1985 -15298 7825 10985 -15793 -6623 14384 -4406 -14339 8233 5801 -12441
607 -12441 693 13163 -3717 -7629 8842 4816 -9470 1253 11967 -3024 -8544 6752 3854
620 3854 -9636 -21 7929 -6692 -9602 5742 2371 -9444 2017 10399 -4774 -7003 7862
633 7862 2799 -7379 3992 9331 -3925 -3430 6823 -19 -7763 1575 5235 -5683 -5283 4737
647 4737 595 -6487 1705 4137 -5605 -3502 6220 1997 -3707 4203 6001 -5283 -2975 7874 957
662 957 -6043 3335 3111 -7871 -2052 6386 -3354 -6056 4829 920 -8161 692 7237 -3196 -2975
677 -2975 7623 1330 -5470 4540 5290 -5379 -366 6605 -2215 -5525 3512 2288 -5850 -1214 2561
692 2561 -4381 -3812 4484 1372 -3570 1900 2442 -3490 -669 5559 3077 -1774 562 1770 -1805 -1062
708 -1062 3000 598 -3732 -901 629 -3358 -2181 1904 -36 -3135 679 2289 -876 -270 3450
723 3450 325 -1630 2900 2280 -1929 666 3159 -1199 -2623 80 -346 -2696 -631 1308 -1499 -2743
739 -2743 750 1191 -1418 794 2989 -323 -1452 1598 2342 -287 1193 3080 -1020 -2411 1300 232
755 232 -3504 122 1160 -3333 -1229 2061 -990 -2239 1128 963 -1488 927 2787 -274 -302 2381
771 2381 1073 -726 773 309 -1519 -470 351 -794 -1180 -1009 -248 -958 -1387 -52 489 -358 384 1948
789 1948 1249 353 1442 680 -308 344 1210 -248 -519 825 -31 -1508 -737 -876 -1928 -794 -199 -734
807 -734 379 1002 284 299 654 673 588 252 582 1165 418 460 325 -84 -705 -895 -1141 -1217 -907 -25 -302 -765
829 -765 40 169 -851 217 1120 153 1155 1406 607 409 1249 276 -791 -373 -382 -713 -456 -378 -372 -737 -512
850 -512 -566 -888 -263 -34 110 927 1164 1554 1570 286 339 473 95 -45 465 -536 -699 141 -543 -1339 -959
871 -959 -646 -982 -856 477 1194 29 438 1188 307 378 1022 394 -380 473 1469 239 -703 84 -247 -2143
891 -2143 -1115 281 -1773 -1346 897 482 -777 790 1337 -1116 -635 2201 1359 51 1823 1470 -1400
908 -1400 -685 1315 -1411 -2240 720 -136 -2058 -98 1047 -1404 -1501 560 572 -734 1045 1975 -271
925 -271 395 2160 677 -889 -230 678 -1013 -1347 510 256 -1620 -377 690 -1218 -1968 261 135
942 135 -1677 851 3744 544 -1039 1013 1026 -1904 179 2578 -451 -1453 1860 214 -2867 -307
958 -307 1054 -2229 -1975 2307 351 -2491 602 2071 -1412 -2 3828 311 -2000 1760 1896 -2544
974 -2544 100 3346 -421 -2599 1346 -3 -3877 -804 2355 -1125 -1302 2657 75 -3362 366
989 366 2249 -1182 244 3602 1311 -1415 820 805 -2018 -784 1834 -76 -1504 492 166 -2572
1005 -2572 -1685 1063 314 -746 791 1316 -1473 -1066 1999 957 -368 1671 1444 -1361 -1376 881 6
1022 6 -1843 937 2043 -1702 -2525 676 -861 -2678 1118 2795 -760 -306 2564 -409 -2448 1567
1038 1567 2393 -1048 567 3252 -1038 -3125 795 -157 -2588 861 2309 -1884 -2116 846 -1041 -2256
1054 -2256 1967 2838 -868 111 1801 -1112 -1578 2196 1738 -523 1009 691 -2303 -2106 212 -339 -1038
1071 -1038 731 827 -1418 -1152 117 -696 -473 1154 1586 564 826 604 -474 -1241 78 891 462 171
1089 171 136 -996 -2117 -1249 -257 9 302 453 -453 -934 -696 633 271 490 1486 893 -571 56 544
1108 544 -775 -240 1105 213 -795 142 -302 -2030 -1507 337 -265 -139 1458 500 -1427 -477 855
1125 855 43 898 2388 674 -1287 -390 -384 -1273 63 1582 -710 -1699 32 -898 -1850 813 869 -1251
1143 -1251 -485 1373 -133 -604 1578 619 -1352 520 1610 -501 193 1223 -831 -2421 99 479
1159 479 -349 141 -59 -1201 -1339 250 567 270 782 834 -215 -764 599 1068 618 477 212 -138 -1184
1178 -1184 -687 289 -341 -714 173 -356 -1186 33 970 -445 -573 777 486 -105 1030 1294 -397 -361
1196 -361 546 -326 -801 728 626 -1412 -986 180 -487 -1029 304 352 -928 -660 783 -98 -434 1152
1214 1152 825 -635 21 1103 -389 -744 867 242 -812 -40 466 -1281 -1317 373 -280 -1191 645
1231 645 996 -868 271 943 27 -25 1403 673 -315 242 540 -354 -116 -33 -305 -762 -439 -258 -65 -26
1251 -26 -30 124 22 -185 363 352 -331 457 621 265 239 605 342 -458 -264 174 -550 -474 202 -302 -715 360
1273 360 -155 -845 -279 358 -85 120 518 658 199 771 577 -29 279 268 -138 -111 -102 155 -442 -248 -755
1294 -755 -529 -428 -256 18 24 -344 233 382 422 -37 538 43 -55 190 244 -14 -109 -171 -483 -379 -220 -516
1316 -516 -461 -300 -10 -38 121 121 -314 437 284 271 385 403 268 399 503 130 -84 -197 -402 -546 -269 -229
1338 -229 -645 -14 -23 -567 -36 282 -224 219 638 76 442 747 249 52 372 56 -300 186 -247 -576 -206
1359 -206 13 -548 -680 -115 -439 -312 288 96 257 543 517 344 448 440 59 -14 81 -38 328 -101 -198 -296
1381 -296 -427 -381 -562 -314 -304 -252 339 267 155 327 419 -136 39 306 634 118 186 -85 -108 -148 84 -39 -490
1404 -490 -609 -43 -128 -84 153 299 -74 6 143 257 402 340 375 161 105 612 -133 -169 78 -226 -446 -23
1426 -23 -139 -540 -206 204 -300 -422 -6 240 -42 379 509 -1 373 150 27 81 344 -357 131 24 -270
1447 -270 3 -326 -489 -400 92 -253 -377 185 361 155 302 737 28 -134 641 146 -400 558 -29 -667
1467 -667 115 167 -631 -469 -60 -313 -490 -178 170 -378 79 472 311 -290 556 794 70 82 147 96 -184
1488 -184 361 281 -572 -480 35 -284 -795 -268 295 -117 -158 468 93 -162 290 408 174 205 639 316 -31
1509 -31 192 68 -251 -337 240 172 -291 -415 -229 -236 -445 354 145 -543 149 733 131 -18 783 148 -295 376
1531 376 874 -45 -453 504 -500 -1216 -18 766 -695 -558 399 -533 -959 605 912 -73 222 756 -484
1550 -484 -587 1110 585 -510 151 96 -715 -317 297 -122 -790 74 -38 -515 -412 468 429 -534 -2 254
1570 254 -171 55 917 398 -292 -221 265 58 -44 550 335 -979 -534 515 -432 -328 767 -12 -787
1589 -787 331 327 66 -108 713 404 -506 241 690 -169 -197 694 -166 -660 115 207 -771 -555 534 -253 -821
1610 -821 369 625 -717 -106 468 -47 115 985 547 -553 39 363 -415 -458 633 16 -845 15 403
1629 403 -658 -445 332 -217 -614 365 504 -54 337 272 -421 -236 357 512 402 173 -115 -709 -440 288
1649 288 123 -151 -439 -114 -459 48 235 476 159 23 60 101 13 349 458 88 -67 265 -41 -370 582
1670 582 -2 -970 -454 337 -103 -231 175 -113 -575 -220 385 37 282 541 339 -306 54 201 -32 -117
1690 -117 28 -131 -528 -198 -69 -191 -58 63 -392 -269 105 59 -26 73 189 114 97 671 239 -338 231 152
1712 152 -542 -203 56 -87 -261 -313 -335 -568 44 407 -52 103 397 31 105 246 185 197 185 289 -24 82
1734 82 -187 -35 -105 -342 -239 -277 -153 -257 -186 -53 28 28 98 21 138 510 242 209 227 160 -116 148 -72 -439
1758 -439 2 68 -228 -430 26 -6 -279 -80 -63 -186 42 16 149 180 128 62 -62 199 4 -82 -117 284 186
1781 186 -343 -230 72 -162 -124 57 -141 -177 -70 44 175 111 220 431 -69 255 92 118 -69 -37 -150 -362
1803 -362 -201 -220 -198 -289 -299 -129 25 31 8 -88 22 215 198 109 405 349 154 329 -141 61 55 -111 -90 -51 -509
1828 -509 -278 -200 -321 203 37 -59 -135 48 252 260 308 292 262 247 42 203 -245 58 33 -191 -184 -8 66 -300
1852 -300 -27 -243 -398 -80 162 -89 315 217 22 100 198 195 -78 333 204 -174 -69 94 -126 -270 -44 -47
1874 -47 -145 -167 -56 -125 -117 -175 -185 -45 -28 198 334 261 108 298 -278 96 291 -103 -86 1 -310 68 -239 -416
1898 -416 187 -197 -321 114 -102 171 416 -8 262 164 208 -83 97 144 168 -235 -140 194 -273 -281 230 -125
1920 -125 -59 171 -53 -467 182 345 93 118 227 290 -178 26 238 144 -58 49 -43 -286 -379 26 -447 -92
1942 -92 -44 -26 -565 206 191 -58 -49 408 121 -137 265 122 -226 38 202 -103 -2 -43 185 -283 -400 163
1964 163 -20 -591 40 356 -90 31 124 -220 -180 43 360 30 194 420 -105 -396 256 322 -372 13 326
1985 326 -402 -381 52 44 -331 -14 533 -427 -295 486 407 -247 262 376 -153 -313 432 30 -355 398 301 -96
2007 -96 -443 93 -382 -564 131 344 -163 -38 489 -144 126 364 78 -126 79 378 72 -293 312 -178
2027 -178 -667 -272 142 -369 -423 130 153 -836 -153 532 27 -29 259 417 -185 91 507 -164 -378 387 -191
2048 -191 -392 51 38 -308 -422 247 71 -530 -90 466 -69 -67 365 177 -609 -219 343 -174 94 386 296
2069 296 -285 448 199 -600 -243 99 -70 -441 284 156 -789 149 613 0 -210 495 341 -466 246 715
2089 715 -204 -157 450 -54 -472 -63 113 -268 -5 95 219 -242 42 -57 -446 16 532 66 -104 316 305
2110 305 -75 14 269 117 -141 108 -127 -411 -145 47 -392 -272 -28 -138 -340 -94 329 -86 -89 200 67
2131 67 -322 -17 418 -592 -344 491 -48 152 1 103 -84 -228 -10 120 -498 90 425 -284 -211 321
2151 321 25 -45 461 383 -188 59 103 -191 -435 576 -66 -325 114 78 -191 -527 278 82 -186 294 236
2172 236 -125 51 516 -194 -172 130 215 -426 29 262 33 -331 287 -129 -337 -276 28 83 -210 271 115
2193 115 -224 24 178 185 -135 238 347 -232 169 13 -296 -48 211 -66 50 -161 176 -489 -59 150 -121
2214 -121 -36 -112 78 -169 98 285 -2 201 136 317 -141 -164 410 -224 -154 -94 -50 -158 -139 4 -95 -252 163
2237 163 6 -318 -109 603 -16 -75 328 480 -59 296 136 43 -343 9 -317 -272 223 45 -190 122 -23
2258 -23 -152 45 20 -61 78 138 41 372 115 39 26 -116 -16 85 11 -91 250 -37 -27 196 8 -7 -133
2281 -133 122 143 -218 -160 172 77 107 208 75 -169 126 62 45 3 160 14 -376 -281 203 -324 -44 33 -47
2304 -47 96 62 10 -9 75 23 223 -23 232 148 16 4 -105 66 -1 281 -240 -98 135 -89 -125 -153 55 -6
2328 -6 106 116 -158 109 70 151 -167 -124 -200 4 85 -60 -177 -105 -84 -303 -184 -173 141 -92 48 111 129 -23
2352 -23 230 70 161 17 -22 175 50 -50 123 55 -22 -265 138 -58 174 8 93 95 -64 -147 27 -15 -10 204
2376 204 116 14 225 101 74 225 217 -27 -72 -167 -71 -351 -284 -34 -148 46 101 -198 -357 123 -236 -131 -40
2399 -40 97 -51 -336 195 331 -60 -38 -243 -332 -229 9 99 16 -154 67 279 -137 239 126 61 -157 -60
2421 -60 -85 -278 138 93 52 190 97 128 80 -129 -94 -382 -81 -37 -129 -337 104 67 -175 176 -59 -230 -233 254
2445 254 80 -38 -105 -73 -22 86 115 -46 14 130 144 -224 -21 54 -87 -19 -76 148 -127 216 139 -224 -62
2468 -62 54 -144 117 104 183 -255 31 -58 -57 -30 76 17 -58 -89 58 6 31 -24 -16 -21 43 -49 -256 104 -77 -115 -26
2495 -26 -195 119 -132 156 1 -15 -252 9 -184 -265 213 243 175 -26 -41 -25 -159 -118 4 329 51 -35 213
2518 213 -63 -164 9 -78 -115 -293 -132 -5 43 133 -128 -28 -116 34 -10 -108 153 -86 137 -52 209 34
2540 34 32 -206 -210 -276 12 -114 -217 -52 -122 -372 -255 -437 -78 30 6 -70 66 37 -192 -90 -179 12 -155 -27
2564 -27 -406 134 -75 -41 -449 -82 0 -253 13 -175 -87 -54 21 48 214 289 169 -23 196 44 17 143 151 73
2588 73 -116 239 414 -178 92 222 -243 17 -175 316 -109 306 90 -19 -160 76 138 -114 -18 -44 -161
2609 -161 -242 132 305 -262 114 -33 -260 202 130 -108 -13 -25 -7 48 -35 188 38 -108 341 148 -15 5 110
2632 110 152 -98 -203 -278 -81 151 14 -56 -158 -193 239 184 29 166 -113 196 138 198 -73 -152 116 -15 14
2655 14 94 15 45 -291 141 218 155 37 -42 -47 -22 -44 -44 202 408 -237 15 60 37 15 6 -26 224 -143 107 233
2681 233 -82 -182 -144 -36 39 0 -148 -142 -36 -85 50 121 -114 171 -289 147 -152 173 -22 197 36 13 -53
2704 -53 -274 99 26 -307 -123 -390 119 159 -107 -33 -13 -353 282 -75 0 -166 -229 150 106 -21 -298 -79 83
2727 83 -15 -61 -251 -28 -46 65 160 266 0 81 0 -148 91 -23 -28 -269 -70 -42 -159 263 -63 -89 0 -57
2751 -57 -157 183 57 19 -75 166 62 -81 145 -86 -29 287 362 65 -57 -274 218 -11 134 154 0 -116
2773 -116 97 -119 5 -110 -53 -75 130 -122 -162 -173 -48 123 -105 20 373 150 182 -147 -144 -240 126 253 -159
2796 -159 -75 -64 -348 -61 9 0 -50 157 -119 69 -380 130 -22 -34 -38 53 256 21 78 316 56 63 374 -96
2820 -96 246 8 -88 14 5 14 66 -81 42 -145 134 -77 -10 125 194 125 151 6 51 -26 100 -52 602 14
2844 14 -138 4 84 114 -100 130 -267 17 -257 228 70 281 -53 351 137 79 120 -123 98 142 -275 -267 -58
2867 -58 60 -60 114 -38 148 196 123 346 2 -91 59 26 -93 -107 305 10 -76 -153 -23 17 -95 295 -156
2890 -156 32 -34 -166 95 -38 -89 -210 -356 -337 230 -162 -92 52 60 -66 -5 6 -152 202 56 133 212 39
2913 39 -18 75 36 63 -95 -206 104 -4 -52 -167 49 143 -90 -1 -42 188 -18 -16 146 -181 -19 -145 113 -108
2937 -108 1 14 70 -128 -89 -265 -181 321 -31 -123 220 48 180 -24 62 4 173 184 197 47 -19 3 -3 -81 -33
2962 -33 161 -175 23 -229 63 50 235 19 -87 227 104 -95 -136 91 168 74 -116 26 -209 62 206 -177
2984 -177 -315 -218 -115 174 -138 202 -27 -5 -260 -68 219 224 1 184 204 -102 111 -126 61 -136 -145 -7
3006 -7 -29 206 -14 -13 266 -75 64 -274 64 125 253 -99 -172 167 156 -73 22 193 -105 16 -183 -178 -134 -11
3030 -11 -66 6 62 -174 -19 159 66 -4 2 -116 -48 77 163 52 -116 -44 -81 -222 -71 -36 229 184 16 55 -103
3055 -103 -101 -203 -447 49 -79 102 71 -13 -50 20 -77 53 -133 -120 72 -332 207 138 -188 -152 70 -145 -85 2
3079 2 88 -264 -65 129 366 -204 210 352 51 -175 132 103 -28 -112 -88 -117 -79 -88 -26 65 -49 -9 46 17 156
3104 156 37 116 83 105 -33 -116 226 -19 -91 -47 0 -18 56 -64 -49 -250 12 1 -139 -18 -89 136 -22 144
3128 144 270 -110 334 52 -49 54 96 -225 123 -49 -260 -87 -94 5 -160 -351 -17 -330 122 243 -133
3149 -133 -178 11 -63 164 -185 66 -198 227 -76 -148 29 -242 -86 -92 57 -19 -142 -105 150 -50 17 -174 21
3172 21 129 35 93 -125 -275 -305 118 240 357 -151 90 249 -83 49 -223 89 -43 32 50 34 113 95 -71
3195 -71 -230 88 78 -193 -147 196 166 -94 -3 8 -2 146 -29 250 14 -128 -122 104 -89 243 124 -77 300
3218 300 -73 59 -3 166 -185 -83 -9 -324 0 8 -517 -71 105 15 -268 105 113 56 204 -12 31 -76 121
3241 121 -2 -56 -200 -157 -21 -64 -189 -42 212 22 -67 11 -46 -39 -216 112 -210 113 69 124 -217 -165 55 57
3265 57 -169 56 -190 -47 147 -111 -124 -19 49 15 35 -50 211 240 10 31 55 140 280 200 -281 115 94 26
3289 26 142 136 53 170 -154 -25 108 14 -203 -103 12 90 -161 -10 -23 90 110 101 -104 69 320 -116 13
3312 13 -173 -18 249 224 -132 -100 -113 -109 -245 89 -270 82 151 -54 36 -199 -25 -80 133 -163 45 -20 211
3335 211 173 -7 15 -89 -13 -153 245 -151 74 -146 -102 81 130 -131 270 104 236 320 109 50 104 22 23 115
3359 115 67 -42 53 -160 -368 -33 129 -23 79 250 166 -46 90 -135 -240 43 71 -75 -70 -92 205 -1
3381 -1 -112 -227 -97 272 94 86 -190 -159 -107 -214 -76 235 -2 -71 1 -35 -233 -82 -73 18 -163 82 37 44 18
3406 18 94 -18 29 85 -257 52 28 -253 -182 -299 -127 63 -121 -114 75 -153 -116 -85 -185 45 -31 -25 -91 -100 248
3431 248 -264 -21 -290 286 -105 -177 -166 -133 19 -72 44 216 -373 96 311 -154 24 4 86 -28 -228 26
3453 26 -68 92 132 38 84 -99 -72 -75 -125 35 202 -137 -159 141 -22 239 26 -24 102 16 -53 -251 -19 110
3477 110 -133 -123 226 -47 84 2 154 14 -93 234 -16 -218 3 -65 126 199 244 68 321 -154 -126 -33
3499 -33 -132 -17 101 120 -48 126 108 58 -258 -269 -30 -107 39 111 -81 156 -94 15 -190 337 -107 50 154
3522 154 -234 162 -147 -176 213 -204 -119 2 326 -82 -110 -193 -213 163 77 -176 222 -144 59 -171 -113 -99 282
3545 282 168 -28 15 37 259 -131 -87 -80 3 92 -42 42 99 70 176 58 57 -60 113 110 -143 -8 36 127 -80
3570 -80 -23 -10 -211 197 68 11 271 102 -64 -172 -81 -106 176 98 12 -42 -242 179 -259 60 -139 146 -188
3593 -188 -398 35 -207 106 19 -278 -77 -126 -159 15 254 186 14 -344 -197 97 -124 -142 -267 114 146 -250
3615 -250 -99 -53 16 194 -34 58 259 158 142 129 99 169 -36 65 -160 242 -283 -133 -67 -101 -59 -79 64 -6
3639 -6 147 -159 2 154 8 -250 -80 -89 -31 -15 -25 -65 276 153 -57 -158 21 -109 -102 -196 -124 -41 -121 -121 -158 43
3665 43 -119 34 -107 -171 114 71 127 175 -104 -100 223 96 -41 -28 -268 28 327 -186 -32 150 -317 -234 -180
3688 -180 187 -24 -80 194 123 -274 41 48 -60 -137 -69 -100 -133 108 -291 58 96 -82 -76 67 59 139 -84 -314 -86
3713 -86 -22 -56 -57 225 -19 -19 150 -11 -116 0 -186 -149 149 -21 -187 8 31 108 -90 24 -92 33 30 -114
3737 -114 144 -80 -209 -165 20 -140 14 -217 -427 -286 8 244 -390 106 317 300 294 -93 -201 161 79 -92
3759 -92 190 99 -31 -127 -181 -151 -90 56 -31 -165 55 -49 -142 118 114 -90 218 97 13 -36 -161 -199 42 108 197
3784 197 10 34 83 46 -7 68 -65 -56 156 -346 -43 73 -172 158 62 -142 196 -100 68 122 -10 66 143 -13
3808 -13 -23 -38 128 -51 -115 69 -14 16 -8 -105 -203 203 35 -4 -109 139 49 132 -22 105 -78 -3 -32 -152 -52
3833 -52 24 -57 -167 62 108 169 -166 -196 -5 255 41 157 236 -81 387 -246 135 -22 -122 165 -148 142
3855 142 -329 192 -41 -190 -23 113 -17 26 -13 148 253 -110 159 -17 62 377 -183 121 -347 -21 -210
3876 -210 -27 106 40 -295 177 -6 82 -171 -37 -72 0 56 7 -37 58 56 56 -165 52 -93 -127 169 21 112 34
3901 34 -108 -180 -252 66 -20 25 -138 -8 119 224 31 -83 182 -163 -20 -41 -61 217 306 19 135 76 -22
3924 -22 192 -147 -25 -63 -62 -71 30 214 19 151 -113 -178 -73 31 78 9 173 -147 212 -289 138 10 185
3947 185 85 -83 -33 -107 128 238 48 -49 -151 47 101 -81 -64 -7 4 -246 -134 -231 106 205 2 -184 -235
3970 -235 -58 -248 -29 115 -130 106 -79 -27 -290 -125 50 151 74 21 24 -31 -234 -275 89 -311 -56 -64 -140
3993 -140 -121 -90 46 -62 -83 47 -154 250 217 -113 -25 228 51 -90 87 -21 122 32 144 39 85 190
4015 190 -19 170 26 -99 132 -9 -59 -43 71 156 -30 -10 -118 -29 0 59 -54 174 -408 14 141 83 9
4038 9 172 100 -6 324 6 -35 -14 -207 -161 161 114 130 68 193 -1 231 -30 319 142 198 -14 -134 -52 169
4062 169 -82 -50 -43 16 -29 -262 255 28 126 -9 163 129 105 57 169 -46 -160 -144 -63 -157 -42 20 -105 107
4086 107 -33 250 295 209 68 108 -52 -12 -3 145 -20 -129 -78 -6 168 -117 -148 -181 -35 -132 171 -41 -38 185
4110 185 159 -56 -73 -196 -205 -103 -117 53 -95 -450 -111 -81 39 145 -153 85 103 -29 -231 13 107 -174 -105
4133 -105 -47 -85 12 -129 -58 34 -80 -41 -56 252 34 -14 -50 -8 -82 12 -59 98 -133 -264 -51 97 179 76 -220
4158 -220 96 127 -103 8 -26 169 -308 -186 78 178 79 139 -9 -98 -186 -34 159 43 -129 168 483 63
4180 63 -107 41 -58 -70 -51 -48 51 287 132 112 269 -18 -30 84 279 -34 -222 -389 -180 -31 -75 79 -66
4203 -66 -70 -166 -181 -48 167 253 123 188 106 22 -51 36 -56 83 109 141 -135 146 41 -110 -115 -258 30 238 167 44
4229 44 -71 172 -113 13 128 43 -215 191 372 12 2 -67 -85 6 111 -80 -190 -115 -5 55 -21 -94 -90 -25
4253 -25 -28 192 256 45 -203 -131 -88 -92 -276 -77 113 421 -165 331 65 -13 177 44 16 62 -121 271 129 -40
4277 -40 -72 -182 204 122 -13 -76 54 -109 -234 -77 40 187 -4 -210 -26 242 -25 313 -104 -101 122 -148
4299 -148 155 26 -202 -6 131 -189 51 16 132 -25 -156 14 -52 92 -16 -161 68 -204 -163 184 76
4320 76 -28 -91 -74 127 -167 -75 -180 -21 -63 -108 -71 117 -8 49 86 197 -138 -215 112 248 -153 -94 -67 -47
4344 -47 322 8 -46 82 -131 75 83 -14 168 -193 -167 61 228 -96 -241 -63 72 1 -183 143 86 -8 -278
4367 -278 -89 157 168 225 66 156 269 51 -162 -200 109 -15 136 -103 2 32 90 -106 -10 74 68 76 -327 195
4391 195 169 -187 42 186 272 243 -106 -134 -209 -358 -297 28 -22 129 297 -130 -314 -94 -219 51 257 122
4413 122 -49 -34 -41 54 164 -180 98 -82 -53 -239 -63 -151 -135 -160 -179 -25 -299 -47 212 -39 -128 -62 47 -67
4437 -67 35 -107 -45 -95 -147 -77 -116 -64 -132 14 -208 -158 232 2 184 -119 -2 -17 107 -4 151 46 -42 60
4461 60 27 269 -18 -125 269 -18 177 -278 -167 -191 -161 -28 51 -143 -141 38 37 -157 30 -148 219 -198 -137
4484 -137 47 -110 14 -21 203 -204 61 -69 -139 -127 -27 90 85 139 74 160 -30 -23 -52 287 138 -293 -55 89
4508 89 -88 192 128 -102 182 150 -95 -11 -14 -40 160 30 -211 -49 -153 275 150 -113 -211 41 -77 -48 323
4531 323 63 -153 67 23 76 -48 164 -129 -21 -185 -33 -104 -182 -171 -145 202 242 -183 17 56 -108 142 -98
4554 -98 228 127 178 -129 -175 -315 40 -59 165 -40 222 226 -225 -224 100 27 26 26 -226 163 -32 141 -166 -55
4578 -55 111 -223 -102 -94 -105 -102 -101 79 46 -112 3 119 113 -33 83 -242 -254 70 -96 385 62 -39 -187 35
4602 35 16 3 232 -107 -88 -60 236 84 -232 258 -167 91 -291 -13 344 243 -18 112 91 83 145 238 -183
4625 -183 168 68 -207 14 -51 85 54 -42 -11 478 27 59 -33 -107 95 117 66 117 -23 412 -74 -78 34 161
4649 161 -9 -7 2 11 107 232 -50 38 62 -194 -44 -59 -340 16 -181 191 169 -115 0 119 -85 287 188 -212
4673 -212 -12 255 146 140 18 116 105 -48 -53 -11 -15 -67 24 -113 179 -50 -97 159 -14 -4 -224 32 -3 -67 -173
4698 -173 -72 248 119 -6 -286 154 4 -9 -19 -138 150 -365 -267 151 -145 -201 174 108 100 188 -33 -197 26
4721 26 -28 82 -36 -234 -79 32 86 -55 -262 -107 -360 141 -326 -216 -131 -4 18 -133 110 114 128 -307 52
4744 52 -157 260 9 -31 -384 -196 -130 -63 -64 92 -165 169 92 148 -144 355 225 -88 17 -87 -66 -70 -93 -57
4768 -57 -133 -139 90 -242 193 -26 -53 197 -130 -87 -81 -150 115 -86 -107 -196 -126 -116 45 -335 -297 -115 -180 41 -58
4793 -58 75 20 76 -165 -59 -7 242 108 89 -46 63 -83 94 -13 9 -175 4 317 203 -8 -119 -151
4815 -151 -80 152 -65 8 74 220 -185 -239 70 -144 106 -128 73 16 -46 125 -51 213 -5 -104 -121 -62 -145
4838 -145 193 -68 13 92 29 4 -160 -47 -27 43 -137 -151 120 168 62 126 117 143 324 212 -89 211 81 -32
4862 -32 157 -98 -87 269 -76 135 29 80 19 133 -147 37 94 -73 -58 -48 51 -177 -47 103 -126 -101 -181
4885 -181 -48 176 181 -95 110 16 -175 208 183 -181 64 108 0 -19 256 187 201 20 79 -130 -24 51 -51
4908 -51 -41 -33 173 118 -180 13 145 -102 -143 -6 23 -30 -28 -173 -168 -110 158 32 36 56 70 2 -74 -10 119 21 63
4935 63 -228 61 -1 287 -166 229 -58 28 359 -279 -23 -35 103 -219 81 -18 -167 -99 -104 8 -10 -64 -81 -198
4959 -198 412 202 101 197 64 86 226 -139 177 26 -95 -103 110 -82 40 255 21 314 164 90 15 182
4981 182 159 38 -111 -57 148 21 86 51 20 111 12 222 -44 -181 136 109 330 -87 -94 81 174 16 -233 -275
5005 -275 45 -12 -74 2 -98 -71 258 185 206 113 -33 70 67 105 2 176 59 138 -166 -119 30 49 -205 -246 106
5030 106 148 -43 220 53 60 128 -160 62 65 8 -6 355 176 -70 91 63 -60 -89 125 96 -370 13 -93 154
5054 154 -179 3 -166 -2 5 190 188 161 96 108 7 -25 262 35 160 -175 60 -21 88 125 -104 -35 -303 61
5078 61 95 -185 -11 279 -102 187 -186 68 -53 -17 356 106 -169 -252 -34 56 154 45 170 -147 -108 60
5100 60 -175 -173 33 -82 158 -28 58 301 -16 -3 0 144 -92 -304 187 39 -81 27 114 -33 17 35 129 63
5124 63 -206 67 -77 123 154 251 -20 -44 114 60 -434 -27 275 -108 24 -69 -93 -82 98 -182 -51 -25 -36
5147 -36 -193 -73 -43 59 -32 -107 -203 -21 66 -115 6 90 -177 57 149 -109 122 143 105 -100 -69 76 -215 15
5171 15 -126 3 172 34 -60 162 -33 -3 161 91 -85 264 -35 -12 -71 -143 109 50 134 411 51 -271 89
5194 89 -140 58 228 194 -49 263 -31 -137 -184 -131 -119 -204 -63 178 -148 -279 -140 -19 21 -77 -106 -126 10
5217 10 73 91 -152 61 37 71 64 -141 -197 -185 95 -142 -288 138 -202 99 -17 278 84 160 329 75 -58
5240 -58 -235 -62 45 131 -47 -195 -167 -106 128 -30 -154 -20 -278 -32 -122 1 6 108 93 -33 183 -48 -117
5263 -117 -245 -157 96 -156 -174 231 24 140 -133 -108 -171 -188 -95 132 45 12 32 145 -103 88 -38 -160 -61
5286 -61 222 -74 182 -24 42 130 37 -235 63 107 29 25 -56 123 55 -24 -236 -4 -89 -1 -113 11 89 -34 29
5311 29 -18 -47 -67 74 187 -140 78 -30 16 -229 -80 -108 126 -68 -119 22 30 25 297 65 -28 -131 -280 139
5335 139 65 33 19 -405 -142 71 -187 45 13 -153 -171 -3 60 17 120 89 -168 270 19 230 93 44 -141
5358 -141 50 -54 -255 -168 128 27 71 -105 -143 -280 77 49 -74 -97 -226 -33 148 93 -39 -132 -224 -36 -98
5381 -98 -115 -171 -95 23 -4 388 152 -58 191 -60 -184 31 -44 94 110 -78 3 15 -4 16 169 42 116 -20
5405 -20 -161 -18 135 -261 -17 -62 286 -146 170 140 153 302 -45 138 91 88 136 -217 -149 -185 -22 -23 -150 163
5429 163 113 295 -198 38 266 183 -17 137 107 74 128 35 18 53 105 57 114 -72 -68 -242 -85 68 75 -166 -213
5454 -213 19 -37 102 -189 39 -64 -97 -25 44 -176 -109 -269 -126 -71 96 -90 64 -49 -43 -174 91 201 132
5477 132 142 137 159 166 317 86 102 236 74 -245 -220 -9 156 64 -121 -6 18 -118 -129 8 -109 -43 -153 264
5501 264 -202 193 204 18 -35 78 -41 -1 200 -6 -70 -179 -290 -51 -60 -154 -302 -217 -70 -63 171 -109 8
5524 8 73 209 274 -185 -119 53 148 -206 -205 -83 72 41 88 -122 -43 -79 92 -23 -305 220 39 10 1 -230 232
5549 232 149 80 191 130 322 20 352 -48 187 -292 -57 134 -34 132 -253 240 285 140 -165 -311 -133
5570 -133 147 75 325 -260 -142 -46 300 -131 32 142 86 -143 95 -143 -202 2 -224 137 -346 404 -77
5591 -77 297 1 3 39 33 -133 -21 191 -142 -146 4 -49 51 -102 17 33 244 -119 -32 107 -8 134 -35 -241
5615 -241 125 -167 -70 159 168 -132 94 -16 -77 -46 55 77 -64 -62 65 -191 66 -45 -105 -65 234 -397 26
5638 26 156 -248 28 -32 184 -174 -39 -500 -120 11 -49 -51 213 122 -46 -89 -194 -67 -123 -55 -139 -43 31 -224
5662 -224 -40 299 37 -262 -82 121 85 94 -23 75 -119 19 -99 -30 -44 26 41 12 72 24 131 -31 200 244
5686 244 135 198 31 121 25 148 -57 122 -185 145 -102 -284 -130 -16 -218 289 85 198 30 -45 -59 48
5708 48 139 170 -148 -122 -301 279 -20 89 253 96 -118 -23 -217 -318 -108 -260 -12 -50 4 11 358 191 118
5731 118 17 -22 125 144 -219 76 -1 -319 -144 -78 -140 -53 -7 -187 -17 -37 -72 107 56 257 38 -1 -193 -72
5755 -72 186 58 -121 51 -272 -129 84 68 -108 -24 -171 -135 82 -53 181 -35 64 119 -376 133 125 -107 -3
5778 -3 -103 58 -187 -211 6 50 -238 -135 -229 -215 201 181 27 228 -138 -104 58 -176 3 99 311 161 129
5801 129 177 177 -86 2 88 57 21 -82 -236 -153 -136 120 -107 66 -92 -190 -139 89 -225 147 94 -110 93 -88
5825 -88 121 -93 106 180 273 13 -104 2 -28 -47 -112 -56 -117 163 127 96 -98 258 -152 -19 -181 72 -155
5848 -155 -115 29 -174 15 82 126 -155 139 4 80 194 116 196 -161 -23 251 -120 -172 100 62 57 -36 -38 -126 192
5873 192 186 -2 -150 -108 -6 -193 -184 -68 -114 -85 43 -42 -37 237 85 111 -4 -165 -42 -141 46 -109 -360 -179
5897 -179 -142 -108 224 -369 -37 189 173 -145 -79 -60 78 134 -124 134 -186 97 -89 202 130 -67 -234 -244 -237
5920 -237 81 145 95 -230 139 48 -91 18 -228 -108 -17 286 296 134 221 -26 81 229 -96 -45 187 125 -90
5943 -90 -39 234 -149 96 271 339 78 48 92 -212 -167 199 -217 -228 118 86 221 236 120 156 -51 -42 -286 122
5967 122 -96 -270 -72 -19 191 -155 -12 -25 -31 258 75 -150 -57 -163 161 86 54 -46 -304 272 -167 164
5989 164 -159 28 -133 -110 -166 -154 -103 115 44 -22 77 99 -122 -191 -77 -89 -124 -22 -169 -13 46 -142 -70 -78 -123
6014 -123 110 -210 -270 144 -202 -144 -98 81 -39 103 -16 88 -386 28 -82 156 185 92 31 -354 162 47
6036 47 -225 -163 -114 239 141 413 51 163 -44 104 86 10 80 -137 -58 -184 -150 -58 105 -223 43 -104 251
6059 251 143 224 -11 193 -65 36 1 -39 212 -112 -159 -241 83 264 273 -72 -94 226 69 -55 84 -52 -202
6082 -202 -132 177 -146 284 236 150 54 -67 -82 -98 -90 0 93 31 60 -187 190 -92 65 -123 -115 -193 66 -59 35
6107 35 -52 -53 115 92 -11 43 9 -43 162 69 -124 -81 -216 -43 71 44 155 48 -81 58 25 -211 -165 60
6131 60 98 -30 -74 -160 -135 -62 -238 -151 25 -190 -89 -16 -57 241 -184 -205 -28 104 11 0 330 152 144 -187 -95
6156 -95 -3 -64 17 68 25 -13 -358 -177 -258 -9 216 12 89 61 170 15 -88 -69 -165 107 114 -81 263 -44 -132
6181 -132 -34 -61 -126 431 18 -60 -235 -115 -129 -11 195 244 133 -118 111 -204 315 151 -106 -60 129 -28
6203 -28 52 209 -36 225 -105 41 61 -344 -17 68 -404 -239 104 -63 -48 30 -97 -132 -220 -81 39 -186 -115
6226 -115 -57 174 -129 -258 -42 -62 153 71 -94 -11 98 88 28 132 86 48 -30 67 -9 127 -121 -56 -90 -147 -173
6251 -173 30 27 -293 80 -12 209 20 81 -183 178 32 -6 -241 -80 22 161 110 -70 77 -121 -87 25
6273 25 59 242 -74 68 28 31 49 -286 -2 104 68 -178 80 1 -178 -22 -177 81 264 -36 -50 133 -155
6296 -155 85 -104 -67 -169 -19 -159 171 -89 91 329 9 -8 -331 -41 -131 -39 -101 -101 -33 21 -51 -4 37 11
6320 11 271 226 -137 9 -26 -136 -89 57 -32 -69 152 -33 82 -387 -111 97 11 78 34 74 75 -132 88 -201
6344 -201 168 -165 -7 -17 -82 39 -29 -18 124 329 -54 -44 110 -1 58 -71 -16 -3 -34 -17 113 -321 2
6367 2 -81 127 -77 -64 -157 -79 91 101 74 51 19 190 190 -71 -53 -271 -155 46 -24 -95 126 -36 -261 98 -229
6392 -229 -41 108 96 -16 -331 190 -98 -90 -24 -11 2 -77 -148 -78 144 17 47 81 -206 3 242 -77 3 2 -71
6417 -71 -149 -211 -117 289 -163 49 7 -113 41 74 -46 -115 -34 -72 173 -172 116 132 -227 248 149 -14 108 101
6441 101 236 -259 -138 -199 -218 -35 112 -4 8 -197 -267 -122 -98 -144 214 -174 -46 141 -37 -93 -170 109 245
6464 245 -58 147 226 -21 14 17 -62 -160 10 -208 86 155 -103 5 -14 -196 -114 -106 -20 167 34 93 -24 -172
6488 -172 -67 -126 -38 51 175 -153 68 -45 129 68 -45 75 -37 -170 117 110 -281 -65 242 30 103 -29
6510 -29 -101 253 -11 89 1 52 100 -63 69 -179 -50 94 -92 -129 142 43 306 -279 -73 151 -258 83
6532 83 6 -18 -39 54 -141 141 -15 -135 -107 -21 -12 -109 -98 138 16 -12 208 262 -154 -40 181 -16 -61 -36 -94
6557 -94 -248 79 -303 39 76 -175 -24 189 90 6 -109 124 39 61 45 146 130 4 145 44 -71 -5 -1 -158
6581 -158 -55 232 -77 12 -6 117 -77 30 7 -135 -34 161 -216 32 231 191 -224 -279 -5 0 37 165 -189
6604 -189 188 47 -288 145 -221 77 -102 105 -126 -27 -302 165 -155 -131 -210 76 9 -405 64 176 251 120
6626 120 -97 289 -193 -58 135 62 -237 204 147 -71 14 -335 -35 -124 -167 -85 -25 -127 -110 -121 173 -217 144
6649 144 -234 -104 179 1 124 42 -275 46 162 -57 201 -41 37 -254 116 69 12 -22 121 178 111 -140
6671 -140 -115 26 -26 -90 52 -27 -251 -60 183 87 -3 -97 -126 -5 190 -70 114 -16 32 -229 46 29 -7 -97
6695 -97 -115 -74 221 -192 -73 134 27 204 53 17 -55 53 38 -182 -93 73 -85 -217 110 -32 46 131 26
6718 26 108 9 61 -95 151 -22 -36 184 47 173 -44 134 -132 -89 -278 312 71 -254 132 -70 39 55
6740 55 -21 156 -62 -84 -53 105 57 96 -201 -37 266 -29 174 281 203 -217 98 -7 10 -184 83 -122 117
6763 117 65 -93 -90 34 -58 473 -291 311 172 -4 250 -53 -176 -94 -178 119 20 -121 86 -195 -75 140
6785 140 -18 6 11 81 -66 165 -112 -173 -41 40 185 -203 29 98 19 89 84 -9 126 -4 -68 -16 41 271 144
6810 144 -163 28 -13 -121 -37 13 79 192 34 49 65 -74 27 95 104 -238 -144 -20 140 12 46 140 27 164
6834 164 105 146 -11 203 265 -304 -29 -212 -92 -291 -170 105 -64 -209 -67 -9 -177 228 -19 -112 95 -282
6856 -282 95 45 226 -259 104 -47 -95 -121 -325 -115 73 264 201 20 169 -47 -122 87 -92 -88 41 -108
6878 -108 97 89 33 -34 -144 -168 -179 -101 -343 55 -69 90 -135 -355 62 -124 44 -36 110 30 -155 -10 -83
6901 -83 222 -178 166 33 360 194 90 111 0 174 -61 115 -225 193 -189 32 -100 199 -3 279 12
6922 12 -45 -95 -61 127 -35 -89 60 86 -136 27 -55 -6 -66 116 -217 148 57 -55 24 39 28 -87 200 56
6946 56 4 194 -33 -102 68 -29 -250 248 -121 140 83 214 -134 -56 -75 109 -3 -101 -280 -136 -46 -2 -125
6969 -125 -13 -7 -195 -367 131 -103 -165 118 9 127 -117 23 152 -87 172 126 -72 111 146 -100 -91 -84 -229
6992 -229 51 -119 -75 -238 109 151 -6 -225 36 -6 87 140 58 -196 -218 67 -221 -56 -57 -62 264 47 -291 76
7016 76 -43 -56 -190 -25 -67 -52 349 181 45 -19 187 76 -189 170 -40 -102 139 -307 217 -124 138 179
7038 179 -63 126 25 -61 4 127 114 92 -143 39 155 258 -30 -27 120 -79 -128 -145 -225 -48 -39 -200 -93 136
7062 136 152 -148 -98 -12 -46 121 -126 -31 -211 21 -11 -200 -165 134 -50 117 -159 114 -12 4 -168 -218 -66
7085 -66 73 -2 -159 -86 69 -219 -236 189 104 237 -111 -64 -109 -52 -80 -58 1 -28 -108 39 9 -206 -165 100 -155
7110 -155 199 -163 84 9 -28 -48 81 -86 192 244 92 242 -118 110 333 139 -17 -363 -62 16 -130 -102
7132 -102 39 40 103 -41 27 145 -145 25 142 -69 -50 -12 169 -50 202 235 183 -178 -206 367 148 -180 -62
7155 -62 25 -17 -28 32 -336 -7 102 -11 208 163 202 315 262 -132 177 3 1 -16 177 -95 -114 129 -68 -98
7179 -98 230 -133 41 -122 197 35 -22 227 49 27 112 -162 180 109 -19 7 -34 -257 46 128 -28 36 5
7202 5 5 172 77 238 127 80 289 16 32 -218 -90 82 -211 -169 -128 -71 -202 -40 171 49 130 24 -134 5
7226 5 115 -335 113 -16 38 193 -138 149 -98 13 -29 -10 30 -316 -106 131 -28 -303 -11 13 100 250 -1
7249 -1 -53 -56 -158 -96 -24 93 246 41 170 43 -211 128 184 274 153 -74 -218 87 -56 49 6 -167 -205 -220
7273 -220 224 -63 41 -126 24 -231 -230 68 -123 144 32 -86 225 294 233 77 300 137 -56 196 147 122
7295 122 -287 -35 26 -113 -166 -157 -287 158 63 234 -87 -225 -56 -41 -237 49 -89 0 -105 123 -136 38
7317 38 -95 -186 123 153 106 -128 -232 70 104 -190 221 -176 185 -128 -47 -56 127 50 68 224 -142 -109 -79 177
7341 177 -46 211 -79 -75 -198 34 -38 128 28 105 -30 -50 48 191 -214 -66 9 294 122 -119 -75 -33 60
7364 60 14 142 153 35 254 -28 -193 170 -53 -13 -19 -27 -110 -212 49 69 11 -250 -144 -144 74 105 -75 -223 -113
7389 -113 -131 242 -131 -109 -174 -50 115 -84 221 -24 104 -152 86 -71 -223 -124 -91 59 -5 53 11 -106 -129
7412 -129 -43 -107 52 -60 -101 -137 -101 -117 -198 28 211 -327 -126 146 -106 -46 193 26 149 -36 45 -37 342
7435 342 -156 144 -33 -2 171 -146 153 -18 -213 -146 13 -43 138 100 -340 24 -86 10 -163 3 -161 2
7457 2 -98 51 130 40 -144 -36 5 -6 96 310 108 -48 19 13 20 -295 127 96 68 -193 -28 -192 109 225
7481 225 128 -36 -53 10 -234 163 -266 -130 66 -169 137 -101 -261 124 1 -217 -2 -140 -117 -182 80 -95
7503 -95 -179 55 -112 -126 35 -64 -183 339 -79 -143 93 -19 -82 -32 -1 -38 -122 66 161 -164 -102 91 34 -54 -230
7528 -230 -141 -103 22 27 -84 65 71 208 197 107 206 163 -18 79 157 -162 -128 70 -12 101 136 302 159 -14 45
7553 45 122 -125 -141 -178 -86 161 147 31 106 -110 154 -87 125 110 -220 85 -52 171 -115 24 211 162 101
7576 101 4 -118 -131 -142 82 -89 9 -39 235 107 -7 -158 -247 -126 -154 -80 -109 176 150 90 64 -130 88 -32
7600 -32 -167 -303 45 -113 -128 -119 -10 266 235 -60 -62 -175 -183 -27 114 35 223 -231 -480 -238 -99 12 32 -194
7624 -194 -17 211 63 54 -30 50 21 14 207 -204 165 415 243 -19 -331 -151 -79 174 -89 52 28 -20 280
7647 280 22 -54 35 133 139 130 348 230 -4 -12 89 -37 -112 -22 -188 217 62 -304 44 34 -81 -366 -67 54
7671 54 -89 35 -157 79 50 60 15 173 122 -96 285 26 -49 30 258 -81 71 8 49 33 -154 38 114 60
7695 60 67 198 -207 -120 135 -247 -288 132 -343 74 105 -102 -118 13 -324 65 216 -154 124 123 88 139 -228 -80
7719 -80 4 57 -98 -317 -149 -167 229 -103 -162 -59 106 127 33 228 -92 -94 37 -21 60 -169 115 90 -244 129
7743 129 -165 -123 -263 -91 -105 -122 459 296 -107 148 -20 79 -155 -219 -169 -204 -65 -56 355 39 80 283 30
7766 30 -66 -87 -36 134 -23 162 -166 -20 -185 -62 -129 85 -132 153 -113 91 -94 -133 82 132 91 -98 259
7789 259 -274 55 -331 45 -176 68 85 7 133 157 86 -230 -184 115 144 -63 42 177 181 174 81 252 226 136
7813 136 -127 -43 -41 111 31 -25 66 -50 -51 156 -37 137 100 30 234 -233 245 68 -139 -15 30 -161 -62 244
7837 244 -38 -229 54 -128 1 -89 146 -70 -170 -203 135 5 82 137 78 -82 -73 -51 9 69 -29 -52 -31 141
7861 141 -195 -32 -29 -233 -27 -82 329 79 54 201 -115 186 -177 106 -134 169 -79 296 157 -125 150
7882 150 -49 63 -66 78 -101 -19 13 6 -47 -296 136 50 -31 -81 -27 -251 -52 -100 276 -79 77 -117 164
7905 164 -135 -298 86 -12 -225 148 110 97 -259 -81 -257 -163 -242 -162 33 -188 220 -173 -53 165 270 45
7927 45 -244 9 -75 53 28 105 -113 30 42 -362 73 -24 137 20 209 1 19 -106 67 -117 124 -1
7949 -1 148 229 -169 -7 228 167 120 232 147 -218 -98 217 -186 -61 -30 120 -197 -17 13 -268 -45 -29 -60
7972 -60 -143 -189 -77 25 -62 74 -177 -116 175 -156 178 -139 0 199 -73 16 -118 263 116 -42 224 -47
7994 -47 119 -212 10 43 55 109 149 -225 -125 93 81 96 -68 -81 -35 -82 299 -18 -49 -194 -64 -57 -19 -4 34
8019 34 86 -230 -62 -144 -183 -160 70 0 376 -28 96 -165 174 -157 45 -188 -129 -233 75 -163 91 -327
8041 -327 -52 172 146 112 101 -63 201 -16 -36 58 -81 150 -210 130 -4 366 78 226 -119 -318 -108 184
8063 184 91 -6 -77 -62 204 113 26 0 -182 -327 69 -185 173 42 -18 100 39 -24 164 48 -270 -101 155
8086 155 -18 96 -64 85 95 -63 82 70 -22 -47 -142 -60 -13 95 -144 231 61 -58 19 -164 103 102 132 -139
8110 -139 -158 165 -181 -396 -27 -17 -68 -93 307 161 24 0 -315 100 -36 -186 -31 -132 -104 96 -131 57
8132 57 -41 208 -56 19 102 209 80 -19 99 -213 -43 42 -116 12 97 222 -254 -65 64 44 -35 97 0
8155 0 56 116 229 465 -71 46 -196 260 -241 -150 -50 85 43 189 42 102 -90 -110 57 9 -1 -145 71
8178 71 38 -166 -60 72 187 112 -78 -127 97 -37 -260 139 -51
8191e1
$$ Imaginary data points
##PAGE= N=2
##DATA TABLE= (X++(I..I)), XYDATA
0 0 0 0 0 0 0 0 0 0 0 -8 8 -8 16 -16 16 -24 32 -40 42 -55 64 -74 88 -104 123 -144 168 -194 225 -258 296 -338
32 -338 383 -434 490 -553 620 -695 776 -866 964 -1073 1188 -1316 1457 -1610 1776 -1957
48 -1957 2157 -2378 2619 -2885 3181 -3507 3876 -4290 4761 -5301 5929 -6668 7554 -8636
62 -8636 9998 -11768 14170 -17629 23069 -32903 56207 -229976 10550 385325 -220340 -55266
74 -55266 329694 -72720 -336140 143271 115467 -181446 65985 230163 -124480 -126694 127979
85 127979 22058 -130435 34106 91431 -24890 -45577 29572 10466 -72272 -52761 80056
96 80056 41111 -75687 35895 98842 -109537 -94461 115469 8229 -89740 139433 104034
107 104034 -167133 -36293 116623 -122127 -93819 212103 66823 -168025 26715 67570
117 67570 -150394 -34542 146465 -11814 -65408 84279 20352 -100397 3690 67235 -24301
128 -24301 -23665 58423 34937 -42723 -39319 10336 4693 -24313 25157 58520 -41349 -76253 31455
141 31455 13535 -64397 51474 94286 -70442 -46193 89003 -28606 -95073 84780 70066
152 70066 -94401 11207 108669 -65700 -90681 72669 9972 -88507 45694 72428 -65855
163 -65855 -26041 56879 -33574 -51622 52417 33092 -32268 13076 33877 -26390 -27060 23362
175 23362 19811 -5731 1729 7203 -15615 -31148 -4778 26067 5067 -17480 10922 3902 -39489
188 -39489 -2228 38701 -11441 -13436 43780 5611 -38491 20591 26164 -41889 -9400 46668
200 46668 -8633 -30905 30181 6131 -50487 -208 28790 -25580 -12043 35424 -1763 -26486
212 -26486 15343 15812 -16173 2684 22569 -1959 -10667 10703 4836 -13886 808 13904 -5898
225 -5898 -15235 520 1558 -13332 -6702 12592 3639 -11167 6459 11799 -12736 -4601 19074
238 19074 1770 -8493 14203 9609 -12509 -1889 8204 -8887 -8900 7800 -2274 -13303 4422
251 4422 5922 -14660 -4531 11645 -1797 -5527 9749 6577 -3334 2529 7075 2096 490 3176
265 3176 -662 -5247 125 2005 -5055 -4952 -1819 -2459 -2357 -2161 -2250 59 303 1065 3378 1955 3119
282 3119 5797 431 -1955 5932 6327 -2868 -5582 921 1387 -4161 -3500 -2124 -4615 -1008 995 -5203
298 -5203 -2100 5037 -925 -3106 5097 5843 2347 3230 747 -697 3449 4394 -2333 -5445 497 1803
314 1803 -2996 -4215 -3481 -2920 -773 -2826 -4049 2502 4311 -238 -189 2596 3942 4327 268 -1866
330 -1866 2427 4527 1329 -1070 -1998 -1794 -2058 -3070 -4181 -4528 27 1954 -2964 -1463 3822 1902
346 1902 -522 -64 470 4201 6203 1565 -310 2759 3688 -736 -5325 -3736 106 -2758 -3648 139
362 139 -1 -1872 -325 -640 -3341 -1527 3868 2870 -1223 4052 8497 414 -1605 3528 -1625 -4187
378 -4187 2894 107 -5762 753 4018 -5368 -7069 1653 -115 -7164 -27 6037 -1488 -258 7536
393 7536 2380 -2781 3764 4246 -3473 -2420 4929 3094 -3711 -1045 2417 -5260 -6871 1406 -2488
408 -2488 -8045 3052 7995 -2990 -3156 8002 1946 -9655 2166 11255 -1859 -2076 11369 1389
422 1389 -9764 3541 4583 -12294 -5772 9066 -2376 -10945 5335 6894 -10423 -2959 12575
435 12575 -2991 -11146 10098 9054 -9714 3106 17761 -3682 -13279 8792 5814 -16492 -2418
448 -2418 14364 -8701 -11909 15585 4078 -20923 -199 12720 -12317 -7378 21230 6246 -14754
461 -14754 7109 13274 -13480 -5170 18323 -2721 -17121 10845 12099 -15274 -6108 12342 -7110
474 -7110 -16357 8336 9988 -12176 -3155 14733 -3141 -11699 12138 12363 -12103 -3931 13820 -2308
488 -2308 -11853 11137 11686 -13141 -6430 11310 -9574 -19325 11496 13479 -13973 -2258 16151
501 16151 -7919 -15509 14442 10514 -16066 2214 19767 -8743 -10016 22431 4534 -26434 796
514 796 15930 -15366 -6691 23448 -2874 -26026 6732 14008 -17388 -2698 25011 -5429 -22534
527 -22534 14199 16126 -14621 1619 21956 -8560 -19904 11751 8995 -17782 408 20148
539 20148 -9614 -19010 11695 5959 -20147 971 18762 -8543 -11060 18247 7073 -17040 3248
552 3248 15538 -11605 -9715 19050 6113 -15380 2809 9292 -13966 -9438 12748 1405 -12978
565 -12978 2655 9270 -9108 -6354 13699 4327 -13297 3207 13179 -7344 -7250 14615 4632 -13560
579 -13560 4534 12439 -13910 -11068 13588 -2204 -16966 10793 12963 -16497 -4870 15498 -8361
592 -8361 -12592 16567 8737 -14217 5136 15140 -11447 -8455 16116 1037 -15257 5591 8810
605 8810 -12252 -4217 11783 -4110 -12184 5257 5794 -9610 -1163 11914 -966 -8843 6764
618 6764 7900 -6753 -621 9938 -3182 -8869 6005 5553 -8736 -1573 8684 -5299 -11033 4784
632 4784 4353 -8214 1069 9422 -3068 -5478 6776 3128 -5735 2306 8185 -2583 -4679 5670
646 5670 2877 -6572 -699 3924 -5484 -5439 4558 1865 -5965 518 4509 -4823 -4146 7544 3308 -5570
662 -5570 2717 6248 -4649 -1373 8531 -123 -6383 3372 2612 -8328 -1428 6630 -3450 -6641 4507
677 4507 1237 -7711 1408 6139 -4236 -1806 7763 648 -4802 4528 5174 -4161 -1407 4440 -1864
692 -1864 -3843 3795 1441 -5694 -1481 1596 -4207 -2119 3989 1737 -3315 -832 2258 92 225
707 225 4093 2106 -2497 -17 2251 -1170 -1686 2107 177 -3733 -1024 1295 -2234 -2548 1239 -268
723 -268 -3000 1388 3015 -1723 300 3721 612 -1390 1904 2171 -1058 -130 1544 -877 -2905 -60
739 -60 687 -2422 -1193 694 -1665 -3208 748 2276 -670 405 2653 86 -1552 2309 2741 -1748
755 -1748 542 2772 -1137 -1767 1821 -758 -3311 118 360 -2621 -813 1529 -1214 -1688 1440 1374
771 1374 -997 856 1829 229 1021 1878 1008 -192 143 -1 -590 -1338 -1005 89 -1216 -1251 532 -566
789 -566 -1389 -176 127 -781 584 2028 937 485 1587 1118 -209 331 440 -582 -182 394 -803 -865
807 -865 -99 -1278 -1419 -533 -583 -381 -204 472 1187 591 594 954 556 551 755 614 227 -30 427 32 -1256
828 -1256 -831 -771 -1776 -1115 181 -635 -36 703 -134 -130 1075 622 16 431 1252 1111 1099 806 106 -582
848 -582 -526 -943 -1063 -606 -573 -514 -479 -298 -277 -197 -808 -611 777 782 581 1378 1073 333 927 559 -487 -894
870 -894 -197 -431 -689 73 -47 -1243 -1139 -500 -866 -744 303 235 -173 977 1759 876 -65 573 629 -600
890 -600 -208 1059 -631 -1056 738 -103 -2053 -740 -63 -1998 -2033 1327 986 -1023 715 1432 -747
907 -747 -214 2221 202 -882 1880 1199 -1293 171 945 -1089 -2126 141 -83 -1854 -336 954
923 954 -1215 -946 1620 641 -969 405 1547 498 75 1280 1894 -241 -56 999 -904 -2106 -1
940 -1 205 -1882 -123 1784 -677 -2981 46 948 -1520 233 3184 649 -1160 1845 1668 -1957 174
957 174 2325 -1091 -1618 1963 759 -2911 -981 1520 -1769 -1934 2169 77 -3189 910 2570 -1650
973 -1650 -84 3996 423 -2563 1509 1911 -2313 -470 3565 -611 -2200 1703 -440 -4256 -730
988 -730 2001 -1283 -1184 2569 676 -2407 236 1638 -650 21 2783 1645 -1139 727 705 -1797 -1105
1005 -1105 1619 709 -1409 -589 340 -1771 -1533 1525 1179 -1108 633 1229 -1189 -992 2142 1930 -413
1022 -413 1074 2426 -1047 -2459 819 193 -2161 1075 2607 -1753 -2683 762 -896 -2916 986 2913
1038 2913 -521 -386 2735 -116 -2884 1643 2497 -1194 623 3156 -1381 -2844 573 -33 -2289 753
1054 753 2162 -2045 -2173 1123 -1037 -1681 2053 1990 -606 306 1269 -735 -917 1863 1341 -189 779
1071 779 720 -1788 -1592 0 -904 -1083 632 775 -609 -341 -81 -702 -569 997 1849 1297 668 478 -540
1090 -540 -934 267 1480 653 -275 -533 -1132 -1698 -752 482 132 254 476 169 -857 -335 423 23 561
1109 561 1813 1182 -223 66 49 -1034 -595 1048 408 -641 79 -663 -2149 -1295 616 -186 226 1640
1127 1640 214 -1524 -23 1258 381 941 2206 -234 -1493 422 169 -1079 179 889 -1371 -1511
1143 -1511 607 -406 -1433 475 5 -1353 370 2207 75 -624 1306 179 -1298 798 1880
1158 1880 132 -203 5 -1414 -1302 400 723 -500 -494 -274 -1148 -1008 241 1249 393 -204 452 289
1176 289 -128 237 1155 458 -131 469 -257 -1245 -377 662 -956 -1275 145 -176 -881 50 743 -819 -657
1195 -657 893 810 104 1239 1220 -423 -435 595 167 -538 514 149 -1178 -792 273 -294 -1335 242
1213 242 621 -918 -133 1107 92 -283 998 1309 -384 -29 1293 -239 -763 404 208 -1169 173
1230 173 610 -1040 -1074 412 -456 -826 334 491 -401 244 1078 357 55 846 447 -208 224 118 -26
1249 -26 -12 -16 -269 -420 -507 -224 -65 -723 -218 512 179 -264 496 515 -258 86 700 287 -70 677 296 -607
1271 -607 26 64 -1072 -521 94 -521 -315 125 69 -254 69 214 -132 334 486 433 368 776 562 20 114
1292 114 5 -474 78 -75 -279 35 -648 -327 -19 -184 -596 206 20 70 658 767 304 571 515 202 -28
1313 -28 -33 150 -321 -42 -103 -672 -177 -449 -454 -160 -43 -314 81 6 -67 2 557 4 115 439 358 223 473
1336 473 354 -78 -130 85 -238 -488 -31 -725 -358 -135 -240 -410 390 -32 -186 111 351 135 513 153
1356 153 195 52 287 27 -108 -373 -459 -390 -109 69 -551 127 -88 -330 -61 13 -198 300 456 436 136 531
1378 531 142 14 -78 -68 196 -69 -216 -292 -256 251 -221 -357 -152 63 -91 -65 63 207 343 332 189 375
1400 375 342 153 -141 -315 235 -63 -146 37 -116 -675 -267 -179 -241 -125 93 280 128 57 670 258 15 605
1422 605 445 -110 186 385 -55 153 -108 -733 -472 -403 -127 -184 -375 12 -286 -19 79 -238 79 433 235
1443 235 39 70 322 2 96 271 -49 271 -358 -690 -47 19 -499 -478 132 -29 -516 187 67 -253 457
1464 457 647 84 163 773 184 -407 350 378 -771 134 88 -494 -595 -24 -421 -984 -341 366 -144 -325 180
1485 180 125 -69 37 612 148 -6 382 263 -704 0 140 -546 -484 222 -206 -717 -271 93 -65 -235 339
1506 339 33 -145 -16 458 259 237 387 419 -152 -28 418 -208 -250 111 104 -676 -372 122 -289 -943 -22 135
1528 135 -434 392 1004 139 -327 572 251 -630 450 1253 -455 -762 378 -246 -1062 614 773 -876
1546 -876 -635 227 -554 -581 1086 951 -249 107 682 -138 -233 1285 411 -498 -183 39 -327 -344 643 -223
1566 -223 -808 -452 -266 -203 -254 442 51 -546 -305 530 377 167 298 317 -562 -119 579 -95 -133 231 -316
1587 -316 -820 -282 568 132 -316 282 206 -472 27 700 12 -543 865 104 -360 195 623 -295 -346 436
1607 436 -229 -737 235 291 -883 -660 577 5 -692 468 567 -440 -133 752 114 -54 601 481 -480
1626 -480 32 703 -416 -399 572 -483 -913 297 213 -556 -213 -108 -329 -470 322 552 -230 -169 195 -248
1646 -248 -57 660 318 39 -186 -219 -171 -316 39 221 -296 -694 -165 -79 -427 462 400 -188 -381 509 132
1667 132 -13 294 583 -561 -77 499 98 -270 109 -58 -849 -390 145 -274 -232 433 197 -598 15 754
1687 754 81 54 445 206 -300 149 531 108 -220 210 -313 -393 -296 45 -360 -573 -3 14 -90 224 204 -438
1709 -438 101 412 267 377 513 -15 -15 78 128 -222 -111 72 -245 -577 -213 -207 -289 225 -108 -111 161 67 217
1732 217 249 208 201 173 351 -136 -90 -291 18 -17 21 -244 -505 -164 -207 -362 -36 -232 184 322 103 72 119 377
1756 377 -233 137 300 86 152 134 237 14 -145 -89 -80 -327 -17 -200 7 -237 -156 -304 -4 101 180 33
1778 33 238 333 229 82 -142 -80 16 -37 -46 -206 -208 40 -80 -16 -93 36 -109 -137 276 100 48 441 117 350
1802 350 224 160 -221 -51 168 13 -32 -159 108 -390 -192 -202 -213 -491 122 54 237 183 141 230 -71 162 139
1825 139 364 73 -35 32 -267 -78 -224 -245 48 -288 -90 -327 -47 258 -96 -18 141 428 -64 409 16
1846 16 -82 144 108 150 -179 110 -221 -8 -405 -282 -150 -301 -52 -77 -238 -105 -66 -177 -64 96 24 200
1868 200 130 121 32 117 45 -231 -189 229 -355 -259 -57 174 -269 -169 156 21 29 -207 23 219 167 7 241 45
1892 45 416 21 -9 44 -83 131 -187 -273 -201 59 -199 -200 69 -222 -78 375 45 -216 -4 110 167 287 352
1915 352 113 -200 398 163 -217 -118 -91 -423 -290 -249 -229 -526 -23 -84 -77 -193 212 -127 3 133 191 60 -37
1938 -37 461 28 -221 -27 182 -264 387 129 -91 -133 0 172 -188 -7 93 -38 28 689 -66 -121 177
1959 177 293 -73 -68 219 49 -333 -379 -147 -513 -224 -323 -229 -233 -39 181 -8 -265 313 190 -197 366 434 -321
1982 -321 54 328 -142 -191 -235 292 -378 -52 576 -405 -539 219 298 -446 -98 342 -287 -274 462 245 -130
2003 -130 234 378 -133 -398 503 32 -306 -129 41 -208 -239 291 -158 -293 137 526 -262 24 457 128
2023 128 -231 60 634 -124 113 327 -29 -248 128 66 -229 2 -1 -245 -578 124 -32 -194 -63 436 170
2044 170 -171 341 298 -339 -74 312 82 -99 315 58 -574 -87 252 94 -143 488 4 -598 60 86 -185
2065 -185 -58 392 326 -394 209 346 -180 -276 359 128 -607 215 212 -309 -312 179 -479 -392 239 259 -203 50 450
2088 450 -386 -227 629 304 -469 -58 296 -160 -14 427 370 -76 -22 -64 -187 -143 347 218 -80 158 318
2109 318 -69 -107 401 -14 -89 386 389 -212 -110 386 20 -348 231 315 -297 -89 213 -365 -147 -26 388 -151
2131 -151 -13 417 -233 -95 179 176 -153 134 90 -149 -238 124 -51 -55 319 62 -405 -78 82 -201 -435 468
2153 468 311 -279 -193 472 92 -13 247 363 -252 115 248 -102 -256 274 -16 -582 103 36 -318 -169 374
2174 374 -351 -128 -49 65 -240 -194 99 -12 -166 269 148 -181 45 284 9 35 123 143 -289 -237 193 -233
2196 -233 -318 -95 388 -207 -57 379 289 -165 -35 153 -193 -195 252 -109 -233 177 -135 -90 -241 -224 -367 -36
2218 -36 123 58 -273 36 128 -35 -55 227 239 25 -47 24 -167 6 99 -174 -197 -69 -25 19 -196 -121 -188 -201 197
2243 197 61 -304 162 345 -221 94 182 282 154 169 75 -173 86 -173 -164 -414 55 23 -67 28 257 -64 -231
2266 -231 130 333 304 30 291 144 -56 129 -29 27 -62 34 -19 -199 49 -253 -326 -106 17 2 -321 -18
2288 -18 126 66 345 -2 -246 -120 73 68 37 -264 115 -66 158 -201 -39 -111 96 187 123 -121 -50 -179 -63
2311 -63 -36 192 125 126 34 -48 -23 -78 263 -269 17 -211 69 -163 -239 8 -61 -4 -248 -123 75 74 -37 -207 55
2336 55 28 50 94 6 278 -182 -163 84 146 -54 131 124 -50 -216 12 165 -91 -91 -20 197 107 205 95 -84 227
2361 227 379 -111 118 -76 145 -17 -113 -75 -15 -30 -88 -50 -172 -131 139 -81 254 -13 51 -168 -36 -45 41 -106
2385 -106 213 78 -168 97 -56 -47 -37 195 -120 -126 -188 327 -13 208 92 110 326 79 5 108 261 -190 212
2408 212 255 -49 -135 61 172 -158 63 9 227 -232 43 -344 167 -280 138 121 139 -222 180 406 136 2
2430 2 -67 187 -283 -83 -317 29 249 -114 -126 -71 -7 198 -224 144 -29 93 -61 238 -179 -69 30 -43 -109
2453 -109 -150 201 -125 146 142 -184 -179 -46 24 168 88 139 -265 -236 -91 -31 -259 336 198 -153 -195 153 61 -235
2477 -235 143 146 -97 -311 -159 83 -70 123 -145 -73 49 176 143 100 43 -57 -312 72 28 176 -55 38 -6
2500 -6 137 -14 -6 132 -298 -79 -13 67 56 58 89 138 -58 159 -78 242 475 114 187 59 212 42 -182 68
2524 68 98 -101 143 -139 -77 99 46 -10 -62 127 -286 -111 253 64 -31 225 228 282 -211 357 231 -91 153
2547 153 -10 -70 -297 -207 21 109 -184 80 -166 -312 94 22 -192 24 206 210 -151 47 45 -233 138 -3 -119
2570 -119 132 70 117 176 -133 -66 -217 -17 92 259 -5 66 -186 177 -140 -43 -7 205 183 23 -201 112 -128
2593 -128 90 40 -169 110 36 -208 -11 55 208 146 81 122 -137 -39 161 443 50 135 -32 -117 -63 -171 -135 -107
2617 -107 -165 63 56 -2 -79 -144 142 31 174 34 -43 -183 201 -27 50 -53 -219 45 84 -131 -157 43 -50 285
2641 285 -60 -10 90 -47 193 -204 148 -48 81 84 110 -285 -94 -38 56 50 4 -186 8 162 114 150 132 -212
2665 -212 -236 151 64 -84 -128 -63 103 87 -275 21 82 29 157 202 165 116 -111 18 43 -60 116 161 88 -175
2689 -175 13 124 -142 63 112 22 -60 73 133 127 -35 95 -242 -10 -74 -3 -155 -33 -244 -16 210 282 -27
2712 -27 119 -123 -120 136 -127 -298 -62 -124 26 305 -57 -141 -76 136 24 144 -31 86 -155 93 123 202 229
2735 229 17 -118 -38 208 126 -48 257 23 25 48 31 155 -365 -18 38 -9 -51 -131 -112 -67 87 196 -178 -202
2759 -202 -47 36 -164 -42 -159 -54 -139 72 -125 -128 147 38 -33 83 189 -86 -19 -50 57 -145 4 -46 56
2782 56 142 -77 -12 9 -142 284 -5 102 122 -260 -297 -260 -29 48 -123 -408 30 -168 121 30 1 106 -129
2805 -129 70 -206 42 -61 -119 -299 -330 134 -268 -180 158 -226 -65 168 72 262 77 -154 85 -91 66
2826 66 -213 -24 -119 -246 95 79 -97 -186 144 -8 24 319 -87 -61 -296 -96 -81 315 54 -9 -19 85 121
2849 121 -252 -63 -6 53 10 -49 -198 -90 -173 61 74 -146 116 -153 -285 -45 -34 -7 -73 -68 -106 226 172 -99
2873 -99 158 -76 314 105 149 -18 -38 8 4 -123 -93 -269 -150 59 25 -27 236 94 62 -357 3 266 -111
2896 -111 536 51 -79 -30 -23 31 151 132 -149 66 -52 -79 95 248 -146 32 155 -228 62 163 66 116 188
2919 188 33 -41 89 91 -133 -45 99 -138 -37 -98 30 23 -60 84 -224 305 228 -119 44 -10 -42 102 -38 -95
2943 -95 79 -81 -345 -159 -62 2 152 20 437 -137 -79 74 364 -178 64 209 -114 -47 -249 -80 -78 7 -69
2966 -69 163 32 191 -10 66 2 -219 -70 100 48 80 -175 258 59 153 136 251 -4 211 76 206 -106
2988 -106 -241 166 -25 -51 127 38 140 -50 90 71 159 44 103 -44 71 104 1 -166 -29 -10 -121 -23 -10
3011 -10 87 -17 -94 -147 -135 -130 -20 219 284 135 317 98 198 230 103 -131 -124 37 -5 -112 -223 71 218 -284
3035 -284 183 -123 -46 28 25 19 94 -100 -64 18 -55 59 178 18 -63 71 -191 142 57 61 -303 200 170 -239 -64
3060 -64 2 222 -51 102 203 -401 72 110 -205 35 -232 93 -199 89 89 402 18 -69 -355 -19 -50 12 142
3083 142 -159 62 128 -178 65 -109 89 -176 348 86 -44 76 163 157 305 70 207 -197 -116 -65 -25 -213
3105 -213 -146 116 93 7 -197 117 -74 62 -87 -146 150 511 -236 32 136 -9 -49 154 382 -285 -439 -11
3127 -11 -148 -60 138 149 -209 -55 25 -145 88 217 97 57 231 251 -87 155 -202 17 -96 111 42 -149
3149 -149 -307 7 -254 -155 121 -38 -10 -39 246 -46 -59 98 -58 56 71 106 -22 21 28 -3 -145 -2 221
3172 221 -238 83 -78 50 -53 237 143 74 -174 150 244 37 -174 -149 -128 -3 68 1 -212 154 179 -148 42
3195 42 321 -153 272 -104 103 -131 -33 260 153 70 224 27 99 60 42 -120 -75 -93 -131 -101 -283 259 -344
3218 -344 -126 -31 47 114 147 148 61 -85 94 175 -79 102 115 -307 -318 62 -57 -1 -404 -56 85 -52 107 307
3242 307 60 -11 -39 -205 -53 89 0 64 21 116 282 -79 -41 -165 62 32 -68 -12 106 -72 218 -35 -47
3265 -47 -107 -116 -162 33 -214 11 417 30 289 151 137 79 -99 229 57 -150 -37 16 2 -19 315 89 49 -162
3289 -162 226 70 -141 -225 121 -189 -17 15 -341 -52 112 77 170 -188 -225 170 -134 37 242 -104 16 245
3311 245 -9 -28 -10 90 336 157 -12 135 69 46 -118 -255 92 -147 -4 -186 84 -183 290 154 75 -115
3333 -115 -49 -23 -205 124 317 259 -151 -130 14 198 89 277 -257 234 -1 206 145 -1 -2 51 109 82 90 -41
3357 -41 -38 198 202 140 68 -143 -1 197 -113 151 32 -197 -100 -129 -118 -197 -27 -11 -276 -68 25 38 95 -45 -153
3382 -153 217 13 -60 -126 -93 17 36 -54 95 105 0 -117 0 -58 -95 -144 -45 10 -229 -402 -78 -13 -44 79
3406 79 -93 -159 15 31 24 -44 -126 -167 -5 13 -157 -176 83 183 39 -61 -395 -113 375 133 -111 220 114
3429 114 197 69 178 314 -74 67 -108 -157 1 -182 -26 -203 13 -252 -241 -104 46 146 139 -112 -6 78
3451 78 -285 -87 -38 -87 386 -68 -120 -51 -197 84 -45 -98 125 -80 -7 138 -28 151 32 142 -148 -134 246
3474 246 106 3 146 56 -296 4 -163 -256 -76 70 123 104 64 -32 -202 -25 -70 127 201 134 57 21 76 196
3498 196 -19 -91 160 -45 124 -26 126 -47 -91 289 -441 -11 -15 -117 -329 107 38 15 18 139 44 71 9 3
3522 3 -158 91 27 -8 -252 -1 29 1 -113 105 60 -197 2 -232 -206 36 -96 -106 -52 51 -163 -129 129 110
3546 110 -47 -2 201 -83 -120 -198 11 -101 94 -156 365 124 119 141 -125 -141 76 -280 -93 222 -37 58 72
3569 72 -85 -403 -19 34 -25 91 23 -119 19 -182 101 -20 158 494 109 116 -148 43 106 -65 -142 -22 -161
3592 -161 -138 189 -99 -305 26 142 -141 118 307 128 105 -59 -10 74 -157 -75 318 193 274 -115 -79 -70 115
3615 115 -95 -245 -3 168 118 133 -113 112 -248 53 62 -247 -77 142 97 121 -205 34 -123 -120 3 6 -125
3638 -125 26 146 120 -112 -123 -59 -193 147 -24 240 268 221 -20 347 135 90 173 185 117 -185 -304 134 86
3661 86 92 34 -30 59 300 216 -255 333 26 485 85 197 100 23 356 27 7 -39 91 -108 101 -274 -216 -35
3685 -35 -52 -187 100 -70 199 30 89 -91 -95 97 -86 188 -221 26 -161 -80 122 -108 -284 209 183 1
3707 1 -88 93 -87 84 -126 -126 -13 -2 -131 152 -36 58 -93 -52 161 339 -105 52 3 377 -103 -154 101
3730 101 -139 18 99 230 58 267 187 -70 -183 -16 163 160 -236 7 1 -11 191 -218 -3 -252 64 -258
3752 -258 -118 286 -55 59 -42 -18 -83 126 99 179 201 -81 178 219 -25 -41 -22 -217 7 -81 -170 -114 -5 125
3776 125 206 -184 -255 -173 -42 -95 296 20 -125 -263 161 318 175 -185 -231 -88 -216 126 92 -89 -97 -172 -165 -110
3800 -110 -28 1 -82 1 -115 234 -45 -52 235 189 -20 -153 -271 11 -31 -206 193 161 -223 -13 7 -102 102
3823 102 -267 72 266 166 255 -30 -30 -289 281 -312 15 197 39 -170 -52 141 43 -84 56 -201 -94
3844 -94 -58 -144 196 258 64 -28 -80 81 127 -20 9 -243 -54 167 -83 -118 -150 139 -125 -82 180 -181 450 120
3868 120 181 99 3 273 65 -70 5 -180 206 98 -69 186 105 42 63 84 99 -64 -48 -219 52 147 156 15
3892 15 -218 203 -57 -10 38 285 151 -32 50 -15 -4 -91 -270 12 -178 -92 335 64 -85 53 -52 -207 148
3915 148 -49 -34 193 81 229 -65 17 176 147 -113 1 -43 15 -171 -49 -123 154 134 -288 103 -15 53 -57
3938 -57 -125 -4 187 -12 -147 -66 -48 -258 58 24 90 192 -161 27 194 108 -95 -153 -46 -10 -35 25 -93 -102
3962 -102 -164 -150 293 -54 14 172 152 198 12 -190 -42 -91 -137 231 27 76 18 -216 50 84 12 -31 -112 -100 -254
3987 -254 45 -2 -199 50 43 -206 -65 56 18 53 -94 38 -53 29 82 -56 179 -188 -244 -130 -210 -50 -202
4010 -202 -65 -34 -49 57 25 234 81 -30 18 -80 137 -53 -111 30 198 14 16 48 -313 -75 91 88 91 -66
4034 -66 -104 -90 -283 221 -45 8 336 -136 60 -36 -15 257 -139 -101 138 94 6 88 99 100 301 -330 206 13
4058 13 -31 89 117 -90 -63 -20 109 134 -127 -178 115 -235 67 226 139 -25 177 -60 157 167 -5 -318 -261
4081 -261 -208 188 -29 -119 386 -292 -268 146 394 422 -122 51 172 -31 -57 -77 -193 155 -158 108 -74 -87
4103 -87 -118 214 81 -31 294 -37 212 232 -16 -42 -48 -365 -41 -138 23 188 225 68 164 103 307 -26 47 105
4127 105 -19 -231 30 17 -13 -60 -18 -77 -135 424 -90 177 -272 -1 242 -65 114 -172 -188 79 29 236 -100
4150 -100 217 -58 -42 -142 74 -126 -80 55 -153 122 -10 364 -56 67 192 73 78 205 36 174 99 21
4172 21 -121 36 180 -9 20 -108 26 -105 -70 77 159 -85 62 -3 -41 -24 131 -24 113 130 12 -64 -207
4195 -207 -30 -228 158 22 -61 -147 -227 -282 -87 125 -46 280 105 -90 -17 252 60 -6 26 -136 -41 -86 -9
4218 -9 -151 23 -24 258 -123 256 39 165 73 -174 87 163 215 124 -83 46 -68 -296 -14 -223 159 24
4240 24 -128 7 216 113 -206 156 134 -57 1 -22 -207 -251 1 -111 235 10 -201 -84 70 -35 64 20
4262 20 43 -162 35 261 320 -4 -22 16 -316 93 -153 180 26 -85 62 21 -133 -172 30 -111 215 -79
4284 -79 -140 78 170 54 -95 -52 -77 -173 -428 30 33 157 122 -21 22 -34 -30 230 -14 -156 21 5 3 -327 -2
4309 -2 -377 -48 -65 -109 -199 -194 -146 -126 98 -100 -177 68 -4 -18 -230 -225 -99 282 69 76 -16 75 157 -34 142 49 -96
4336 -96 -158 2 167 83 123 229 175 -135 50 -127 74 -63 -51 158 -153 -22 -89 -120 -255 -13 16 -44 34 -143
4360 -143 86 -34 -22 57 194 53 -33 -69 25 -121 -240 -305 0 -198 -219 65 42 140 172 -107 -406 132 276
4383 276 -164 27 -12 -17 278 -144 91 146 70 -63 81 96 77 87 -37 335 -67 -116 63 200 -94 33 17
4406 17 -101 -15 221 -67 -130 38 239 -15 342 -480 -308 95 34 21 23 121 -129 91 -44 -207 71 31 -116
4429 -116 0 -33 -296 -249 -119 105 -285 -107 -112 65 -37 -299 -120 296 159 48 -44 -46 -25 -132 165 308 20
4452 20 -208 -45 -58 98 -24 -97 -48 -61 -314 -258 -88 36 59 34 128 22 111 -125 -125 40 170 65 175 -32
4476 -32 -9 240 100 -198 -151 -65 259 2 -95 -40 -357 188 70 -142 -80 -103 -225 -154 -38 -105 178 112 256 18
4500 18 -154 -76 11 182 -148 103 -55 -349 -158 250 92 -64 -109 10 46 -46 -12 197 -118 -128 187 85 -73
4523 -73 -116 -161 104 37 219 2 -17 244 -22 47 -89 -177 -234 -251 -64 14 -90 -248 -41 13 51 -79 22 96
4547 96 -187 -298 -153 -86 -187 -69 -58 -246 -49 91 -156 173 78 110 29 -84 -62 -222 -155 42 199 -94 -291
4570 -291 113 -260 -24 -204 -68 -135 110 105 -214 136 18 8 -156 -191 215 101 196 -48 357 -7 44 -22 141
4593 141 -26 -99 4 16 -242 -57 144 -5 98 -97 203 205 -184 157 206 -112 -190 42 -401 -74 -24 168
4615 168 61 322 -26 -240 313 -90 -41 -200 395 18 72 132 -106 158 43 -50 23 -83 -257 119 -134 -1
4637 -1 -9 49 -93 -81 192 -128 -137 -16 61 41 -101 -180 87 14 154 263 -23 129 -113 -309 -63 -124 -143 2 51
4662 51 38 171 88 -39 -5 77 -192 110 85 -107 -334 108 24 89 -33 -246 23 250 102 -9 82 47 45 -53
4686 -53 -20 64 126 63 -30 -73 -185 -149 -255 155 26 52 115 23 -122 -50 -46 34 -22 62 -47 -28 -24 -89 -92 98 306 96
4714 96 -142 38 151 -42 99 381 -184 223 -143 -66 66 221 116 -162 161 34 -33 -224 166 -62 84
4735 84 -26 5 -36 33 176 34 115 -52 -7 -68 360 52 93 90 -12 278 -176 -10 101 111 -68 8 1 23 -25
4760 -25 -40 3 -19 -65 15 157 112 110 26 50 50 -165 195 59 -241 -4 203 -181 205 -136 43 42 86 -28 -310
4785 -310 226 -111 -166 -11 -27 73 -114 117 133 -251 160 -95 144 -211 199 -78 -52 71 -105 70 100 -60
4807 -60 -244 264 -76 -69 -408 38 28 121 36 -32 232 268 34 128 86 51 5 47 87 -53 -146 -104 36 -38 -164 46
4833 46 71 117 1 57 22 -134 -14 144 -41 -91 143 -14 135 3 -198 -119 -66 374 -159 -34 32 258 -13
4856 -13 162 -85 -298 -40 -127 -161 143 30 40 -37 73 217 -181 53 -201 -183 -81 -214 180 -225 -76 -93
4878 -93 98 -72 69 283 -89 -69 284 -107 132 -76 -334 44 -39 -152 3 257 -134 109 4 -129 -243
4899 -243 158 128 55 -69 -2 140 355 316 40 65 324 -190 52 230 51 43 -60 126 62 34 48 -51 9 118
4923 118 -227 28 -42 -63 262 139 101 -111 78 60 88 113 246 -329 221 73 184 280 -69 78 -33 -22 111
4946 111 -205 -60 -45 -65 112 41 9 -195 309 415 199 166 -102 11 3 58 265 56 54 243 -130 -190 106 174
4970 174 225 -68 266 -177 -104 -339 40 196 -157 75 -128 -197 2 54 5 -142 -202 32 -56 64 135 -73 82
4993 82 -141 -10 181 106 50 40 23 -104 68 93 232 22 -100 -473 34 122 -99 -82 -155 241 100 -46 45
5016 45 124 -364 15 -62 -149 65 -416 3 68 -100 115 -123 247 -286 159 -4 -276 -321 -3 -67 25 28 198
5039 198 -242 -253 134 -121 69 -236 -131 -78 118 234 1 -61 29 143 -124 44 -14 -7 102 -165 28 80 -73
5062 -73 100 53 -22 -121 125 -166 -54 -92 37 -98 44 172 90 179 -131 90 153 -131 -49 156 119 -58 -65 163
5086 163 103 153 53 -90 -7 47 137 -21 53 30 -194 -28 -65 24 55 8 0 -39 76 -111 144 65 200 -46 116
5111 116 10 183 -130 -2 59 -208 163 -172 271 68 -272 90 69 -7 -201 65 53 -75 -63 230 110 -83
5133 -83 104 141 131 4 -46 -223 71 -226 -8 -69 -125 -44 39 49 86 -67 -110 -34 103 165 -127 -70 38 119 -33
5158 -33 30 114 -52 -183 -39 51 47 26 8 -101 -142 -75 185 -28 197 71 -101 60 279 75 85 -141 130 -21
5182 -21 72 114 37 -70 170 134 -255 -267 -54 -12 -49 19 52 -105 139 14 -213 90 -136 55 -278 -349 164 -102
5206 -102 1 149 -192 -187 6 -33 -223 28 -68 -173 -207 9 -1 51 -52 64 -187 72 12 115 -92 -158 -170
5229 -170 17 -3 -108 128 -121 111 41 13 360 -37 -217 55 6 98 -87 24 -3 138 349 98 38 -112
5251 -112 14 66 -81 61 69 133 -309 270 45 91 -8 22 -160 90 -36 111 14 66 134 -137 371 7 148
5274 148 -42 -97 107 -17 -8 -66 39 -30 112 148 114 104 -101 214 -80 92 363 -68 -60 -20 -316 -152 -259 146
5298 146 3 28 -45 -55 -277 144 277 -237 202 54 -268 -155 101 173 -49 76 71 -62 17 92 -160 -293 168
5321 168 19 -134 196 6 -23 105 -97 -268 80 -99 -41 -90 -83 91 70 149 244 47 -236 -63 -252 -16 -283
5344 -283 -45 -84 -106 28 -91 25 10 -2 -61 -121 68 2 22 131 -31 -139 24 -36 94 -125 77 -148 85
5367 85 -28 103 -362 315 2 -131 180 23 171 253 56 24 -252 -63 209 139 -14 -181 -148 -70 -109 150
5389 150 -25 -32 137 -119 81 169 -35 -124 -75 -216 -212 199 22 169 255 223 204 6 -36 33 -97 -331 -3 93
5413 93 471 -1 -224 21 256 -154 38 61 62 -53 49 -35 167 -83 202 -132 173 221 33 -112 -28 224
5435 224 -102 78 194 -303 41 -134 196 164 33 -241 -284 68 -207 23 -49 -121 -69 -148 114 132 -247 -294 94
5458 94 -59 18 -46 -116 -103 175 -133 -79 96 -126 225 -149 15 -33 14 159 42 207 -36 150 8 -212 267
5481 267 -106 53 -151 -188 70 22 -69 -57 -125 -133 -6 5 -221 71 -68 226 117 129 0 -100 -17 223 -320
5504 -320 -454 -35 136 123 -119 24 98 -167 296 124 -143 -13 -81 -203 15 -42 149 346 221 -261 -111
5525 -111 188 -83 -80 167 -268 1 -99 -237 -146 -29 170 -32 92 -65 103 89 298 139 -156 -11 -58 -113
5547 -113 -315 -36 5 -72 289 -75 48 17 -55 191 105 32 -40 166 -114 253 229 148 -58 -196 -20 73 -190
5570 -190 73 144 -153 58 -177 436 170 132 74 21 -11 -49 -169 162 6 -7 103 -212 -257 -154 115 34 -136
5593 -136 -40 -220 227 -35 -86 154 24 -249 -1 -348 136 132 34 82 132 -77 -75 24 -78 92 26 -8 -57 -39 -183
5618 -183 129 242 370 153 5 -121 237 -117 64 -165 33 -136 93 30 -158 -66 183 -75 21 -99 -258
5639 -258 -196 113 -38 -92 185 90 130 21 270 -88 -67 -75 146 20 -72 -229 93 -67 195 -28 40 -66 11
5662 11 91 -91 271 -10 177 99 9 -269 77 137 -2 -123 -69 -165 -211 115 191 -239 -194 168 -104 1 -127
5685 -127 135 203 39 -81 146 122 -89 137 123 313 -58 48 -159 -223 -278 0 -477 -274 53 -71 59 -134
5707 -134 245 62 -178 122 211 56 115 6 -345 -12 123 81 -87 130 -89 89 115 20 -447 -18 203 -151
5729 -151 -79 -325 98 -83 -96 60 -136 -104 261 268 -129 106 -130 147 -70 173 157 65 114 -81 -6 -48 -124 168
5753 168 12 -69 181 51 -48 139 195 16 -83 67 -153 61 -238 -253 -191 218 214 33 35 -57 216 -157 -91 -194
5777 -194 192 96 408 287 166 161 91 39 106 51 -98 257 113 -53 101 -56 -141 112 107 196 -22 46 238 290
5801 290 -181 116 85 250 -72 256 -213 -171 115 145 271 123 73 100 -133 -234 -17 86 -30 -102 -22 92
5823 92 63 -60 21 25 -60 56 -14 60 51 0 41 -59 -87 -77 194 -36 -49 -2 -34 -82 71 -159 -168 208 -80 82 -15
5850 -15 111 114 -95 23 -163 60 -50 121 -124 36 -155 88 212 315 137 82 -381 -180 174 -29 -216
5871 -216 -310 154 -58 -21 67 -52 -17 31 21 -214 -65 160 73 -113 -201 208 -83 21 12 39 90 -40 29 11 -150
5896 -150 -206 -154 47 32 181 30 17 -68 91 131 139 -89 -32 232 -51 185 -3 167 78 163 -91 32 148 -77
5920 -77 -155 184 -223 6 10 27 -40 136 -234 188 80 166 -191 20 -71 93 -96 135 -67 -26 -19 -168 95 -65
5944 -65 -82 -65 -23 -48 -171 -78 -110 -128 -8 -276 -93 -168 127 -96 92 -28 84 26 215 -17 -128 42 53 276
5968 276 -11 -177 -51 148 180 108 113 48 92 -116 139 -3 -145 186 31 -150 -140 223 -221 -117 -37 65 133
5991 133 -23 78 174 147 16 58 -145 200 -124 -80 69 57 -64 -44 -315 -271 119 342 -47 -101 111 98 0
6014 0 127 42 -359 37 -241 254 -6 29 302 -101 14 147 -32 40 165 154 -172 -35 57 205 90 -124
6036 -124 197 -206 0 -30 -125 -21 277 252 -23 -16 -219 -139 -145 -250 -123 223 165 -28 -54 -99 27 -34 54 -114
6060 -114 -8 162 125 -114 -18 -343 -55 -67 307 49 119 -410 141 115 134 -184 -114 -45 76 152 74 -160 83
6083 83 193 -125 69 -175 -38 -135 147 -94 15 -67 156 63 -75 196 97 -161 -63 -148 -83 73 47 75 173 -189
6107 -189 -176 -163 -133 -105 -122 -113 225 -222 -179 226 43 23 240 -178 -126 120 44 275 -99 -105 149 -101 -142 -144 315
6132 315 115 -64 329 3 -97 70 20 -67 192 69 409 -218 26 2 -64 52 -370 31 -178 -165 -79 32
6154 32 -25 -111 -88 -104 -4 -51 87 13 4 -108 29 125 -30 17 340 -59 31 38 -50 105 119 60 -34 -222 -103 38
6180 38 11 74 122 354 48 -178 31 56 270 -27 7 65 56 -126 -50 -74 -49 -255 50 -129 237 189 -167 -9
6204 -9 44 11 -73 16 -16 -130 -109 -145 -94 -41 22 -57 -24 246 -70 -348 -47 -174 44 -130 37 -151 -51 -15 85
6229 85 169 48 -13 193 -38 161 22 -107 172 -79 146 -12 -156 181 141 177 -133 -71 -96 53 107 95 379
6252 379 -38 35 113 -240 310 80 46 21 -22 120 222 103 -85 -32 -98 18 -36 -15 169 275 23 -12 180
6275 180 -38 11 -155 -109 -144 -94 0 128 -98 -73 101 256 -238 -3 217 56 -56 -420 -43 -179 99 7
6297 7 23 -136 -173 -40 -6 35 199 -185 41 66 206 17 57 132 4 -99 98 141 337 185 203 44 -150 20
6321 20 -196 117 -54 -28 -30 -108 66 -138 -169 -6 -116 -32 55 -300 85 21 101 113 52 93 366 -34 143 -118
6345 -118 -22 100 6 9 -243 -169 -7 -77 -49 67 -292 64 168 -74 20 -84 -97 118 -1 -423 -111 55 256
6368 256 -5 88 -13 -15 114 48 -297 27 -71 -138 69 -426 -88 50 131 136 17 120 -219 252 63 86 125 93
6392 93 87 55 -91 -80 -111 -169 265 -116 -10 -109 -97 89 15 -159 29 21 -128 -88 14 -215 28 -30 53 42 -24 97
6418 97 -117 158 -159 -46 -200 -124 199 -128 87 -54 -30 86 78 53 -8 -14 -178 134 104 -191 175 -145 21
6441 21 130 201 -237 -322 -158 -11 30 20 -81 -54 -136 319 257 -321 17 141 -69 -11 270 119 -207 -18 174
6464 174 -127 -186 -97 -57 31 144 366 143 -32 166 -2 -7 -151 -56 156 -154 -76 169 130 41 145 132 -148 -165
6488 -165 72 225 132 -39 -191 78 -32 196 -190 -43 212 -94 74 13 60 131 -42 11 -68 -130 -64 -4 -85
6511 -85 -14 216 64 -175 134 78 -115 28 158 121 61 -68 217 -28 -72 -104 34 164 129 -61 33 -120 56
6534 56 -42 71 127 -138 -45 19 -78 -16 198 -162 -84 57 -37 -62 125 -54 190 37 -26 66 5 188 -121 194
6558 194 64 -5 -168 -96 96 58 -6 -420 131 -186 18 -100 -71 -1 -248 155 52 58 -86 -52 9 -56 -277 224
6582 224 -98 -89 44 -151 3 -161 20 -141 -207 -154 -85 83 96 -284 82 69 -33 161 -89 -49 -130 -320 387
6605 387 21 -83 123 12 -142 39 -3 -78 61 -39 105 101 75 217 195 88 -214 -8 -55 34 98 -83 64
6628 64 -101 -9 114 188 222 -212 -29 256 -95 250 67 -19 -103 -190 53 32 -89 8 63 129 43 -102 5 289
6652 289 -24 21 179 -144 -264 -187 72 -53 -236 -70 -61 -264 -10 -54 34 171 218 38 -64 -135 -270 373 260
6675 260 204 7 21 -53 -53 176 -202 43 -55 -7 -185 -7 -52 -210 -94 -8 -57 188 192 -40 -150 -107 136 249
6699 249 1 148 -60 278 -232 57 32 269 -198 47 -132 -2 -65 138 -127 -261 28 -198 101 95 97 14
6721 14 -118 17 111 182 127 24 204 -48 -81 37 -12 259 198 -411 -29 -7 -213 372 15 150 186 -1 27
6744 27 -71 95 -22 -194 36 -411 223 -27 1 -82 63 -64 94 74 52 174 -10 -97 111 -174 -119 89 23
6767 23 3 -55 -149 -140 29 -82 0 128 74 -357 -174 131 74 -229 -262 167 -210 -97 107 -93 3 162 60 -199
6791 -199 -165 -109 169 -3 -139 -15 220 -31 -111 35 -24 23 93 -175 146 76 16 -58 -266 177 -304 -17 -86
6814 -86 52 -51 152 -20 -35 221 13 -146 -156 -148 -126 -145 -107 -1 -282 -98 -294 -163 -19 181 72 30 86
6837 86 -11 219 -13 -174 112 -235 -54 -5 45 -159 9 134 -174 -61 -217 -88 122 86 133 -126 -140 -136 92
6860 92 -57 19 85 -71 118 -93 67 258 73 103 -89 -413 -26 -318 99 -365 -20 -4 -103 80 107 -192
6882 -192 349 50 2 76 -57 -407 198 53 -93 -37 -103 121 -269 -38 108 -86 -14 -134 113 11 -128 27
6904 27 62 140 229 -3 -133 19 203 210 81 33 -175 136 123 -17 233 29 124 45 236 -7 168 -115 105
6927 105 184 -97 6 57 -14 -7 -90 -97 -52 -249 129 -124 192 -256 50 28 95 26 102 -205 117 131 -5 -75 -140
6952 -140 75 -98 57 -437 60 81 196 260 -8 -29 90 -35 -75 -137 -160 140 -252 66 80 -88 -56 -275 129
6975 129 -164 -9 219 267 185 239 -122 -74 24 60 -11 -21 70 15 241 111 59 103 -357 151 77 157 160 387 21
7000 21 -22 -181 -215 -8 -333 -162 -109 1 92 -32 -71 -107 -54 -42 -94 117 38 -114 -85 -235 -9 -25 58 136 -25
7025 -25 50 154 -125 -62 43 -113 187 -41 185 181 -55 136 -150 16 88 106 3 -33 38 -179 43 -11 80 76
7049 76 -134 190 42 -195 109 299 -113 -163 31 -83 -87 196 49 -228 198 -253 -132 -74 -32 37 -252 131
7071 131 -2 124 -40 286 53 -339 266 40 82 -146 -63 172 92 -119 -1 -5 -47 243 -110 -3 -30 -12 -30
7094 -30 -121 142 -124 -38 -66 -76 -149 113 67 210 62 -256 -150 128 228 159 211 -197 129 84 -190 47 104 45
7118 45 -160 -23 4 -258 226 90 97 -6 -59 -157 96 -189 92 184 445 -165 -47 9 165 -35 13 89 70 -108
7142 -108 -219 124 -282 57 -118 119 93 -209 -56 101 134 231 -165 -151 71 -178 130 42 4 -61 183 -29
7164 -29 -220 -90 54 239 180 -90 -7 93 1 -21 -154 -98 51 -93 32 5 -19 28 190 94 136 9 106 -141
7188 -141 -226 -182 -21 -185 -158 -181 205 -99 -94 179 -446 206 80 -69 57 148 -467 46 127 -127 148 -64 -219
7211 -219 161 397 69 -82 -3 59 -26 -133 -208 21 201 -45 -133 -189 33 -268 -27 -73 -193 5 -76 73 -88
7234 -88 -44 40 -230 250 -262 214 7 -31 95 92 -109 -56 215 309 -10 56 198 -47 -97 -289 327 -122 -12
7257 -12 -71 141 -114 -160 -169 -329 80 -277 -118 74 -241 155 -105 -61 149 37 7 -216 -22 -165 137 -6
7279 -6 -141 3 87 215 -66 -229 -56 18 54 -77 -55 -52 101 31 47 60 -91 -75 80 -184 17 224 -206 -134
7303 -134 48 73 237 92 -55 24 -135 133 41 106 -235 67 43 53 -369 38 80 160 18 103 33 -171 189
7326 189 53 -58 38 27 -10 -345 -287 129 90 110 116 190 90 -69 50 -366 34 -97 -181 -123 -118 313 200 144 113
7351 113 116 -63 -108 -183 222 -11 -10 209 -216 14 347 4 40 -19 -23 -219 -83 -178 90 -45 164 99 118 16
7375 16 -88 -23 -12 30 -222 117 122 -173 125 -107 -18 288 -17 -20 -184 28 -14 2 150 -68 -22 27 -50 238 -64
7400 -64 161 31 57 -25 -37 302 75 128 -203 115 39 -128 82 -495 -189 -14 -137 248 -272 -144 78 -169
7422 -169 54 -69 154 57 35 -16 34 46 76 72 -39 -112 34 -122 -14 -19 87 29 224 176 -122 160 173 263 -229
7447 -229 434 -149 34 178 -4 119 162 -47 85 74 70 30 107 4 -58 -174 128 64 -210 94 47 -48 53
7470 53 -44 9 86 -26 -226 12 -75 -81 117 -243 218 2 -200 -89 204 -137 113 -182 28 146 -274 -268 -159
7493 -159 -382 256 -37 -133 33 -98 83 101 99 -54 -135 -208 20 -143 10 105 87 92 -57 168 234 -31 -24 -197
7517 -197 126 95 -5 -1 -207 3 -159 263 -107 68 -164 42 -237 -207 -175 18 -175 25 -184 -186 -190 15 -42
7540 -42 51 -73 -85 3 154 136 205 -143 -180 152 -36 25 124 265 -158 -85 -93 -163 -102 210 -37 167 153 -66 -53
7565 -53 -196 -174 -27 29 -92 72 140 40 -3 143 -78 -86 -35 36 40 -299 257 5 -121 60 7 -198 136 112
7589 112 101 68 -14 -138 -263 16 -39 42 264 -178 95 -134 -147 72 -69 57 -131 -315 205 -275 8 53
7611 53 284 -230 58 78 27 23 -96 -162 78 -184 -107 5 -182 -245 -42 69 -199 219 223 -370 66 7 -20 46
7635 46 -113 82 124 204 72 -15 -129 5 65 60 -2 185 3 27 -154 -32 -63 93 -88 338 69 214 -62
7658 -62 309 201 1 224 -220 -38 134 -185 118 359 38 -145 -242 -79 102 177 -201 31 -19 -74 -29 -52
7680 -52 -24 295 241 -41 -65 30 170 284 -80 76 154 -30 23 182 247 -131 271 -135 56 -82 -238 143 -122
7703 -122 153 -83 53 -113 -74 247 -140 -99 -47 -144 -130 -62 0 -185 95 -162 115 17 -42 -198 10 292 -4
7726 -4 -258 13 10 -101 -52 89 48 281 -459 149 44 -47 -136 -77 -8 -51 34 -52 190 199 136 -302 265 -148 105
7751 105 -96 -31 181 133 -91 56 -202 10 83 131 -78 -208 -21 255 -103 19 186 -204 174 198 -131 304
7773 304 150 -391 -202 81 -161 -153 95 -194 4 259 95 -112 320 -20 162 157 -121 -276 87 -110 63
7794 63 -195 -117 190 147 -204 -4 115 -183 -50 -12 -78 58 -7 -63 -178 -130 -84 75 -231 -165 -19 144 46 48
7818 48 179 -55 -47 253 -53 149 59 88 -64 21 96 -212 24 -130 -68 -82 39 4 189 -108 -100 79 2 -146
7842 -146 28 354 212 -175 -8 75 132 -82 -72 158 -25 -198 -103 -14 109 -13 -229 -66 95 -116 -268 -130
7864 -130 -103 81 89 -114 -184 -30 31 80 -67 -9 -41 55 -138 -40 92 -91 122 174 374 55 -258 212 139 79
7888 79 57 79 112 307 -93 -11 -157 -267 165 16 78 52 5 -126 178 -81 -144 -13 48 -106 47 -53 150
7911 150 -330 1 39 -91 130 110 116 -34 187 69 27 -194 -93 -187 80 9 -93 143 189 -37 84 -113 416
7934 416 -28 -106 60 -60 -18 -398 -147 -97 -111 145 -149 -22 124 119 -8 -64 5 -128 -87 -217 156 -41 87
7957 87 164 64 23 -128 -99 135 -273 -15 226 180 3 -29 -101 -63 -292 -189 6 99 94 -26 -1 -59 -234 166
7981 166 151 23 -102 216 60 -153 -9 -262 42 7 179 57 -99 -33 -192 -99 231 60 189 22 -65 27
8003 27 40 -37 -435 -201 -118 -51 72 -52 -115 -195 -369 174 110 -357 -90 -70 96 179 134 -53 123 -78 133 -36
8027 -36 71 51 81 163 5 46 80 237 324 138 -308 -362 -195 10 -93 273 66 -195 45 14 -144 -10 -120
8050 -120 -289 -4 30 61 -122 -220 -141 -41 144 68 10 93 -162 -95 -125 -81 -86 62 -89 -26 215 -190 151 23
8074 23 -90 -9 -80 63 -188 25 209 -58 189 162 -320 505 89 246 -94 -69 119 5 -53 64 76 -46
8096 -46 -145 -14 24 -54 -38 -178 51 -67 -25 -43 -75 20 52 -35 -77 -152 -23 402 123 127 41 32 -2 -29 299 6 137
8123 137 165 51 -56 -75 -113 188 17 38 58 42 71 -189 -214 -181 418 -73 34 -143 93 23 -262 135 100 -250
8147 -250 46 91 -163 75 -6 -113 -87 277 -12 113 -88 87 45 220 -109 -9 -23 44 20 -179 236 -180
8169 -180 -94 -132 -120 -75 -195 -102 -97 -127 -87 -108 227 -215 28 141 -73 151 24 -7 211 55 -240 15
8191A5
##END NTUPLES=NMR FID
##END=
