##TITLE=1H_LR-798-RM2-C1
 200.13MHz, CDCl3,
 8 sc
 
 12.3.2025
##JCAMPDX= 6.0         $$ Bruker NMR JCAMP-DX V2.0
##DATA TYPE= NMR FID
##DATA CLASS= NTUPLES
##ORIGIN= UXNMR, Bruker Analytische Messtechnik GmbH
##OWNER= pz
$$ XWIN-NMR		Version 3.5
$$ Wed Mar 12 14:07:02 2025 Russian Standard Time (UT+4h)  she@DPX200
##.OBSERVE FREQUENCY= 200.1313
##.OBSERVE NUCLEUS= ^1H
##.DELAY= (6, 6)
##.ACQUISITION MODE= SIMULTANEOUS
##.ACQUISITION SCHEME= undefined
##.AVERAGES= 8
##.DIGITISER RES= 18
##SPECTROMETER/DATA SYSTEM= spect
##.PULSE SEQUENCE= zg30
##.SOLVENT NAME= CDCl3
##.SHIFT REFERENCE= (INTERNAL, CDCl3, 0, 14.3821)
##AUDIT TRAIL= $$ (NUMBER, WHEN, WHO, WHERE, WHAT)
$$ ##TITLE= Audit trail, XWIN-NMR		Version 3.5
$$ ##JCAMPDX= 5.01
$$ ##ORIGIN= Bruker BioSpin GmbH
$$ ##OWNER= she
$$ F:/spectra/data/she/nmr/H-C/1/audita.txt
$$ ##AUDIT TRAIL=  $$ (NUMBER, WHEN, WHO, WHERE, WHAT)
(   1,<2025-03-12 14:05:25.14 +0400>,<she>,<DPX200>,
      <created by zg, POWCHK disabled, PULCHK disabled
       configuration hash MD5:
       00 E9 B6 7A A2 85 ED C7 34 08 36 98 17 FE 4E 26
       data hash MD5: 16K
       5A FE 56 6C C0 DC 49 2C 0C EC 39 E6 28 D6 F7 6A>)
$$ ##END=
$$ 
$$ hash MD5
$$ 24 3B 4B 0C AA 20 5D 9C 45 BB EB 54 C7 D1 A4 12
##$RELAX= 
##$RELAX= 
##$RELAX= 
##$RELAX= 
##$RELAX= 
##$RELAX= 
$$ Bruker specific parameters
$$ --------------------------
##$DU= <F:/spectra>
##$EXPNO= 1
##$NAME= <H-C>
##$PROCNO= 1
##$TYPE= <nmr>
##$USER= <she>
##$AMP= (0..31)
100 100 100 100 100 100 100 100 100 100 100 100 100 100 100 100 100 100 
100 100 100 100 100 100 100 100 100 100 100 100 100 100 
##$AQSEQ= 0
##$AQ_mod= 1
##$AUNM= <au_zg>
##$AUTOPOS= <>
##$BF1= 200.13
##$BF2= 200.13
##$BF3= 200.13
##$BF4= 200.13
##$BF5= 200.13
##$BF6= 200.13
##$BF7= 200.13
##$BF8= 200.13
##$BYTORDA= 1
##$CFDGTYP= 0
##$CFRGTYP= 5
##$CHEMSTR= <none>
##$CNST= (0..31)
1 1 145 1 1 1 1 1 1 1 1 1 1 1 1 1 1 1 1 1 1 1 1 1 1 1 1 1 1 1 1 1 
##$CPDPRG= <>
##$CPDPRG1= <>
##$CPDPRG2= <>
##$CPDPRG3= <>
##$CPDPRG4= <mlev>
##$CPDPRG5= <mlev>
##$CPDPRG6= <mlev>
##$CPDPRG7= <mlev>
##$CPDPRG8= <mlev>
##$CPDPRGB= <>
##$CPDPRGT= <>
##$D= (0..31)
0 0.7 0 0 0 0 0 0 0 0 0 0.03 0 0 0 0 0 0 0 0 0 0 0 0 0 0 0 0 0 0 0 0 
##$DATE= 1741773924
##$DBL= (0..7)
120 120 120 120 120 120 120 120 
##$DBP= (0..7)
150 150 150 150 150 150 150 150 
##$DBP07= 0
##$DBPNAM0= <>
##$DBPNAM1= <>
##$DBPNAM2= <>
##$DBPNAM3= <>
##$DBPNAM4= <>
##$DBPNAM5= <>
##$DBPNAM6= <>
##$DBPNAM7= <>
##$DBPOAL= (0..7)
0.5 0.5 0.5 0.5 0.5 0.5 0.5 0.5 
##$DBPOFFS= (0..7)
0 0 0 0 0 0 0 0 
##$DE= 6
##$DECBNUC= <off>
##$DECIM= 32
##$DECNUC= <off>
##$DECSTAT= 4
##$DIGMOD= 1
##$DIGTYP= 9
##$DL= (0..7)
0 120 120 120 120 120 120 120 
##$DP= (0..7)
150 150 150 150 150 150 150 150 
##$DP07= 0
##$DPNAME0= <>
##$DPNAME1= <>
##$DPNAME2= <>
##$DPNAME3= <>
##$DPNAME4= <>
##$DPNAME5= <>
##$DPNAME6= <>
##$DPNAME7= <>
##$DPOAL= (0..7)
0.5 0.5 0.5 0.5 0.5 0.5 0.5 0.5 
##$DPOFFS= (0..7)
0 0 0 0 0 0 0 0 
##$DQDMODE= 0
##$DR= 18
##$DS= 0
##$DSLIST= <SSSSSSSSSSSSSSS>
$$ [...]
##$SUBNAM0= <"">
##$SUBNAM1= <"">
##$SUBNAM2= <"">
##$SUBNAM3= <"">
##$SUBNAM4= <"">
##$SUBNAM5= <"">
##$SUBNAM6= <"">
##$SUBNAM7= <"">
##$SUBNAM8= <"">
##$SUBNAM9= <"">
##$SW= 18.0517328524113
##$SWIBOX= (0..15)
0 0 2 0 0 0 0 0 0 0 0 0 0 0 0 0 
##$SW_h= 3612.71676300578
##$TD= 16384
##$TD0= 1
##$TE= 0
##$TE2= 300
##$TE3= 300
##$TEG= 300
##$TL= (0..7)
0 120 120 120 120 120 120 120 
##$TP= (0..7)
150 150 150 150 150 150 150 150 
##$TP07= 0
##$TPNAME0= <>
##$TPNAME1= <>
##$TPNAME2= <>
##$TPNAME3= <>
##$TPNAME4= <>
##$TPNAME5= <>
##$TPNAME6= <>
##$TPNAME7= <>
##$TPOAL= (0..7)
0.5 0.5 0.5 0.5 0.5 0.5 0.5 0.5 
##$TPOFFS= (0..7)
0 0 0 0 0 0 0 0 
##$TUNHIN= 0
##$TUNHOUT= 0
##$TUNXOUT= 0
##$USERA1= <user>
##$USERA2= <user>
##$USERA3= <user>
##$USERA4= <user>
##$USERA5= <user>
##$V9= 5
##$VALIST= <valist>
##$VCLIST= <CCCCCCCCCCCCCCC>
##$VD= 0
##$VDLIST= <DDDDDDDDDDDDDDD>
##$VPLIST= <PPPPPPPPPPPPPPP>
##$VTLIST= <TTTTTTTTTTTTTTT>
##$WBST= 1024
##$WBSW= 4
##$XGAIN= (0..3)
0 0 0 0 
##$XL= 0
##$YL= 0
##$YMAX_a= 380530
##$YMIN_a= -474258
##$ZGOPTNS= <>
##$ZL1= 120
##$ZL2= 120
##$ZL3= 120
##$ZL4= 120
##$ABSF1= 10
##$ABSF2= 0
##$ABSG= 5
##$ABSL= 3
##$ALPHA= 0
##$AQORDER= 0
##$ASSFAC= 0
##$ASSFACI= 0
##$ASSFACX= 0
##$ASSWID= 0
##$AUNMP= <proc_1d>
##$AZFE= 0.1
##$AZFW= 0.1
##$BCFW= 1
##$BC_mod= 2
##$BYTORDP= 1
##$COROFFS= 0
##$CY= -3
##$DATMOD= 1
##$DC= 2
##$DFILT= <>
##$DTYPP= 0
##$F1P= 0
##$F2P= 0
##$FCOR= 0.5
##$FTSIZE= 0
##$FT_mod= 4
##$GAMMA= 1
##$GB= 0.15
##$INTBC= 1
##$INTSCL= 1
##$ISEN= 128
##$LB= 0.25
##$LEV0= 0
##$LPBIN= 0
##$MAXI= 10000
##$MC2= 0
##$MEAN= 0
##$ME_mod= 0
##$MI= 1.114404
##$NCOEF= 0
##$NC_proc= 0
##$NLEV= 6
##$NOISF1= 3.799351
##$NOISF2= 2.8
##$NSP= 1
##$NTH_PI= 0
##$NZP= 0
##$OFFSET= 14.38212
##$PC= 1
##$PHC0= -472.3292
##$PHC1= 15.99221
##$PH_mod= 1
##$PKNL= yes
##$PPARMOD= 0
##$PSCAL= 0
##$PSIGN= 0
##$REVERSE= no
##$SF= 200.129724274929
##$SI= 16384
##$SIGF1= 3
##$SIGF2= 2
##$SINO= 400
##$SIOLD= 16384
##$SREGLST= <1H.CDCl3>
##$SSB= 0
##$STSI= 0
##$STSR= 0
##$SW_p= 3205.1282051282
##$SYMM= 0
##$S_DEV= 0
##$TDeff= 0
##$TDoff= 0
##$TI= <>
##$TILT= no
##$TM1= 0
##$TM2= 0
##$TOPLEV= 0
##$USERP1= <user>
##$USERP2= <user>
##$USERP3= <user>
##$USERP4= <user>
##$USERP5= <user>
##$WDW= 1
##$XDIM= 8192
##$YMAX_p= 0
##$YMIN_p= 0
$$ End of Bruker specific parameters
$$ ---------------------------------
##NTUPLES= NMR FID
##VAR_NAME=  TIME,          FID/REAL,        FID/IMAG
##SYMBOL=    X,             R,               I
##VAR_TYPE=  INDEPENDENT,   DEPENDENT,       DEPENDENT
##VAR_FORM=  AFFN,          ASDF,            ASDF
##VAR_DIM=   8192,          8192,            8192
##UNITS=     SECONDS,       ARBITRARY UNITS, ARBITRARY UNITS
##FACTOR=    0.0002768,     1,               1
##FIRST=     0,             0,               0
##LAST=      2.2672688,     0,               0
##MIN=       0,             -474258,         0
##MAX=       2.2672688,     380530,          0
$$ Real data points
##PAGE= N=1
##DATA TABLE= (X++(R..R)), XYDATA
0@%%%%%%%%%%%%%%Qj6J6j6J6j8K6l2L3m0M7n3O1p0Q2r4J04j15J30j48J68j88K09
$$ 0 0 0 0 0 0 0 0 0 0 0 0 0 0 0 8 -8 8 -8 8 -10 16 -16 17 -23 24 -29 32 -38 44 -50 54 -61 69 -79 89 -99 110
37A10k32K58k85L15l50L85m25M69n16N67o23O89p59Q33r17J013j120J243j384
$$ 110 -122 136 -149 166 -184 201 -224 245 -271 296 -327 362 -397 436 -481 532 -588 655 -729
56g29J547j740J969k250K599l044L635m446N623p460J0622j6984L4003j52497
$$ -729 818 -922 1047 -1203 1396 -1648 1987 -2459 3164 -4296 6326 -10658 23345 -129152
70a29152l45106O33472K9040m77900L59161K72799m36967r0977L07962j06218
$$ -129152 -474258 159214 188254 -289646 69515 342314 -94653 -185630 122332 16114
80A6114k19008K77494J50497l44188o81K70718j82425j19872K15728p535j01520
$$ 16114 -202894 74600 225097 -119091 -119772 150946 -31479 -151351 64377 56842 -44678
91d4678L4759L8448K4378j11705k8809K00408r6513j47052K69516l002l00744
$$ -44678 -9919 28529 52907 -58798 -87607 112801 16288 -130764 138752 135750 -164994
102a64994J26137J44500k09065J3863K57903p6991k46777J49188J38111l08712
$$ -164994 -38857 105643 -103422 -89559 168344 91353 -155424 -6236 131875 -176837
112a76837K9395L84998j93946k10617L03870o3475k64253K02492R3982j69319
$$ -176837 -147442 237556 43610 -167007 136863 73388 -190865 11627 105609 -63710
122f3710N6777J08742q3478r7070N8887P7768j02106j9586J49556n3460j04197
$$ -63710 -6933 101809 18331 -78739 -19852 57916 -44190 -63776 85780 32320 -71877
133g1877P5007M739m2474J7490K8949O1693o9755q0122J36931m0798j43650J86569
$$ -71877 3130 7869 -34605 -17115 11834 73527 3772 -76350 60581 19783 -123867 62702
145F2702M9803j96234Q3287R2355j58366j4425J32687j8614j02015O2106J04890
$$ 62702 112505 -83729 -442 91913 -66453 -80878 51809 33195 -68820 -6714 98176
156I8176j33046n8224J76591p4001j27755J83994P177j48694J06400L6948j21412
$$ 98176 -34870 -93094 83497 9496 -118259 65735 72912 -75782 30618 67566 -53846
167e3846K2713N9095j0534k7942K157N1228n2884o3165R7529K449p3350O6836
$$ -53846 -31133 27962 17428 -10514 -8357 42871 -10013 -73178 24351 26800 -46550 20286
179B0286Q403n9176J5292N459K5060M018m4555O4330k935j02221Q0210L5359j08810
$$ 20286 28689 -30487 -15195 -9736 15324 19342 -25213 39117 36182 -66039 14171 49530 -59280
192e9280O2098N6678q8905Q806M5221k7387k7109Q340M8347k7535m2728Q7714
$$ -59280 2818 59496 -29409 -20603 24618 -2769 -29878 -21538 26809 -726 -43454 44260
204D4260j7130r2081R1202J2934r5743P1594L3041p1074K3790J3970j8288L081
$$ 44260 27130 -64951 26251 39185 -56558 15036 48077 -22997 793 14763 -3525 -444
216d44j5725K8335R75n0330M5471Q639n8138M7242J5057m2321L0182m498j3383
$$ -444 -16169 12166 13141 -37189 8282 16921 -41217 6025 21082 -21239 8943 4445 -8938
229h938K3192k8054J8369K5100n2415L2915K3592o9084L5102K8724n9079K5985
$$ -8938 14254 -13800 4569 29669 -22746 10169 33761 -35323 -221 28503 -30576 -4591
241d591K0883l0139J3058n483K901J1737l2764L0947J6896n4345M2542K0985o2508
$$ -4591 16292 -13847 -789 -6272 -3371 8366 -24398 6549 23445 -30900 11642 32627 -29881
254b9881L7110J9333m5876K6946K103k0703K2288j9869J002K0999l4505K0037
$$ -29881 7229 26562 -19314 7632 9735 -10968 11320 -8549 -7547 13452 -21053 -1016
266a016J6820m4999L1743J4794m1930L1701N344k6140K9497j4327r829K9550k8395
$$ -1016 15804 -29195 2548 17342 -24588 7113 12457 -13683 15814 1487 -8342 21208 -7187
279g187N309K3158l9934J8876K0217m3048K0342J3186k8217K1565p290j1929K9860
$$ -7187 -1878 21280 -18654 222 20439 -22609 -2267 10919 -17298 4267 -3023 -14952 14908
292A4908k3362l69K7617l3092J5634K4276m4339K1110K0669l8059K0553L747k4114
$$ 14908 -8454 -8823 18794 -14298 1336 25612 -18727 2383 23052 -15007 5546 9293 -14821
305a4821K7236j2109j4872K4853k0886L849J9583l4985J9720K0809l6225K0924
$$ -14821 12415 306 -14566 10287 -10599 -6750 12833 -22152 -2432 18377 -17848 3076
317C076R542k6425K7132o770k0351L0843j6532o616K5062l0589O599K4351l6022
$$ 3076 12618 -13807 13325 6555 -13796 17047 515 -6101 18961 -11628 -5029 19322 -16700
330a6700R699J6773k6285J9800J010k1337K6356p778j1693K2804k1510N407K5873
$$ -16700 -7001 9772 -16513 3287 4297 -17040 9316 1538 -10155 12649 -8861 -3454 22419
343B2419l3740J0206K2549l1931J4250Q197k9066K1812J95j9268K1339j2554l292
$$ 22419 -11321 -1115 21434 -10497 3753 11950 -17116 4696 4891 -14377 6962 -5592 -8884
356h884K4017k8628L401K6260k9243J0044J7046k4881J8113N979k1126J7898r176
$$ -8884 15133 -13495 -10094 16166 -13077 -3033 14013 -10868 7245 13224 -7902 9996 820
369H20q182K2718k5452J944K8183l2317M999K3155l2379R844J6409k3898J3691
$$ 820 -7362 15356 -10096 -8152 20031 -12286 -7287 15868 -16511 -6667 9742 -14156 -465
382d65M260q897J7053j6832R05K4361l0476M783K6644l2608P383K2488k7659P041
$$ -465 3795 -5102 11951 -4881 -3976 20385 -10091 -5308 21336 -11272 -3889 18599 -9060 -2019
396b019R356j5753J0817j0476k607K3965k4907K214L0846l1676J034K9166k8510
$$ -2019 7337 -8416 2401 -8075 -10682 13283 -11624 -9410 21436 -10240 -9206 19960 -8550
409h550M54K0857j2815L785j409p69J3592k7076J854K9281l5477K185L7410l3791
$$ -8550 -8096 12761 -54 3731 2322 1553 15145 -11931 -10077 19204 -16273 -14088 23322 -10469
423a0469m166L0924k1184n483J2080j857O511j4091N147K4888l1355J073L6073
$$ -10469 -14635 16289 -4895 -10378 1702 -155 6356 -7735 -2588 22300 -9055 -7982 28091
436B8091l5999p494L4875k3265j0056J9285m027J26r174L272J8872l0815P14L9216
$$ 28091 -7908 -15402 19473 -3792 -13848 5437 1410 1536 -7638 -4366 14506 -16309 -15595 23621
450B3621l4819p245M7648k5167k0396K9605o019j4066J413J0673R344k6750O069
$$ 23621 -11198 -18443 29205 4038 -16358 13247 7228 -6838 -5425 5248 14592 -12158 -6089
463f089L1625m0808o396M7824l3071k0509M3441r626k0417J5419O923l798j6804
$$ -6089 25536 -15272 -21668 26156 -6915 -27424 16017 6391 -14026 1393 8316 4518 -12286
476a2286J0051K5781l4210k287M4849l5566k1298M7020j3554k6430K1396K316
$$ -12286 -2235 23546 -10664 -12951 31898 -3668 -24966 22054 8500 -17930 3466 5782
488E782j2906q111J3366K0922l0970o31M1483l8366k1519N5101j4084l0442L3190
$$ 5782 -7124 -15235 -1869 19053 -11917 -12548 28935 -9431 -30950 24151 10067 -20375 12815
501A2815L075k2732L53J4400N379k9464M726L6808l7855j3222N7087k5055l7648
$$ 12815 15890 -6842 -6489 7911 13290 -16174 -11448 25360 -12495 -25717 31370 6315 -31333
514c1333M0885j173k9271J8896J7565p639j9161Q444K4206l2354n205M9876k9234
$$ -31333 9552 8379 -20892 -1996 15569 7930 -11231 -2787 21419 -10935 -16140 33736 4502
527D502l3373M3637n926l0853K5648J1419j6840j1264P773J7272k5515m019M6660
$$ 4502 -28871 14766 8840 -22013 3635 15054 -1786 -13050 -5277 11995 -13520 -17539 29121
540B9121k5753l1994M9213n992l8738L0099J1740k6119l29J8535M979k6065J558
$$ 29121 3368 -28626 20587 14595 -24143 5956 17696 -8423 -8752 9783 14762 -11303 -9745
553i745L2962l3903k0676N3934j4226l6242M0527R93l3921J6509J4320q095q768
$$ -9745 23217 -10686 -31362 22572 8346 -27896 12631 13624 -20297 -3788 10532 2437 -6331
566f331N646J8634k2760j2688M1184j5056l2291L5574Q68l2643J7175J1144j1440
$$ -6331 -685 17949 -4811 -17499 23685 8629 -23662 11912 12780 -19863 -2688 8456 -2984
579b984n888O756J6164k0039j2780L7814j6042l2027M5341L006l8543K6070J1661
$$ -2984 -8872 -2116 14048 -5991 -18771 19043 3001 -29026 16315 19321 -19222 6848 18509
592A8509k9053K609J5039j04j4481O73K3926k0590j9586L8795q681l1438L1462
$$ 18509 -10544 -7935 7104 7000 -7481 -6808 17118 -3472 -23058 15737 7056 -24382 7080
605G080K819k6526J7966P971r013j253j373J2297q630j5477K9161m434l0539K6588
$$ 7080 9899 -16627 1339 9310 297 -956 -2329 9968 1338 -14139 15022 10588 -19951 6637
619F637M899k7588J6461Q618j4807n13K515Q284p061r555K7125p716k7737L0282
$$ 6637 11536 -16052 409 9027 -5780 -6293 -3778 4506 -2555 -12110 15015 7299 -20438 9844
633I844K501k9988K4252Q684k3863Q850O122o399k205l608J2814o340j7334K4332
$$ 9844 12345 -17643 6609 15293 -8570 280 6402 3 -2202 -5810 7004 664 -16670 7662
647G662j36k4851K2624L706k3138J4982N579r699O216k438M944j382j4350J7870
$$ 7662 7526 -17325 5299 9005 -14133 849 6428 -3271 2945 507 5451 4069 -10281 7589
661G589J649k3073J9796M082k5369J5792O145j5123Q156J387k387N97p676J3322
$$ 7589 9238 -13835 5961 10043 -15326 466 6611 -8512 -356 1031 -1356 -759 -8435 4887
675D887K003j8399J9122L394k4179J8760N535k0949J2357M006j0756M586k714
$$ 4887 6890 -11509 7613 11007 -13172 5588 11123 -9826 2531 6537 -4219 367 -2347
688b347L788J760j4000J2620K381j8182J8227M121j9819J4782L279j4267J0412
$$ -2347 1441 3201 -10799 1821 4202 -13980 4247 8368 -11451 3331 6610 -7657 2755
701B755K07j726N252j0991O439M580j6398J3196N763k0305J2302M604j6509J0500
$$ 2755 2962 1236 6488 -4503 1936 6516 -9882 3314 9077 -11228 1074 5678 -10831 -331
715c31K677o124N886o078L973N949j3027J1122N013j9025J4007N579j8802J2637
$$ -331 2346 -3778 2108 -3970 3 5952 -7075 4047 9060 -9965 4042 9621 -9181 3456
729C456L988j3818Q253k598l398P711r044M335N946j4900J0335O500j5548J1657
$$ 3456 7444 -6374 1879 -719 -4117 3594 -5450 -1115 4831 -10069 266 6766 -8782 2875
743B875M353j3508R487r71n186R059p684J780P615j4854O796Q027j7836R351P047
$$ 2875 7228 -6280 3207 2236 -2950 6109 -1575 205 7820 -7034 -238 7789 -10047 -696 6351
758F351j5665R304L700j0115Q612k236k768P508q448M432P311j3411P274O665
$$ 6351 -9314 -10 3690 -6425 2187 -49 -2817 4691 -3757 675 7986 -5425 1849 8514
772H514j5205R137L053j2655R890j535p204J0134p096j495J0256j2334L330R666
$$ 8514 -6691 2446 5499 -7156 2734 1199 -6005 4129 -2967 -4462 5794 -6540 -3210 6456
786F456j3143O688O743j1746Q085J810q709Q315m117l306R301j0038J582R567
$$ 6456 -6687 1 6744 -5002 3083 4893 -3816 4499 382 -2924 6377 -3661 -2079 7488
800G488j3965M776P057j3711P403M694j1288J0063k81o921J0202n666k436R676
$$ 7488 -6477 -1701 5356 -8355 -952 3742 -7546 2517 2236 -4685 5517 -149 -2585 7091
814G091r804J363R019j1989N237M917j1594P354N01r041R513m043m450J0991q641
$$ 7091 -2713 -1350 7669 -4320 917 5834 -5760 1594 2095 -6946 2567 -1476 -5926 5065 -3576
829c576J68J0155j1729L344Q091j1681O845M742j0651Q351q32p285Q933n801l555
$$ -3576 -3408 6747 -4982 -1638 6453 -5228 1617 6359 -4292 4059 3227 -4058 4875 -926 -4481
844d481R675r222P51Q371j0840M525N481j1153P547J687p762R703k798m328J0465
$$ -4481 5194 -4028 -3277 5094 -5746 -1221 4260 -6893 654 2341 -5421 4282 1484 -2844 7621
859G621q493j748R932j1028J739Q343j1134M371M630r437O216q74o019Q767n397
$$ 7621 -872 -2620 7312 -3716 -1977 6366 -4768 -397 4233 -5204 1012 138 -5881 2886 -2511
874b511k310J0826q812Q17R842j1010K728P276j0516M947K438p347P887l567m884
$$ -2511 -4821 6005 -2807 -1990 7852 -3158 -430 6846 -3670 1277 3715 -3632 4255 688 -4196
889d196R402p845k877J0582j0354P74J0206r618K644N397p420N198p50m776R616
$$ -4196 5206 -2639 -5516 5066 -5288 -4514 5692 -3926 -1282 4115 -3305 1893 1143 -3633 5983
904E983o135k519J1147j0429j811J0868j0912n2Q279q400L279J780n356P078m062
$$ 5983 -152 -2671 8476 -1953 -3764 7104 -3808 -3860 4419 -3981 -702 1078 -4278 2800 -1262
919a262m124J1067p772k407J2091r204j394J0417q240M08M252o211N082k734n106
$$ -1262 -5386 5681 -2091 -4498 7593 -1611 -3005 7412 -828 -420 3832 -2379 2703 -31 -5137
934e137J0230o725m247J2400q805m388J1844p961j460P820m319K768K81n449Q293
$$ -5137 5093 -1632 -5879 6521 -2284 -6672 5172 -2789 -4249 3571 -748 2020 2301 -3148 5145
949E145n438m875J2522p277n092J2429q232m463R166o085N7L186m617N871k549
$$ 5145 -293 -5168 7354 77 -5015 7414 -818 -5281 3885 -2200 -2143 1043 -3574 2297 -252
964b52n486J1083n826n401J3241n802o474J0879n461l319N916l843L431j345o325
$$ -252 -5738 5345 -481 -5882 7359 1557 -4917 5962 501 -2818 3098 -745 2686 1341 -4984
979d984R061n410p266J3915n328o811J2779n271n890P819m042Q60K636m058P514
$$ -4984 4077 -1333 -8599 5316 -12 -6823 5956 685 -5205 2614 -1428 -568 2068 -1990 5524
994E524l294o948J0435n262p964J3076m158o810R289m445l502M344m027M873N6
$$ 5524 2230 -4718 5717 455 -7509 5567 1409 -5401 3888 -557 -4059 285 -3742 1131 1187
1009A187o040R598l702q232J2242k681p339J1238l458o035N906m119J103K031
$$ 1187 -4853 4745 1043 -7189 5053 2372 -4967 6271 2813 -3222 2684 -1435 -332 1699
1023A699n563P630j811q898R765l193p861J1343j516n807Q277l241k107L036n042
$$ 1699 -3864 3766 1955 -6943 2822 -371 -8232 3111 1595 -4212 4065 824 -1283 1753 -3289
1038c289N510J341p234R112k210j0262J0106j615q034R895k137m361M848m542
$$ -3289 2221 3562 -3672 5440 3230 -7032 3074 1459 -6575 3320 1183 -3178 1670 -2872
1052b872Q82K569m815P887r3q514R027j675q576J0052j484n144P694l998k636
$$ -2872 -1990 579 -4236 3651 3558 -4956 4071 2396 -6180 3872 2388 -2756 4938 940 -1696
1067a696L466o147L980K452o912P345K26q886P838j029o652Q867j269k570N517
$$ -1696 1770 -4377 -397 2055 -4857 2488 2714 -6172 1666 637 -6015 2852 1583 -987 4530
1082D530n191O73K220o291O164J956q072P742j520r040Q017j198m646P621k792
$$ 4530 -661 12 2232 -4059 2105 4061 -4011 3731 2211 -6829 1188 -10 -4656 2965 173
1097A73k345L885n183K821L270o106O864L77p432P574k190o789Q645k742l228
$$ 173 -2172 1713 -3470 -649 2621 -3485 3379 3756 -3676 3898 1708 -5081 3564 822 -2406
1112b406O533n056j037L299o256L548L459o288P085m00p573O935j547m398Q514
$$ -2406 4127 -929 -1966 1333 -4923 -1375 2084 -4204 2881 2481 -5092 1843 296 -4102 4412
1127D412k479k217M448o318J328L394o089N706J012q238O662q86o926Q004o91
$$ 4412 1933 -284 4164 -2154 -826 2568 -3521 2185 3197 -5041 1621 735 -6191 1813 1122
1142A122m780N555k724l45L876m475K653J791o324O851m5p076Q041k519p074P023
$$ 1122 -3658 1897 -827 -1172 2704 -1771 882 2673 -3651 3200 3155 -3921 4120 1601 -5473 1550
1158A550j719k021N329m697j30K186n522N477K364o119O596q66p517P027j6l605
$$ 1550 -169 -2190 3139 -1558 -1688 498 -5024 453 2817 -3302 3294 2428 -5089 1938 1922 -1683
1174a683N467l411j097L323n977L748K510p752O219J135q589P185J113o442N514
$$ -1683 3784 373 -724 2599 -3378 370 2880 -4872 1347 2482 -6107 1078 2191 -4251 1263
1189A263r99k361M365l026J607K643o390M468J497p299O663J265p823N474q30
$$ 1263 264 -2097 2268 -758 849 3492 -2898 1570 3067 -4232 2431 3696 -4127 1347 517
1204E17m370N679k455j134M209n590K511L666o949N115K536o841M553J354m728
$$ 517 -3853 1826 -629 -1763 2446 -3144 -633 3033 -3916 1199 3735 -3106 1447 2801 -1927
1219a927L897j537j596M096m745J663L186p463L864L112q007N574K717o306M123
$$ -1927 1970 433 -1163 2933 -1812 -149 3037 -4426 -562 2550 -5457 117 2834 -3472 651
1234F51M93l513M769k630k15L722n008J920L586o785L680K634p172M376Q22m786
$$ 651 1144 -2369 2400 -230 -445 3277 -1731 189 3775 -3010 670 3304 -3868 508 1330 -3456
1250c456N054k175k271N250m361K16N091n813J630M382o286L522K617n111L883
$$ -3456 1598 -577 -2848 2402 -1959 -1743 3348 -2465 -835 3547 -2739 783 3400 -1711 2172
1265B172q03l388M078l432m66M615n407J062M636o781K546L945o169L593J855
$$ 2172 1369 -2019 2059 -1373 -1839 2776 -2631 -1569 3067 -3714 -1168 2777 -3392 201 2056
1280B056m586M248l65k663M379l647k30L910m902J599L140n546K891J562n220
$$ 2056 -2530 1718 1353 -1310 3069 -578 -808 3102 -1800 -201 2939 -2607 284 1846 -3374
1295c374M278q95l787N655k425k076N922m082l42M768m984R38L257m578K776J054
$$ -3374 904 9 -3778 1877 -548 -2624 3298 -784 -1126 3642 -1342 -404 2853 -1725 1051 2105
1311B105l795L638j945k465M655l573j216M871m635Q40M114n267K434K581n035
$$ 2105 -1690 1948 3 -2462 2193 -1380 -2596 2275 -2360 -1520 2594 -2673 -239 2342 -2693
1326b693L955O75m080M215j195k169M198l466o87L786m606J366K609m633L019
$$ -2693 1262 1937 -2143 2072 877 -1292 2906 -560 -1247 2539 -2067 -701 1908 -2725 294
1341B94Q15m053M017r47l065N331k879j254N317m159m39M612n112J339K770m524
$$ 294 1109 -2944 1073 126 -2939 2392 -487 -1741 3576 -583 -1022 3590 -1522 -183 2587 -1937
1357a937K672M83l804M012j595k229M247l637o4M030m125J101L346m567K707J867
$$ -1937 735 1218 -2586 1426 -169 -2398 1849 -1788 -1852 2178 -1947 -846 2500 -2067 640 2507
1373B507m498L609j52l209L995j617k369M335l531r20L784m204J435K313l966
$$ 2507 -1991 1618 1466 -1743 2252 635 -1734 2601 -930 -1850 1934 -2270 -835 1478 -2488
1388b488K793J063l897M184j045k612M608k656j055M128l714L19L163m410K015
$$ -2488 305 1368 -2529 1655 610 -2002 2606 -50 -1105 3023 -691 -372 2791 -1619 396
1403C96Q84m073L340l82k819L773j542j567L866k867n84L850l640R01L192m355
$$ 396 1280 -2793 547 165 -2654 1119 -423 -1990 1876 -991 -1575 2275 -1365 -464 2728 -1627
1419a627L037Q23m263L614n52l130L921k129j762M194l321k58L108l981K097J904
$$ -1627 1410 2233 -2030 1584 1032 -2098 1823 -306 -2068 2126 -1195 -1453 1655 -2326 -229 1675
1435A675m353L593K98l189L886j313j821L896k588j142L473l498O63K451m278
$$ 1675 -2678 915 1213 -1976 1910 597 -1224 2672 84 -1058 2415 -1083 -420 2031 -2247
1450b247K452J006l925L088l76k260L837j864q61L055l020Q27K871m098J874K630
$$ -2247 205 1211 -2714 374 -2 -2262 1575 -289 -1150 1905 -1115 -288 2583 -1515 359 2989
1466B989m680K440J124l879K919q42k403L306k055j38L114m043J395K904m378
$$ 2989 -1691 749 1873 -2006 913 71 -2332 974 -1081 -1219 1895 -2148 -753 2151 -2227
1481b227K077J874l336K588L92k591L115k111p14L307l518M29L156m457O13L317
$$ -2227 -150 1724 -1612 976 1368 -1223 1892 -219 -933 2374 -1144 -715 2441 -2016 -1403 1914
1497A914l978J712J707l051J870l18j141L293k830K38L876m327L03L742m278Q03
$$ 1914 -2064 -352 1355 -1696 174 -144 -1285 2008 -822 -584 3292 -1035 -732 3010 -1268 -465
1513d65K754l479J477M24k436K637j793r29L826l390m12M242l551K46L191l270
$$ -465 2289 -1190 287 711 -1725 912 -881 -1810 2016 -1374 -1786 2456 -1095 -849 2342 -928
1529i28J015J470k110K425j447j458L459l808o33M842l778j003M266l922m55L067
$$ -928 87 1557 -553 1872 425 -1033 2426 -1382 -2015 2827 -951 -1954 2312 -1610 -2065 1002
1545A002j806J362r5j421K321k054q44M679l132j059M191l709q08L431k848O88
$$ 1002 -804 558 463 -958 1363 -691 -1535 3144 12 -1047 3144 -565 -1373 2058 -790 -102
1561a02N61k020J774p34j288M005l105j842M650k470j003M211k570l23J434k325
$$ -102 459 -1561 213 -521 -1809 2196 -909 -2751 1899 -571 -1574 2637 67 -256 1178 -1147
1577a147K132j95j511L411k691k592M491k705j498M327k479j411K689j849M77
$$ -1147 985 790 -721 2690 -1 -2593 1898 -807 -2305 2022 -457 -1868 821 -1028 -551
1592e51J193j777K670j386j920M168j920k012M446k790j563L174k010p2J054k308
$$ -551 642 -1135 1535 149 -1771 2397 477 -1535 2911 121 -1442 1732 -278 -350 704 -1604
1608a604J737j94k311L985j164k993M193j626k366M414j559j040J908j742J299
$$ -1604 133 -61 -2372 1613 449 -2544 1649 23 -2343 2071 512 -528 1380 -362 937
1623I37j41k210K911j025k807L957j201l088M204j699k265L219j238K96J514k434
$$ 937 796 -1414 1497 472 -2335 1622 421 -2667 1537 -162 -2427 792 -446 -150 1364 -1070
1639a070J552p9k173L674n33k677L667k164k110L398j691n59K044k524Q21P48
$$ -1070 482 403 -1770 1904 1371 -1306 2361 197 -1913 1485 -206 -765 1279 -1245 -424 324
1655C24k694L229K17l303L531o72k758L664r19j490K431j745M26J262k212J612
$$ 324 -2370 859 1076 -2227 1304 632 -2126 1538 619 -871 1560 -185 241 1503 -709 903
1671I03r5l248K942j35k656L529p58k664K931j324p18K573j978Q07J250k790K377
$$ 903 808 -2440 502 367 -2289 1240 482 -2182 749 -575 -1293 1280 -698 109 1359 -1431 946
1688I46L09k168K312l55k741K938j382j268K480j802j58J574k529J764J135l145
$$ 946 1255 -913 1399 1044 -1697 1241 -141 -1409 1071 -731 -889 685 -1844 -80 1055 -2090
1704b090K877J48k738L384l13k649K962j324q35K076k205Q23J553l015J421M47
$$ -2090 787 935 -1803 1581 1268 -1381 1581 257 -578 1498 -707 116 1669 -1346 75 522
1720E22k793L121l00k658L035r03j564K903j611k05K035k477R53J714k926K110
$$ 522 -2271 850 550 -2108 927 24 -1540 1363 -248 -453 1582 -895 58 1772 -1154 956
1736I56M23k851K562q21j780K527j819o82K327k091O09J919k891J858J064k965
$$ 956 1379 -1472 1090 269 -1511 1016 -803 -1485 842 -1249 -640 1279 -1612 246 1310 -1655
1752a655K599L22k781L332r91j757K687k046l88J929k384R40J307k959J864N48
$$ -1655 944 1266 -1515 1817 826 -931 1756 -290 -678 1251 -1133 -193 1114 -1845 19 567
1768E67k747K897k04k452K963j171r47K883k230N54J606k649J570J167l203K120
$$ 567 -2180 717 513 -1939 1024 -147 -1094 1789 -441 113 1719 -930 640 1807 -1396 724
1784G24J78k491K303q22j453K458j672m79K485k327J013J560k796J833J234l094
$$ 724 902 -1589 714 -108 -1561 897 -775 -1254 1231 -1096 -83 1477 -1319 514 1748 -1346
1800a346K286J77j979K260j014j581K401j949j30J824k449J247J404k835K212
$$ -1346 940 1117 -862 1398 384 -1197 1204 -745 -875 949 -1500 -253 1151 -1684 528
1815E28L65k443K490n28j624K620j576j87K033k085K67J816k878Q59J179k379
$$ 528 893 -1550 940 412 -1212 1408 -168 -355 1678 -407 -140 1676 -1202 -343 836 -1543
1831a543J895J08k246K528q47j324K694j759j31K142k272P94J713k401J313N52
$$ -1543 352 460 -1786 742 -105 -1429 1265 -494 -625 1517 -755 39 1752 -649 664 1216
1847A216k023J874o53j547K284j502q00K108k010R2J928k628J571J338k540J850
$$ 1216 -807 1067 414 -1133 1151 -351 -1151 957 -1053 -961 967 -1661 -90 1248 -1292 558
1863E58N58k147J986l00j342K449j684p36K271k095M00J141k657J090J135k209
$$ 558 1116 -1031 955 655 -687 1762 78 -658 1613 -482 -82 1059 -1598 -508 627 -1582
1879a582J870J64j692J916p37r89K512k028L2K512l013J488J372k955J415M97
$$ -1582 288 452 -1240 676 -61 -1050 1462 -566 -534 1978 -1035 453 1825 -1130 285 782
1895G82k177J922k85j768K370j562n49K502k141M27J826k915J593J569k688J754
$$ 782 -1395 527 242 -1526 844 -718 -1267 1235 -906 -479 1347 -1568 25 1594 -1094 660
1911F60jj605K100r26r67K208k148q4K088k664O76K010k853J111J021k098J863
$$ 660 659 -946 1154 228 -739 1469 -679 -763 1325 -1339 -663 1347 -1506 -395 626 -1472 391
1928C91q8j307K420j412o69K406k148K67J995k676L98J732k294J178K91j210J166
$$ 391 303 -1004 1416 4 -665 1741 -407 -140 1855 -821 -423 1309 -985 193 484 -726 440
1945D40p44p44J982j728j40K714k829M19K229k381J095R67j868J246l49j057K187
$$ 440 -304 -1048 934 -794 -934 1780 -1049 -630 1599 -782 313 1280 -588 658 309 -748 1439
1962A439j852o03K824k958l08K787k471K49J582j471P74M71j146J497p80p25K465
$$ 1439 -413 -1016 1808 -1150 -1458 1329 -1142 -893 689 -782 -8 463 -683 814 34 -691 1774
1979A774k116l36K472k221JK367k751O3J098j439J373l60q29J842j762p81K886
$$ 1774 -342 -678 1794 -427 -426 1941 -810 -747 351 -1088 285 -75 -904 938 -824 -1605 1281
1996A281j927j53K708k172l74K026j653M91O45j248J212j254q06K515j973o49
$$ 1281 -646 -799 1909 -263 -637 1389 -264 227 872 -376 836 -418 -1224 1291 -682 -1331
2012a331K813k121q42K305j315O2Q12r72J471q80m69K531k243j072L294k150j490
$$ -1331 1482 -639 -1481 824 -491 -429 383 -589 882 2 -467 2064 -179 -1251 2043 -107 -1597
2029a597K944j824m98J716j292K27L9n04J307o80j225K967j957j115L066j129
$$ -1597 1347 -477 -975 741 -551 -324 -285 -789 518 -162 -1387 1580 -377 -1492 1574 445
2045D45j017J849j152m26O95r36J120n02j160K371j654j547K859j594r82K727
$$ 445 -572 1277 125 -301 394 -542 578 76 -1084 1287 -367 -1914 945 -649 -1631 1096
2061A096r78r22J325m74K85K36j080K358j385j629K953j732j614K973j605j370
$$ 1096 118 -804 521 47 332 568 -512 1846 461 -1168 1785 53 -1561 1412 -193 -1563
2077a563K264r72l90Q31j085J251n08j325K895j117j344K582j056j552K372q74
$$ -1563 701 -271 -661 170 -915 336 -172 -1497 1398 281 -1063 1519 463 -1089 1283 409
2093D09p01J051o39j46K7j194J910l95j438K116q94k005K460k89j341J900o96
$$ 409 -292 759 120 -26 1 -1193 717 322 -1116 1000 106 -1899 561 272 -1069 831 135
2110A35j94O35r43J192l0j990K710j100j656K481p79k222K371o28p47R01r41R14
$$ 135 -59 576 -367 825 795 -1195 1515 415 -1241 1240 461 -1761 610 -18 -765 136 -805 109
2128A09j67j059J934m57j478K820j102j885K531q75j074J737j002L0J96j283J153
$$ 109 -58 -1117 817 360 -1118 1702 600 -1285 1246 371 -703 1034 32 62 258 -1025 128
2145A28J52j901K321j99k110K255m11j439J747L7p88Q19q15N32J03j112J855o37
$$ 128 280 -1621 700 501 -1609 646 235 -1204 543 580 -208 611 -204 328 431 -681 1174 537
2163E37k179K682o05k034K244n02j245J397o40L4P95j174J257O5j616K060l40
$$ 537 -1642 1040 435 -1599 645 143 -1102 295 -345 -311 484 -690 567 632 -984 1076 736
2180G36j934K365n85j385J440m52m36N97p74N16q2j426J850r1j679K099j52j672
$$ 736 -1198 1167 582 -803 637 185 -251 346 -428 88 6 -1420 430 339 -1340 759 607 -1065
2198a065J610k18p22R14k70k29N00j043Q19P15k428K202j96k070K046l19j368
$$ -1065 545 327 -395 519 249 20 520 -523 296 1011 -1417 785 589 -1481 565 246 -1122
2215a122J402l25l25Q89j051O88K99j534J896pj735J487K58j705J392r5r35Q83
$$ -1122 280 -45 -370 519 -532 156 455 -1079 817 810 -925 562 820 -885 507 412 -523 360
2233C60r79J63P98j213J007M89j874J410L36j457J135O16j511J203k22n21J211
$$ 360 -619 -456 342 -871 136 625 -1249 161 497 -960 175 791 -720 483 261 -260 951
2250I51j197L71L89j530J176L81j597J352K48j973J536m3r48J297p98K79R36j600
$$ 951 -246 125 514 -1016 160 541 -1056 296 544 -1429 107 64 -884 413 -385 -106 830 -770
2268g70R04P58j564J100N01j631J124j31r95J313p13l27J025j293M54R96j954
$$ -770 134 892 -672 428 929 -702 422 291 -704 609 -104 -431 594 -699 -245 751 -1203
2285a203Q31J238j578R55M85j223J233k33q79M68k67o1J034j448O80Q15j818P67
$$ -1203 -372 866 -712 243 728 -495 738 505 -374 94 -173 -234 800 -648 32 847 -971 -204
2303b04O53j458R81J83r63J267m25n34J463j134K57J035j589M72R57j804J154
$$ -204 449 -1009 -28 155 -808 459 34 -500 963 -171 86 1121 -468 4 961 -843 311
2320C11L65j343Q69Pq63J093q14k34J382j419L19R35j242J015L33j328J190J10
$$ 311 676 -667 202 209 -654 439 -375 -609 773 -646 -327 608 -634 381 714 -614 576 686
2338F86j217J351p79m97J158q21q8Q79j551L19J115j666J312K87p81N35j43n46
$$ 686 -531 820 41 -456 702 -119 -207 672 -879 -560 555 -1111 201 488 -293 242 99 -447
2356d47J248o80m67J204j239L08J012j638R03P35j824O73N29j254J160m20l65
$$ -447 801 121 -346 858 -381 -73 939 -699 204 939 -885 -212 317 -937 223 -197 -562
2373e62J022r54q5J288j291M16R49j087K31O00q97R35k2r95J040o11o06J219j066
$$ -562 460 -494 -579 709 -582 -166 783 -304 -73 527 -370 565 543 -452 588 -23 -629 590 -476
2392d76M5J056j131J9Q83p14L61L26p04R70m76m66J087r05J11J208j564J27P92
$$ -476 -431 625 -506 -487 396 -318 43 369 -335 635 159 -307 780 -125 -14 1194 -370 -243 549
2411E49j174M75O87j208O78k0p59R55m97j8R14p90k24J127p72J91O16j011M72
$$ 549 -625 -150 537 -671 7 -13 -772 183 -314 -332 582 -208 -432 695 -77 114 730 -281 191
2430A91R7l65N25m51m42Q47r01j38J080j011O5R22r45M87N35q22O77j37o82J226
$$ 191 288 -77 448 -3 -445 402 -499 -637 443 -568 -503 419 -526 -39 496 -326 351 214 -468 758
2450G58p38m86J190p52l57J185j075oO58q29J35M33p82R31l50n54J283l88q79
$$ 758 20 -466 724 -28 -385 800 -275 -281 377 -452 -317 116 -666 265 -85 -639 644 256 -623
2469f23J677j086k53J096q44l8P29r70N03o8o22Q39n12o8J083j251m90J631q68
$$ -623 1054 -32 -285 811 -33 -71 658 -312 191 123 -499 340 -172 -240 843 -408 -898 733 -135
2488a35m18P14m33K01M20o59R36j71q80J202r01o24J015n93j93R59p14J32L12
$$ -135 -553 161 -272 -71 349 -310 626 455 -425 777 -124 -748 267 -326 -519 440 -274 -142 170
2507A70n63K30K56o71J132m33n57J426j079n72J489m52o84O02m24mK62o46P86
$$ 170 -393 -163 93 -578 554 121 -436 990 -89 -661 828 376 -308 294 -130 -134 128 -518 268
2526B68n59m45J204n66p93J452m76m95O50k64r9N65l15J41j8o42Q66p9j218J384
$$ 268 -291 -736 468 -98 -891 561 85 -410 240 -24 -123 442 127 268 250 -392 474 395 -823 561
2546E61m70p98J160m01q02R32l02J8M21q02P81j92m60J363o24q12J234o73n85
$$ 561 91 -707 453 52 -750 182 -120 -102 319 -483 298 106 -354 1009 385 -427 807 134 -451
2565d51Q22o52M2N78o61M35k14p69J404n89p92J710o98q17R97j89n63O45k2J7
$$ -451 371 -281 -239 339 -322 113 -101 -870 534 -55 -847 863 165 -652 345 156 -407 238 216 233
2585B33Ql81N00k12r86J240m03o10J110l67p72N87l9j14R0j11M64J38q51J009
$$ 233 241 -140 360 148 -838 402 -1 -611 499 132 -640 -53 -92 -206 -116 -227 237 375 -476 533
2605E33j94j064J168J0j094J047l85m31O22l42n5K55p07Q64n8q96J196l88p61
$$ 533 339 -725 443 453 -641 406 21 -410 212 -130 -185 70 -637 227 169 -727 469 81 -680
2624f80J075M3q50P74j17n61P59p81O24m2r01R50k17o87J216m07j207J077j40
$$ -680 395 438 -412 362 245 -316 443 -338 286 244 -657 293 76 -611 605 198 -1009 68 -72
2643g2m48O17j61J85k0l58O05m9o89R30J21j389Q22K06n91O09k08l28L06l28K88
$$ -72 -520 97 -64 121 101 -257 348 299 -390 540 661 -728 94 300 -291 318 110 -218 88 -240 48
2664D8K33q46P88j50o32Q45J73q79Q74R2k45k26j08J17J67o41Q23l14j105J082
$$ 48 281 -565 223 73 -559 286 459 -420 454 546 301 75 -33 84 251 -390 433 119 -986 96
2684I6P7q70N78N2n7L73l24N9L67n36O75k42n20N19K31r52P78Lq20O29l05m8J81
$$ 96 173 -697 -119 -67 -124 249 -75 -16 351 -185 490 248 -272 247 478 -474 304 307 -513 116 -189 -237 -56
2707e6l77M49K59r81P26R6q39R57J35o98M46M27q25M40l63J66L93l93J58J73j027
$$ -56 -433 16 275 -706 20 116 -723 234 369 -329 117 544 -281 159 -204 -38 355 -38 120 293 -734
2728g34P72J01q25M64L13n22N32rj53J90k29K36L54o60L76K20q90M11K47n23M93
$$ -734 38 139 -686 -222 91 -431 101 92 -61 129 -100 136 490 -170 206 426 -464 -53 194 -329 164
2749A64m73Q1K80m15J53L49n45M00K43q91O61J16o84P65p8j60L74j60k42N26q72
$$ 164 -309 -228 52 -363 -210 139 -406 -6 237 -654 7 123 -561 204 126 -34 340 180 -62 464 -408
2770d08M28L64q04N08L30q64K62O19p18L84k31M3K65k30M71J63o04K1M06p66N65
$$ -408 20 384 -420 88 418 -446 -184 435 -283 101 -130 -87 178 -52 419 582 -22 -1 405 -361 204
2791B04J85r22N32O0l72K99pj47M77o29L21J93m98K12K33l32K62J52l80K86j58
$$ 204 389 -533 -1 59 -313 -14 -21 -168 309 -320 1 194 -304 -92 141 -191 71 223 -157 129 -29
2812b9m32N75M5n27O63q42J63O56l99J08J08j95M08k49j58L10j90j61L61k02j18
$$ -29 -461 114 159 -368 295 -547 -384 272 -127 -19 89 -106 302 53 -105 205 15 -146 215 13 -105
2833a05N45o99L06K89p80K74L00m32J73J03k64N08l29K39K6m22P4N35k70J35M6
$$ -105 440 -259 47 336 -444 -170 130 -302 -129 -26 -290 218 -111 128 154 -268 -194 341 71 206 252
2854B52m60L12k65k44O74m52o4L52j79r4M34m17k17P68q47N18J14n96M48k1l58
$$ 252 -208 104 -161 -405 269 -183 -247 105 -74 -168 266 -151 -368 400 -447 71 185 -411 37 16 -342
2875c42M88k65J98J25m46m3O85j84k03J22k87K46L6l68K30J7j15L77m3RM9l22
$$ -342 146 -119 79 204 -242 -285 400 216 13 135 -152 94 130 -238 -8 9 -106 271 228 237 286 -36
2897c6Q2K41o25L27J00m98N49q3k20O28o85q7M23m34j11P76q38P69J61o54L66
$$ -36 46 287 -338 -11 89 -409 140 57 -163 465 -220 -307 116 -318 -429 347 -491 278 439 -215 151
2918A51J71q58P99L6m98M13n33O4O88q03M92P5n80N27J21o18K94J22n10Q60k44
$$ 151 322 -536 263 299 -199 214 -319 -255 433 -370 122 197 -383 144 265 -353 -59 63 -447 413 169
2939A69k60N12n77J08N18o78K09M85n72K97k87j87J17ok60Q20j98n40M44p6m3
$$ 169 -91 421 -156 -48 470 -208 1 486 -86 211 -76 -263 -146 -152 -412 408 210 -330 114 38 -5
2960eK18m52J63L31l22M53k54n3Q6L0j47N27n85j58L40k57j99M92p34O16Q6m16
$$ -5 213 -239 -76 255 -67 386 132 79 165 195 48 575 -10 -168 172 -85 -284 208 -526 90 176 -240
2982b40J50K34n15P42k43j52K72j05r8M49o78k15K99m08M18k6k45N10j23l13O44
$$ -240 -90 144 -371 371 128 -24 248 143 45 494 -184 -399 -100 -508 -90 -116 -361 149 26 -287 357
3003C57l64l59O51n31k54R86l30qP0m37K84R3l72M02l53k0L65k55k66L77k04L4
$$ 357 -7 -366 285 -246 -500 486 156 148 218 -219 65 158 -214 188 -165 -185 180 -75 -341 36 -168 -134
3025a34K56l62M31l27k27K70J51j81O65m15m12O73k98l22L58k64P3R4m13N18k33
$$ -134 122 -240 191 -136 -363 -93 58 -123 542 127 -285 388 90 -232 126 -138 -65 29 -384 134 -99
3046i9j12M26p3l90Q71l76l86J73k38K85R2n8r7K8n47N94p5m22P27m75l71P19
$$ -99 -211 215 142 -248 623 247 -139 34 -204 81 173 115 18 46 -501 93 18 -404 323 -152 -523 196
3068A96r2k35L30l75J17N70p50L80k36l42M98Q3m15O21j74n6l1j79k8J62m27M20
$$ 196 104 -131 199 -176 -59 511 -239 141 -95 -437 61 144 -271 350 176 120 89 -90 -118 44 -383 37
3090C7k68p0M49k34j70O03qo85P40k96k87M11m52J38N43p39L03l4k97M72k13m15
$$ 37 -231 -301 148 -86 -256 347 339 -346 394 98 -189 222 -230 -92 451 -288 15 -19 -316 156 -57 -472
3112d72P05j2m91O6L3J13J48q5K41R8o77M86J03o19N40k8l45L39k64j14L22l91
$$ -472 233 221 -270 -204 -171 -58 90 5 246 344 -333 153 256 -363 177 149 -196 143 -121 -235 87 -304
3134c04P8L42m70J85L82m96L67J36k86K98p1n52N52j9k88K23l94K10J65l07J89
$$ -304 -226 116 -354 -169 213 -283 84 220 -66 232 161 -391 161 142 -146 77 -317 -107 58 -249 -60
3155f0J03j86L87k8l74M7j0J52K82n73O55l39j20L13q1k42K34m42q5L29L55m10
$$ -60 43 -143 244 216 -158 -111 -121 31 313 -260 395 56 -64 249 168 -74 160 -282 -367 -38 317 -93
3177i3J92j27J13K2l14O5M29o00K99J31l02M24j24k47p8L52j79J63j47L51k67
$$ -93 99 -28 85 107 -207 -142 287 -313 -14 117 -185 239 115 -132 -210 142 -37 126 -21 330 63
3198F3l69L70K29o36K89J76l25J66j04Q4K59l62L80K20n14O0J13k51K49J56j09
$$ 63 -306 64 293 -343 -54 122 -203 -37 -141 -57 202 -160 220 440 -74 -14 99 -152 97 253 144
3219A44m1J90m75L02l86QK81r3J30N3j92J65Oj28j17K61l91K42J20k96L29l46
$$ 144 103 293 -182 120 -266 -258 23 -70 60 113 -79 86 92 -36 -153 108 -283 -41 79 -217 112 -234
3241b34L11j72j71J46J85p7l43M43k37K22Q3l62K68p4q3L64l47Q6J37n62L05J48
$$ -234 77 -95 -266 -120 65 -12 -355 88 -149 73 156 -206 62 -12 -95 269 -78 8 145 -417 -112 36
3263C6m9j20K58l01L27l76N3M01l00P0P3j08j20L67k26n4O0k47L31r3j31J0L58
$$ 36 -13 -133 125 -176 151 -225 -172 229 -71 -1 72 -36 -156 211 -15 -69 -9 -256 75 -18 -149 -139 219
3286B19n81N04j12l93N83k98k06N42k63J24M3j32K70k76j85K51L2j01N23k87l70
$$ 219 -362 142 30 -363 220 -78 -284 258 -5 119 162 30 300 24 -161 90 122 21 544 257 -113
3307a13K44k29oL76m01m9J1K28n5j64J88R8j15P2J59M6p7K1j15k69L98l72K40
$$ -113 131 -98 -104 272 -129 -178 -167 61 6 -158 30 128 13 85 244 290 213 234 119 -150 248 -124 116
3330A16o0l73L88k73J99K27j39k17L0k1J86P4r3J79P3l68K09q3k12L28N8l53L00
$$ 116 56 -317 71 -202 -3 224 85 -132 -102 -123 63 137 44 223 296 -72 137 54 -158 170 228 -125 175
3353A75k43j00J57j12M4j79L63l2k39P1O7N6J54M5o1j40J23l37K59rk65J11J64
$$ 175 -68 -168 -11 -123 -79 -258 105 73 -166 -95 -28 28 182 227 166 26 149 -188 71 62 -203 -92 72
3376G2J7j69J79n63N99k80Q1K48l49n3K85j25k8L90l56J34n7k03J95J67l03M81
$$ 72 89 -80 99 -464 135 -145 -64 184 -165 -218 67 -58 -86 304 -52 82 25 -178 17 184 -119 362
3398C62n07Q4J64m32L65j89l6J47K6O8J2J38k96L50j97r9j03K23r7K25l20o7K64
$$ 362 -145 -61 103 -329 36 -153 -189 -42 -16 52 64 202 -94 256 59 -40 -143 80 -17 208 -112 -179 85
3421H5j81o4J79p0N2m13R6K29Pm6r6LK89J03l02J83K17n52K40p2O5O6k19n5N98
$$ 85 -96 -160 19 -51 1 -412 -316 -87 -80 -126 -222 -219 70 173 -129 54 271 -281 -41 -113 -48 18 -201 -256 342
3446C42j32k93j36N2J58J7k19K23J56j93n1J46J23l65N39n55J78k63J37K79n06
$$ 342 210 -83 -219 -167 -9 8 -211 12 168 -25 -76 70 193 -172 367 -188 -10 -273 -136 143 -363
3467c63P1K91j35oJ87L5k04R8P6K18k47k23M22m3k06J63l9Q3l48K79l02K5L18
$$ -363 -292 -1 -136 -142 45 80 -124 -26 50 268 21 -202 220 177 -29 134 95 178 -170 109 -193 -168 150
3490A50o9K61k22l00K58k39K62L0j88o7J56n0j24J52o1J38q9J68l01pL49k34J43
$$ 150 81 342 120 -180 78 -161 101 131 -57 -124 32 -18 -142 10 -51 87 -2 166 -135 -142 207 -27 116
3513A16o3K5p3J03j83Q3K33m03L33m5q8L47m12k36L12k92K53j02K42Q8j43p0J11
$$ 116 53 78 5 108 -75 8 241 -162 171 126 38 385 -27 -263 49 -243 10 -92 150 238 95 25 136
3536A36M2j69j07J40k83N2L91k36K53l39L73R4k38O8L4n87M06lp1J7kp8M01l8
$$ 136 178 9 -98 42 -241 -189 202 -34 219 -120 253 347 109 177 211 -376 30 27 -44 -27 -29 -107 294 256
3560B56l41N6N0j12J01j11M8J7o2K82j55r6P1j29J09O7J14k78K74l47J05Q8j50
$$ 256 -85 -29 21 -91 10 -101 -53 -36 -98 184 29 -67 4 -125 -16 51 165 -113 161 -186 -81 7 -143
3583a43L35j57r1r0N2O8J58j92J5J53j8q8JJ8q0K16j60j49J46j8k9L76l45J39
$$ -143 192 35 -56 -146 -94 -26 132 -60 -45 108 90 2 3 21 -59 157 -3 -152 -6 -24 -53 323 -22 117
3607A17k38j8J07j12K48J34k38J9p2J01J68p0j02J95l79p5K75k98J70J10j79p7
$$ 117 -121 -139 -32 -144 104 238 0 19 -53 48 216 146 44 239 -140 -215 60 -238 -68 42 -137 -214
3629b14J40k42K29R2J85k61J64l94K33j96K18J74p8j88L54l43J12pK12j32l25
$$ -214 -74 -316 -87 5 190 -71 93 -301 -68 -264 -46 128 50 -138 216 -127 -15 -22 190 58 -267
3650b67J51L62k92L27m31K38j25J66r4r6J36L1o5j61Q0k9M0j39J04k34J85P7j9
$$ -267 -116 246 -46 281 -150 88 -37 129 35 -61 75 106 41 -120 -40 -69 -29 -168 -64 -298 -113 -36 -55
3673e5o8N9n6K57J13k41J4J07l19K31l2P8q3k35o9K49q5Q7M6%j73K26j12J03O3
$$ -55 -123 -64 -120 137 250 9 23 130 -189 42 10 88 5 -230 -299 -50 -135 -48 -2 -2 -175 51 -61 42 105
3698A05j05j4P0j34L6p1k20N96k75J36Nl40L90j55J75j7n00K20K14j8j65J59n5
$$ 105 0 -14 56 -78 -42 -113 -333 263 -12 124 129 -211 179 24 199 182 -318 -98 116 98 -67 92 37
3721C7L23m01L11k35o3k6K17j15k2N2J07q7r1p1J1J10k71J33J95n9k95J63j67
$$ 37 360 -41 270 35 -28 -54 163 48 26 78 185 98 7 -64 -53 57 -214 -81 114 55 -240 -77 -244
3744b44L36r3j02Q6N4k22M04o2k38O7j67m9L36l72L49j57j1J28j54k41J14J17
$$ -244 92 -1 -103 -17 37 -185 219 157 -81 -14 -181 -230 106 -266 83 -74 -85 43 -111 -352 -238 -121
3766a21RK10Kp8Pk36J38L79k39n2J49l07O9K8k09M45m31K36j54J20P0q5K59r5
$$ -121 -112 98 100 22 29 -207 -69 310 71 19 168 -139 -70 -42 -251 194 -237 -1 -155 -35 35 -50 209 114
3790A14k0R9k73J24k02K94J59k64j25j07j24O19l62n4J89J23k42J69j45k25L05
$$ 114 94 193 -80 44 -158 136 295 31 -94 -201 -325 294 -68 -122 67 190 -52 117 -28 -253 52
3811E2l75K60L11J4l13q2K26J15k84J34N7l80L97p8l21L48N8q5J59k14P4n4N4
$$ 52 -323 -63 248 262 -51 -133 93 208 -76 58 115 -265 132 54 -267 81 139 54 213 -1 73 19 73
3834G3k66J93O6M8k21L4J83m8r4K90l8j97m4K03l94L54Pk48K75m71O92l98L9j28
$$ 73 -193 0 66 114 -107 -73 110 62 -32 258 220 23 -21 182 -212 142 149 -99 176 -295 397 -1 38 -90
3858i0R0o9n8J69r5K80n27J27J60l35K29j05L25j93p7J62N2K2l6j21J52j78J32
$$ -90 0 -69 -127 42 -53 227 -300 -173 -13 -348 -119 -224 101 -92 -169 -7 45 67 31 -90 62 -116 16
3881A6J38k65J75O1lk32R5M8j3nJ29o1j9j11N6j03K66m39N0L96k91J05J7k13j35
$$ 16 154 -111 64 125 122 -110 -15 33 20 15 144 83 64 -47 9 -94 172 -267 -217 179 -112 -7 10 -203 -338
3906c38M17l36K98R2j02m5kq1K8k4q2J14J80l8K02k14k19K58n3l10K01l01M87
$$ -338 79 -257 41 133 31 -14 -16 -97 -69 -93 -175 -61 119 81 283 69 -150 108 55 -255 -54 -355 132
3929A32r1O1l82L72k13J40j3J62l07P8K6j10J17n6j67J73m7J84j40J65J48o9Q3
$$ 132 41 102 -280 92 -121 19 6 168 -139 -61 -35 -145 -28 -84 -251 -78 -125 59 -81 84 232 163 246
3952B46k95k23J63J63K32k34n0J47k64J54j92K23L4j57J39l38L06j25j10K17R9
$$ 246 -49 -272 -109 54 286 52 2 149 -115 39 -153 70 104 -53 86 -252 54 -71 -181 36 135
3973A35J29k19J36k7j91J80m8P2l11Q9J3P3K6p0n1J27j5n1K62k82o2q9K24j58
$$ 135 264 45 181 154 -37 143 95 167 -144 -55 -42 31 57 -13 -64 63 48 -3 259 -23 -85 -174 50 -108
3997a08L48j04m34M04J4n6L2j32R8r7m3M4p6J81MJ48j32k09k9L33n0O0k79j83
$$ -108 240 136 -298 106 120 64 96 -36 62 -35 -78 -34 -110 71 75 223 91 -118 -147 186 136 196 -83 -266
4021b66L02k57N40m19K44k16J37lJ15k7j29J48l0M5j76j42J91R1j36k36P7J53
$$ -266 36 -221 319 -100 144 -72 65 62 177 150 21 169 139 184 8 -134 57 148 12 -224 -147 6
4043Fj35J53MJ0l58M00K9Q9j69j86J95L7k92K36j8j31j24J07K26j76K88j64Q5
$$ 6 -129 24 28 38 -320 80 109 198 29 -157 38 75 -217 19 1 -130 -254 -147 79 -97 191 27 112
4066A12l29L02k9l34J25K80k94J69P4r4j82J93J51j53j73rP7J13O2q8O1M9l02
$$ 112 -217 85 56 -278 -153 127 -167 2 76 -18 -200 -7 144 -9 -182 -191 -114 -1 61 -27 34 83 -219
4089b19K74j68j64K32K54k40Q3K36k15J66m83K55M4j28J58k76n2J44K06R0k79
$$ -219 55 -113 -277 -45 209 -31 52 288 73 239 -244 11 55 -73 85 -191 -243 -99 107 197 -82
4110h2O0K31k85j21n5P0J74j10J79l1L8J28l23P5j0J39l2K12o43M84k93M0L00
$$ -82 -22 209 -76 -197 -252 -182 -8 -118 61 30 68 196 -127 -52 -62 77 45 257 -386 98 -195 -155 145
4133A45j15J55l80K13L85n62J98l4R2n4n7l9N1M4n9l05K73J4J5r0j4N6K01j52
$$ 145 30 185 -195 18 403 -159 39 5 97 43 -14 -53 -2 42 -17 -322 -49 -35 -20 -110 -124 -68 133 -19
4157a9K27l09K37p8k6J90k64J85j07n0J17m13L82j8j23K79j87R4L5j83L00m56
$$ -19 208 -101 136 58 32 222 -42 143 36 -14 103 -310 72 54 -69 210 23 117 152 -31 269 -187
4179a87K80M7m2r1o2j6M9j39K00O6j16J51l03M50j89j85p1J92j10K10k57N3J2
$$ -187 93 140 98 7 -55 -71 -22 -161 39 105 -11 140 -163 287 98 -87 -158 34 -76 134 -123 -70 -58
4202e8K91k83J46n5R8j03J05r9k04L46j41Q2q2K08j86l27K62P1j13k71L93j98
$$ -58 233 -50 96 41 139 36 141 42 -162 184 43 125 43 251 65 -262 0 71 -42 -313 80 -118
4224a18K46j75j07J22p0k6L62k06k52K15K15j02j85J78k5j84J38k8k5N7K20m10
$$ -118 128 -47 -154 -32 -102 -128 234 28 -224 -9 206 104 -81 97 72 -112 26 -2 -27 30 250 -160
4246a60j28K95K05j94J39J5o5r7k50K90j13J53j28n3k9L40k79jj28N11l87K48
$$ -160 -288 7 212 18 157 172 107 10 -240 50 -63 90 -38 -91 -120 220 -59 -60 -188 323 -64 184
4268A84l0k82j16K61J0K29k50K41m21J72K39j67j93J15J76l97L04p4o5K57l55
$$ 184 154 -128 -244 17 27 256 6 247 -174 -2 237 70 -123 -8 168 -229 75 1 -64 193 -162
4289a62L41M2j52L9j49J78k39K74j57O9q6j3n7J93k51K57r7N9M1j66Qj94J13q8
$$ -162 179 221 69 108 -41 137 -102 172 15 84 -2 -15 -72 121 -130 127 30 89 130 -36 -28 -222 -109 -197
4313a97J28J6j36K23L76k05j51j47J95j55Q2j45o4K30L1j26J89j80k9L64k97J05
$$ -197 -69 -53 -189 34 410 205 54 -93 102 -53 29 -116 -180 50 81 -45 144 -36 -65 299 2 107
4335A07J21j56l78M65r0M4j91J19R8j62j74L33k4n6M0r2k53M23j06j53J45ll55
$$ 107 228 72 -306 159 69 113 -78 41 139 -23 -197 136 112 56 96 4 -249 174 68 -85 60 57 -298
4358b98L84k15j08N54o36O22m18K55l09Q9l0K62k08j52J07L6K01K1j9N3j94k40
$$ -298 86 -129 -237 317 -319 303 -115 140 -169 -80 -110 152 -56 -208 -101 -65 136 157 138 191 -3 -243
4380b43K76l25J19M03m5k00O8k55L02k10O8L71j41O9k86J93J15j44k06K03k39
$$ -243 33 -292 -173 230 185 -15 53 -202 100 -110 -42 329 188 257 -29 164 279 135 -71 132 -107
4401a07P1j34K17m2j9RjJ19j10m3J9J66l3J01k02j66P4L53m70j1M80q8J18n34
$$ -107 -36 -170 47 5 -14 -5 -6 113 3 -40 -21 145 112 213 11 -155 -81 272 -198 -209 271 183 301 -233
4425b33M78k53J1J39o5o2j08nj32N62m55k4L27l79K45p1j8oJ65l03K96j28j71
$$ -233 245 -8 3 142 77 15 -93 -98 -230 332 -123 -147 180 -199 46 -25 -43 -49 116 -187 109 -19 -190
4448a90M04l12K67k59J13l6J32j90l2L07l55M40j76j33J20k33k8L22k32J60k30
$$ -190 214 -98 169 -90 23 -13 119 -71 -103 204 -151 289 113 -20 100 -133 -161 161 -71 89 -141
4469a41J57K0N5n7L6j84l9J19r0J90J89m60J64j2j58K80k43oL89l66J62p5K14
$$ -141 16 36 91 34 70 -114 -153 -34 -124 66 255 -205 -41 -53 -211 69 -174 -180 209 -157 5 -70 144
4492A44l27M50l24J0J62l74J79M6J35k40L49l12P5qJ60n1k2J41l69K64l2P5m16
$$ 144 -183 267 -57 -47 115 -259 -80 -34 101 -139 210 -102 -27 -35 125 74 52 193 -176 88 56 131 -285
4515b85K57Q8j59Q5K58l01PL84m23K37j81k59K88K1o8J88j93J20K9k67L61n1l82
$$ -285 -28 60 -99 -14 244 -57 -50 334 -89 148 -33 -292 -4 17 -51 137 -56 64 93 -174 187 136 -246
4538b46K62k3m4J60o2J08k0j48p3K79k43J12N8n12L99j5K0N8m8k78N05m29J80
$$ -246 16 -7 -51 109 47 155 135 -13 -86 193 -50 62 120 -392 7 -8 12 70 22 -256 249 -180 0
4561@o7M6J87j99r2J51L50o52K77J36k25J81j69K04j17L3p4J38k25k4M74j87j28
$$ 0 -67 -21 166 -33 -125 26 376 -276 1 137 -88 93 -76 128 11 44 -30 108 -117 -141 333 146 18
4584A8J61j5j89J64k99K46k78J90L02l63m3K57l0k88L38l10O6M79q25M34j45j60
$$ 18 179 164 -25 139 -160 86 -192 -2 300 -63 -106 151 121 -167 171 -139 -73 406 -419 15 -130 -290
4606b90L90j43p7K10k41K07m7L23m93J83q5K12m7m08N20j36m1j20k1J42O1j16
$$ -290 100 -43 -120 90 -151 56 9 332 -161 22 -63 149 102 -306 214 78 37 -83 -104 38 99 -17
4628a7J0pk7J9L0o8J19Jj59p6R8nM37m00L0J78k73K4J43j8N2j05J20j82J9L2q7
$$ -17 -7 -14 -41 -22 8 -60 59 60 -99 -175 -77 -82 355 -45 -15 163 -110 -86 57 39 91 -14 106 -76 -57 -25 -112
4655a12J79j77L03k76J15P1l40N21k93l18K28J48p0J72J66k44P9k63R9O9j00J86
$$ -112 67 -110 193 -83 32 103 -237 284 -9 -327 -99 49 -21 151 317 73 152 -111 -12 57 -43 143
4677A43j63K58m83L05k40L2K9J96k30K16j46N16l77k13J84k78K18J65j84q6J75
$$ 143 -20 238 -245 60 -180 -148 -119 77 -153 63 -83 433 56 -157 27 -251 -33 132 -52 -138 37
4698C7N2j35Oq3K67j57j55M45l68K29j79Q5m4o1j54K53m5J85l57J6K08K60l40
$$ 37 89 -46 -40 -123 144 -13 -168 277 -91 138 -41 44 0 -61 -215 38 -7 178 -179 -163 45 305 -35
4721c5j00J19k7J46j45nJ09j29K23k78N1l2O0j6o0K1K54k2l27K75J09p8j27K35
$$ -35 -135 -16 -43 103 -42 -47 62 -67 156 -122 -71 -103 -43 -59 -119 -98 156 134 -193 82 191 113 -14 221
4745B21j61J77l24j76K84Pp2j87J60J3J2L5J09j06l45O63l94q0k1K19m8q1J96
$$ 221 60 237 -87 -263 21 28 -44 -231 -71 -58 -46 -11 98 -8 -353 310 -84 -164 -185 34 -14 -95 101
4768A01M5OJ96m57K44j41k18N2J64R5j30j01J0j66J84o8O7o2K41k18K96l01L39
$$ 101 146 152 348 -109 135 -6 -224 -172 -8 87 -43 -144 -134 -300 -116 -184 -117 -179 62 -156 140 -161 178
4791A78j4n19L02N0K64m8j88j25N1j12J39mJ52j25l0n3K60j89K13k46M9K21m63
$$ 178 164 -355 -53 -3 261 213 25 -100 -49 -161 -22 -26 126 1 -29 -82 178 -11 202 -44 5 226 -237
4814b37J31J54j34J64J5j46O7ol33L95j87m1J80J8j92j9K77j32L0k05L66J28l85
$$ -237 -106 48 -86 78 93 -53 14 8 -325 70 -117 -158 22 40 -152 -171 106 -26 4 -201 165 293 -92
4837i2P1K66l13J23k17K86p0J3j12J98j96L23j19k76J40l58L68j16L17p4J52j43
$$ -92 -21 245 -68 55 -162 124 54 67 -45 153 -43 280 161 -115 25 -333 35 -81 236 162 314 171
4859A71k70L29l01Q5k39J93J82k13j03N95n38RN1J63j61Kk31L33L6m85L71J27
$$ 171 -99 230 -71 14 -225 -32 150 -63 -166 429 -109 -100 -49 114 -47 -45 -276 57 93 -392 -21 106
4881A06k08J14R3l07J82p6J7j2rP2J34j91k49K92k23K76QP1O5n7j37j18K95m79
$$ 106 -102 12 105 -202 -20 -96 -79 -91 -100 -28 106 -85 -334 -42 -265 11 19 90 155 98 -39 -157 138 -341
4905c41N82j28k26Lr6J39J52k38J51j30O6K14j36J7NJ88k25J64j96j70N31j96
$$ -341 241 113 -113 -110 -206 -67 85 -153 -2 -132 -66 148 12 29 34 222 -3 161 -35 -205 326 130
4927A30k38L57k96o5P3J69r4J43j87k08L3K90q8J42k88K98k30M0K60l48L05l91
$$ 130 -108 249 -47 -112 -39 130 36 179 -8 -216 -183 107 19 161 -127 171 -59 -19 241 -107 198 -193
4949a93J40J47r0l8j77K87l05R3m3J20J06j42m9J29l4J04k00J22K32L9l07K48
$$ -193 -53 94 4 -34 -211 76 -229 -136 -179 -59 47 -95 -144 -15 -49 55 -145 -23 209 248 -59 189
4971A89l77J70K63k35k84L73k18j60L03j18K81j48J19j82Q6n6K2r5J13O8Jk01
$$ 189 -188 -18 245 10 -274 99 -119 -279 24 -94 187 39 158 -24 62 6 28 -67 46 114 115 -86
4993h6j07J37l7J48j52l6J68k26K33j98j87K65q0L93j04k60Q5R7j71O61o23J00
$$ -86 -193 -56 -93 55 -97 -133 35 -191 42 -156 -343 -78 -158 235 131 -129 -44 53 -118 543 -80 20
5015B0o8K64j13j40O9P4o4j98Q3l5J86R3l90P6K75nj13J92k37M3J93k34lJ64k64
$$ 20 -48 216 103 -37 32 106 42 -156 -73 -108 78 171 -219 -143 132 127 14 206 -31 12 205 -29 -32 132 -132
5040a32L77r1j06p2J61k86K09m4K08j23k18J42k61J74j2J70M5N1Q8j36j47L4Q3
$$ -132 245 154 48 -24 137 -149 60 16 224 101 -117 25 -236 -62 -74 96 141 192 280 144 -3 31 114
5063A14j34J21Q4r0l43J40K47k63L45J66k73M2M7k46K03k38Q8K13Rj71K2j77j21
$$ 114 -20 101 185 95 -248 -108 139 -124 221 387 114 156 203 -43 160 -78 10 223 232 61 83 -94 -215
5086b15K60m15l5N01k77N00k36l16K21pK92r7l14K10J53j56P9R6k55j06J88j99
$$ -215 45 -370 -405 96 -181 319 83 -233 -12 -19 273 176 -138 72 225 69 148 244 -11 -117 71 -128
5108a28m9O7J27j22m9q7K90J63j13K0j61k1K16m79L72R5j8j44p9J18M5k62P8K85
$$ -128 -177 -110 17 -105 -154 -241 49 212 99 119 -42 -63 153 -326 46 141 123 -21 -100 18 63 -199 -121 164
5132A64l7l70M78J0l36K58k63J84O7l69J87k8k2L85k72J73l52L16K22m91K28l24
$$ 164 127 -243 235 245 -91 167 -96 88 155 -214 -27 -55 -77 308 36 209 -143 173 395 -96 132 -192
5154a92M65l27J43p2l14N44k30N5N9j59J9J09r0L5p5L0M3k2k29M45r2K56k96k50
$$ -192 273 -54 89 17 -297 247 17 72 131 -28 -9 100 10 45 -30 0 43 21 -208 237 145 401 105 -145
5178a45M43k0m28R8K32j12p5P6k08M24m47J97K11l0p3Q8j75J81jn62K47J28j94
$$ -145 298 278 -150 -52 180 68 -7 69 -139 285 -162 35 246 216 143 231 56 237 236 -326 -79 49 -145
5201a45R8j95j10L93l82L9L97k84K24K11m70N22j72j90Ll2J28J91k61j30K57k72
$$ -145 -47 -242 -352 41 -341 -302 95 -189 35 246 -224 298 126 -64 -61 -93 35 226 -35 -165 92 -180
5223a80J84J18m15Q5J50J61k12K10m20M49l28K46L1kk48L04j20N2M4j50j45J58
$$ -180 4 122 -293 -208 -58 103 -109 101 -319 130 -198 48 79 77 -171 133 13 65 109 -41 -186 -28
5245b8k8N2K14n04M44k98K7L3L66m60L98k61k8M94m95J16L14l41n0J34r0M2K43
$$ -28 -56 -4 210 -294 150 -148 -121 -88 278 -182 216 -45 -73 421 -74 42 356 15 -35 99 9 51 294
5268B94m22KJ10j43O34p70J77K11l17K93Q3l58J20L3Q8J10R0k35J69j86M2J35
$$ 294 -128 -126 -16 -159 475 -295 -118 93 -224 69 152 -206 -86 -53 35 145 235 0 169 -17 25 160
5290A60l96J97K00k51J18O6k30J76l44n5L58n2m3L06j75J31r4k07L64J49n29l
$$ 160 -236 -39 161 -90 28 94 -136 40 -304 -359 -1 -53 -96 210 35 166 72 -135 229 378 -151 -154
5312a54J04j79r6K09k08M38K1l40L65j07j23K07l22K18jK49l09L14l14K12n58
$$ -154 -50 -229 -325 -116 -324 114 135 -205 160 53 -70 137 -185 33 32 281 -28 286 -28 184 -374
5333c74M24j34j4R4J2k08L21J57m21L46j7j74K83m55J02J2M7m6K40j5p5J12k75
$$ -374 50 -84 -98 -4 8 -200 121 278 -143 203 186 12 295 -160 -58 -46 1 -45 195 180 105 217 -58
5356e8K36j34j23p3K50j44J05j52K31m00M46P1M7l26LO5l66K32K65n6K9K6l35
$$ -58 178 44 -79 -152 98 -46 59 -93 138 -262 184 255 302 -24 -21 44 -322 -90 175 119 148 174 -161
5379a61K45j07j56p2K05m3M91n77N0l0N7L23m7j42O6q3o1K19Q3k42J1J42m4J7
$$ -161 84 -23 -179 -251 -46 -89 402 -175 -125 -155 -98 225 178 36 102 19 -42 177 260 18 29 171 127 144
5403A44o5k73O3o8L62j27j19M77m03MO4j0N1P2m09K50k0k01J38L92l24m7p4J03
$$ 144 79 -194 -131 -199 163 36 -83 394 -9 -5 59 49 100 172 -237 13 -7 -208 -70 322 -2 -49 -123 -20
5427b0J69j79O8N2j36p1K95m34L97j7k48J78L3j24J24Jq8J85k31R7p3l47K42J97
$$ -20 149 -30 38 90 -46 -117 178 -256 141 124 -124 54 87 -37 87 88 0 185 -46 51 -22 -369 -127 70
5451G0l6j61k09L34Ok24J07j79L82k96O16o15L65r5j7k0K5o8J62j37k14j08L40
$$ 70 34 -127 -336 -2 4 -220 -113 -292 90 -206 410 -205 160 65 48 28 53 -15 147 10 -204 -312 28
5474B8M6k2l93K97L25l18n1L36j15pml4J5N5j39K62k67k38O3K19k15L22l35J06
$$ 28 74 52 -341 -44 281 -37 -88 248 133 126 122 88 103 158 19 281 14 -224 -161 58 -157 165 -170 -64
5498f4Q8k34L73J45m45L54j77l26N94l39K85J29m02j22P1j55L1K67j74Q2J33l02
$$ -64 24 -210 163 308 -137 217 40 -286 308 -31 254 383 -19 -141 -70 -225 -194 73 -101 -19 114 -188
5520a88L20k63j23M14k86K89Q2l48j38M20n28L53J28R5P6n77K02M62o60kM06k80
$$ -188 132 -131 -254 160 -126 163 245 -103 -241 179 -349 4 132 227 303 -274 -72 390 -270 -272 134 -146
5542a46OK19l22K86m2j27L62P8n31K44j58NJ62J53j06k03j40PM33k17J92n8p0
$$ -146 -140 79 -243 43 1 -126 236 314 -217 27 -131 -126 36 189 83 -120 -260 -253 180 -37 155 97 27
5565B7j24J85M1J25m92J03K25j2j32J10l58R3K21Q3k13J30j39K56j79K20jm50
$$ 27 -97 88 129 254 -238 -135 90 78 -54 56 -302 -209 12 95 -118 12 -127 129 -50 170 169 -281
5587b81L30j65Q5J99l59J40J02J41l15K64o1j70l9Q6j62K11j51O5M69n84O3Rj54
$$ -281 49 -116 -31 168 -191 -51 51 192 -123 141 80 -90 -129 -43 -205 6 -145 -80 389 -195 -132 -123 -277
5610b77L31j39k75N10l52N37l46k97L05J71j59j46N07m03j06p3l9L23J42k99J78
$$ -277 54 -85 -360 150 -202 335 -11 -308 -3 168 9 -137 370 -33 -139 -212 -251 72 214 -85 93
5631I3k3k06K38k15K37m0j11Q9O2l79J72k3Q1M63n67K14K5m73J69L25K38o56Q0
$$ 93 70 -136 102 -113 124 84 -27 62 124 -255 -83 -106 -25 438 -129 85 110 -363 -194 131 369 -287 -207
5654b07K41k2J35K6l3j62j90J98j13P4L18k84q4J27j49r5K39K8J65k16P1n2l23
$$ -207 34 12 147 173 140 -22 -212 -14 -127 -53 265 -19 -103 24 -125 -220 19 47 212 -4 67 15 -308
5677c08P5R0K15J27k2J1j40j2j98m9N11l96K9J14qj1oj75L01j47l9M9n4j07lJ38
$$ -308 -233 -143 72 199 177 188 48 36 -162 -211 300 -96 -67 47 39 28 22 -153 148 1 -38 11 -43 -150 -153 -15
5703a5K51j74m87N22k8j95J63M0j27n0L55m11j02m8Q9M14k83J84J51k31L35k50
$$ -15 236 62 -425 97 69 -126 37 77 -50 -100 255 -156 -258 -306 -217 197 -86 98 249 18 353 103
5725A03j19R0R3k76K56j26l8J13j30K19j22J08k04o1o1M00l98o8K64r9J9J9j88
$$ 103 -16 74 167 -109 147 21 -17 96 -34 185 63 171 -33 -94 -155 245 -153 -221 43 -56 -37 -18 -206
5748b06K43K0L3K19k82j16L21l26M6J58m90L17O1O4o2L89o52J41K45l42M12k49
$$ -206 37 57 90 309 27 -89 232 -94 -48 110 -380 -63 -2 62 0 389 -263 -122 123 -219 193 -56
5770e6j79K23M9m07L99J81l77J29K49l00L17l76P0Q1j37J19J08k05J71j09j1j0
$$ -56 -235 -12 37 -370 29 210 -167 -38 211 -89 228 -148 -78 3 -134 -15 93 -112 59 -50 -61 -71
5792g1J96r2L34n01M32j28j76L25l92q9O0J49k76l7J64JP0J4k11K42j53j2J43
$$ -71 125 33 367 -134 298 170 -6 319 -73 -162 -102 47 -229 -266 -102 -101 -31 -17 -228 14 -139 -151 -8
5815hr7J63Nk50L48n9j47J25ok41J34l21L83j70M6j01R8N3J07M9j66J79j66K60
$$ -8 -105 58 63 -187 161 102 -45 80 74 -167 -33 -354 29 -141 -95 -196 -98 -45 62 111 -55 124 -42 218
5839B18k49j04K23L45m32J20l65L94K77o31M3N8k7J14m2M5j04J67j67R6J48j99
$$ 218 -31 -135 88 433 1 121 -244 150 427 -204 -161 -103 -130 -16 -58 -13 -117 50 -117 -21 127 -72
5861g2o7L69q9k39K81l11L6J8k63L86N5j03j1q7j7K32j59R5J7j81K65n63N34k3
$$ -72 -139 230 141 -98 183 -128 -92 -74 -337 49 104 1 -10 -97 -114 118 -41 54 71 -110 155 -408 126 103
5885A03m4o3Q3k26K14J30op1k64q4K90k0j78K86k27m7j44M1K70O1j73J40J90n19
$$ 103 59 -4 79 -147 67 197 191 120 -144 -228 62 42 -136 150 -77 -124 -268 -227 43 104 -69 71 261 -258
5909b58K75O2J47l2m21M42n3o0r7J71l17j22M06j20k8O6j05Qj68K63M4k6L4j7
$$ -258 17 79 226 194 -227 215 162 102 5 176 -141 -263 143 23 -5 61 -44 -36 -204 59 103 77 111 94
5933I4j25j12M17j45j72J39n8J25j66k64L64R5k06L6j66J77k20K30j74L77j90
$$ 94 -31 -143 274 129 -43 96 38 163 -3 -267 97 192 -14 22 -144 33 -187 43 -131 246 56
5954E6j58K34j23j39j2K6M76j31m06N92n89L5J84l0k04L13q6K01j50Kj80M47m85
$$ 56 -102 132 9 -130 -142 -116 360 229 -177 415 -174 -139 45 15 -189 124 38 239 89 91 -89 358 -127
5977a27K57n6k6l5J23k16P8O7M2O7k50L6j65R3J44m3L6r9K87j58j31j58J13J19
$$ -127 130 74 48 13 136 -80 -2 65 107 174 -76 -40 -205 -112 32 -11 25 -74 213 55 -76 -234 -121 -2
6001bp5M1J27J10j78L14l97k4J31k40K90k20J30o1j44O2J66k62O4L08j58J0R9
$$ -2 -77 -36 91 201 23 337 -60 -84 47 -193 97 -123 7 -54 -198 -136 30 -232 -168 140 -18 -8 91
6024I1j38K72k21m1K24l69K34j23k69K56L26l95L8N6j0K00k68l2L08p1j66R3j16
$$ 91 -47 225 4 -37 187 -182 52 -71 -340 -84 242 -153 -115 -59 -69 131 -137 -169 139 68 -98 -5 -121
6047a21J61M3q9J57k36j12N8K24k51M9n8K46j3R7m3o6q5K09q9k73M23m3k26q1
$$ -121 40 83 -6 151 -85 -197 -139 85 -166 -117 -175 71 58 155 112 46 -39 170 81 -192 231 188 -38 -119
6071a19KO0M19l06r8K22p0m48M55k61J73o6l41N16j14Mj29M20k97K38k06j9j38
$$ -119 -117 -57 362 56 -42 180 110 -338 117 -144 29 -37 -378 138 24 28 -101 319 22 260 54 35 -103
6094a03K7j13K77J63p5k99j5J08oK24q1l42K20N5J68k13l14J64J37J11pk03J60
$$ -103 -76 -189 88 251 176 -123 -138 -30 -36 188 107 -235 -15 40 208 -5 -319 -155 -18 93 86 -117 43
6117D3lj99K11K52n48K00L7j30J73J79j36j56O8J13l6l24K14P9Pl0j89J39P8k48
$$ 43 40 -159 52 304 -244 -44 -7 -137 36 215 79 -77 -9 104 68 -256 -42 37 44 14 -175 -36 42 -206
6141b06L32k62o6J78k09K94p8k51L00Q3m21K99m5qj0M7j40L90j74R7j53j97J98
$$ -206 126 -136 -202 -24 -233 61 -17 -268 32 115 -306 -7 -52 -60 -70 -23 -163 227 53 150 -3 -200 -2
6164bJ13k12k3j34k9N05k39J20j10j22K47k94N3J38k03J84J9J76j00j00L6r6J88
$$ -2 111 -101 -124 -258 -287 218 -21 99 -11 -133 114 -180 -127 11 -192 -8 11 187 87 -13 23 -73 115
6187A15l19K74k44J06k38L22K50j75j25o2K4K05k9L0k09jj30J89%j20j24N74l87
$$ 115 -204 70 -174 -68 -306 16 266 91 -34 -96 -72 133 104 134 -75 -76 -206 -17 -17 -137 -261 313 -74
6210g4J23Lj59L70n87L27n4K58l15J38p7n4L38j76k31K89l92L92J39k94q6J61
$$ -74 49 52 -107 263 -324 3 -51 207 -108 30 -47 -101 237 61 -170 119 -273 119 258 -36 -122 39
6232C9j7j24K68k77J34J08k48J07rO3q8K33k60Q9J03j40j32O2R9M8l06K85r4O0
$$ 39 22 -102 166 -111 23 131 -117 -10 -19 44 -44 189 -71 18 121 -19 -151 -89 10 58 -248 37 -57 3
6256CN4n5K1j26j37K15Q6o9r9J99j55j09L47Q9j50J56j30m%m62M41k39O6j83J43
$$ 3 57 2 23 -103 -240 -25 61 -8 -107 92 -63 -172 175 264 114 270 140 136 136 -326 115 -124 -58 -241 -98
6281i8j19L19k10MN20j91n26L06j00K61Ol42L55j98j25J18O9J79n6l99R5J61o5
$$ -98 -217 102 -108 -104 416 225 -301 5 -95 166 172 -170 185 -13 -138 -20 49 228 172 -227 -132 29 -36
6304c6L0m11K91N8P0%jO6j75lP7j52L33kn6j66m13M47J54o6l2k4j73K74k65L3
$$ -36 -6 -417 -126 -68 2 2 1 67 -108 -111 -34 -186 147 145 89 -77 -490 -43 111 45 13 -11 -184 90 -175 -142
6330a42J17L0n1L5j36K73k42n7J96M00n44M3J05pk49J69j13K11O0j46M8l6J52
$$ -142 -25 5 -46 -11 -147 126 -116 -173 23 423 -121 -78 27 20 -229 -60 -173 38 98 -48 0 -36 116
6353A16n9q7J8l75L56K47k18J04J40l47K68k84K7J99k85RJ10J97J05j65j61J96
$$ 116 57 -30 -12 -387 -31 216 -2 102 242 -105 163 -121 -94 105 -180 -171 -61 136 241 76 -85 111
6375A11J5JQ2k00j63M8J14j87K72J27k60JJ50k9K36n31mL58J34j0l10q4K18J05
$$ 111 126 127 209 9 -154 -106 8 -179 93 220 -40 -39 111 82 318 -213 -217 141 275 265 -45 -129 89 194
6399A94j93O1%J22Mj05r4K90j46j59K9l33K35j44J30o4K11k73L77m4J27j57oj05
$$ 194 1 62 62 184 188 83 -11 279 133 -26 3 -330 -95 -239 -109 -173 38 -235 142 98 225 68 62 -43
6423d3K13l50J01L72m66P9J44K97l83j04K33J87o0J26m12K0k9Q5l2j51Q7J07n3
$$ -43 170 -180 -79 293 -173 -94 50 347 -36 -140 93 280 220 346 -66 -46 -75 10 -22 -173 -86 21 -32
6446c2r2l1L50k33P0J2K5q4j11J2J13m7j97O4K26j91M1J07k24K80M13l46O4l44
$$ -32 -124 -155 195 -38 32 44 69 -15 -126 -114 -1 -48 -245 -181 45 -146 -105 2 -222 58 471 125 189 -155
6470a55L09j72ro2L7p0K56m15P9n4K32%m7Q4J64k4k6j45p6M9J06MQ9J49j74k19
$$ -155 154 -18 -27 -89 -52 -122 134 -281 -202 -256 -24 -24 -71 13 177 153 127 -18 -94 -45 61 65 154 303 129 -90
6496i0K55n4k49K37P%K5l80K66j27J10J34k07J0k6J06j65K05j39K57k9R3l62L23
$$ -90 165 111 -138 99 106 106 131 -249 17 -110 0 134 -73 -63 -89 17 -148 57 -82 175 146 239 -123 200
6520B00j29j38r0L8J89k65J91m1J28k4O9n5j80K24p8O7J57k44J02l90M4K24rJ76
$$ 200 71 -67 -157 -119 70 -195 -4 -45 83 59 128 73 -107 117 39 106 263 19 121 -269 -225 -1 -10 166
6544A66k80J1J13J25m30J38k12M08j12J30m2R9m8QK07k3r3l7O6j09P8k74J40j09
$$ 166 -114 -103 10 135 -295 -157 -369 39 -73 57 15 114 66 74 281 258 165 128 194 85 163 -111 29 -80
6568h0J71O8m5k36J56p2rK54j12j02m9K09j13J78l50J87K11m49Q1K11j47k05J54
$$ -80 91 159 114 -122 34 -38 -47 207 95 -7 -56 153 40 218 -132 55 266 -183 -102 109 -38 -243 -89
6591h9M8n5M0K21k6k78J91K53l87J57n5l8L03l94L44k90O6J57Km5j55J37k88L06
$$ -89 -41 -96 -56 165 139 -139 52 305 -82 75 20 -18 285 -109 235 -55 11 168 170 125 -30 107 -181 125
6615A25j45J21j10J3l1J32o2q0J47k82Q6J55j31%K40j17J45j84L4J71j49J09J54
$$ 125 -20 101 -9 4 -27 105 43 -37 110 -172 -86 69 -62 -62 178 61 206 22 56 227 78 187 341
6638C41m71J51P9m0ll96N24jm13J37L31j71OM4n4j69J77J67q5k1o4P5j40k3m5
$$ 341 -130 21 100 60 57 -339 185 184 -229 -92 239 68 74 118 64 -105 72 239 154 133 69 144 4 -19 -64
6663f4K7k0o2K13l2l10M63l1j23J47k22k3p1J69Q1j37R5k34J32K4r9j61J91K55
$$ -64 -37 -57 -119 94 62 -248 215 184 61 208 -14 -37 -108 61 142 5 100 -134 -2 22 -77 -238 -47 208
6687B08m53M87l20j1K33q2j43j77OK08n5K66l20M24J02m71J50l37M21k25Q9K20
$$ 208 -245 242 -78 -89 144 62 -81 -258 -252 -44 -99 167 -153 271 373 -98 52 -285 136 -89 0 220
6709B20l38M2K41n11M14j21M63j53m1k28P8k14M58k50j34J74lJ29l32J35K82l93
$$ 220 -118 -76 165 -346 68 -53 410 257 216 -12 66 -148 310 60 -74 100 97 226 -106 29 311 -82
6731h2J43J44j94j6p9o6J00K11j24rNO1M53o46p9J24K33l41K73J30p7k07Pj33
$$ -82 61 205 11 -5 -84 -150 -50 161 37 28 33 94 547 -99 -178 -54 179 -162 111 241 164 -43 -36 -169
6755a69J75k40J70r6J89J7j56J04J97o0k62j41J88J15k39L79j91J10L7j60N6j03
$$ -169 6 -234 -64 -160 29 46 -110 -6 191 131 -131 -272 -84 31 -208 171 -20 90 127 -33 23 -80
6777h0p0J82k24L56K08l69Q8P3l34K20J3Q4j25m40M48j76K61k54R1n6J04K55l98
$$ -80 -150 32 -192 164 372 3 91 164 -170 50 63 147 22 -418 30 -146 115 -139 -48 -104 0 255 -143
6800a43K18p3k01J11O5L4j93L69j24j29J35j55K58j01lJ06j19k06L25l56K00j20
$$ -143 75 2 -199 -88 -23 11 -182 187 63 -66 69 -86 172 71 68 174 55 -151 174 -182 18 -102
6822a02j44L03J45k21q7j61M06Jj32j23J24l1M1J04k00K05j05J10k47J39l36L30
$$ -102 -246 57 202 -19 -106 -267 139 140 8 -115 9 -22 19 123 -77 128 23 133 -114 25 -311 19
6844A9j36K25k60L06n6K48m88K70j59k42M69j72m8K8K1n6J68j23Q7l0L7J88k07
$$ 19 -117 108 -152 154 98 346 -142 128 -31 -273 196 24 -24 4 25 -31 137 14 101 71 108 296 89
6867H9j02M5m8j04K46n8J82l36J8J3J85j67j17J77l4J18j52MJ17o2p1J79j56L2
$$ 89 -13 32 -16 -120 126 68 250 -86 -68 -55 130 -37 -154 23 -11 107 -45 -41 76 14 -57 122 -34 -2
6891bp1j41J56L23m75K76m36J98L40j73j86q2L70O0k07J31k50K27j8K3rj9j82
$$ -2 -73 -214 -58 265 -210 66 -370 -172 168 -5 -191 -273 97 157 -50 81 -169 58 40 63 54 35 -147
6914a47K24P2l08K24j42N0l5j05J82m8j30J58J82l55n1J59j20L79l10j72L33j96
$$ -147 77 149 -159 65 -77 -27 -62 -167 15 -33 -163 -5 177 -178 -229 -70 -190 189 -121 -293 40 -156
6936a56J54M4L2K43l21K5p1KL01l63K19K0n6j37MLQ3j36K6M07j85j80j51L77N4
$$ -156 -2 42 74 317 -4 21 -50 -48 253 -110 109 129 73 -64 -60 -57 26 -110 -84 323 138 -42 -193 184 238
6961B38l14K72n91O75l84J32J09o2j26K20j92Q1o9r8J31m9K13k73N8r1J57p4Q5
$$ 238 -76 196 -395 280 -104 28 137 75 -51 169 -23 58 -11 -109 22 -27 186 -87 -29 -120 37 -37 48
6984D8j5J67n16L47k54K85n5j30j00K49m2r6L45m29L53L0j07p1M8l6k35K23k2
$$ 48 33 200 -316 31 -223 62 7 -123 -223 26 -16 -112 233 -196 157 187 80 9 57 21 -214 9 -13
7007a3M5J3j5l29M00M9l03J07j5J21m74N29k23j10J40O6R4l63J44L75l25j8R3
$$ -13 32 45 30 -299 101 150 -153 -46 -61 60 -414 115 -108 -218 -78 -12 82 -281 -137 238 -87 -105 -12
7030a2J41j46m9kj9N9OL08k36r1J01j31J27k17o3K59j31J43J13m48L89k59Q9L44
$$ -12 129 -17 -66 -68 -87 -28 -22 286 50 -41 60 -71 56 -161 -224 35 -96 47 160 -288 101 -158 -69 275
7054B75j64j7k60P5K15l30J27L46j96K21l95L9P4j42R6K15Q2l25J21l60J74k45
$$ 275 111 94 -166 -91 124 -206 -79 267 71 292 -103 -64 10 -132 -36 179 261 -64 57 -303 -129 -374
7076c74L04K57j16l39M03j39j01Q8K0R8q7j12m4m9j2L27l3M1N7n1K96q28N37P1
$$ -374 -70 187 71 -268 135 -4 -105 -17 3 101 14 -98 -142 -191 -203 124 91 132 189 138 434 -394 143 214
7100B14n86K29K18j12j68L87j62k09L04j43j66K42p7j37J33J04r3J92k78N7Jj38
$$ 214 -372 -143 75 -37 -205 182 20 -189 115 -28 -194 48 -29 -166 -33 71 -22 170 -108 -51 -50 -188
7122a88J50k6J0%j34M9L57n32J53K56j30K40k32l8M5k73R0O7K58n7k3M1j2o5L52
$$ -188 -38 -64 -54 -54 -188 -139 218 -314 -161 95 -35 205 -27 -65 -20 -293 -203 -136 122 65 42 83 71 6 358
7147C58n03L45j63k44K17k04K42R0j79j42jJ34J53R1k88J16k36J9K80k08L61m18
$$ 358 -145 200 37 -207 10 -194 48 138 -41 -183 -184 -50 103 194 -94 22 -214 -195 85 -123 238 -180
7169a80K78ml10n5L69J43j20K23m79K05k09K30prk01m2L49l62J44J5L25l74p8
$$ -180 98 94 -216 -271 98 241 121 344 -135 70 -139 91 84 75 -126 -168 181 -181 -37 -22 303 -71 -149
7192a49L5J6K69l65K76k7K2J81j34l21K97k51L00N3m57M96l42m5Q2j26R8J09l9
$$ -149 -114 -98 171 -194 82 55 77 258 124 -197 100 -151 149 202 -255 241 -101 -146 -64 -190 -92 17 -22
7215b2J65j81q6k3L33n7j45N6l11K36L9k01J60J97k32k0j47K29J66J07k07M8k36
$$ -22 143 -38 -124 -147 186 129 -16 40 -271 -35 4 -197 -37 160 -72 -92 -239 -10 156 263 56 104 -132
7238a32K62l05K26J72k36p1j41J10n2J0K81N7j69m1j48K47j49Q7k85J21K32j27
$$ -132 130 -175 51 223 -13 -84 -225 -115 -167 -157 124 181 12 -29 -177 70 -79 8 -277 -156 76 -51
7260e1K02k36J88r1K23k44j20K01J44mm93K68k55L31j03J59j91N9l6J98j49j60
$$ -51 151 -85 103 12 235 -9 -129 72 216 212 -281 -13 -268 63 -40 119 -72 -13 -49 149 0 -160
7282a60pJ24k46K45P3J86k62l9q1K97j75K12m17M93n74J93j06K13rJ82k05J39
$$ -160 -167 -43 -289 -44 29 215 -47 -86 -167 130 -45 167 -250 243 -331 -138 -244 -31 -40 142 -63 76
7304G6j22K14l01J64j19j14O06p64N64j13P7k6m1l30l1J71M36o86M94K3m02J02
$$ 76 -46 168 -133 31 -88 -202 404 -360 204 91 168 142 101 -229 -260 -89 347 -339 155 178 -224 -122
7326a22M7K39k53K18m7j37J10l6l64K59L09j4k49P1k84R1K93P5k14J44k18p1M14
$$ -122 -75 164 -89 129 82 -55 55 19 -345 -86 223 209 -40 31 -253 -162 131 206 -8 136 -82 -153 261
7349B61m17M95o41M43l58K5K29l7k0J74R9j60l66K55J79k27LK6J12q8j36n1J19
$$ 261 -156 339 -302 141 -217 -192 37 0 -20 154 253 93 -273 -18 161 -66 -63 -37 75 -13 -149 -200 -81
7372h1qM16l14J76k56j2Q9P6k10%J38j9L45l67J9j13K18j20O1n2j04l1Q7j2O5
$$ -81 -89 327 13 189 -67 -79 10 86 -124 -124 14 -5 340 -27 -8 -121 97 -23 38 -14 -118 -149 -62 -74 -9
7397il1J24j61P9m7J07R1K4j33o1lp0l3O7J54j55K7j94M11k32J43l57K35n8j03
$$ -9 -40 84 -77 2 -45 62 153 177 44 -17 -20 -90 -123 -56 98 -57 -30 -224 187 -45 98 -259 -24 -82 -185
7422a85l7J18L36m65J91q5O6J21j25pNK55l28J11J02N8l17Q2L10j82l5q0q4K60
$$ -185 -222 -104 232 -233 -42 -127 -61 60 -65 -72 -67 188 -140 -29 73 131 -186 -104 206 24 -11 -91 -175 85
7446H5O6k9o8n1K5O7K39k32j67nl9Q9N7n0m1P5j9j0PK5K96m65m6M62m37J81OJ22
$$ 85 151 122 54 3 28 95 334 102 -65 -70 -109 -20 37 -13 -54 21 2 -8 -1 24 320 -145 -191 271 -166 15 21 143
7474A43J8k65K63j73j7J45k24J58o6k82N50l72J78l0l6k7q0K64k50jQ1Q1J6j56
$$ 143 161 -104 159 -14 -31 114 -110 48 -18 -300 250 -122 56 26 -10 -37 -117 147 -103 -104 -23 58 74 -82
7498h2J02l9J31J45l69K77k95j22J10J26K40k40r9P7L8l22M22l1J60l7R8l22l6
$$ -82 20 -19 112 257 -112 165 -130 -252 -142 -16 224 -16 -115 -38 0 -322 100 69 229 192 290 -32 -68
7521f8R0j78J9J44K10Q0l24l4L2J39J48k64P0n1P8j95L07k61K92j12k17q2J35
$$ -68 22 -156 -137 7 217 297 -27 -61 -29 110 258 -6 64 13 91 -104 203 -58 234 122 -95 -177 -42
7544d2Q9l36L16K9n8j67J33k27L70J28k14p7J04n6j65n8K82k35L8%L63j97k9J3
$$ -42 47 -289 27 56 -2 -169 -36 -263 107 235 21 -56 48 -8 -173 -231 51 -184 -146 -146 217 20 -9 4
7568DR7O6k37K18k51J57j76p3J6L50k53O8R3j54N3N2l9M13m16L7j95P4n2J0J47
$$ 4 101 167 -70 148 -103 54 -122 -195 -179 171 -82 -14 79 -75 -22 30 -9 404 -12 25 -170 -96 -148 -138 9
7593Ij78M3M0J67l51J65K40k50J87o1j38P6O7k23J59J4j71j07K72K80k38K01j45
$$ 9 -169 -126 -86 81 -270 -105 135 -115 72 11 -127 -51 16 -207 -48 -34 -205 -312 -40 240 2 203 58
7616E8L8k15L27k47J03n5J42j51K5n9J34k97M82j87k11J72J29j95O8K00m91M42
$$ 58 96 -119 208 -39 64 9 151 0 25 -34 100 -197 285 98 -113 59 188 -7 61 261 -230 212
7638B12j55J85m45L85j79M4q8j48k3K52%j4o3j03R3L3j32K57m42J87J06J18P9
$$ 212 57 242 -203 182 3 47 -41 -189 -212 40 40 26 -37 -140 -47 -14 -146 111 -331 -144 -38 80 159
7661A59k26J53J99p5k76n9P3J32o2O6k08m0K21N8l11J58k15J82J49l7j80K12p7
$$ 159 -67 86 285 210 -66 -125 -52 80 18 84 -124 -164 57 115 -196 -38 -253 -71 78 41 -139 73 -4
7684dN5q8L60j7j64k01oJ94P1j37O8j08J94l87kM15k48K56j23o4J3j7ko4O7Q4
$$ -4 51 -37 323 306 142 -59 -65 129 200 63 131 23 217 -170 -172 243 -5 251 128 64 77 60 58 -6 61 145
7710A45j77J97M7k91m5K08k69J84R2j5l0M56l95j46K16k32k4P8K42k69k03N47
$$ 145 -32 165 212 -79 -124 84 -185 -1 91 76 46 502 107 -39 177 -55 -79 -1 241 -28 -231 316
7732C16k96k57J37J7K24k6J71n18K06r1M3J14R7p5l15L44n8J5J05k11j24q6R1
$$ 316 20 -237 -100 -83 141 115 286 -232 -26 -117 -74 40 137 62 -253 91 33 48 153 -58 -182 -268 -177
7755a77K33n7O1k49L25J8k80J03J30q1P5nK82j33m58M98j94l27K74j76J47K20
$$ -177 56 -1 60 -189 136 154 -126 -23 107 26 101 96 378 245 -213 285 91 -236 38 -138 9 229
7777B29j0j23j57p6j16M64o9j1n7Q2q4J38r1k48L5K55j49l03L25k7l1P5l5o2k13
$$ 229 219 96 -61 -137 -253 211 142 131 74 156 72 210 119 -129 -94 161 12 -291 34 7 -24 51 16 -46 -259
7802b59N57k68j92J64JN5l20K94j64P4J90L68n19J11l47L94O5l66K93j88j23K70
$$ -259 298 30 -162 2 3 58 -262 32 -132 -58 132 500 -19 92 -255 139 204 -162 131 -57 -180 90
7824I0j55M1P5q2K33l49J45L2k7j24L2K91l00J02J20k44l0J86L7j66M0j02J59
$$ 90 -65 -24 51 -31 202 -147 -2 30 3 -121 -89 202 -98 4 124 -120 -150 36 73 -93 -53 -155 4
7847DJ6k7j99J87q5K2k9pR7N1m8O0j67P3k49J6K88k37J76N0m9l6J48rj05l56O80
$$ 4 20 -7 -206 -19 -104 -82 -111 -118 -21 30 -18 42 -125 -52 -301 -285 3 -234 -58 -8 -57 -93 55 46 -59 -415 265
7874B65l85M6K84l37n2l7L98l95J71j53K00J40j23k4k1m6L3lJ09jj5Q4l28J68
$$ 265 -120 -74 210 -127 -179 -216 182 -213 -42 -195 5 145 22 -2 -23 -69 -36 -39 70 69 54 138 -190 -22
7898b2mK01j27lQk35K21r7O5r5J27j69K93q9J77m12K77j62M6k9qj25j05J75K70
$$ -22 -26 175 48 45 53 -182 39 -58 7 -88 39 -130 163 74 251 -161 116 -46 0 -29 -37 -162 -267 -92 178
7923A78k90J57j23l40O53l86J04jK37k00o3J48J47m19M9P3K04O9M1k91J06j17
$$ 178 -112 45 -78 -418 235 -151 -47 -48 189 -11 -74 74 221 -198 -149 -76 128 197 238 -53 53 -64
7945f4L86O6l09k7j39J97j72J96l08L25m92M89k54L79k07q3m2o2r6J16K77m85
$$ -64 322 388 79 52 -87 110 -62 134 -174 151 -341 148 -106 273 66 -17 -59 -121 -217 -101 176 -309
7967c09J49l1M17j99J7L04k27n3J02k55J61q2p5J70Q1j53L0n5k9K51l22J65M1
$$ -309 -160 -191 226 27 44 348 121 68 170 -85 76 -6 -81 89 170 17 47 -8 -37 214 -108 57 98
7990I8J22l8k82l9J09p1K75k50N8J3K85l17j39N4K83n1kj48J1m1j03L38j62K49
$$ 98 220 182 -100 -139 -30 -101 174 -76 -18 -5 280 -37 -176 -122 161 110 108 -40 -29 -70 -173 165 3 252
8014B52l32K62K15k21j94L46l56j00L03k79K40J30l28K15Nr5j78K92j23k35q0
$$ 252 -80 182 397 176 -18 328 -28 -128 175 -104 136 266 -62 153 158 63 -115 177 54 -181 -261
8035b61K04L2J5J9P3q1J68k06J63k90J98k6rK5o9L19k44J78k27j49J26J34J42
$$ -261 -57 -25 -10 9 82 1 169 -37 126 -164 34 8 -1 24 -45 274 30 208 -19 -168 -42 92 234
8058B34o6j69r8J35n7Q5oJ94k12j52M9M3k0K42j76l49M52l40K28J35l34L39m2
$$ 234 168 -1 -99 36 -21 64 58 252 40 -112 -63 -20 -40 202 26 -323 129 -211 17 152 -182 157 115
8081A15j43k44K74j39L17l90L51l85J53N7j56J57J9J28l49K42P8j1n9J64k52J64
$$ 115 -28 -272 2 -137 180 -210 141 -244 -91 -34 -190 -33 -14 114 -235 7 85 74 15 179 -73 91
8103I1l44M03j74J56k92J53N0j07K12P2l69J26M2N7k7j02Q1J46m31K09o4J43j00
$$ 91 -253 150 -24 132 -160 -7 43 -64 148 220 -149 -23 19 76 49 -53 28 174 -257 -48 -112 31 -69
8126f9R8j09k3J29N7J47k88P5L02n59L36m9m0l2J00l58L56P3L0l23O9K50r2j28
$$ -69 29 -80 -103 26 83 230 -58 17 319 -240 96 47 7 -25 75 -283 73 146 176 -147 -78 172 80 -48
8150d8j48M33k33O8jP7M1l81O1J14k90RK61j31M2P8J0N5R6j62k62J11K05j71K62
$$ -48 -196 237 4 72 71 148 189 -192 -131 -17 -307 -298 -37 -168 -126 -48 -38 17 113 -49 -311 -200 5 -166 96
8175I6k3j05L00l67L87j83o3k67K64J5r6O8J58o6k38O1
$$ 96 73 -32 268 -99 288 105 42 -225 39 54 -42 26 184 118 -120 -59
8191e9
$$ Imaginary data points
##PAGE= N=2
##DATA TABLE= (X++(I..I)), XYDATA
0@%%%%%%%%Qj6J6j6K4l2L2m0N6p2Q8j04J23j47J76k08K46k90L38l91M50n19N96
$$ 0 0 0 0 0 0 0 0 0 8 -8 8 -8 16 -16 16 -24 32 -40 48 -56 67 -80 96 -112 134 -156 182 -209 241 -278 318
31C18o81P75q78R92j119J259j412J580j765J966k186K426k690K981l295L636m010
$$ 318 -363 412 -466 526 -593 666 -746 834 -931 1035 -1151 1275 -1415 1566 -1729 1907 -2103
48b103M420m871N367n911O512p181P928q769R720j0804J2057j3523J5266j7373
$$ -2103 2317 -2554 2813 -3098 3414 -3767 4161 -4608 5112 -5692 6365 -7158 8108 -9265
62i265J9989k3339K7792l4039M3501n9666R4503k99976K72040L48990o39812K41244
$$ -9265 10724 -12615 15177 -18862 24639 -35027 59476 -240500 31540 380530 -259282 -18038
74a8038L37961m07215k03118M03078k1219k35737J87892K02295l39656q0537L12146
$$ -18038 319923 -87292 -290410 112668 91449 -144288 43604 245899 -93757 -174294 137852
85A37852r3099k09185K27849L8337j63043K9325N5890j2609n7084m3489J71823
$$ 137852 44753 -164432 63417 101754 -61289 -31964 23926 11317 -45767 -89256 82567
96H2567j8269j88577J89991P9619l11365P4695K36673j69413n5610K37870n6555
$$ 82567 64298 -124279 65712 145331 -166034 -91339 145334 -24079 -79689 158181 101626
107A01626k65359R8493K01624k26507n9903L71473j15089l27722K62219P0108
$$ 101626 -163733 -65240 136384 -90123 -150026 221447 106358 -221364 40855 110963
117A10963l04140J60158J90975j97175l059J36154q3106r8084O8182R1917p2524
$$ 110963 -193177 -33019 157956 -39219 -42278 93876 10770 -87314 -19132 72785 261
128B61n4926J31039k1933j42233P0426N0444o3100K0690K8676J7804m1694q7198
$$ 261 -54665 76374 54441 -87792 -17366 33078 -30022 -9332 19344 37148 -4546 -91744
140i1744J07427L6320j49891J25322J09985k10410J9594J49800j34153m5327J52152
$$ -91744 15683 52003 -97888 27434 137419 -72991 -53397 96403 -37750 -83077 69075
151F9075n742j14550L3827J00373r8698r5327J62002j716j64294J42696P3705
$$ 69075 63333 -51217 -17390 82983 -15715 -111042 50960 49244 -115050 27646 101351
162A01351j82818N9164R5727j26213O488R4723k0470l3800J51L4921k2709o6212
$$ 101351 -81467 -22303 73424 -52789 -46301 48422 27952 -5848 -5697 29224 6515 -59697
174e9697P9848L8230r6858L5749L8748p5262J2118L2185Q01J1519m1482K7028
$$ -59697 20151 58381 -38477 -2728 36020 -39242 -27124 5061 5862 17381 -24101 2927
186B927L0439r2722M5322Q2208j03657J8533R0481q7666k1016O8380k7008l1164
$$ 2927 33366 -59356 -14034 68174 -35483 -16950 73531 -14135 -35151 33229 6221 -24943
198b4943J5908L4521j1805n4046N6438J8318j01711N8747O0898j03109L7923P1171
$$ -24943 -9035 25486 13681 -40365 16073 34391 -67320 -8573 52325 -50784 -12861 58310
210E8310q1032L262M4660k7512K930n19Q563J5073m6916K0395L5205o1353K1250
$$ 58310 -22722 -19460 25200 -2312 618 99 8662 23735 -23181 -2786 32419 -28934 -7684
223g684M0377n5116J1858J9819k9159K2556q274n317L7370l9701K404M7068n8156
$$ -7684 32693 -22423 -10565 9254 -19905 2651 -5623 -10940 26430 -13271 -10867 36201 -21955
236b1955P312N6754n5604K171M3387l7346n13J0837j2537J4462k1956O195L2246
$$ -21955 -14643 42111 -13493 -11322 32065 -5281 -5794 5043 -7494 6968 -14988 -8793 23453
249B3453m9188J2747M6198o0164J1148M8668m8646R450K8277l0661J6558m88j6350
$$ 23453 -25735 -12988 33210 -26954 -15806 32862 -15784 -6334 21943 -8718 7840 7352 -8998
262h998K7591k2633m720L1568m0415O625L5193m5478J1008K7597l6545J8355P788
$$ -8998 18593 -4040 -8760 22808 -17607 -10982 24211 -21267 -10259 17338 -19207 -852 6936
275F936k5169L0153r842j5303L4379k6807k924L7056l8051Q20L2883l2745O441
$$ 6936 -18233 11920 2078 -13225 21154 -5653 -8577 28479 -9572 -8752 24131 -8614 -2173
288b173J1498k4501K2625o637k0259L1759j9389q780L6590l4501j262L9773l4455
$$ -2173 9325 -15176 7449 812 -19447 12312 -7077 -15857 20733 -13768 -15030 24743 -9712
301i712K703K5843k8101J6173P429k7389K3378n357j5438K5319k4522k502L3442
$$ -9712 -7009 18834 -9267 6906 14335 -13054 10324 4967 -10471 14848 -9674 -12176 21266
314B1266l4770nK8166l0372J2729J3260k9051K5195L681k3067K7831j3247j2445
$$ 21266 -13504 -13509 14657 -15715 -2986 10274 -18777 6418 10099 -12968 14863 1616 -10829
327a0829L3522k5934q753L1088k4229K119J6008k7683J5430O970k4975K0159n486
$$ -10829 22693 -3241 -11994 19094 -5135 -3016 12992 -14691 739 7709 -17266 2893 -2593
340b593j1840L0774k1966q933L5009k5216l446K5154k6425R789J7006k6189J4311
$$ -2593 -14433 16341 -5625 -14558 20451 -4765 -8211 16943 -9482 307 17313 -8876 5435
353E435K626j8072K2501j5818j4596L2274k0514q870K8383k1777J768J9497k4510
$$ 5435 8061 -10011 12490 -3328 -17924 14350 -6164 -15034 13349 -8428 -6660 12837 -11673
366a1673J0219Q349j7139K1905q416j4208L3087k0191j5236L2406k3775q373K8322
$$ -11673 -1454 6895 -10244 11661 3245 -10963 22124 1933 -13303 19103 -4672 -13045 15277
379A5277k2954k66J6644j6505R192l143j2073K5384j6102j2064L5296k0483j0107
$$ 15277 -7677 -7943 8701 -7804 1388 -1755 -13828 11556 -4546 -16610 18686 -1797 -11904
392a1904L3548k1939p792K1801j6628K721L447j1580K0579j2390j5539L2107j9850
$$ -11904 21644 -295 -8087 13714 -2914 -193 3254 -8326 12253 -137 -15676 16431 -3419
405c419j8213L5135j7954j3986L0453r675o765R032o074J0937j2491r683L3360
$$ -3419 -21632 13503 -4451 -18437 12016 2341 -4424 4608 -1466 9471 -3020 -12703 20657
418B0657k0075j6794M1201k1649k4435L6078j3175j9298J9786k398n71m231m352
$$ 20657 582 -16212 24989 3340 -21095 14983 1808 -17490 2296 -102 -673 -4904 -9256
431i256K4166j8098j4948L9278k0022k3778M1081r788k3593K5776j100r458j519
$$ -9256 14910 -3188 -18136 21142 1120 -22658 18423 8635 -14958 10818 9718 260 -1259
444a259l930J6317j7838j3524L9244j8476k6648M6372j1347l6671L1998N527k1590
$$ -1259 -5189 11128 -6710 -20234 19010 534 -26114 20258 8911 -27760 4238 9765 -11825
457a1825Q289J0521O524j7262n447L2300k4601k3262M9034j5612l8207M2845K362
$$ -11825 -3536 6985 13509 -3753 -9200 23100 -1501 -24763 24271 8659 -29548 13297 15659
470A5659l4293J5679R777q929r908M077K4987k0543j7409M4468j6206l6589M6378
$$ 15659 -18634 -2955 6822 -2107 -12015 -7938 17049 -3494 -20903 23565 7359 -29230 17148
483A7148L073l9374K0986J1328j8161k255R480J5854k1895j6501L8218j9126l5423
$$ 17148 20221 -19153 1833 13161 -5000 -7255 2225 18079 -3816 -20317 17901 -1225 -36648
496c6648N2265M133m5464K8080J5906k9677K414J6494L794j9181l607L5844k0121
$$ -36648 15617 19750 -25714 2366 18272 -11405 -8991 7503 11297 -7884 -11491 24353 4232
509D232k9396N0666p496n3181L6247J7064l7481J4169K1182j4293j6434N035K4410
$$ 4232 -25164 25502 18006 -35175 1072 18136 -19345 -5176 16006 1713 -14721 -9686 14724
522A4724j8299j7120M5323j1201m6034M0823J4598l9837J9705J8768k4012r933
$$ 14724 -3575 -20695 24628 13427 -32607 8216 22814 -17023 2682 21450 -2562 -12495
534a2495Q836J4804j4418j4244L7813r993m4814M1016J4037m7587K2601K5788
$$ -12495 -3659 11145 -3273 -17517 20296 10303 -34511 6505 20542 -27045 -4444 21344
546B1344k9683k035K2155K072k0229n421L1116j6235l1500M7604M016n0471K9562
$$ 21344 -8339 -10374 11781 13853 -6376 -11797 19319 3084 -28416 19188 23204 -27267 2295
559B295J7890m1526J0972K3662j4088q264M955J4096j0950j8181L4277J255m0296
$$ 2295 20185 -21341 -10369 13293 -795 -9059 -4104 9992 -958 -19139 15138 16393 -23903
572b3903K8692J7105l7941J1499K1596j6661o536O514R714j1987j8782L0245P54
$$ -23903 4789 21894 -16047 -4548 17048 387 -6149 365 10079 -1908 -20690 9555 10309
585A0309l9003L4111J9464m6177J4731K6446l0282j594K3082k098j2399j455J8850
$$ 10309 -28694 5417 24881 -21296 -6565 19881 -10401 -11995 11087 8989 -3410 -4865 13985
598A3985q663k5469L0951O663m0248K2447J7431l3024J0243J7599j6097j503K116
$$ 13985 5322 -20147 10804 17467 -22781 -334 17097 -15927 -5684 11915 -4182 -5685 -3569
611c569O252K61j5740K0096Q518l3259J7681J9618l0342P573J7956j8757l057
$$ -3569 2683 2944 -12796 7300 15818 -17441 240 19858 -10484 -2911 15045 -3712 -6769
624f769P735K876k596j1569J6676K637l1166K0111J8196l3306J4008K1593k6895
$$ -6769 966 3842 1246 -10323 6353 8990 -22176 -2065 16131 -17175 -3167 18426 -8469
637h469K918J5451r618j668P11O291P62j7777J5373J0448k8506J1941J4664k6146
$$ -8469 -5551 9900 282 -1386 -675 5616 6378 -11399 3974 14422 -14084 -2143 12521 -13625
651a3625P793J5084j4740K747L648k009L804j0876J0104J1383k3273R840J5480
$$ -13625 -5832 9252 -5488 -2741 907 -1102 2702 -8174 1930 13313 -9960 -120 15360
664A5360k5259P323J6715j8795K268P584q101J633m681N310P825j8010Q639J3434
$$ 15360 -9899 -2576 14139 -4656 -2388 5196 -2905 -1272 -5953 -643 7182 -10828 -2189 11245
678A1245k4082R527J6861k2589O313J3637j3750K957L651k585M495j1084M231
$$ 11245 -12837 -3310 13551 -9038 -2725 10912 -2838 119 3770 1185 5680 -5404 -1173
691a173J0220j8129P663J3219k2998O303J2733j7039O253P840p739N365m939m41
$$ -1173 9047 -9082 -1419 11800 -11198 -4895 7838 -9201 -2948 4892 -2847 2518 -2421 -2862
705b862J1078j2832M506J3386j9542L506J4143j7876L774J0146j1262L217o72
$$ -2862 8216 -4616 -110 13276 -6266 -2760 11383 -6493 -2719 7427 -3835 -618 -1290
718a290l000Q091r702K417J1593j7315N175J5536j8694N192J3206j5697M086N987
$$ -1290 -4290 3801 -5901 -3484 8109 -9206 -4031 11505 -7189 -1997 11209 -4488 -402 5585
732E585q376P425m330l158R161j2096J420J3001j5742K925J1807j5348M155P875
$$ 5585 -2791 4634 304 -2854 6307 -5789 -4369 8632 -7110 -4185 7622 -7726 -3571 4304
746D304r700Q162r14n205J0665r443j488J4550j4736J81J4711j5623J554J0268
$$ 4304 -5396 2766 1852 -3353 7312 -2131 -3619 10931 -3805 -3624 11087 -4536 -2982 7286
760G286j2522L573L884p913P254l516l042J1178j0382j18J3244j3289J889J1262
$$ 7286 -5236 -1663 2221 -5692 1562 -1954 -4996 6182 -4200 -4318 8926 -4363 -2474 8788
774H788j3135M667O725j1160P407j09q444J0535p159n017J3515j0493j876J2414
$$ 8788 -4347 320 7045 -4115 3292 3183 -5261 5274 -1885 -6902 6613 -3880 -5756 6658
788F658j1414J267Q344j0355N489L286p402R517l776n017J2263r597l477J2500
$$ 6658 -4756 -3489 4855 -5500 -11 3275 -4127 5390 1614 -3403 8860 -737 -4214 8286
802H286j1890j45J0815j2283L522O097j0770O667Q82q150J0157l815n052J2789
$$ 8286 -3604 -3749 7066 -5217 -1695 4402 -6368 299 1181 -6969 3188 -627 -5679 7110
816G110p839k097J0634j0412J864O969j0141N501K836r142Q973l409p360J1217
$$ 7110 -729 -2826 7808 -2604 -740 6229 -3912 1589 4425 -4717 4256 847 -6513 4704
830D704o838m653J2135r079l15J0612j0700L187O449r682O338J642q089R895l761
$$ 4704 -2134 -6787 5348 -3731 -4046 6566 -4134 -947 5502 -4180 2158 3800 -4289 5606 1845
845A845n927J0979q023l115R711j0070J036P930j0014N470L338r448R298j915
$$ 1845 -4082 6897 -1126 -4241 5470 -4600 -3564 4366 -5648 -178 3160 -6288 3010 1095
859A095p695J2078n356m625J2569q394j724R507r468J063N267q919N975L12p643
$$ 1095 -6600 5478 122 -4503 8066 -328 -2052 7455 -2013 -950 4317 -4602 1373 1685 -5958
874e958R981m366o266J1484p028l829J1250q013j51Q609q001L902L038q639Q405
$$ -5958 4023 -343 -6609 4875 -2153 -5982 5268 -2745 -2896 5713 -2288 1614 4652 -3987 4418
889D418k198p588J0721m847o340J1683o443m445Q740p187O73M433o692P185N02
$$ 4418 2220 -5368 5353 506 -5834 5849 -594 -5039 3701 -3486 -2813 1620 -5072 2113 2615
904B615q206J1050l847p799J2497n120o102J1610o097k271N589o542L058J334
$$ 2615 -5591 5459 1612 -6187 6310 1190 -4912 6698 601 -1670 3919 -2623 435 1769
918A769p950Q409j811q264J2305l954p701J1895m086m774Q168m984J074L397o836
$$ 1769 -6181 2228 417 -7847 4458 504 -7197 4698 612 -4162 4006 -978 96 3493 -3343
933c343P828l78r704J1108l100j0635J1875k797p501R692k757k927M050n942M783
$$ -3343 4485 4107 -5597 5511 2411 -8224 3651 854 -6647 3045 288 -2639 1411 -4531 252
948B52J283p993J1070o18j0092J1944k075j0017J0263j576n452N884l734Q95J883
$$ 252 1535 -6458 4612 3994 -6098 5846 3771 -6246 4017 2441 -3011 2873 -861 34 1917
963A917p855P903K50j0111J1097K76j1827J0462K58p118P716r52j462K575o472
$$ 1917 -5938 1965 2215 -7896 3201 3477 -8350 2112 2370 -4748 2968 2016 554 3129 -3343
978c343N710R02r979J0815J117j2324J0088Q9j1046Q050O71l979M958l465K782
$$ -3343 2367 3269 -6710 4105 5222 -7102 2986 3075 -7971 79 750 -3229 1729 -1736 1046
993A046K111r392Q156K001j0385J0999K124j1595Q112L27p666N789j827J81K955
$$ 1046 3157 -6235 1921 3922 -6463 4536 6660 -4935 3177 3504 -4162 1627 -200 -19 2936
1008B936p346M808K163j0961R753L779j2027R040J893r595O266O57k546M703m065
$$ 2936 -4410 398 2561 -8400 1353 5132 -6895 2145 4038 -5557 709 1366 -1180 3523 -542
1023e42K752K139r778O150L495j1343Q558L733j0538O122M53o121N021j987J086
$$ -542 2210 4349 -5429 721 4216 -7127 1431 5164 -5374 748 1201 -4920 101 -1886 -800
1038h00N047p094M334L518j1264P268M872j0288P336K637r196M169q44k784N268
$$ -800 4247 -2847 1487 5005 -6259 1009 5881 -4407 2929 5566 -3630 539 -305 -3089 2179
1053B179m535K519L647r681M921M189r866P220M643q798O073L02o225N476k570
$$ 2179 -2356 163 3810 -5871 -950 3239 -6627 593 5236 -3562 2511 2813 -3412 2064 -506
1068e06L00N105o629K325M327j0795M616M155q448O070K466o834N143k006l024
$$ -506 -206 4899 -1730 595 4922 -5873 -1257 2898 -5550 520 2986 -3848 1295 -711 -3735
1083c735N779l986J897N833p971K842M089j0114N909M734q269N444J85o648M589
$$ -3735 2044 -1942 -45 5788 -2183 659 4748 -5366 543 5277 -2992 2452 2637 -4011 578
1098E78k543j188N919n374K183M265q743M313L774q025O559K841p276O066j159
$$ 578 -1965 -3153 2766 -2608 -425 3840 -4903 -590 3184 -4841 1718 4559 -2717 3349 2190
1113B190m960N535m381M1O035o757K072L434q980M393L145o603O657J234o237
$$ 2190 -2770 2765 -1616 -1575 4460 -2297 -225 3209 -5771 -1378 1767 -4836 1821 3055 -3182
1128c182M842k848j273O105m096J594M300q715L205M239q497N272K859q085M467
$$ -3182 1660 -1188 -2461 3644 -452 1142 5442 -3273 -68 4171 -4326 946 3805 -4280 187
1143A87N74m154M565k982k94M168n325L360M628q622M884L094r062O419K895o128
$$ 187 761 -3393 1172 -1810 -2104 2064 -3261 99 4727 -3895 989 4083 -4979 1440 4335 -1793
1159a793M931k412l705M557m026J526N200p624K262L276q238N034M532o154M166
$$ -1793 3138 726 -2979 1578 -2448 -922 4278 -3346 -1084 2192 -6046 -1012 3520 -2634 1532
1174A532j4m093M863k963K62N479p201J650N700r119L077N682q555K321L138n217
$$ 1532 1518 -2575 2288 -675 -413 5066 -2135 -485 5215 -3904 -827 4855 -3700 -1379 1759 -3458
1190c458M101o68k072M053m476Q21N818p028L478N152q717K813L811n910L903
$$ -3458 643 -25 -2097 1956 -2520 -1699 4119 -2909 569 5721 -2996 -183 3628 -2282 1621
1205A621N81m329M144k909j715N444n802R93N812p396J458M976n657K694K110
$$ 1621 2202 -2127 2017 -892 -2607 2837 -2965 -1972 3840 -3556 -2098 2878 -2779 -85 2025
1220B025l766M354j789k133N311n537j76O519p484J078N945p510J168M318n418
$$ 2025 -1741 2613 824 -1309 4002 -1535 -1711 4808 -2676 -1598 4347 -3163 -1995 2323 -3095
1235c095K683Q70k817M096k808p97N935n395J86N699o408J513M149n708K759J610
$$ -3095 -412 458 -2359 1737 -1071 -1868 4067 -1328 -1142 4557 -1851 -338 3811 -1897 862 2472
1251B472m799M083j624l067N531l855k320O094m492p1N277m829R95K868m520L686
$$ 2472 -2327 1756 132 -2935 2596 -1259 -3579 2515 -1977 -2048 3229 -1600 -605 2263 -2257 1429
1267A429n8k862N080l165k629N492m665j444O497n776n3M640n466K020K757m580
$$ 1429 1371 -1491 3589 424 -2205 3287 -1378 -2822 3675 -2101 -2154 2486 -2980 -960 1797 -2783
1283b783L490k09l010N075k552j378N070m436k95M458n237J670K634n385L573
$$ -2783 707 498 -2512 2563 11 -1367 3703 -733 -1028 3430 -1807 -137 2497 -2888 685
1298F85Q60m914M673j312l374N304k645k394N650l473J2M062m428J836J702m306
$$ 685 1545 -3369 1304 -8 -3382 1922 -723 -3117 2533 -940 -928 3134 -1294 542 2244 -2062
1314b062L928q48l239N218k735k755N199m042j291N050m961R48L564m457K719
$$ -2062 1866 1018 -2221 2997 262 -2493 2706 -1336 -2627 2423 -2538 -1590 1974 -2483 236
1329B36J549l953L863l92l395M775k175j586M217l663ML281m920J922J857m594
$$ 236 1785 -2168 1695 1303 -2092 2683 508 -1078 3139 -524 -520 2761 -2159 -237 1620 -2974
1345b974L584J30m066M844j185l183N141k845j149M516l568L35L343m343K209
$$ -2974 610 740 -3326 1518 333 -2850 2291 -554 -1703 2813 -755 -420 2923 -1420 789
1360G89J327m063L428o25l634M778k537k003M645l550n02L981m122J298K777m098
$$ 789 2116 -1947 1481 856 -2778 2000 -537 -2540 2105 -1445 -1947 2034 -2088 -790 1987 -2111
1376b111L166J235m147M013q70l084M070k245j577L809l435L96K694m325K108
$$ -2111 1055 2290 -1857 2156 1286 -1798 2272 27 -1550 2259 -1176 -780 1914 -2411 -303
1391c03J369m163L672N54m082N100j745k529M779k659j087L735l839J367K374
$$ -303 1066 -3097 575 1129 -2953 2147 402 -2127 2652 -7 -1094 2641 -1198 169 2543
1406B543m318K633L80l897L743p81k962M044k239j245M157l490L53L350m291J731
$$ 2543 -1775 858 1238 -2659 1084 303 -2659 1385 -854 -2099 2058 -1432 -1079 2271 -2020 -289
1422b89K607l873L017J75l195L581j220k573L772k807r06L695m019Q29K938m292
$$ -289 2318 -1555 1462 1637 -1558 2023 803 -1770 2002 -805 -1711 1984 -2035 -1206 1732 -2560
1438b560K104J709l768L435K96l138L805j328j699M043l333p7L189m044P84K162
$$ -2560 -456 1253 -2515 920 1216 -1922 1883 555 -1144 2899 -434 -511 2678 -1366 -582 1580
1454A580l652K406L53k995L111j391j849M084k563p30M489l917L17L478l729J371
$$ 1580 -2072 334 687 -2308 803 -588 -2437 1647 -916 -1646 2843 -1074 -757 2721 -1008 363
1470C63J634l317K541j02k413K986k031j822M339l715k66L666l234M45K509l518
$$ 363 1997 -1320 1221 1119 -1294 1692 -339 -2161 2178 -1537 -1803 1863 -1371 -926 1583 -1935
1486a935K092R42k792L738j308k282M197k727j645M695l421q94L230k880qJ826
$$ -1935 157 1099 -1693 2045 737 -1545 2652 -75 -1720 2975 -446 -1340 1890 -990 -998 828
1502H28k743K227m66j951L705k166k109N148k847j124M299k945l80K591k800J235
$$ 828 -1915 312 -154 -2105 1600 -566 -2675 2473 -374 -1498 2801 -144 -524 2067 -733 502
1518E02O35k891L184j404k620M535k443k284M647k646j325L422j727O76Q27k790
$$ 502 1137 -1754 1430 26 -2594 1941 -502 -2786 1861 -785 -2110 1312 -415 261 1088 -1702
1534a702K808j93k791M906j608l421M419k326k632M157j353q66J319k604J706
$$ -1702 1106 913 -1878 3028 1420 -2001 2418 92 -2540 1617 264 -602 717 -1887 -181
1549a81J19k301M130j097l203M347j302k686M212j180j567K197j842L57R65k219
$$ -181 -62 -2363 1767 670 -2533 1814 512 -2174 2038 858 -709 1488 -354 3 968 -1251
1565a251K859r43l838M167l60l327M051p12k863K605j091O91J420k199K215l24
$$ -1251 1608 665 -3173 994 634 -2693 1358 646 -2217 388 -703 -12 1408 -791 1424 1100
1581A100l735M526j73l728M368j079l639K989n29j291K128k282R23P69k831L438
$$ 1100 -2635 1891 1718 -2010 2358 1279 -2360 629 100 -1191 937 -1345 -422 347 -2484 954
1597I54J68l588L923j99l520M189n53k129K073j687m0J807k555J972L38m108L397
$$ 954 1122 -2466 1457 1258 -2262 1927 1374 -755 1318 -369 -409 1398 -1157 815 1153 -2955 442
1614D42M78l678L422L94l215K765m71q74J776j901J459J093l558L096J014m632
$$ 442 920 -2758 664 1058 -2157 608 137 -737 1039 -862 597 1690 -1868 1228 2242 -2390
1630b390L666K07l816L147j81j923J835j525r6J623k235K084J240l562K822O68
$$ -2390 1276 1483 -2333 814 633 -1290 545 -980 -1076 547 -1688 396 1636 -1926 896 1564
1646A564l797L460N16k349K282j426j010K185k643J145J895m103J908J517l928
$$ 1564 -2233 1227 1743 -606 1676 250 -760 1425 -1218 -73 1822 -2281 -373 1144 -2784
1661b784K903J091l223K670l37j355K169j354J28J568l082K252J751l676K261
$$ -2784 119 1210 -2013 657 320 -1035 1134 -220 -92 1476 -1606 646 2397 -1279 982
1676I82P94l923K440L33k384K666j271r87K148k039Q24K244l162J695J431l409
$$ 982 1776 -2147 293 626 -1758 908 -363 -1350 798 -1241 -417 1827 -1335 360 1791 -1618
1692a618K323O37k455K627n83k029K445k147Q5K170l032N55K204l231J909J608
$$ -1618 705 1342 -1113 1514 931 -1098 1347 -800 -715 1455 -1577 -1022 1182 -2049 -140 1468
1708A468l463K065J026k437K360l63j361K508k130m9K275l062J490J129l317K307
$$ 1468 -1995 70 1096 -1341 1019 656 -705 1803 -327 -376 1899 -1163 327 1456 -1861 446
1724D46M52l029K336j82j889K572j201o40K836k394L96K215k972J396J408k834
$$ 446 898 -2131 205 23 -1866 706 -495 -1135 1701 -693 -297 1918 -1054 342 1750 -1084
1740a084J625M77k181K400j002j489K400k122m11K591k915R37K371l205J607J163
$$ -1084 541 1018 -1163 1237 235 -1254 1146 -976 -1387 1204 -1711 -774 1597 -1608 -1 1162
1756A162k847K375J87k109K597r87j271K674k318J89K185l319J255J538k978J969
$$ 1162 -1685 690 877 -1232 1365 378 -893 1781 -537 -348 1837 -1482 -227 1311 -1667 302
1772C02J67k146K581r67j349K792j890l60K833k485N85J867k736J225J006k920
$$ 302 469 -1677 904 -63 -1412 1380 -510 -870 1963 -522 63 1930 -806 419 1425 -1495
1788a495K271k78k029K575j465r97K326k065j13K502k852J231J970k736J769P99
$$ -1495 776 498 -1531 1044 -421 -1418 908 -1157 -1270 1232 -1620 -389 1581 -1155 614 1413
1804A413k436J943j49j445K126j603q56K652k627K37J859k656J071J239k562K380
$$ 1413 -1023 920 771 -674 1452 -151 -1007 1645 -982 -745 1114 -1542 -471 768 -1794 586
1820E86K4k122K360o64j317K357j601k80K821k500J67J996k927J425N31k272J922
$$ 586 610 -1512 848 184 -1133 1224 -377 -657 2164 -336 -169 1827 -1100 325 856 -1416 506
1837E06m13j708K310j101j126K878k341J89K268k573Q80J547k062J421L96j993
$$ 506 93 -1615 695 -406 -1532 1346 -995 -806 1462 -1111 -231 1316 -746 675 1071 -922
1853i22J981p40j788K677j581p66K311k296K44J905k436J424O64j977J731K12
$$ -922 1059 319 -1469 1208 -373 -1139 1172 -1124 -880 1025 -1411 13 677 -1300 431 643
1869F43j736K549j046j243K587j970j11J922k458N45J393k480J491M83k188K101
$$ 643 -1093 1456 410 -833 1754 -216 -327 1595 -863 -318 1075 -1405 86 569 -1619 482
1885D82o46j405K604j463o50K785k243q2K220k224R74Q17j978J622p4j894K335
$$ 482 -164 -1569 1035 -428 -1078 1707 -536 -618 1602 -622 352 1169 -809 813 739 -1155 1180
1902A180j486j278K866j852r10K628k308N11J607j987J418L46k033K293m56j348
$$ 1180 -306 -1584 1282 -570 -1480 1148 -1160 -649 958 -1029 389 735 -1298 995 539 -809
1918h09K581j702j093K366j699o97K334k631O66J367k111J681j91j611K482r78
$$ -809 1772 70 -1023 1343 -356 -1053 1281 -1350 -684 683 -1428 253 62 -1549 933 -45
1934d5j296K993j758j012K869j799k03J586j558L22O47j674J427k25j829K929
$$ -45 -1341 1652 -106 -1118 1751 -48 -251 1335 -223 99 746 -928 499 274 -1555 1374
1950A374j800j558L005j440q17K267j261j7R78j526J439K8j785K519q95j968K945
$$ 1374 -426 -1984 1021 -419 -1236 1031 -230 -247 731 -795 644 672 -1113 1406 511 -1457 1488
1967A488r75j927K543j474p94J437j496J163J70j566K393q31j708K990q42j941
$$ 1488 513 -1414 1129 -345 -1139 298 -1198 -35 135 -1431 962 131 -1577 1413 571 -1370
1983a370L092j334j502K231j265M33N55j503J034l76j852K830r79k106L136j019
$$ -1370 1722 388 -1114 1117 -148 285 840 -663 371 -5 -1857 973 -6 -2112 1024 5
1999Ej644K519j101n07J535j197R13O5j447K126p93j867K837r06k120K138l24
$$ 5 -1639 880 -221 -728 807 -390 523 588 -859 1267 474 -1393 1444 538 -1582 556 232
2016B32j323J479p29p7M65j050J830l97k219K919m28k427L234n11j953K044q87
$$ 232 -1091 388 -341 -418 47 -1003 827 430 -1789 1130 702 -1725 1509 998 -955 1089 202
2033B02p22R49q41P74J85j957J911l32k360K938L5k486K340j39j255J143l82O6
$$ 202 -520 429 -412 362 547 -1410 501 169 -2191 747 782 -1704 636 497 -758 385 3 69
2051F9J023j301J233j63k269K135J46k546K326m9k154J736l90n16R50j122J355
$$ 69 1092 -209 1024 861 -1408 727 873 -1673 653 604 -1550 186 -204 -720 230 -892 463
2068D63J78k249K386K54k665K633K19k538J992J47j320P97n17K70N06k101J944
$$ 463 641 -1608 778 1032 -1633 1000 1219 -1319 673 820 -500 297 -220 50 556 -1545 399
2085C99N09k785K188N08k768K503O55k129J832o05m80Q73j339J303P22k313J524
$$ 399 908 -1877 311 819 -1949 554 1209 -920 912 307 -173 700 -639 664 1386 -927 597
2102E97L56k854K084P37k029J178R7j202J073m37M13P99j770J496M35k312K093
$$ 597 953 -1901 183 920 -1109 69 166 -1036 37 -400 13 812 -958 538 973 -1339 754
2119G54N50k773K053L19j805J182j13o23N96r78P76Q22k274J850L99k437J944
$$ 754 1304 -1469 584 903 -902 280 167 -456 140 -838 -62 760 -1514 336 735 -1702 242
2136B42M33j682J605Q2q08P50q19L82P00j636R80R35k583J169J076k117J234N45
$$ 242 675 -1007 598 680 -128 622 -197 185 885 -751 229 1164 -1419 -250 826 -1291 -57 488
2154D88j361J092l70k84J124j638J340Q38k316J768R09k716J258J242k326J328
$$ 488 -873 219 -151 -435 689 -949 391 1229 -1087 681 1590 -1126 132 1374 -952 376
2170C76N0j041Q50q26M62O32j787J101R68j975J248J198k299J462K97j097Q71
$$ 376 426 -615 235 -591 -129 503 -1284 -183 785 -1190 58 1256 -1043 419 716 -381 490
2187D90j03n48J242j479O32P42k307R57J109k262J396J033j904J124M7j000J296
$$ 490 387 -161 1081 -398 234 976 -1331 -374 735 -1527 -131 902 -1002 122 169 -831 465
2204D65q88P61Q62j828Q54J198k238J048P50k095J161L25r44P57l37l68R45j103
$$ 465 -423 338 1200 -628 226 1424 -814 234 984 -1111 50 375 -569 188 -149 -517 428 -675
2222f75M32J289j992P26J321k001O78Q49j121Q97k24l89J099j159j75J361j781
$$ -675 -243 1046 -946 -220 1101 -900 -222 627 -494 403 179 -210 889 -270 -445 916 -865
2239h65N39J294k082N88J220j644O76M90q07R54l78k78J160j318M18J072j809
$$ -865 -326 968 -1114 -526 694 -950 -274 216 -591 363 -15 -293 867 -451 -33 1039 -770
2256g70R64Q83j423L54O79j507J023o15m35R52k85m28J350j420J86J700k090P08
$$ -770 194 1077 -346 8 687 -820 203 -412 -847 105 -180 -608 742 -678 -492 1208 -882 -174
2274a74J211j504N75P27j183J142q09n76J322j284j15J589j722R4J235j391M99
$$ -174 1037 -467 108 835 -348 794 -15 -591 731 -553 -668 921 -801 -707 528 -863 -364
2291c64Q93j300J201p8q38J212o80m40J334j217l63J629j648K52J168j360L46
$$ -364 529 -771 430 352 -486 726 46 -394 940 -277 -640 989 -659 -407 761 -599 -253
2308b53M62j069J009k93o88J765j296j77J582j645L13R34r93N45N79j214P26l5
$$ -253 209 -860 149 -144 -832 933 -363 -540 1042 -603 -290 644 -349 196 775 -439 287 252
2326B52r92J308n67q09J321r15m72J423j242K49J142j291O19M25j208J478m67
$$ 252 -740 568 1 -808 513 -402 -874 549 -693 -444 698 -593 26 451 -757 721 254
2343B54q92J678r19n60J160j107p2Q63j049M16O45j316O79K02q54J162k44n00
$$ 254 -638 1040 121 -439 721 -386 -458 405 -644 -228 417 -899 -220 -18 -872 290 46 -454
2361d54J217j095k30J430j043J88P65j215L08P03j302J045k72j001J125l42o73
$$ -454 763 -332 -562 868 -175 13 778 -437 -129 574 -728 317 45 -956 169 -173 -846
2378h46J449q93j38J371j297K09N59p75P21M50j219R92o79m80J251p14p16J280
$$ -846 603 -290 -428 943 -354 -145 414 -361 360 810 -409 583 -96 -576 675 -39 -755 525
2396E25j085N0Q36o89L39J34q65R73J1j204J715o12p36J388n60n08J084o44l36
$$ 525 -560 -510 326 -363 -24 110 -755 218 229 -975 740 128 -608 780 220 -288 796 152 -184
2415a84M57p47N87j40o80J121p78n35J437q23k91J186o76j80R96q12K47J18p62
$$ -184 273 -474 113 -27 -707 414 -364 -899 538 -285 -576 610 -66 -246 750 -62 185 303 -459
2434d59J015k53r92J623j017p38J299p24m85J235j001K53N01j054P71p6l26J301
$$ -459 556 303 -689 934 -83 -821 478 -246 -731 504 -497 -244 257 -797 -26 -102 -428 873
$$ [...]
8191A01
##END NTUPLES=NMR FID
##END=
