##TITLE=1H_LR-798-RM1
 200.13MHz, CDCl3,
 8 sc
 
 6.3.2025
##JCAMPDX= 6.0         $$ Bruker NMR JCAMP-DX V2.0
##DATA TYPE= NMR FID
##DATA CLASS= NTUPLES
##ORIGIN= UXNMR, Bruker Analytische Messtechnik GmbH
##OWNER= pz
$$ XWIN-NMR		Version 3.5
$$ Thu Mar  6 16:49:43 2025 Russian Standard Time (UT+4h)  she@DPX200
##.OBSERVE FREQUENCY= 200.1313
##.OBSERVE NUCLEUS= ^1H
##.DELAY= (6, 6)
##.ACQUISITION MODE= SIMULTANEOUS
##.ACQUISITION SCHEME= undefined
##.AVERAGES= 8
##.DIGITISER RES= 18
##SPECTROMETER/DATA SYSTEM= spect
##.PULSE SEQUENCE= zg30
##.SOLVENT NAME= CDCl3
##.SHIFT REFERENCE= (INTERNAL, CDCl3, 0, 14.3821)
##AUDIT TRAIL= $$ (NUMBER, WHEN, WHO, WHERE, WHAT)
$$ ##TITLE= Audit trail, XWIN-NMR		Version 3.5
$$ ##JCAMPDX= 5.01
$$ ##ORIGIN= Bruker BioSpin GmbH
$$ ##OWNER= she
$$ F:/spectra/data/she/nmr/H-C/1/audita.txt
$$ ##AUDIT TRAIL=  $$ (NUMBER, WHEN, WHO, WHERE, WHAT)
(   1,<2025-03-06 16:48:41.71 +0400>,<she>,<DPX200>,
      <created by zg, POWCHK disabled, PULCHK disabled
       configuration hash MD5:
       00 E9 B6 7A A2 85 ED C7 34 08 36 98 17 FE 4E 26
       data hash MD5: 16K
       7D 8A 02 DD 36 25 E7 65 14 7E E0 9D 96 12 CA 24>)
$$ ##END=
$$ 
$$ hash MD5
$$ 0B C6 D8 A0 FE 2D CE 27 A8 7D 69 F2 7A 78 26 38
##$RELAX= 
##$RELAX= 
##$RELAX= 
##$RELAX= 
##$RELAX= 
##$RELAX= 
$$ Bruker specific parameters
$$ --------------------------
##$DU= <F:/spectra>
##$EXPNO= 1
##$NAME= <H-C>
##$PROCNO= 1
##$TYPE= <nmr>
##$USER= <she>
##$AMP= (0..31)
100 100 100 100 100 100 100 100 100 100 100 100 100 100 100 100 100 100 
100 100 100 100 100 100 100 100 100 100 100 100 100 100 
##$AQSEQ= 0
##$AQ_mod= 1
##$AUNM= <au_zg>
##$AUTOPOS= <>
##$BF1= 200.13
##$BF2= 200.13
##$BF3= 200.13
##$BF4= 200.13
##$BF5= 200.13
##$BF6= 200.13
##$BF7= 200.13
##$BF8= 200.13
##$BYTORDA= 1
##$CFDGTYP= 0
##$CFRGTYP= 5
##$CHEMSTR= <none>
##$CNST= (0..31)
1 1 145 1 1 1 1 1 1 1 1 1 1 1 1 1 1 1 1 1 1 1 1 1 1 1 1 1 1 1 1 1 
##$CPDPRG= <>
##$CPDPRG1= <>
##$CPDPRG2= <>
##$CPDPRG3= <>
##$CPDPRG4= <mlev>
##$CPDPRG5= <mlev>
##$CPDPRG6= <mlev>
##$CPDPRG7= <mlev>
##$CPDPRG8= <mlev>
##$CPDPRGB= <>
##$CPDPRGT= <>
##$D= (0..31)
0 0.7 0 0 0 0 0 0 0 0 0 0.03 0 0 0 0 0 0 0 0 0 0 0 0 0 0 0 0 0 0 0 0 
##$DATE= 1741265321
##$DBL= (0..7)
120 120 120 120 120 120 120 120 
##$DBP= (0..7)
150 150 150 150 150 150 150 150 
##$DBP07= 0
##$DBPNAM0= <>
##$DBPNAM1= <>
##$DBPNAM2= <>
##$DBPNAM3= <>
##$DBPNAM4= <>
##$DBPNAM5= <>
##$DBPNAM6= <>
##$DBPNAM7= <>
##$DBPOAL= (0..7)
0.5 0.5 0.5 0.5 0.5 0.5 0.5 0.5 
##$DBPOFFS= (0..7)
0 0 0 0 0 0 0 0 
##$DE= 6
##$DECBNUC= <off>
##$DECIM= 32
##$DECNUC= <off>
##$DECSTAT= 4
##$DIGMOD= 1
##$DIGTYP= 9
##$DL= (0..7)
0 120 120 120 120 120 120 120 
##$DP= (0..7)
150 150 150 150 150 150 150 150 
##$DP07= 0
##$DPNAME0= <>
##$DPNAME1= <>
##$DPNAME2= <>
##$DPNAME3= <>
##$DPNAME4= <>
##$DPNAME5= <>
##$DPNAME6= <>
##$DPNAME7= <>
##$DPOAL= (0..7)
0.5 0.5 0.5 0.5 0.5 0.5 0.5 0.5 
##$DPOFFS= (0..7)
0 0 0 0 0 0 0 0 
##$DQDMODE= 0
##$DR= 18
##$DS= 0
##$DSLIST= <SSSSSSSSSSSSSSS>
$$ [...]
##$SUBNAM0= <"">
##$SUBNAM1= <"">
##$SUBNAM2= <"">
##$SUBNAM3= <"">
##$SUBNAM4= <"">
##$SUBNAM5= <"">
##$SUBNAM6= <"">
##$SUBNAM7= <"">
##$SUBNAM8= <"">
##$SUBNAM9= <"">
##$SW= 18.0517328524113
##$SWIBOX= (0..15)
0 0 2 0 0 0 0 0 0 0 0 0 0 0 0 0 
##$SW_h= 3612.71676300578
##$TD= 16384
##$TD0= 1
##$TE= 0
##$TE2= 300
##$TE3= 300
##$TEG= 300
##$TL= (0..7)
0 120 120 120 120 120 120 120 
##$TP= (0..7)
150 150 150 150 150 150 150 150 
##$TP07= 0
##$TPNAME0= <>
##$TPNAME1= <>
##$TPNAME2= <>
##$TPNAME3= <>
##$TPNAME4= <>
##$TPNAME5= <>
##$TPNAME6= <>
##$TPNAME7= <>
##$TPOAL= (0..7)
0.5 0.5 0.5 0.5 0.5 0.5 0.5 0.5 
##$TPOFFS= (0..7)
0 0 0 0 0 0 0 0 
##$TUNHIN= 0
##$TUNHOUT= 0
##$TUNXOUT= 0
##$USERA1= <user>
##$USERA2= <user>
##$USERA3= <user>
##$USERA4= <user>
##$USERA5= <user>
##$V9= 5
##$VALIST= <valist>
##$VCLIST= <CCCCCCCCCCCCCCC>
##$VD= 0
##$VDLIST= <DDDDDDDDDDDDDDD>
##$VPLIST= <PPPPPPPPPPPPPPP>
##$VTLIST= <TTTTTTTTTTTTTTT>
##$WBST= 1024
##$WBSW= 4
##$XGAIN= (0..3)
0 0 0 0 
##$XL= 0
##$YL= 0
##$YMAX_a= 432671
##$YMIN_a= -523665
##$ZGOPTNS= <>
##$ZL1= 120
##$ZL2= 120
##$ZL3= 120
##$ZL4= 120
##$ABSF1= 10
##$ABSF2= 0
##$ABSG= 5
##$ABSL= 3
##$ALPHA= 0
##$AQORDER= 0
##$ASSFAC= 0
##$ASSFACI= 0
##$ASSFACX= 0
##$ASSWID= 0
##$AUNMP= <proc_1d>
##$AZFE= 0.1
##$AZFW= 0.1
##$BCFW= 1
##$BC_mod= 2
##$BYTORDP= 1
##$COROFFS= 0
##$CY= -3
##$DATMOD= 1
##$DC= 2
##$DFILT= <>
##$DTYPP= 0
##$F1P= 0
##$F2P= 0
##$FCOR= 0.5
##$FTSIZE= 0
##$FT_mod= 4
##$GAMMA= 1
##$GB= 0.15
##$INTBC= 1
##$INTSCL= 1
##$ISEN= 128
##$LB= 0.25
##$LEV0= 0
##$LPBIN= 0
##$MAXI= 10000
##$MC2= 0
##$MEAN= 0
##$ME_mod= 0
##$MI= 1.114404
##$NCOEF= 0
##$NC_proc= 0
##$NLEV= 6
##$NOISF1= 3.799351
##$NOISF2= 2.8
##$NSP= 1
##$NTH_PI= 0
##$NZP= 0
##$OFFSET= 14.38212
##$PC= 1
##$PHC0= -465.1172
##$PHC1= 9.992219
##$PH_mod= 1
##$PKNL= yes
##$PPARMOD= 0
##$PSCAL= 0
##$PSIGN= 0
##$REVERSE= no
##$SF= 200.129724274929
##$SI= 16384
##$SIGF1= 3
##$SIGF2= 2
##$SINO= 400
##$SIOLD= 16384
##$SREGLST= <1H.CDCl3>
##$SSB= 0
##$STSI= 0
##$STSR= 0
##$SW_p= 3205.1282051282
##$SYMM= 0
##$S_DEV= 0
##$TDeff= 0
##$TDoff= 0
##$TI= <>
##$TILT= no
##$TM1= 0
##$TM2= 0
##$TOPLEV= 0
##$USERP1= <user>
##$USERP2= <user>
##$USERP3= <user>
##$USERP4= <user>
##$USERP5= <user>
##$WDW= 1
##$XDIM= 8192
##$YMAX_p= 0
##$YMIN_p= 0
$$ End of Bruker specific parameters
$$ ---------------------------------
##NTUPLES= NMR FID
##VAR_NAME=  TIME,          FID/REAL,        FID/IMAG
##SYMBOL=    X,             R,               I
##VAR_TYPE=  INDEPENDENT,   DEPENDENT,       DEPENDENT
##VAR_FORM=  AFFN,          ASDF,            ASDF
##VAR_DIM=   8192,          8192,            8192
##UNITS=     SECONDS,       ARBITRARY UNITS, ARBITRARY UNITS
##FACTOR=    0.0002768,     1,               1
##FIRST=     0,             0,               0
##LAST=      2.2672688,     0,               0
##MIN=       0,             -523665,         0
##MAX=       2.2672688,     432671,          0
$$ Real data points
##PAGE= N=1
##DATA TABLE= (X++(R..R)), XYDATA
0@%%%%%%%%%%%%%%%qJ6j6J6j6J9k7L2l2L6m4N0n5O3p2Q2r3J03j15J31j48J61j77
$$ 0 0 0 0 0 0 0 0 0 0 0 0 0 0 0 0 -8 8 -8 8 -8 11 -16 16 -16 20 -24 26 -29 34 -38 44 -49 54 -61 70 -78 83 -94
38i4K00k22K44k70K97l26L59l94M32m75N21n74O34o98P70q53R48j057J185j335
$$ -94 106 -116 128 -142 155 -171 188 -206 226 -249 272 -302 332 -366 404 -449 499 -558 627 -708
58g08J518j744K026k390K877l560M569o170Q986j4793L0796j45210l99862O28973
$$ -708 810 -934 1092 -1298 1579 -1981 2588 -3582 5404 -9389 21407 -123803 -523665 105308
72A05308J33384n29969L26792L83527n09329j63224M16638j46683k67151L62598
$$ 105308 238692 -291277 35515 419042 -90287 -253511 163127 16444 -250707 111891
82A11891J26638l80732K8587K67413j70192j56703J97482P6077j35993q159J15145
$$ 111891 238529 -142203 -113616 153797 -16395 -173098 24384 100461 -35532 -43691 71454
93G1454k3306j53620M5647J72759j07029j01479K21736j199k72818R3937J64603
$$ 71454 48148 -105472 -59825 112934 5905 -95574 126162 124963 -147855 -53918 110685
104A10685k18584j303L12395j16786k63528K15630O8909l35503J11363L56025
$$ 110685 -107899 -109202 203193 86407 -177121 38509 107418 -228085 -116722 239303
114B39303j95241j74785K48028n5217k47889J69230J44296j71133J5066J54339
$$ 239303 44062 -130723 117305 62088 -185801 -16571 127725 -43408 -28342 125997
124A25997j05770j28908J06537N7407j12604N608J26573k5542j09686K3852N8153
$$ 125997 20227 -108681 -2144 55263 -57341 -51733 74840 49298 -60388 -36536 21617
135B1617n0861k4764J13176L2108j39378J266J17583j01461o5973J93789n068
$$ 21617 -29244 -54008 59168 91276 -48102 -46836 70747 -30714 -96687 97102 92034
146I2034j85048J03466R3817j95568p124J95646q1635j29064J67613N2337j98797
$$ 92034 -93014 10452 104269 -91299 -98423 97223 15588 -113476 54137 106474 -92323
157i2323L0339J52072j23366o2193J77330j6409j32857Q8321N0591j22122K687
$$ -92323 -61984 90088 -33278 -95471 81859 65450 -67407 20914 71505 -50617 -47930
168d7930R6573k9490m9434M8351J8203o9141j4871N8249N40k8653K7183J4109
$$ -47930 48643 19153 -30281 18070 36273 -32868 -47739 10510 11050 -17603 9580 23689
180B3689m3329k0997M0389L0561l1904M30M8864m3657n5131P0508J3613p5238
$$ 23689 -19640 -40637 -248 30313 -1591 -1161 47703 4046 -51085 19423 33036 -42202
192d2202M4488N4115p6736j7017P1928l1393o3850N6958M0716o4239P763O9074
$$ -42202 2286 56401 -20335 -37352 34576 3183 -60667 -3709 37007 -27232 -19469 49605
204D9605m9537m6020P0343j131n9237M6702L3602n3835m159L5947j8586k5604
$$ 49605 68 -45952 24391 23260 -35977 10725 44327 -9508 -13667 22280 3694 -21910
216b1910K2173J7395k7888r393K8268j0576k4570K7997J5597k5000l03J6879m110
$$ -21910 263 17658 -10230 -19623 8645 -1931 -26501 1496 17093 -7907 -8210 8669 4559
229D559j4246R185K0769j4430j2813K7173r390l3140K4762J2414l2968Q526K3621
$$ 4559 -9687 -502 20267 5837 -6976 20197 10807 -22333 2429 14843 -18125 -9599 14022
242A4022j8458j1349J5847K512j5531N329J8564j1647q329K5216n507k1690J8154
$$ 14022 -4436 -15785 62 2574 -12957 -7628 10936 -711 -9040 16176 10669 -11021 7133
255G133O817j7835N475O978r104k823J122J459k521l706P018m282q305J3387K502
$$ 7133 13950 -3885 1590 8568 -536 -3359 -2237 -778 -3299 -7005 13 -4269 -12574 813 3315
270C315j0762O661N618j664J919l105J513L362n955K922J701q437N618Q35j2556
$$ 3315 -7447 -786 4832 3168 5087 1982 3495 6857 902 3824 5525 -2912 2706 3541 -9015
285i015L958O847n110k796j372M695M084m527K708J876l717J0550l79j2028R726
$$ -9015 -5057 1790 -3320 -6116 -7488 -2793 1291 -3236 -528 1348 -2369 8181 7802 -4226 5500
300E500M563j1435J916K965l059K865n127n504L700K266m54m931k805J0541J400
$$ 5500 10063 -1372 544 3509 450 3315 -1812 -7316 -3616 -1350 -1804 -6735 -9540 1001 2401
315B401n540M377k34J1O432o797j695R492l601l472J816m444L351J009j0767N43
$$ 2401 -3139 1238 1004 1015 7447 650 -1045 8447 4846 1374 3190 -1254 2097 3106 -7661 -7118
331g118N197k37J060l414q70O460n95j860k4o88P971Q69q022O572L462o947M63
$$ -7118 -1921 -2158 -1098 -4512 -5382 1078 483 -1377 -1401 -2089 5882 6751 -1271 5301 8763 1816 2279
348B279l096l698O989j615o346K196J377K306k009o975M914M285m490M001L761
$$ 2279 -817 -4515 2474 859 -5487 -3291 -1914 392 -1617 -8592 -3678 607 -3883 118 3879
363C879k293M522O95n260j179J106K952m375n300R615J115j1922M941K358j1246
$$ 3879 1586 6108 6803 1543 364 1470 4422 47 -5253 4362 5477 -6445 -1504 854 -10392
378a0392N898N870q018J525R849O2o408P92Q125m087p421R740P20r438O878M486
$$ -10392 -4494 1376 -6642 -5117 4732 4794 -1614 -822 7303 3216 -4205 5535 6255 -3183 3695 8181
394H181j1305K53N385m878o457J780R220k763p504J0613L525j2873N606Q859j2159
$$ 8181 -3124 -2871 2514 -2364 -8821 -7041 2179 -584 -8088 2525 6050 -6823 -1217 7642 -4517
409d517m84J5841j756j1727N664J0035j4763j1180J7715n83j8438J4584J0740
$$ -4517 -5001 10840 9084 -2643 3021 13056 -1707 -12887 4828 4245 -14193 391 11131
422A1131k1370J459J8482j3180j2623J8661Q767j7402j02K1454r025j6796K0061
$$ 11131 -10239 -8780 9702 -3478 -16101 2560 11327 -6075 -6177 15277 6252 -10544 9517
435I517N841k7856O471K1098j8595j0621K4035R38k5700N994K1464j8166j5410
$$ 9517 15358 -12498 -6027 15071 -3524 -14145 9890 10828 -14872 -8878 12586 -5580 -20990
448b0990K8401J938k8029K1045K4126l2051q807L0611r724k4726K2134J8219k7267
$$ -20990 7411 9349 -18680 2365 26491 -5560 -14367 16244 6520 -18206 3928 22147 -5120
461e120p083K8083j2274k6339K4686J1748l2906O017L1225j6425j8376K1989P891
$$ -5120 -12203 15880 3606 -22733 1953 13701 -19205 -13188 18037 1612 -16764 5225 13116
474A3116k5547K800K7491j0955k2010K4698R621l3245N132L0108j9274k1450K4645
$$ 13116 -12431 -9631 17860 6905 -15105 9593 19214 -14031 -8899 21209 1935 -19515 5130
487E130N620k9933O311L2432j6528k2616K8645M529m0549J5734L8945k5320j7750
$$ 5130 10750 -19183 -12872 19560 3032 -19584 9061 13590 -26959 -11225 27720 2400 -15350
500a5350L4218l172l6178J7356K7579l0589j5457L7758o240l6117L0253K4089
$$ -15350 18868 15696 -20482 -3126 24453 -6136 -21593 16165 9925 -26192 4061 28150
512B8150m6166p037M0481j5346k3691L6110J2155m0597K647L5027j9859k2618
$$ 28150 -18016 -25053 15428 82 -23609 12501 24656 -15941 -13294 21733 1874 -20744
524b0744L8605O347m5733J0205L3958k6958j4638L5971k944l7090J1067K7022
$$ -20744 17861 24208 -21525 -11320 22638 -4320 -18958 17013 14069 -23021 -11954 15068
536A5068k3038j3266L7812J566l9075J5309K8777k9970j1227L6051n006l0905
$$ 15068 -7970 -21236 16576 18142 -20933 -5624 23153 -6817 -18044 18007 13001 -17904
548a7904J9854K2205k9621j2002L1885q926l2983K6172K4425l3034n717L0574
$$ -17904 1950 24155 -5466 -17468 14417 5491 -27492 -1320 23105 -9929 -15646 14928
560A4928j3937k3074K5035J5273k5997k282K7153r816k5019K3846J6621l3203
$$ 14928 991 -22083 2952 18225 -7772 -10054 17099 7283 -17736 6110 22731 -10472
572a0472k902L1813j5602k5160K6006J2442l0583K295L1590j8765k5883L1202
$$ -10472 -13374 18439 2837 -22323 3683 16125 -14458 -12163 19427 662 -25221 5981
584E981R204l6578J6134L4096l0658j4905L4271r188k9687K4155J8003k9130k353
$$ 5981 15185 -21393 -5259 28837 -1821 -16726 17545 8357 -21330 2825 20828 -8302 -10655
597a0655K7409j4988k2685K4589R632k7659N293K1637j6262q449K0260Q50j6948
$$ -10655 16754 1766 -20919 3670 13302 -14357 -9064 12573 -3689 -12138 8122 8972 -7976
610g976M757J3913r230j0264J6073N439k0298J585J7758j1903j0901J6503L33
$$ -7976 -3219 10694 1464 -8800 7273 12712 -7586 -6001 11757 -146 -11047 5456 5789
623E789j8637N620J5949j0912q980J9390P69k2513R458J7237j6640l116K0259
$$ 5789 -12848 -7228 8721 -2191 -11171 8219 8988 -13525 -4067 13170 -3470 -6586 13673
636A3673o951j5757J1222P289j5053j394J5176n482j4718J0687J0079j5304j305
$$ 13673 6722 -9035 2187 9476 -5577 -6971 8205 2723 -11995 -1308 8771 -6533 -7838
649g838J4228p718r159J3274N297j0955N02J1150n916j1046J2513O742j6608K004
$$ -7838 6390 -1328 -10487 2787 8084 -2871 -2369 8781 2865 -8181 4332 11074 -5534 -3530
663c530J3056j2700o908J5752k071j3156Q538P036j2490j927J4187j719j1438
$$ -3530 9526 -3174 -10082 5670 3599 -9557 -1019 6017 -6473 -8400 5787 4068 -7370
676g370J0343N614j4446L802J2309j0537m365J1499l344r756O289N364o951m261
$$ -7370 2973 8587 -5859 -2057 10252 -285 -4650 6849 3505 -6251 38 5402 -1549 -5810
690e810N833p81n566O216M693q063L16N988l686j160N449J652l448k980K581J996
$$ -5810 23 -758 -6324 -108 4585 -3478 -3162 2826 -860 -2020 3429 5081 1633 -1347 1234 3230
706C230m793J567M909o672l052O615k516n344N356L304n677q38N888p23m891N389
$$ 3230 -1563 4 4913 -1759 -4811 1804 -712 -6056 -700 2604 -3073 -3911 1977 1254 -3637 1752
722A752L556p923J921P485o764j992P237l377n685L378J323k569m54K434j162
$$ 1752 5308 -2615 -694 6791 27 -1965 5272 1895 -3790 -412 911 -1658 -2112 322 -840
737h40m058L099L885m027M30M641l171k548M126J570j479o79K060qn582J956M085
$$ -840 -4898 -1799 2086 -1941 -1511 3130 -41 -2589 1537 3107 1628 949 3009 3001 -2581 -625 3460
754C460o230o49O250l857l720N309r41l663L177J967j738n64L503M74l463K223
$$ 3460 -2770 -3419 2831 -1026 -4746 563 -378 -4041 -864 1103 -635 -1199 2304 2778 -685 1538
770A538K506m564O36K654l418K1K178k283p55M97p60P56j326n11L201j121m18
$$ 1538 4044 -520 116 2770 -648 -627 1551 -732 -1487 -990 -1750 -994 -2320 -2831 370 -751 -1169
787a169K995n68j292J567q4q06K03O11P44j995k8J935l231j687K642j863n86K492
$$ -1169 1826 1258 -34 1533 1449 643 846 1457 2201 206 178 2113 -1118 -2805 -163 -2026 -2612 -120
805a20j493J23J940o95M2L66j83J228l50l54K379j188r54R00j785p12Q62j316
$$ -120 -1613 -1490 450 -245 -203 163 -20 1208 858 504 2883 1695 741 1641 -144 -856 6 -1310
823a310qO96o80J154j021p10K087j379r8K266r34M96K327j797m14J239j339k88
$$ -1310 -1318 -622 -1302 -148 -1169 -1879 208 -1171 -1269 997 63 559 2886 1089 675 1914 575 287
841B87N20j335Q57l7j605R43q61m87O28j330Q42J561m00J429J91r63J713j211
$$ 287 807 -528 329 292 -1313 -370 -1231 -1718 -1090 -2420 -1578 -17 -417 1012 1203 240 1953 742
859G42j452K580o49j554K318o04j878J053p19k028K1P81M26m18j12K513j455n71
$$ 742 -710 1870 1221 -333 1985 1381 -497 556 -163 -2191 -2170 -1389 -963 -1381 -1493 1020 -435 -1006
877a006K837j648j154K716p80o99J742J80q83j432k14J219k053j320K301j105
$$ -1006 1831 183 -971 1745 965 266 2008 2188 1305 -127 -341 878 -1175 -2495 -194 -1299
893a299j147L228l66k802J662R52j011r2K277J296k074P1K760l287j726L774j903
$$ -1299 -2446 782 416 -2386 -724 228 -783 -875 1402 2698 624 695 3455 168 -1558 2216 313
910C13k550L266J62l361M70P60O1j307Q22K184j596q92L688m95k339K967j03k538
$$ 313 -2237 1029 1191 -2170 -1700 -940 -879 -2186 -1364 820 -776 -1668 2020 1525 -814 2153 2050 -488
928d88M16J854l94k489L73L069k604k364L759j542m420L893K400l431J324M080
$$ -488 -72 1782 1388 -1101 -728 2341 -263 -2627 1132 -410 -4830 -937 1463 -1968 -644 3436
944C436k434l565K831K562l768j0N493k616m123N237j118o314L168L416m099j081
$$ 3436 1002 -2563 268 2830 -938 -948 4545 1929 -2194 3043 1925 -4389 -1221 2195 -1904 -2985
960b985M252n80m446K037M436l594j561N511j271m971M764K131m812Q73M263k499
$$ -2985 1267 687 -3759 -1722 2714 -880 -2441 3070 1799 -3172 1592 3723 -1089 -216 4047 1548
976A548l978J544J966l369l90N176k124l404L319L42m423K292L544j511q74K395
$$ 1548 -2430 -886 1080 -2289 -2679 2497 373 -3031 288 630 -3793 -1501 2043 532 -342 2053
992B053R55l468j020L804j452k827L921J192m930M15K130k773j619L906J669l597
$$ 2053 3008 -460 -1480 2324 872 -1955 1966 3158 -1772 -1357 773 -2000 -3619 287 1956 -1641
1008a641n31M359k947k489N899R50m700K067K619m808j102M512k7l385K082K193
$$ -1641 -2172 2187 -760 -3249 2650 3600 -1100 967 3586 -1222 -2324 2188 2161 -1224 858 3051
1024C051m962k520M900o02l946N192J989n027L29L445k836j844M416K274l948
$$ 3051 -1911 -4431 469 -133 -4079 1113 3102 -1925 -1596 1849 -987 -2831 1585 3859 -89
1039h9K94L662m166l407M916N53m261L212J942m993j254L418j86j571K707J856
$$ -89 205 3867 -299 -3706 1210 1763 -2498 714 2656 -2337 -3591 -173 -359 -1930 777 2633
1055B633k995j352K630q57j225L651O46k638j1L8j538p3R77J069k91j313M23m95
$$ 2633 -362 -1714 916 59 -1166 2485 3131 493 482 520 -1018 -1091 -114 955 664 -649 -226 -721
1073g21k181J190J545k32M52J885o13j558l25J100m10J23K637o80l213P59J43
$$ -721 -2902 -1712 -167 -399 53 1938 1325 -233 -558 542 132 255 2892 2212 -1001 -242 -99
1090i9k730J776K824k203m54O91q54k165J903K308q95j40K504j845k295K648N47
$$ -99 -2829 -1053 1771 -432 -886 -195 -1049 -3214 -1311 997 102 -38 2466 621 -1674 974 1521
1107A521k395K339J209k712m74Q89j628r68J488J246o21n94J707k133j523K449
$$ 1521 -874 1465 2674 -38 -512 377 -1251 -2219 -731 515 -106 -700 1007 -1126 -2649 -200
1123b00P93m37J799O40k912q61J299N92j66R87L95k842j285K112o99j160K543
$$ -200 593 156 1955 2595 -317 -1178 121 713 547 1534 1929 -913 -2198 -86 -785 -1945 598
1140E98k85k034Q69J374j002J10J084l1q76J101J180j346j111J665j327j561K120
$$ 598 313 -1721 -852 522 -480 -370 714 683 -193 908 2088 742 -369 1296 -31 -1592 528
1157E28Q44j451m35n72q30N71R20J132j40j314M13j40p64J930J758q26j481N18
$$ 528 1372 -79 -514 -1086 -1916 -1345 -425 707 567 -747 -334 -474 -1238 692 2450 1624 143 661
1175F61M5j472M09K088j448k042K363o78k688K621J127k857L53K448p18r93J421
$$ 661 706 -766 -357 1731 283 -1759 604 -74 -2762 -141 986 -1871 -1518 930 212 -781 640
1192F40O81j713O07J961j602j068K669j132k764J359J065j563J99J111j261n44
$$ 640 1321 -392 215 2176 574 -494 2175 1043 -1721 -362 703 -860 -661 450 -811 -1355
1208a355N03J044p58n28K135k60j793J277Q89j016P7J282m87p43l37O64j590l21
$$ -1355 -852 192 -566 -1094 1041 781 -1012 265 1154 138 215 1497 1010 267 -70 594 -996 -1317
1226a317J902o39j543J678M68j763N85R61p28J98R61j24n76M7J238m75j029R16
$$ -1317 585 -54 -1597 81 549 -1214 -629 332 -396 -198 763 639 63 110 1348 873 -156 760
1244G60l6j542N83K80m89k26J34J46m5q40R84O47j153P34J014j116O32J092r15
$$ 760 724 -818 -235 45 -444 -670 -536 -390 -435 -1275 -291 356 -797 -63 951 -165 467 1559 644
1263F44n24L08Q2k43l84P90p82j117Q40k13r94J324P43j670N94J198j071N47N47
$$ 644 120 428 510 267 -117 673 -109 -1226 -386 -599 -1593 -269 474 -1196 -602 596 -475 72 619
1282F19j47l49N33M39l80m43L45k95p59M70l28n17N73q25L52P82p58p7P40m43
$$ 619 472 123 656 1095 715 272 617 322 -437 33 -295 -812 -239 -1064 -712 70 -688 -765 -25 -468
1302d68kJ082p52N98N74n79K33q7j70k06l85j33P7j71J73J07r84N06K40k77N54
$$ -468 -470 612 -140 458 1032 453 686 599 429 223 -162 -295 -218 -389 -216 -109 -1093 -587 -347 -624 -70
1323g0o1j19N13K52J7N20p89Q4L26j99j59K83r09Q0J80n27L27o22P2P30n39L69
$$ -70 -131 -250 263 515 532 1052 263 347 673 474 315 598 -311 -231 -51 -578 -251 -873 -801 -71 -610 -241
1345b41N41p22M06O71o15M9N29l97L25K55n34M0j4n01r9m47J38J08j35M18J04
$$ -241 300 -422 -16 655 40 89 618 221 546 801 267 307 293 -208 -307 -754 -616 -508 -643 -225 -121
1366a21l32O21l2n08Q43k81j90J196o84j60O42o19k42R8n58j38L1K20j49j80J48
$$ -121 -453 168 136 -372 471 190 0 1196 512 352 994 375 133 231 -327 -465 -434 -214 -363 -543 -395
1387c95m8k33j21J063o18L25O45l30L5O84o45k75M37l36Q7k00l86L35n66r7O74
$$ -395 -443 -676 -797 266 -352 -27 618 288 323 1007 362 87 524 188 275 75 -311 24 -542 -639 35
1408C5p80q8M08j47L26Q26q27P01r5M4K6k53j37P39k05o87O20n92j41n4m38m6
$$ 35 -745 -833 -425 -572 -246 580 -247 454 359 403 429 176 39 778 573 -114 506 -86 -227 -281 -719 -765
1430g65J53r3P43k21l99J090n55j49M54K8J90L3j62K50k85l93L79l30o40J026
$$ -765 -612 -705 38 -183 -582 508 -47 -196 258 286 476 509 347 597 312 -81 298 -32 -672 354
1450C54o09r75J146j28m26L10Q8k5l65O84K65o6P5Q79n07q13R63o30n08O58m59
$$ 354 -255 -1230 -84 -212 -638 -328 -240 -265 -630 54 319 253 328 1207 700 -113 850 220 -288 370 -89
1471h9n35K61K35K1n14o4N15l91M4J048j90l56L70R3j49L62l05N21j86o81M84
$$ -89 -624 -363 -128 -107 -621 -685 -170 -561 -517 531 341 -15 355 448 299 661 356 877 691 10 494
1492D94o42q74Q19Q87j505J55P73n45l32J98J257r41P5J386o77j095J585K71j434
$$ 494 -148 -1022 -203 684 -821 -666 107 -438 -770 -572 685 -256 -181 1205 528 -567 1018 1289 -145
1511a45M25R05j677j90Q47J7r78N41O38p87q40J838k85j483R73Q61r58M14J347
$$ -145 280 1185 -492 -682 165 182 -796 -255 383 -404 -1244 594 309 -1174 -201 660 -298 116 1463
1530A463p99o70o2Q89j000n2J437l82k310J148K57j219P18J539j227o56L13N41
$$ 1463 664 -6 -68 821 -179 -231 1206 824 -1486 -338 -81 -1300 -582 957 -270 -926 -613 -72
1548g2k69L77J293n55j185P97L65r61M66J157j281p72N41p9k36l14J062k44j526
$$ -72 -341 36 1329 774 -411 386 751 -210 256 1413 132 -640 -99 -178 -414 -728 334 90 -1436
1567a436Q79J397j432K86J307j359k63J183R87j456j01J051j196j176J652J027
$$ -1436 -557 840 -592 -306 1001 -358 -621 562 1549 93 -8 1043 -153 -1329 323 1350
1583A350k370P10J098k342Q8J862m57q50J305J34j269L82J341j80j576J285N80
$$ 1350 -1020 -310 788 -1554 -1466 396 -61 -911 394 528 -741 -359 982 802 -774 511 1091
1600A091j815N77J430j213n03M88O7r94Q03J27k8j629J301Q88j025O08P36j127
$$ 1091 -724 -147 1283 70 -433 55 122 -872 -69 58 30 -1599 -298 590 -435 173 909 -218
1618b18n74J361j23k29L05K73m27j181J183K30j270j9P06q60j17J556p14n07j0
$$ -218 -792 569 446 217 522 795 368 -813 370 600 -670 -689 17 -843 -960 596 -118 -625 -635
1637f35R54l42k26Q69M18j504L13J215j321N5R28n68p76J38M67o09P9P96k89j120
$$ -635 319 -23 -249 620 1038 -466 -153 1062 -259 -204 724 156 -620 -482 -15 -624 -545 251 -38 -1158
1657a158O07J281j232L66J184r18q75J524k7r79N41M10r08m98J237r1r48J45M41
$$ -1158 -551 730 -502 -136 1048 130 -745 779 752 -227 314 724 -184 -682 555 464 -484 -339 102
1676A02j409L93J645q40k91N42q0m75N33M39N4k76j0J94n09R9L74n94q3L11m85
$$ 102 -1307 -914 731 -109 -400 142 62 -413 120 559 613 337 327 521 12 111 485 -109 -192 119 -366
1697c66n0k54M21N08n81j84O84n70Q9J294p51m00N78J23l89K02K42o09j45j69
$$ -366 -416 -670 -249 259 -322 -506 178 -392 -303 991 240 -160 418 541 152 354 596 -13 -158 -327
1717c27N83n65L29J90r47J60O17m78j0N95J48j09j8n3K76j08l6L65m39k87M57
$$ -327 256 -309 20 210 -737 -577 40 -438 -448 147 295 186 168 115 391 283 247 612 173 -114 343
1738C43l69j84J72l83J22k28j6M43k94J76J84l64N44M60o34p5Q02q55K15O78n83
$$ 343 -26 -210 -38 -421 -299 -527 -543 -100 -394 -218 -34 -398 146 606 -28 -103 699 -156 59 737 154
1759A54k40L05j90n20j94O05R1r51N96M17m12K69L11l02L42M50o78k8N26n17K05
$$ 154 -86 219 29 -491 -685 -80 11 -940 -344 73 -339 -70 241 -61 281 731 53 25 551 34 239
1780B39j86L5J0k41j66K40k39N1Lk84L46q9l59N91j36L48L35m25MO05m57j21M79
$$ 239 53 88 98 -143 -309 -69 -308 -257 -254 -538 -192 -281 -640 -49 -185 163 498 73 77 682 225 104 583
1803E83l94l07K21l36K19l37K60J82m80j96N50l00J32O36l82J71L89o77L86L7
$$ 583 189 -118 103 -233 -14 -351 -91 91 -389 -585 -35 -335 -203 433 51 222 611 -66 320 357
1823C57k96K67j50j1n7l10k08L71m83K25j52q5J93J0L03J10k37K67K08k26L44
$$ 357 61 328 178 167 110 -200 -408 -37 -520 -295 -447 -532 -339 -329 -26 84 -153 114 322 96 440
1844D40J2p8l8l7j85j09L2m1k30P7j99n9J43k31L16k19L08K50l99P9N58q0L1p9
$$ 440 452 374 336 299 114 5 37 -4 -234 -157 -356 -415 -272 -503 -187 -406 -98 152 -247 -168 390 310 341 262
1868B62j27L63l92m43P57o23k45N45o75L06k4J83l83K38L87q4m1K7K99r9j43O40
$$ 262 135 498 106 -337 420 -203 -448 97 -578 -272 -296 -113 -496 -258 129 45 4 31 330 231 88 728
1890G28q99M8O84n47q0K64j00j23k41m8P2k20L01L52o69L61N64n02j86P85k91
$$ 728 -171 -123 561 14 -66 198 98 -25 -266 -314 -242 -462 -161 191 -478 -117 447 -55 -241 544 253
1911B53K9K2j17K78l11K5N3km32J21l96l5N99o8j95J89p4L44k08o6M82l94l0M71
$$ 253 282 304 187 465 154 179 232 230 -202 -81 -477 -512 87 19 -176 13 -61 283 75 9 491 97 67 538
1935E38m48k22O56m41k75J04l6j87j83K48L26n76n6R23p19j42P37K23o18O18M6
$$ 538 90 -132 524 83 -192 -88 -124 -311 -494 -246 80 -496 -552 371 -348 -490 247 470 -148 470 516
1956E16o84K74L21j73l91M19M2p24n8R69p93m80P91J13p19L34Q01o10l93P31M00
$$ 516 -168 106 427 254 -137 282 324 -400 -458 511 -282 -762 29 142 -577 -243 558 -52 -445 286 686
1977F86q30J48J126j026o89J149n09n72M73N18j007n2M58j19n87O46P24p71k21
$$ 686 -144 4 1130 104 -585 564 55 -517 -44 474 -533 -585 -127 -246 -833 -187 537 -234 -455
1996d55J010n55n29R85L08p28J44L81j27p68M32M91o47m35Q02m30q76J151J80
$$ -455 555 0 -529 456 764 36 180 561 434 -334 98 589 -58 -493 309 -121 -997 154 334
2015C34j072N67N05j48p75M67Q75j140J72J296q25o20J275o12j087N42O50r34
$$ 334 -738 -171 334 186 -589 -122 753 -387 -215 1081 256 -364 911 299 -788 -246 404 -530
2033e30j20Q24l16j062Q41J099j364Q4J429n60j400R85R22j077K57P57m11p39
$$ -530 -650 174 -142 -1204 -363 736 -628 -544 885 325 -1075 -90 832 -245 12 769 358 -381
2051c81M65K89j039RJ255o75n48J132j17j370O64Q40j20m59N97j10p63M0J207
$$ -381 84 373 -666 -657 598 -77 -625 507 390 -980 -316 524 404 -55 542 432 -331 -291 916
2070I16p38o71J476n73j078N37K85p54j06P49J3n93L23N77p53l20J317k82q67
$$ 916 178 -493 983 410 -668 -131 154 -600 -706 43 56 -537 -214 363 -390 -710 607 325 -542
2089e42R92L97r21j77O36j55n16N02N66j114m34Q16m24m83J262K30j217J84M46
$$ -542 450 847 -74 -251 385 230 -286 216 782 -332 -766 50 -374 -857 405 635 -582 -398 48
2108D8m38pJ124j4j123N28P40q22m42J224m90o51O71M19j289K04O54m02l86N45
$$ 48 -390 -397 727 713 -410 118 858 36 -406 818 328 -323 348 767 -522 -318 336 -66 -452 93
2128I3J96n19m51J367q78l00Q55J78q11N70K43o92k99O27P7m93m4N06o76m40J211
$$ 93 289 -230 -681 686 -192 -492 363 541 -270 300 543 -149 -448 179 256 -237 -281 225 -451 -891 320
2149C20N2q84P34K70n94k49Q38o0k84J27N17p25m57J009l86q25Q96k00m79l53
$$ 320 372 -512 222 492 -102 -351 487 427 143 270 787 62 -395 614 228 -597 299 99 -380 -733
2169g33Q32l90j52N30K22m57l8Q12m60q01R91L34r47K85N10p84j47N94j49m76
$$ -733 99 -291 -443 87 309 -148 -186 626 166 -635 356 690 -257 28 538 -246 -393 201 52 -424
2189d24L90M47n48n64R46j30r35O82Q96j040N02K63m60q9J33N10p53L5O38m38
$$ -424 -34 413 -135 -699 247 117 -818 -136 760 -280 222 485 25 -64 69 579 -174 -139 499 61
2209F1n66P80j87q31Q43l0p28L22M75k14k65K94O38m00k43N41k63m25N08M53q77
$$ 61 -505 275 88 -743 100 70 -658 -336 139 -75 -340 -46 592 192 -51 490 227 -198 310 763 -114
2230a14K79n6J29o58J98L53l79j90N06Lm99O24J09o84K55L49j07m6J42K10n61
$$ -114 165 109 238 -420 -222 131 -248 -438 68 71 -428 196 305 -379 -124 225 118 72 214 424 -137
2251a37K20J93k37m69M92j19m83L31K84j48j35L53l76K15mL23k3o45P06L20r37
$$ -137 83 276 39 -430 62 -57 -540 -209 75 -73 -208 145 -231 -16 -20 303 280 -365 341 661 -276
2272b76K63N09p08K6L01k41k74N65L3l17j75M55j34l19K49K32m72O16K77o13K2
$$ -276 -13 496 -212 -186 115 -126 -400 165 198 -119 -294 161 27 -292 -43 189 -283 333 610 -3 19
2293A9N55j47l86J6R7k72j29R7K54n93L32kJ17J6j8k5p0J52K51K31m18mK68k66
$$ 19 574 427 41 57 154 -118 -247 -150 104 -489 -157 -159 -42 -26 -44 -69 -139 13 264 495 77 73 341 75
2317G5J31j00l30J56L54m65K47l04j0R9k57N77k27k57N0O75n68QK74q3K78J4k28
$$ 75 206 106 -224 -68 286 -179 68 -236 -246 -147 -404 173 -54 -311 -261 414 -154 -146 128 45 323 337 109
2340A09J90l19J02l02j10L40P8m77J5O62o90K65L6J23lJ94j14K11n70O10j15l84
$$ 109 299 -20 82 -220 -330 10 88 -389 -374 288 -402 -137 -101 22 19 213 99 310 -260 350 235 -149
2362a49J57o5R3JM7l45J15j3K35M3l55j73M39r5n5J53j89K55O5j2j37k3p6M58
$$ -149 8 -57 36 37 84 -261 -146 -159 76 119 -236 -409 30 -65 -120 33 -156 99 164 152 15 -8 -84 374
2386C74k91j43J3J01Qk9J7k01K23j23j10K53j32j87L43j13j10j03P54k01k93n6
$$ 374 83 -60 -47 54 62 33 50 -151 72 -51 -161 92 -40 -227 116 3 -107 -210 544 343 50 -6
2408fK83m62L0J89Q7j85n9P1o9l01M76j54m4J66K64k65K06J98k12j27L90J0o30
$$ -6 277 -185 -155 34 121 -64 -123 -52 -121 -422 54 -100 -144 22 286 21 227 425 213 86 476 486 -144
2431a44M9J10j27m02M49J72k16J0Qk10J18N02m45q3J05L51k68j5L63k82k47K13
$$ -144 -95 15 -112 -514 -65 107 -109 -99 -91 -301 -183 319 -126 -209 -104 247 -21 -36 327 45 -202 11
2453A1J69m42J43J16p1j40L4J3r1M9J39K16j71K91k25k05L85J53k22j72O43j33
$$ 11 180 -262 -119 -3 -74 -214 -180 -167 -258 -209 -70 146 -25 266 41 -164 221 374 152 -20 623 490
2475D90o85K31J00l56J9L30p8o45P71K33o38j75N46j57j07M26P2m67J14J72J23
$$ 490 -195 36 136 -220 -201 129 51 -594 177 410 -228 -403 143 -14 -121 305 377 -90 24 196 319
2496C19m90K20J03j51k46P39o00k23N60k04m22Q7P05n15l57O99Qn15L22O54m59
$$ 319 -171 49 152 1 -245 494 -106 -329 231 27 -395 -308 397 -118 -475 224 232 -283 39 693 234
2517B34j84M08j15m04L34k28k99J18L65l54l58N72P8m12o9N01qk16J72J77n18
$$ 234 50 458 343 -61 273 45 -254 -136 229 -125 -483 89 167 -245 -314 187 179 -37 135 312 -206
2538b06K51J66K31r03P22J67l55k60M57m18l46M34O6l83J91O66n19j78O28k33
$$ -206 45 211 442 -461 261 428 73 -187 270 -148 -494 -60 6 -377 -186 480 -39 -217 411 178
2558A78m39PP89m99l53Q56m41l53L42j95l29O7P25m01l97N37o4m75K74M59n27
$$ 178 -261 -254 535 36 -317 539 98 -255 87 -108 -437 -370 355 -46 -443 94 30 -445 -171 288 -239
2579b39N1N26K37o70J41M54l86l30M80L8o45J79O20n06k60O47k89l83K25K63j26
$$ -239 -188 338 575 -95 46 500 114 -216 264 302 -343 -164 456 -50 -310 337 48 -335 -110 153 27
2600B7j64L47r0k55N64q6n18Q8N04n61P6L95j94n55R9M86l07o80O84L07p33M79
$$ 27 -137 210 120 -135 429 343 -175 -87 417 -144 -68 327 133 -422 -323 163 -144 -824 -140 167 -566 -87
2622h7L99m31P0L73j60m42K77K52j80m25M72J90o80K50M92o42O1N35l75l18K82
$$ -87 312 -119 -49 324 164 -278 -1 251 71 -354 118 308 -372 -122 370 -272 -211 324 -51 -369 -87
2643h7K11k56k42O67k03m94O75J23m58L1L85k01m82N70k4o35M5L98j21k60M89
$$ -87 124 -132 -374 293 90 -404 271 394 -64 -33 352 151 -331 239 215 -420 -375 23 -98 -358 131
2664A31K87r18K29P77r61L4P69j49l41J63M17m64k21M10Rn55M23Q2k64k14P98
$$ 131 418 -500 -271 506 -455 -421 348 199 -142 21 438 -26 -247 163 172 -383 40 122 -142 -356 442
2685D42l24o16L95K41k35N5L20j38r9j13N21o91m0O97m56p8o0M05k25q1J39m72
$$ 442 118 -498 -103 138 -97 -42 278 140 41 -72 449 -242 -282 415 -41 -119 -179 226 1 -80 59 -413
2707d13J71K48n6k41K34K64l42k09L77L77q06O09j30j05m6M67j67l36N1R3k96
$$ -413 -242 6 -50 -291 -57 207 -135 -344 33 410 -396 213 83 -22 -68 399 232 -104 -53 40 -256
2728b56j90L72J44l92L57J68l01j45N42K18o00L37Oo06K55N50n65K2O5k1k26N00
$$ -256 -446 -74 70 -322 35 203 -98 -243 299 517 -83 254 260 -346 -91 459 -106 -84 -19 -40 -266 234
2750B34l8m27k05L65J27k07N8K58j80L6K07k4k29J06N6n1k30M9N25n47j41L34
$$ 234 196 -231 -436 -71 56 -151 -93 165 -15 21 228 204 -25 81 137 86 -144 -95 430 -117 -258 76
2772G6j23k91K74J28k30J85M07p07M19N8k3j2r5k6j50pM17k66oL21j81l12J24
$$ 76 -47 -338 -64 64 -166 19 426 -281 138 196 173 161 66 40 -110 -117 300 34 28 349 168 -144 -20
2795b0j3K0k00K15j96o2N36j27%j33J84J70l47J38Nj38qL8L77n47L38k84n3j46
$$ -20 -33 -13 -213 2 -194 -256 280 153 153 20 204 374 27 165 170 32 24 62 439 -108 230 -54 -107 -253
2819b53N15m05j20J39M43j68m1J8j50J25o2K31k08k17K56R8k23K28j73k01L41
$$ -253 262 -143 -263 -124 319 151 110 128 -22 103 41 272 64 -153 103 201 -22 206 33 -168 173
2840A73l73J18P8J56j09j80J91o4N7m7K32J83m20Q3K6j93j50R2K34j14l03K81
$$ 173 -200 -82 -4 152 43 -137 54 -10 47 0 232 415 -5 78 104 -89 -239 -147 87 -27 -330 -49
2862d9J76k80K27k70M1K06m45L22J62K0O6q7j35K00kj83P8o9J63k15J68j00J28
$$ -49 127 -153 74 -196 -155 51 -394 -72 90 110 176 89 -46 154 152 -31 47 -22 141 -74 94 -6 122
2885A22k19M2O3O4P2n7J49k50l7J73j13j89K31n7j05J40K12k91lL26l31r0N4j41
$$ 122 -97 -55 8 72 144 87 236 -14 -51 122 9 -180 51 -6 -111 29 241 -50 -53 273 -58 -148 -94 -235
2909b35K42k97p3K48K88l60M61j17k22L56k89j1N5q2K35n01J94P2j21J0K69j14
$$ -235 7 -290 -363 -115 173 -187 274 157 -65 291 2 -9 46 -36 199 -302 -108 -36 -157 -147 122 8
2931Hk86K10P2l26K50M2K3J38q4R3J06j33l6m2J29j28j8k36oJ18K2j57j5L43k05
$$ 8 -278 -68 4 -322 -72 -30 -7 131 47 140 246 113 77 35 164 36 18 -218 -224 -106 -84 -241 -256 87 -118
2956a18K9K11j08l16M85j18j44J32O6m2J10k67K42j59j87o2K59L2j47M1o0k10
$$ -118 -89 122 14 -302 183 65 -79 53 119 77 187 -80 162 3 -184 -246 13 45 -102 -61 -121 -331
2978c31K85R6j01Q2L4L9r2J05R9k22J60k1j52mJ42l79J74J93n2j57k1K85p1k02
$$ -331 -46 50 -51 31 65 104 12 117 216 -6 154 133 -19 -23 119 -260 -86 107 55 -102 -123 162 91 -111
3002a11K98n2l5j9K43k25p5Q5j00j63K69m5k1j57l2M2J36M7k59l0l5K35j64P8
$$ -111 187 135 100 81 324 99 24 109 9 -154 115 70 49 -108 -140 -98 38 85 -174 -204 -239 -4 -168 -90
3026i0L96L6l49K78k7j92k25L53L09n43N3l4l6q7J88j76k7J70q3K5k95K41J57
$$ -90 306 342 -7 271 244 52 -173 180 489 -54 -1 -35 -71 -158 30 -146 -173 -3 -86 -61 -356 -115 42
3049D2L8M9q0p8K13k9j40J11k78J12J76k93N1P2j77R5J73r5J68j52J53k74K16
$$ 42 80 129 49 -29 184 155 15 126 -152 -40 136 -157 -106 -34 -211 -116 57 -38 130 -22 131 -143 73
3072G3J71k23J34M90n22m65M06o7m72M67Pj71o0Q1K73k73q7P4m8O9J56Qk84L09
$$ 73 244 21 155 645 123 -342 64 -3 -475 -8 -1 -172 -232 -151 122 -151 -238 -164 -212 -143 13 21 -263 46
3096D6J34q3j08k14K17k09K84j02O8p8K33j67m79M90l16q2K36L11j47KK16k46
$$ 46 180 97 -11 -225 -8 -217 67 -35 33 -45 188 21 -458 32 -284 -366 -130 181 34 36 252 6
3118FO1N7K42l85JK69j39l00K96k20j60Mn8K88k26M51L81r40K63K52J80k70K14
$$ 6 67 124 366 -19 -18 251 112 -188 108 -112 -272 -268 -326 -38 -264 187 568 -372 -109 143 323 53 267
3141B67j53k20K29P8k69r1L33j09j48k60M59Rl25o6J60O3l7J94k42k80O06j3k87
$$ 267 114 -106 123 201 -68 -159 174 65 -83 -343 116 125 -200 -266 -106 -43 -80 114 -128 -408 198 185 -102
3164a02K92l23J53k49M35p2k45j46N0q7j9rL00k69J30M01l06k47M69J12n19K82
$$ -102 190 -133 20 -229 206 134 -111 -257 -207 -294 -313 -322 -22 -291 -161 240 -66 -313 156 268 -251 31
3186C1K00l31J13J46Kj90J05J53k98N2j2J87k97M6L43m24J33N4O0l40K37J85l03
$$ 31 231 -100 13 159 161 -29 76 229 -69 -17 -29 158 -139 -93 250 -174 -41 13 73 -267 -30 155 -148
3209a48j90N23Mn08L27n4p6J97n2j68L21l52m8K66R4k85K39l6j84M13k48j9J79
$$ -148 -338 185 189 -319 8 -46 -122 75 23 -145 176 -176 -224 42 136 -149 90 54 -130 283 35 16 195
3232A95L43m72j01M5J43k82O8k27K73mj3J99j40j00O4j3L3j48K58k79L78o9j37
$$ 195 538 66 -35 10 153 -129 -61 -288 -15 -19 -32 167 27 -73 -9 -22 11 -137 121 -158 220 151 14
3255A4J27n2l10K65J03k24j51M57k42j06O3J78j77j9O9J52J43j65n2P3l42L74
$$ 14 141 89 -221 44 147 -77 -228 229 -13 -119 -56 122 -55 -74 -5 147 290 125 73 146 -196 178
3277A78m05M8K99j03k09j8J06K86k83j74K94k78J85jj56K49Q3q8L38l80j8K19
$$ 178 -227 -179 120 17 -192 -210 -104 182 -101 -275 19 -259 -74 -75 -231 18 101 13 351 -29 -47 172
3299A72j84P0J4KQ6j15p2k7j74J37j46K94k1k51L40J17j94J12k40L15j47p1J09
$$ 172 -12 58 72 74 160 45 -27 -54 -228 -91 -237 57 36 -215 125 242 48 160 -80 235 88 17 126
3322A26R0l29K24k61J20n8M6n7p1L19j45qqL94n74K63m1j18L25l11J24j53J33
$$ 126 216 -113 111 -150 -30 -88 -42 -99 -170 149 4 -4 -12 382 -192 71 30 -88 237 -74 50 -103 30
3345C0m0R4k52J45J93j33m4j80Q8M5L2q5K56M7n5n0%N5r6q7K87q9m0o3p9n0J40
$$ 30 -10 84 -168 -23 170 37 -7 -187 -99 -54 -22 -107 149 196 141 91 91 146 50 -37 250 161 121 58 -21 -71 69
3372F9o4l2k31L28j97j36M17p8J94k07k17O4P1j19J22j5k39Q5K07J20k58J20J18
$$ 69 5 -27 -258 70 -127 -263 154 76 270 63 -154 -90 -19 -138 -16 -31 -270 -185 22 142 -116 4 122
3395A22o9o5n7N0M2J64k29K0m6P1j24K59j10m7o1L82q7k31K69l33J27j98J88l15
$$ 122 53 -12 -69 -19 23 187 -42 -22 -68 3 -121 138 28 -19 -80 302 215 -16 253 -80 47 -151 37 -278
3419b78L48K01m15J73j67J66P9j8k14Q0J40m0K4l7n4J09j92K49k49O2L1j49o5
$$ -278 70 271 -144 29 -138 28 107 89 -125 -45 95 55 79 42 -12 97 -95 154 -95 -33 -2 -151 -216
3442b16J35J47Q0j05o1k39N59k3m36L31n0j59J17pk61J44n1K84m6m6k18J3P6j35
$$ -216 -81 66 146 41 -20 -259 300 277 -159 172 122 -37 80 73 -188 -44 -95 189 143 97 -121 -108 -32 -167
3466a67J02P6P1n0J26N3m6j58k1j46L34j25K9l36M71j16j14J94k70O0j37M33l45
$$ -167 -65 11 82 32 158 211 165 7 -14 -160 174 49 78 -258 213 97 -17 177 -93 -33 -170 263 -82
3489h2L69m42j53L88J21p3r6K4j52J71L3j34r6K28j23N4J10n24J84K41k34J74
$$ -82 287 -155 -308 80 201 128 32 56 -96 75 108 -26 -122 106 -17 37 147 -377 -193 48 -186 -12
3511a2Oj1M9J49k78J31p5R4L0j25M4l8M1J30k76k3Q3J44p7l55M58j23r5L08o0
$$ -12 -6 -17 32 181 -97 34 -41 53 83 -42 2 -36 5 135 -141 -164 -81 63 -14 -369 89 -34 -129 179 119
3536A19L1j95K42j84Q3n7j66L62k42j25L16k37j07N0K58n6N2r6k45K77k38M3J93
$$ 119 150 -45 197 13 96 39 -127 235 -7 -132 184 -53 -160 -110 148 92 144 48 -197 80 -158 -115 78
3559G8j09j02K69j41jk0j03N5o2J40L0K81m03J29j58p4J88N7k19J28j72J92J12
$$ 78 -31 -133 136 -5 -6 -26 -129 -74 -136 4 34 315 -88 41 -117 -191 -3 54 -165 -37 -209 -17 95
3582I5k17L31P4m95K32J61l70K61k96M40k23K12j78k66K32k62M70k75M3K3o7M6
$$ 95 -122 209 283 -212 20 181 -189 72 -224 216 -7 205 27 -239 -7 -269 201 -74 -31 -8 -75 -29
3604b9l8L30r3j34m7K36k55K90O5k62p2n2J88j38p3J57r1%K03n8m1m5k09M04k74
$$ -29 -67 263 170 36 -11 225 -30 260 325 63 -9 -61 127 -11 -84 73 -18 -18 185 127 86 41 -168 236 -38
3629c8J79j61N0J17l13K54k39J14J10j70J90k39J56p0K5NK59k7m72L70l9l8k35
$$ -38 141 -20 30 147 -166 88 -151 -37 73 -97 93 -146 10 -60 -35 -30 229 202 -270 100 61 23 -212
3652b12K51k17L23J01l24K10r9j3L7k33N8J90r1j19r7K65J6j22j10M26o21L38
$$ -212 39 -178 145 246 -78 132 33 20 57 -176 -118 72 -19 -138 -235 30 46 -76 -186 240 -381 -43
3674d3M15l89J87j83j51L03j36J03o2j4r0J46o1m4q1J01j9j3O6j38p6K27R4m22
$$ -43 372 -17 170 -13 -164 139 3 106 44 30 -60 86 25 -19 -100 1 -18 -31 35 -103 -179 48 142 -280
3698b80K98k88M12J0P1k52n4J26p9j01O9r6j37L85N4r4r9j0L51n54J63J78o1o
$$ -280 18 -270 142 152 223 -29 -83 43 -36 -137 -68 -164 -301 84 138 44 -55 -65 286 -268 -105 73 12 6
3722Fk58L95k22L00j92j61K04p4l40L27J77k37nM53o00jM15j81K14m3k73J30l92
$$ 6 -252 143 -79 221 29 -132 72 -2 -342 -15 162 -75 -80 373 -227 -228 187 6 220 177 -96 34 -358
3745c58M49j59K4l9j18L77j09q7m9K86k24m9R1Q0l69M79j86j24J28J37Q1l43N6
$$ -358 91 -68 -44 -83 -201 176 67 -20 -69 217 -7 -56 35 115 -254 225 39 -85 43 180 261 -82 -26
3768b6O1p5j1J22K7jk14J98k01R4m6l4P5k15K35j17L16m44j08K91L60r2o1p1k70
$$ -26 35 -40 -51 71 98 97 -117 81 -120 -26 -72 -106 -31 -246 -11 -128 188 -256 -364 -73 287 195 134 63 -207
3793b07q4M10o5r8j66K35K55k55K84k21k37r8L02M1p6p0j86L81n8q8J49l8l27
$$ -207 -291 119 54 -44 -210 25 280 25 309 88 -149 -247 55 96 20 -50 -236 145 87 -1 148 110 -217
3816b17K17jL36k40J40n76L01L4r5J11p4P4Q2O1k89K43j4L6l73J47K40N0K02j77
$$ -217 0 -1 335 95 235 -341 -40 -6 -101 10 -64 10 92 153 -136 107 93 129 -244 -97 143 193 395 218
3840B18l49j46L18l0L7l90L59P8m8J28k3j11J49j79o3j32P1j0J93r3j91J98K69
$$ 218 -131 -277 41 11 48 -342 17 95 47 175 152 41 190 11 -52 -184 -113 -123 70 -23 -214 -16 253
3863B53l20R2n2J47J09k31k13OM26l36N5NL94k86M0k61j41L70J0j4k71n2L86n2
$$ 253 -67 25 -27 120 229 -2 -215 -209 217 -119 -64 -59 335 49 89 -172 -313 57 67 53 -218 -270 116 64
3887F4Rl18L11j47L06j08j78k71L33J89l15R9J86j61j98J60K59k37o0j49L38k72
$$ 64 73 -245 66 -81 225 117 -61 -332 1 190 -125 -26 160 -1 -199 -39 220 -17 -77 -226 112 -160
3909a60J44O9j67J0L45m9m6k95N6k43M25j24j20J94o8J45k50P4j52L66l01R1K25
$$ -160 -16 53 -114 -104 241 192 146 -149 -93 -336 89 -35 -155 39 -29 116 -134 -60 -212 154 -147 -56 169
3932A69q4L7r4K8p0j66K2J82k37m9M30j04j84J21l75N20k94J59j86K02K36k54
$$ 169 85 122 28 56 -14 -180 -158 24 -213 -262 168 64 -120 1 -374 146 -148 11 -175 27 263 9
3954Ij48J12j22J77L5M6K25k51J2l36N23k81p8L33j89k22K31j7M0j15k10J78Q9
$$ 9 -139 -27 -149 28 63 109 334 83 95 -241 282 1 -77 256 67 -155 76 59 99 -16 -226 -48 41
3977D1L6P8j20k12K28k05M7J15j62J87j23K48l4R4k96L3n6K52l13J69k5J61j96
$$ 41 77 155 35 -177 51 -154 -107 8 -154 33 -90 158 124 218 -78 -45 -101 151 -162 7 -18 143 -53
4000e3O7R1R3n7j86J45j1m58K79J79j82K21l01J59K22r8n7O8J05k16K09m01K42
$$ -53 14 105 198 141 -45 100 89 -369 -90 89 -93 128 -173 -14 208 110 53 121 226 10 219 -182 60
4023F0kN6L28l93j71J14J60l50M01o7j3l85K84r2K43l53M03l5k47J22k18l7N4
$$ 60 58 114 442 49 -122 -8 152 -198 203 136 123 -262 22 -70 173 -180 223 188 -59 63 -155 -192 -138
4046a38J05L30k38J7m0j54j92J81R9k92N79j04j60J06J20o9m00N32k11L2k32L5
$$ -138 -33 297 59 76 36 -118 -310 -129 -30 -322 257 153 -7 99 219 150 -250 282 71 103 -129 -94
4068i4J92p8P3k49K71l3L8n4r1m6j20K77k64J37K95l20J80k20n4K41j22M1j59
$$ -94 98 20 93 -156 115 82 120 66 -25 -71 -191 86 -178 -41 254 -66 114 -106 -160 81 -41 0 -159
4091a59O6J39J34K4k10k94Q6K04j95L97j82l62K09R9J71m5p5J44k0k25K38j13
$$ -159 -93 46 180 204 -6 -300 -214 -10 -205 192 10 -352 -143 -44 127 82 7 151 131 -94 144 31
4113C1J36j83j10K74R5j78k3J84j30o6k8m9k92J58J4L77j52j2Ql51L30K73j67
$$ 31 167 -16 -126 148 243 65 42 226 96 30 2 -47 -339 -181 -167 210 58 46 54 -297 33 306 139
4136A39l01M5L6J87J4J04j76l8J25j33M1J6j36j6K1OJ8k81K84l8K70j3%j89p0
$$ 139 -162 -117 -81 106 120 224 48 10 135 2 43 59 -77 -93 -72 -66 -48 -329 -45 -83 187 174 174 -15 -85
4161h5K33R8l00Ll0O1M5j70K73l74Q0K71J6j80K04o5j87J71l22J91j41M0J23N1
$$ -85 148 246 -54 -51 -81 -20 25 -145 128 -246 -166 105 121 -59 145 80 -107 64 -258 -67 -208 -168 -45 6
4185FM8J01j66j80K42J45j75l71J10mJ61l83K39M49r1j98J70j99J25o4N0M25l83
$$ 6 54 155 -11 -191 51 196 21 -350 -240 -244 -83 -466 -227 222 131 -67 103 -96 29 -35 15 440 57
4208E7k39L82p0m4l11r9J96Q0J01K24m63J95k29K80L2p8J56k90k10N47K6k36R
$$ 57 -182 200 130 86 -225 -324 -128 -48 53 277 -186 9 -220 60 92 14 170 -120 -330 217 243 7 16
4231A6Jj47k59L97J07j21j03k6j5K00RJ39j80P8j41P3j14L4r4K03K76k42m31M06
$$ 16 17 -130 -389 8 115 -6 -109 -135 -150 50 59 198 18 96 -45 28 -86 -52 -146 57 333 91 -340 66
4255F6l8o7%K80l90J37r6K40j14J33l04J23P5j02m8j7K43pkq0L6j64K98l03J69
$$ 66 28 -39 -39 241 -149 -12 -108 132 18 151 -153 -30 45 -57 -105 -122 121 114 112 32 68 -96 202 -101 68
4280F8j73K29J9l39N0J80o5j22m3L31p9J07j59o7J71q0j57j06M35k04j8k47K93
$$ 68 -105 124 143 -196 -146 34 -31 -153 -196 135 56 163 4 -63 108 28 -129 -235 200 -4 -22 -269 24
4303B4k51J93k46j8n0M49Lk73Q3p2L03K9j25K43k67l09O52n01J8L65l35M9P4N3
$$ 24 -227 -34 -280 -298 -348 101 104 -169 -86 -158 145 174 49 292 25 -284 368 -133 -115 250 -85 -36 38 91
4327I1j17n4O6K30l24J55P8m64N95j50j19l5Ln5N8l2m2K49k81M2J77m10K22q2
$$ 91 -26 -80 -14 216 -108 47 125 -339 256 106 -13 -48 -45 -100 -42 -74 -116 133 -148 -106 71 -339 -117 -199
4351a99K26k58K31N3l11L57p8k6o2M4K18k25J39j94J09J78l71O2P8N8K8l7j33
$$ -199 27 -231 0 53 -258 99 21 -5 -67 -23 195 -30 109 -85 24 202 -169 -107 -29 29 57 20 -113
4374a13L52l88J07Q0q2N6J3J05K3j73J2j69J97j21J04K26l45j21J12J73P7k78
$$ -113 239 -149 -42 38 -44 12 25 130 153 -20 -8 -177 20 -101 3 229 -116 -237 -125 48 125 -153
4396a53Q6J38o8j58J0J79p7K27j92r8K75o6n3J0K66j17k54j20K38m5Ql8k71L3
$$ -153 -67 71 3 -155 -145 34 -43 184 -8 -106 169 103 50 60 326 209 -45 -165 73 28 36 -2 -273 -240
4420b40L75m44L86r9k28J47O9J8K68m59J56R6jj4P5K4j23nj73J26j25Q0Mj2k82
$$ -240 135 -309 77 -22 -250 -103 -34 -16 252 -207 -51 45 44 30 105 129 6 1 -172 -46 -171 -91 -87 -99 -381
4445c81O61j37l72K92j86j32K15j45O6J38j31J50r4p9J15L33o11J70K63K1k10
$$ -381 280 143 -229 63 -123 -255 -40 -185 -119 19 -112 38 -56 -135 -20 313 -298 -128 135 156 -54
4466e4K88k39L00j53K1l4k49K55p0J40j41O6q9k50R1k14L85L1j71L5M30k83k12
$$ -54 234 -5 295 142 163 129 -120 135 65 205 64 130 41 -209 -118 -332 53 84 -87 -52 378 95 -117
4489a17K44r1p5j84J64L78l55J7J66p2k60J51m9j19K19J00j60O3j52j7L5K45O0
$$ -117 127 36 -39 -223 -59 319 -36 -19 147 75 -185 -34 -83 -202 17 117 -43 20 -132 -149 -114 131 191
4512A91k23l0K6J36j12K21k24n0M1R9r1N4k34K18j6p3j50K34o9j05J78j47J61
$$ 191 -32 -62 -36 100 -12 209 -15 -65 -24 75 -16 38 -196 22 6 -67 -217 17 -52 -157 21 -126 35
4535C5l95K42J48o5K19k64J66R6j41j22Q1j82r9k6Q9J13P8R4k76L33j87J03J94
$$ 35 -360 -118 30 -35 184 -80 86 182 41 -81 0 -182 -281 -307 -218 -105 -27 67 -209 124 -63 40 234
4558B34k51R8k2j65J02j1J95L9j17k20K71k88P5J95j12K73k09k40m5O5N4J69K49
$$ 234 -17 81 59 -106 -4 -15 180 219 102 -118 153 -135 -60 135 23 296 87 -153 -198 -133 -79 90 339
4581C39l45j72J67J59oj64J57r7l0K18m71K73m1k2L34l74j93L16p0K30l32N6j59
$$ 339 -6 -178 -11 148 142 -22 135 38 8 226 -245 28 -13 -35 299 -75 -268 48 -22 208 -124 -68 -227
4604b27J32o5K02j83L4M68k97kj72K40l2j79j9J52k21K56k13J31Q2k04J7O1K35
$$ -227 -95 -160 42 -141 -107 361 64 62 -110 130 98 -81 -100 52 -169 87 -126 5 87 -117 -100 -39 196
4627A96j64j73K78J78O2l68j37K04p3J83k97j7L70k82j11ON2K0k3k3J07k13K17
$$ 196 32 -141 137 315 377 9 -128 76 3 186 -111 -128 242 -40 -151 -145 -93 -73 -96 -119 -12 -225 -8
4650hr5J25j8j44P4n3K48k08J65J05q5k88K9j55L16L0Pj16J8K19k71K6J41k47
$$ -8 -103 22 4 -140 -66 -119 129 -79 86 191 106 -182 -153 -308 8 38 45 -71 -53 166 -105 -79 62 -185
4674a85K1L39j21nL6M2n8L9j18m3J30k5N3m56J86K08N6j91P5P8o9q3j67M73j92
$$ -185 -164 175 54 49 85 127 69 108 -10 -53 77 52 105 -351 -165 43 99 -92 -17 61 -8 -91 -258 215 23
4699B3j68L27Q3m93M57j8m85L12J33k3j42j08J35oJ24R1n41M25R8k57n8L91k02
$$ 23 -145 182 265 -228 229 211 -274 38 171 148 6 -102 33 27 151 242 -299 126 224 -33 -91 300 98
4722I8m43L89j69j38K08J59J41j63j38m01O01J30j06m64K21Q9j35L43j87M5j53
$$ 98 -345 44 -125 -263 -55 104 245 82 -56 -457 144 274 168 -296 -75 14 -121 222 35 80 -73
4743g3Q7P0nk3J80k81J33n5J25j0lj00k13K00k87p1J03K16R3j74q3j62m8M97m18
$$ -73 14 84 79 56 236 -45 88 33 158 148 145 45 -168 32 -255 -326 -223 -7 86 -88 -171 -333 -381 116 -302
4768c02O57l04J60j74P6q5k8J44j73m2O8J02p1j28k48K66k14O3OK41m8m6K4q6
$$ -302 355 51 211 37 113 28 0 144 -29 -71 -3 99 28 -100 -348 -82 -296 -233 -227 14 -34 -80 -56 -142
4792a42L12q4Qm1p9Mj0N4k39J61j24O7p9M23l76J43Q1n7p8J27k17J33L56l87m5
$$ -142 170 86 94 53 -26 -22 -32 22 -217 -56 -180 -113 -192 231 -145 -2 79 22 -56 71 -146 -13 343 -44 -89
4817h9o9j7K64L7k99L56k86K65l34K38k37J58rK8r6L24l36J77l60K67J83j34K07
$$ -89 -158 -175 89 126 -173 183 -103 162 -172 66 -171 -13 -22 6 -90 234 -102 75 -285 -18 165 31 238
4840B38j45k75P3K99j4l1R9m00J30j22K35q0P6K90m42O1O1L10l84J02j84J50l19
$$ 238 93 -182 -109 190 176 145 244 -156 -26 -148 87 7 83 373 -69 -8 53 363 -21 81 -103 47 -272
4863b72L84k37q9J26K52r9k15J91m0j50J42J55j40K57j96Pl8K26k31j07K98m07
$$ -272 112 -125 -214 -88 164 65 -150 41 1 -149 -7 148 8 265 69 76 38 264 33 -74 224 -183
4885a83J84M8j09K02k03J60k2j8K04k69K05j04J12k47J89j80RJ1R2n6N5j08L30
$$ -183 1 49 -60 142 -61 99 77 59 263 -6 199 95 207 -40 149 -31 -22 -11 81 25 80 -28 302
4908C02j82j41j39K73pj60k33M43n7j95N6j19M53l83K36k89J78p6K79m73K1j5
$$ 302 120 -21 -160 113 106 -54 -287 156 99 -96 -40 -159 294 -89 147 -142 36 -40 239 -234 -213 -228
4930b28P6L87n76M58k01O6j51J40k4Kj73J04L75j77j04R1n4pK89p7m8j92j01K62
$$ -228 -152 235 -341 117 -84 -18 -169 -29 -53 -51 -224 -120 255 78 -26 65 11 4 293 216 168 -24 -125 137
4954A37k56J72q5J13l3j87L88j4j10o2o2k18M04l52K06R9k19K46r5j06k8k45J36
$$ 137 -119 53 -32 81 48 -139 249 235 125 63 1 -217 187 -165 41 140 -79 167 72 -34 -62 -307 -171
4977a71K39l36j48J55M52p2k07n7J65P9K31O6p23M01q8K34Jn04L08j40K43j98
$$ -171 68 -268 -416 -261 191 119 -88 -145 20 99 330 396 -327 74 -14 220 221 -283 25 -115 128 -70
4999g0N7j93K07kl8N3O0l7Q6k82R7J21M8l45K56J44l04J19o0j1J86n8Q3j94m8
$$ -70 -13 -206 1 -1 -39 14 74 37 123 -159 -62 59 107 -238 18 162 -142 -23 -83 -94 92 34 117 -77 -125
5024a25M9Q8O5n5j70J93N5o2q2j28K51j05j02L77l59K4J15K7k39L43k14L14j67
$$ -125 -76 12 77 22 -148 45 100 38 -44 -172 79 -26 -128 249 -110 -86 29 56 -183 160 -54 260 93
5047I3m0p5LQ0j27j28m3L65m6K63j12k48j61J49J86k35J25P7R7jk54J23j59m6
$$ 93 53 -22 -19 61 -66 -194 -237 128 82 345 233 -15 -176 -27 159 -76 49 126 223 222 -32 91 -68 -114
5071a14K09k12K97o5k22L12j19k5J36p3M5l19L92k14L7l6K41l55J55P9j42J2L6
$$ -114 95 -117 180 115 -107 205 86 61 197 124 169 -150 242 28 65 29 270 -85 70 149 7 19 55
5094E5K4K00l3l81MJ61j38J30M6L3l50N77l99J64nq1L1j99L26j84J63k66j37J10
$$ 55 79 279 246 -135 -131 30 -108 22 68 101 -249 328 -71 93 88 7 38 -161 165 -19 144 -122 -259 -149
5118a49J91k79O18k56j51M6o7K49j84Jj45J67r3p0J83k2K4n5Om38M43j07N3P2
$$ -149 42 -237 381 125 -26 20 -47 202 18 19 -126 41 -52 -122 61 39 63 8 14 -424 19 -88 -35 37
5142C7o2j5J34j32K98j69n7P5l9P4J62l71K46j36k52M27j19L0k0J9k84L56j5k76
$$ 37 -25 -40 94 -38 260 91 34 109 70 144 306 -65 181 45 -207 220 101 131 111 130 -154 202 187 -89
5166h9j4N9j12J00O8J92j57k35K97j06j83L79r7k00k38K91K00j05j69k03L65J0
$$ -89 -103 -44 -156 -56 12 204 47 -188 109 3 -180 199 102 -98 -336 -45 155 50 -119 -322 43 53
5188E3j24j29Q4l7m6jQ5%K5K18o0l57L09Mk75L41j23j6J32k66K18j3k20N7M23
$$ 53 -71 -200 -116 -153 -199 -200 -115 -115 -90 128 68 -289 20 24 -251 90 -33 -49 83 -183 35 22 -198 -141 282
5213B82k13Q6k13L93j92l85J76l04K45K6j49L57K16l89k68L92j13K51l30K49j32
$$ 282 69 155 -58 335 143 -242 -66 -370 -125 -99 -248 109 325 -64 -332 60 -53 198 -132 117 -15
5234a5J7k8J27J42p5j4q5oj06l4k59L54K48j74m44L34j6L06m17K71o1j5k29M15
$$ -15 2 -26 101 243 168 154 69 63 -43 -77 -336 18 266 92 -352 -18 -34 272 -145 126 65 50 -179 236
5258B36l50L58j14L5J19k36j68L82k35L3Mk87N19k03j24l2QJ29n2No6j09J82q3
$$ 236 -114 244 130 165 284 48 -120 262 27 60 64 -223 296 93 -31 -63 -55 74 22 27 -39 -148 34 -49
5282d9J06k09K45k1n7J18p7Lr9lL5Nj73K10j25L88l12K36j50J61k64K2Q7k54L3
$$ -49 57 -152 93 72 15 133 56 59 -40 -43 -8 -3 -176 34 -91 297 -15 221 71 232 -32 -10 77 -177 -144
5307a44J66j50J52J50l7j79j00L25l08k6L40k23Q5n0K7J23m4O9m03N20j45k0k9
$$ -144 22 -128 24 174 137 -42 -142 183 -125 -151 189 -34 51 1 28 151 107 176 -227 293 148 128 99
5330I9p4k45L68l16L8LK91l42K34J31k81L71k53Mj13j01L74j27j29K27K4k48N
$$ 99 25 -220 148 -168 -130 -127 164 -178 56 187 -94 277 24 28 -85 -186 188 61 -68 159 183 -65 -60
5353f0K3m3j1J20K56m10O3Q4N4J66j9k95q0P5M2J76j72k24N87j87l38L78k85N7
$$ -60 -37 -80 -91 29 285 -125 -62 22 76 242 223 -72 -152 -77 -35 141 -31 -255 332 145 -193 185 -100 -43
5377d3K13l46K05J92k85j75L17r3L1j8N6r9J45l42K67j63J80L42j94k88o0K09
$$ -43 170 -176 29 221 -64 -239 78 -15 16 -2 54 -45 100 -242 25 -138 42 384 190 -98 -158 51
5399E1l9O2n5K0o8o4K3J50l41M9K76m2l15L08j36K33J89m25j0P1J40J2k17N6k62
$$ 51 12 74 19 39 -29 -93 -70 80 -261 -212 64 22 -293 15 -121 112 301 -124 -134 -63 77 89 -128 -72 -334
5424c34M01j05j8Lm4p6o2K86l57K48J78r8j8k18K3L49k3J80k27l02L8J18K16l23
$$ -334 67 -38 -56 -53 -97 -173 -235 51 -306 -58 120 22 4 -214 -191 158 135 315 88 -214 -176 -58 158 -165
5448a65J97K31n29jL54QO2l78L64p2O7k3n8k32M8l3K52J40l62J42j42K78p3k70
$$ -165 32 263 -266 -267 87 95 157 -221 143 71 138 115 57 -175 -127 -160 92 232 -130 12 -130 148 75 -195
5472a95K70k08ko0J98K83k41N1k15M14k34M1k01j30K6L27k52K72K5j53r2j25L20
$$ -195 75 -133 -135 -195 3 286 45 96 -119 295 61 102 -99 -229 -203 124 -128 144 169 16 -76 -201 119
5495A19l44L01j46O8J56R3k13k5J17l46J06J43K82k24JM3j02J00L48l86j09q1
$$ 119 -225 76 -70 -2 154 247 34 9 126 -220 -114 29 311 87 88 131 29 129 477 91 -18 -99
5517i9J42J2K77l67r3J28M3p3j51J65J45m15L95M4r9l1m9Q7ML9j10j88R6K63m47
$$ -99 43 55 332 -35 -128 0 43 -30 -181 -16 129 -286 109 153 54 23 -26 61 65 104 -6 -194 -98 165 -282
5542b82J91P0p2L69k32L30k55N7k21M6K67j24P0k71K22k93O1p7k12M10n2K69l07
$$ -282 -91 -21 -93 276 44 374 119 176 -45 1 268 144 214 -57 165 -128 -67 -144 -356 54 2 271 -36
5565c6R0N1j30m4L00k03K35k54L4p7j43J9J33L23l24J98j25K63m7%m13J75R3j06
$$ -36 54 105 -25 -69 231 28 263 9 43 -34 -177 -158 -25 298 -26 172 47 310 263 263 -150 25 118 12
5589A2j40K24j24j8l9k1j1K92J10l43R9L62m16L13l74j44K27k83L76r5j76L99
$$ 12 -128 96 -28 -46 -85 -106 -117 175 285 -58 41 403 -13 300 -74 -218 9 -274 102 7 -169 230
5611B30o57K87o9M84j89l4j64k6J94Jk5k33L22j59j39P3L83l00k07M15k58P1l20
$$ 230 -427 -140 -209 275 86 52 -112 -138 56 57 32 -201 121 -38 -177 -104 279 -21 -228 187 -71 0 -320
5634c20K58N6j39L00j40k43J53p5J66J43j70k1J45lq9j62J37m5j58N43l87p5L15
$$ -320 -62 -6 -145 155 15 -228 -75 -150 16 159 -11 -32 113 110 21 -141 -4 -49 -207 336 -51 -126 189
5657A89k01j52J63p7R8J29Rk06M9J6k77M29k04k31L58j34j24K76o9j5q9K27k24
$$ 189 -12 -164 -1 -78 20 149 158 -48 1 17 -260 169 -35 -266 92 -42 -166 110 41 26 -63 164 -60
5680f0L50k62j67J78K01L5n86M60k05k6m6J58j69OJ21l1j65K39j04J17L5l99N54
$$ -60 290 28 -139 39 240 275 -311 149 -56 -82 -128 30 -139 -133 -12 -43 -208 31 -73 44 79 -320 234
5703B34k90K45k33K08l36n0M74j49l11L8K19n4M7p9L09k68Q4J00l24K7J4K04k99
$$ 234 -56 189 -44 164 -172 -222 252 103 -208 -170 49 -5 42 -37 272 4 88 188 -136 -109 -95 109 -190
5726a90J94j93K66P5l92J45J27r4J49Q8k39%L44p4k48J82q9n0n2o7J00O3l60J49
$$ -190 4 -189 77 152 -240 -95 32 -62 87 175 -64 -64 280 206 -42 140 51 1 -51 -118 -18 45 -315 -166
5750a66K2K24m7m3o9K36l14K92J61k45nj49P2K3J06J45k15j92K63k23L0J78k62
$$ -166 -144 80 33 -10 -79 157 -157 135 296 51 46 -103 -31 -8 98 243 28 -164 99 -124 -94 84 -178
5773a78J11N1N3j89L0L00k45J01J47k46J87k75J0J33j80k1L48m2k08l7K27r0J24
$$ -178 -67 -16 37 -152 -122 178 -67 34 181 -65 122 -153 -143 -10 -190 -211 137 95 -113 -150 77 -13 111
5796A11j72L0K18k78k0K7J47l8L50k18j64J04m37L91K96m40J07M6J22k73K54j02
$$ 111 -61 -31 187 -91 -111 -84 63 25 375 157 -7 97 -340 51 347 -93 14 60 182 -91 163 61
5818F1n7l3R7o9j80K73K06l58k27k9M89p0p4jk41K37k22K88j07K46j24kl55N07
$$ 61 4 -29 68 -1 -181 92 298 -60 -287 -316 173 103 29 28 -213 24 -198 90 -17 229 105 103 -252 255
5842B55k79K53l67k6J94k09K13J7J09j00j21J3m5M1L19l63J80L39l17o2k5J34
$$ 255 -24 229 -138 -164 30 -179 34 51 160 60 -61 -48 -93 -52 267 -96 84 423 106 44 19 153
5864A53k83O3r6L04r8j45L21l25l46L40l2J27O0J15p2k8m2j16J33k76J67k15K83
$$ 153 -130 -67 -163 141 43 -102 219 -106 -452 -112 -144 -17 43 158 86 58 16 -100 33 -243 -76 -291 -8
5887hp5J23j12K43j23k46L43k89J77q9Q6Lj70K42j72j27K12J41j82j3j12N4l7
$$ -8 -83 40 -72 171 48 -198 145 -144 33 -56 30 33 -137 105 -67 -194 18 159 -23 -36 -148 -94 -131
5910a31J27J90j86q7K96J72n95rj00J29J56j2m5R9K10k72K35l77M16l57J96J35
$$ -131 -4 186 0 -87 209 381 -214 -223 -323 -194 -38 -50 -95 4 214 -58 177 -200 216 -141 55 190
5932A90p9j16j10L5P7J18P7j00n8k3M2Kq8N1K24l81p3J68K60n04L59l01K40k49
$$ 190 111 -5 -115 -80 -3 115 192 92 34 11 53 55 -33 18 242 -139 -212 -44 216 -288 71 -230 10 -239
5956b39K68j9j68J74L0o1j75K96k36J5O0k9J78j21j52J15J78k43J03J71k57J19
$$ -239 29 10 -158 16 46 -15 -190 106 -130 -115 -55 -84 94 -27 -179 -64 114 -129 -26 145 -112 7
5978GP3j52Q1j62K95j47J95j18l36J00l00L91l5L6J37k61j48M90j10j6m15L34
$$ 7 80 -72 9 -153 142 -5 190 72 -264 -164 -464 -73 -108 -72 65 -196 -344 146 36 20 -395 -61
6000f1L6K5J40J1n8j82J3R4p2L11m71M1J85P7j14k32K76N6j16J52j89P9j19n6
$$ -61 -25 0 140 151 93 -89 -76 18 -54 257 -214 -173 12 89 -25 -257 19 75 -41 111 -78 1 -118 -174
6024a74L34o6l34rL70l19K82j79K58k55P0J77j49K95k92k83K45J43O4j94m4J58
$$ -174 160 94 -240 -249 121 -198 84 -95 163 -92 -22 155 6 301 9 -274 -29 114 178 -16 -60 98
6046I8k26JP8lJ45k57P4K53l39J83J13q8q8r7J30j65K40k0K02j99O6pj00J43r2
$$ 98 -128 -127 -49 -52 93 -164 -90 163 -176 7 120 32 -56 -153 -23 -188 52 32 234 35 101 94 -6 137 45
6071D5J4j56K0K27J4q5m04L79k46M02k91kj24K44J06n25M78o6j0p9o2K66k58J21
$$ 45 59 -97 -77 150 164 79 -325 54 -192 210 -81 -83 -207 37 143 -382 96 30 20 -59 -121 145 -113 8
6095Hj24r5K3M03q9L5l55J71L58k91M9l80N1O1L82j99L8o9M3K8J1ln6j04j91L12
$$ 8 -116 -211 -188 215 126 161 -194 -23 335 44 93 -287 -236 -175 207 8 46 -23 20 48 59 56 0 -104 -295 17
6121A7N3J26l90J95j72R0J86j37NJ87k87N4j66K76j09N5r9J63l4j25O07p17K92
$$ 17 70 196 -194 1 -171 -81 105 -32 -27 160 -127 -73 -239 37 -72 -17 -116 47 13 -112 495 -222 70
6144G0O8q6L4j77J07K52k45n8k8K28j74J0n0j75K96j66K5M39m64j70L11j27J89
$$ 70 138 52 86 -91 16 268 23 -35 -63 165 -9 1 -49 -224 72 -94 -69 370 -94 -264 47 -80 109
6167A09j51QJ51j55L9K5J4p4m8k7J05k5K49KJ85m48J00L4j75k8K19k75j26K61
$$ 109 -42 -34 117 -38 1 26 40 -34 -82 -109 -4 -29 220 222 407 -41 59 93 -82 -110 109 -166 -292 -31
6191c1o3J30l67M10k02K68L4k92N2L70k78J36m39K89J58Q8j35O5n8j57M3J33J1
$$ -31 -94 36 -331 79 -123 145 179 -113 -61 309 31 167 -272 17 175 263 128 193 135 -22 21 154 165
6214A65M9o8j36J5k86Q6K03j39J87j10J14k35J10N86m32k29K32j59j31R5j44K99
$$ 165 214 146 10 25 -261 -175 28 -111 76 -34 80 -155 -45 541 109 -120 112 -47 -178 -83 -227 72
6236G2K98m26j48K56j96qJ58P2n8j33P7K04k86J21l4L2L15m41L9K41o8M4j58o1
$$ 72 370 -56 -204 52 -144 -152 6 78 20 -113 -36 168 -118 3 -31 1 316 -125 -86 155 87 131 -27 -88
6260h8p9J11p1Q7M3J68k36L49J11o13J69j27J55j7j11M51l10j42K8p9O5J17J31
$$ -88 -167 -56 -127 -40 3 171 -65 284 395 -218 -49 -176 -21 -38 -149 302 -8 -150 -122 -201 -136 -19 112
6283A12q3J5J55j54L08j47q0O1J5k42K46m27L62P8j39N3j24k93J78o3J43K90n4
$$ 112 29 44 199 45 353 206 126 187 202 -40 206 -221 141 219 80 133 9 -284 -106 -169 -26 264 210
6306B10r0k4j06l9J67R3j88n8k8j8O7no4j43O5L17k13J48J43j63m4o3j75J17J80
$$ 210 120 96 -10 -49 118 211 23 -35 -63 -81 -14 -19 -83 -226 -161 156 -57 91 234 71 27 -36 -211 -94 86
6331H6p8o6k0K98k70l88M81M3L8j60L9o0o6J02J36j62j1J00j0qPJ4P7J80n5k99
$$ 86 8 -58 -78 220 -50 -438 43 86 124 -36 3 -57 -123 -21 115 -47 -58 42 32 24 31 45 122 302 247 -52
6357e2o8M12l30J7j25N9n3N89m02j66J01k06J21P0j89N0L6J34j47L39k84L67l10
$$ -52 -120 292 -38 -21 -146 -87 -140 449 47 -119 -18 -224 -103 -33 -222 -172 -136 -2 -149 190 -94 273 -37
6380c7M8M8j00l0j37Q6K46q7j33K19j10R9n8m67M00n7J51k7j12j53L34Q4k48k14
$$ -37 11 59 -41 -71 -208 -122 124 37 -96 123 13 112 54 -413 -13 -70 81 54 -58 -211 123 207 -41 -255
6404b55K69p7n8j4J63M7o5j47K28J6r0N1k08J88l4K0K00l65P1J99J53l96J40L5
$$ -255 14 -63 -121 -135 28 75 10 -137 91 107 17 68 -140 48 14 34 234 -131 -60 139 292 -104 36 71
6428G1j63l7pM58j49l02J39k06L15J83m32J28j25K70j42J52o9k49M35o27M73l70
$$ 71 -92 -129 -136 322 173 -129 10 -196 119 302 -130 -2 -127 143 1 153 84 -165 270 -357 116 -254
6450b54L53p1O5m1j3o8J76m23M83k13K78l99K92k8j57J48k0J7l88K36K39k06j8
$$ -254 99 28 93 52 39 -29 147 -276 207 -6 272 -127 165 137 -20 128 108 125 -263 -27 212 6 -12
6473a2J95k43lJ23j8l34N54k58J98k66LK03m4j61M6K42l68J79j8P7k30Q2J36r2
$$ -12 183 -60 -63 60 42 -292 262 4 202 -64 -61 142 98 -63 -17 225 -143 36 18 95 -135 -53 83 -9
6497iJ03j41J47k43K4j25K16R0L3O8P0j74l8j6o5N1P3l58K77J1l58J66R8K87M3
$$ -9 94 -47 100 -143 -119 -244 -28 62 95 163 233 59 21 5 -60 -9 64 -294 -17 -6 -364 -198 -100 187 230
6522B30O0m03J07K5k95K30oJ0P1j08n0R1J81q0P1RK5k38m0K40k08%P3L9L7k99
$$ 230 290 -113 -6 19 -276 -46 -52 -42 29 -79 -129 -38 143 63 134 143 168 -70 -110 130 -78 -78 -5 34 71 -228
6548b28M11j53m7J38j75O9M5J82k61j09m9L34j81K19l36J33k7l0J51j98o8M26
$$ -228 183 30 -17 121 -54 15 60 242 -19 -128 -177 157 -24 195 -141 -8 -35 -65 86 -112 -180 246
6570B46l98L94l33N0Q1K19l74j78K68q4N0OO2j3N6lJ58m14K98l8L18o18JK42P9
$$ 246 -152 242 -91 -41 40 259 -115 -293 -25 -109 -59 -53 9 -4 52 49 207 -207 91 53 371 -247 -246 -4 75
6595G5k32K12p3j94J59K70n35M02k88K13j81J14j17m6K13j75L77k28j4O7j03R
$$ 75 -157 55 -18 -212 -53 217 -318 84 -204 9 -172 -58 -175 -221 -8 -183 194 -34 -48 19 -84 -75
6617g5nJ06J54j15l22K63J17k22m4J36J73j06j49M4J25j47K54j02p6j93J95J32
$$ -75 -80 26 180 65 -257 6 123 -99 -143 -7 166 60 -89 -45 80 -67 187 85 9 -184 11 143
6639A43R0K6l14J84p2m7K09p5q6k03N77l08Q7k92J90j8j75j9J59k27J64K3J12
$$ 143 233 259 -55 129 57 10 219 144 58 -145 432 124 211 -81 109 91 -84 -103 56 -171 -7 16 128
6662A28k56M91p7o1j16k34k03M48l83M49J94j99k11j06K87j17k23M56l87l9K32
$$ 128 -128 363 286 225 109 -125 -328 120 -263 186 380 181 -30 -136 151 34 -189 267 -120 -159 73
6683G3k93O1K07K20k38J4k38J65j53N9M5J82P8J23l58k9K33j38J58o3k8J55k57
$$ 73 -220 -159 48 268 30 44 -194 -29 -182 -123 -78 104 182 305 -53 -82 151 13 171 108 80 235 -22
6706b2j41K25q4q0J45j56J28j55K7K33P3k71j65OP3Q9K2k0j2J21j62K08l1kk21
$$ -22 -163 62 -22 -102 43 -113 15 -140 -113 120 193 -78 -243 -237 -164 -75 -53 -73 -85 36 -126 82 51 49 -172
6731a72K02M0j62k47L68N5k31k4L10j32P1k93M24m32M26n76L54k2r3L03q3J01
$$ -172 30 70 -92 -339 29 84 -147 -171 139 7 78 -215 209 -223 203 -373 -19 -41 -134 169 86 187
6753A87j8l09j6L8q0K15l32M95j25P1k9j98Kl1L61q1k61J48k78K33j56L94l27
$$ 187 169 -140 -156 -118 -198 17 -315 180 55 126 97 -101 -99 -130 231 150 -111 37 -241 -8 -164 230 -97
6776i7J17J97L2j20Q2n3k31j5n1m8J47R1j47J77j24J18j50K6J82n84N82K4J4k61
$$ -97 20 217 249 129 211 158 -73 -88 -139 -187 -40 51 -96 81 -43 75 -75 -49 133 -451 131 155 169 -92
6800i2J87m9l8n0M6M7J5k11J55j2k61J55P1J78l67L41j64m4k80M70j63J99k99
$$ -92 95 46 8 -42 4 51 66 -145 10 -2 -263 -108 -37 141 -226 115 -49 -93 -373 97 -66 133 -166
6823a66k3N8K03Q0k25J72J99l58N8L5o2K86r6Q8k35j50J78r0P8r1N9l77M20K92
$$ -166 -189 -131 72 152 -73 99 298 -60 -2 33 -29 257 161 249 14 -136 42 -48 30 -61 -2 -379 41 333
6847C33l40J7R1q8J20M9p2l1L0p3M5l8k02QJ6j11L38M5l5j12o4K02j94k16L30
$$ 333 -7 10 101 13 133 182 110 79 109 36 81 43 -159 -151 -135 -246 92 137 102 -10 -74 128 -66 -282 48
6872D8k3ko9M3Q1n3O8k44j56J88J29J97J77l35p8j15O7j9K11J6K63n93m4K49l06
$$ 48 25 23 -46 -3 78 25 93 -151 -307 -119 10 207 384 49 -29 -144 -77 -96 115 131 394 -199 -243 6 -300
6897c00J08K71q5m4j56J2J35K1Q1M6l4M4m4J43q5P0j23Q3M5n06L16J74k75J55
$$ -300 -192 79 -6 -50 -206 -194 -59 -38 43 89 55 99 55 198 113 183 60 143 188 -318 -2 172 -103 52
6921E2j60K46l63J69M5J64j58M8J0l20M14k24oJ23O2k0j66kM83k04j91r3lk23
$$ 52 -108 138 -225 -56 -11 153 -5 43 53 -267 147 -77 -83 40 102 82 -84 -86 397 193 2 -91 -94 -317
6945c17M52J09l08J17q9J97n3O4k27j4n2m8J56K1j44K3J51O9k0j75J62r2M10l94
$$ -317 135 244 -64 53 -36 161 108 172 -55 -69 -121 -169 -13 8 -136 -113 38 107 87 -88 74 -18 392 -2
6969bJ05p7k62K06J7L9k16L93m9k4j21j4J1k2M1j32J52m5N1Qo0Qk73K82j53K42
$$ -2 103 26 -236 -30 -13 26 -190 203 154 130 9 -5 6 -16 25 -107 45 0 51 59 -1 7 -266 16 -137 105
6995A05N5l07M38p4M0n75J49K18j56L65j72P0l08J31J50K8k76J76K0k46p5J03
$$ 105 160 -147 291 217 257 -318 -169 49 -107 258 86 156 -152 -21 129 157 -119 57 77 -169 -244 -141
7017a41n8L90j61m7j24K77j23J09k26nQ8o4J37K15o0j83j76O8J42l63J03K74j58
$$ -141 -199 191 30 -17 -141 136 13 122 -104 -109 -21 -85 52 267 207 24 -152 -84 58 -305 -202 72 -86
7040h6j04K16k00R8J08j8j70k33L99m6PJ47J38k76o6K9p3l8K25j27M7Q7j27L57
$$ -86 -190 26 -174 -76 32 14 -156 -389 10 -36 -29 118 256 -20 -86 -57 -130 -168 57 -70 -23 64 -63 294
7064B94n31J63L3KJ7j74K74j0R0j75nQ6J69m4j68j32K14l80L14j11J32oj45K69
$$ 294 -237 -74 -41 -39 -22 -196 78 68 158 -17 -22 64 233 189 21 -111 103 -277 37 -74 58 52 -93 176
7088A76k30p1J68n7j47K52l17O6J77JJ93m35K29j03J27J12l82R2K37Nk02j90M71
$$ 176 -54 -125 43 -14 -161 91 -226 -160 17 18 211 -224 5 -98 29 141 -241 -149 88 93 -109 -299 172
7111A72l02O3K12n4ql77L69l9J34l03K96p8l71K30K2M2M3j17O0M2J13m70K06J12
$$ 172 -130 -67 145 91 83 -294 75 36 170 -133 163 85 -286 -56 -34 8 51 -66 -6 36 149 -321 -115 -3
7135cl8P5q5O8J72j49p7K01j46rrL2j13j73J24L17k19K85l25J84r0j62J78M0o4
$$ -3 -41 34 -51 17 189 40 -37 164 18 9 0 32 -81 -254 -130 187 -32 253 -72 112 22 -140 38 78 14
7160A4j67K05m9P0Q2p8J44l31J97k12o9N52m72M06l36R6k77M7J77M1j18M14k10
$$ 14 -153 52 3 73 155 77 221 -110 87 -125 -194 358 -114 292 -44 52 -225 -178 -1 40 -78 336 126
7183A26O7j83j57K83Pj21j55J54O3k2k48L02m3J3k1q0j5l0l0J92O6l52P6j6J18
$$ 126 193 10 -147 136 143 22 -133 21 84 62 -186 116 73 86 65 -15 -30 -60 -90 102 168 -184 -108 -124 -6
7208fJ37Ok03l4J36j10J21k35J91N1p7J41R0K2n4l67K50j48J65k10o9K07P3j9
$$ -6 131 137 -66 -100 36 -74 47 -188 3 54 -23 118 208 230 176 -191 59 -89 76 -134 -203 4 77 58
7232E8K93l58k35K3L66k5j16l49K83J16N8k50K54J0j19K84j78k76O0Q6k06K17
$$ 58 351 -7 -242 -219 147 122 6 -343 -60 56 114 -136 118 128 9 293 115 -161 -101 -15 -221 -4
7254dJ07J20k36m3J90k07J35nk02J48j34l7N99k68n6k30J95J37m67P4K95R7k13
$$ -4 103 223 -13 -56 134 -73 62 57 -145 3 -131 -168 431 163 107 -123 72 209 -258 -184 111 208 -5
7277eR6o4k25K47Q2j06j61K27k22rrL80p7k4Nj02k7M0k5k03J43J19j56n4K00L9
$$ -5 91 27 -198 49 131 25 -136 91 -131 -140 -149 231 154 130 135 33 6 46 21 -182 -39 80 -76 -130 70 109
7303A09l50J91j95J05J7rK58P9l30K54p2K22k87l1O7J07k1j81r1K08K9J32l72
$$ 109 -241 -50 -245 -140 -123 -132 126 205 -125 129 57 279 -8 -39 28 135 114 -67 -158 50 79 211 -161
7326a61L52J04l09J5l3o6R8l3Q3J61j51J79l31M41r6l11qj14K32j07M0j23j0L12
$$ -161 191 295 -14 1 -32 -98 0 -33 50 211 60 239 -92 349 253 -58 -66 -180 52 -55 -15 -138 -148 164
7350A64j09k42jR4K56n9Q8k34J16r9J0j70K85j34M2J56j99j31K20j56L03k24j69
$$ 164 55 -187 -188 -94 162 103 191 -43 73 -26 -16 -186 99 -35 7 163 -36 -167 53 -103 200 -24 -193
7373a93Q3J7L02r4k37k5l1J51Q7j39RM49k63j79J09j82j27J53J58l7J54k31K05
$$ -193 -110 -93 209 115 -122 -147 -178 -27 60 -79 -70 379 116 -63 46 -136 -263 -110 48 11 165 -66 139
7396A39N2j48k6J61k73J56O2p8k5L3j0O3Kj32P5o8n6J44J02j30q5O3l02K44O5
$$ 139 191 43 17 178 -95 61 123 45 20 53 43 106 108 -24 51 -17 -73 71 173 43 -42 21 -281 -37 28
7421B8k77L54j43K44k73N11m44k66R4N24j33r5j45j25M99l14j7j66J5m8K76jp2
$$ 28 -249 105 -38 206 -67 444 0 -266 -172 352 219 124 -21 -146 353 39 22 -144 -129 -177 99 98 26
7444B6r2J04N1k4%o7q2L89l25O1K4j95K48m37L5J27J75j02J17j63j57M59N2j74
$$ 26 -66 38 89 65 65 -2 -84 305 -20 41 65 -130 118 -319 -284 -157 18 -84 33 -130 -287 172 224 50
7468E0J62l5k77J77M0r6j22k00J55M5m0k55N46k32J1K16l62M02j33k52K59r1J84
$$ 50 212 177 -100 77 117 21 -101 -301 -146 -101 -141 -396 150 -82 -71 145 -217 185 52 -200 59 -32 152
7491A52k62K87K53l33j70J28p9j38L36k60O4j41o3j68N58k90q3M4j07M10k20K70
$$ 152 -110 177 430 97 -73 55 -24 -162 174 -86 -22 -163 -226 -394 164 -126 -209 -165 -272 138 -82 188
7513A88m78K11K76j23J03on10J26M04j71J1J19j05j45K24j70j24K37l55M45k56
$$ 188 -290 -79 197 74 177 171 -339 -213 191 20 31 150 45 -100 124 -46 -170 67 -288 157 -99
7534i9J38j82j65N96l61m6o3Q9L31l67K05Mj89J61j95L16k68L94l38J54o0k5k64
$$ -99 39 -143 -308 288 -73 -119 -182 -93 238 -129 76 80 -109 52 -143 173 -95 299 -39 115 55 30 -234
7557b34K7K25j39L22k91j59L97m8q1l6Q6J78k25j17M1Q7r7p3L0Q5J21k15J38J61
$$ -234 -207 18 -121 201 -90 -249 148 100 19 -17 69 247 22 -95 -54 33 -64 -137 -107 -22 99 -116 22 183
7581A83l8j24l2J36j76N8l1j4J7M91m32k76K79r1n9J38j09l5J66k61K51m5J15
$$ 183 145 21 -11 125 -51 7 -24 -38 -21 470 38 -238 41 -50 -109 29 -80 -115 51 -210 41 -4 111
7604A11m36L92K01m52J38M0J97j28J02k71k2J25j40J75L0j27Mo8K17pP3j12Q1
$$ 111 -325 67 268 -184 -46 -6 191 63 165 -106 -128 -3 -143 32 62 -65 -61 -129 88 81 154 42 123
7627A23N1k70M48n28R8L00l66k5K22j30n2L62l98J79L7j15q7K16J0l9p9J23N9
$$ 123 174 -96 352 -176 -78 222 -144 -169 53 -77 -129 233 -165 14 51 -64 -151 65 75 36 -43 80 139
7650A39P1p0m33K68R0l65L69k63K46j06k7K29o33K71J97K50k61j17L37k23lL50
$$ 139 210 140 -293 -25 65 -300 69 -194 52 -54 -81 148 -485 -214 -17 233 -28 -145 192 -31 -34 316
7672C16l52Q0J00q2j34j54M71k10O7n3L2N8K3r5J43k15J76j62Q7m9L3k94K76p
$$ 316 -36 44 144 62 -72 -226 245 35 102 49 81 139 162 67 210 -5 171 9 96 47 80 -214 62 55
7696E5k47J91L5k05J30J56l28J49k7R3k0J84j01mj14P6j1K40k40j16J21p5l2K83
$$ 55 -192 -1 34 -171 -41 115 -213 -64 -91 2 -18 166 65 61 -53 23 12 252 12 -104 17 -58 -90 193
7720A93%m16R2J58l4p2K6n2J71k69J31J19R8o7j17J68M1l2j78K99j67r0l35L55
$$ 193 193 -223 -131 27 -7 -79 -53 -105 66 -203 -72 47 145 78 -39 129 170 138 -40 259 92 2 -333 22
7744B2J54l86M11k77k7KR8p8K34j29q8L36j15k38q2J22l5J82J84K5p6j68K28o01
$$ 22 176 -210 201 -76 -103 -101 -3 -81 153 24 -64 272 157 -81 -163 -41 -76 106 290 315 239 71 299 -302
7768c02J15J90M7p3J13q6O9R4j02Lk45J92K70n63K82K89n56J39R9m0J49k2K5j48
$$ -302 -187 3 50 -23 90 4 73 167 65 68 -177 15 285 -278 4 293 -263 -124 -25 -65 84 62 87 -61
7792f1k42K55J27L5j58j62J11K67k73j2j65K30J4%M1j92J04K41j06j30J57mj35
$$ -61 -303 -48 79 114 -44 -206 -95 172 -101 -113 -278 -48 -34 -34 7 -185 -81 160 54 -76 81 77 -58
7815e8P8k9J81l23K53q9l08j04L69R8L7j82O7N5J24k71M71m15L5J28Op9k20K20
$$ -58 20 -9 172 -151 102 13 -295 -399 -30 68 105 -77 -10 45 169 -102 369 -46 -11 117 123 44 -176 44
7839D4j8O8Q0j85R9r2j64J30o4q1L25k80o3Nj33M53k00n9M6k5P6l95O20j56j6
$$ 44 26 94 174 -11 88 -4 -168 -38 -102 -183 142 -138 -201 -196 -329 124 -76 -135 -89 -114 -38 -433 187 31 15
7864A5p1J19o8k3K15j19Ml82N21j46k86J50p8K76P5l55J25%j28L48l64N4j3p8
$$ 15 -56 63 -5 -28 187 68 72 -310 211 65 -221 -71 -149 127 202 -153 -28 -28 -156 192 -172 -118 -131 -209
7888b09L46l38L43k58L48k48N8k71L11j93K75r8L6J87m09J69l11J09j5j68L45
$$ -209 137 -201 142 -116 232 -16 42 -229 82 -111 164 66 102 289 -120 49 -262 -153 -168 -336 9
7909Ik9L6J14m4R5r2j28L14l33N3k5J07K2lJ22k97J35K10m31J00p6j86K48j08
$$ 9 -20 16 130 86 181 89 -39 275 -58 -5 -30 77 99 96 218 -79 56 266 -165 -65 -141 -327 -79 -187
7933a87O5K52J19k85j7N6qJ19K4o0rl03K72K32m42K52j98P4K29J89k51J8L5j84
$$ -187 -122 130 249 -36 -53 3 -5 114 138 78 69 -234 38 270 -172 80 -118 -44 185 374 123 141 176 -8
7957hk40M50m79P1K78k36P7J07j76J40J8J94j84l8k5J40O6k08K61k64P4L1J60
$$ -8 -248 202 -277 -206 72 -164 -87 20 -156 -16 2 196 12 -26 -51 89 155 -53 208 -56 18 49 209
7980B09m58N31l75j65L73j17K25j59k10J03J7J60n02L79M1O7P9k97Q3K91j03k50
$$ 209 -249 282 -93 -258 115 -2 223 64 -146 -43 -26 134 -368 11 52 119 198 -99 -16 275 172 -78
8002g8J39R3n7nk08K07k90J59N8j10J34O1j6r0N2N8k32K91k86J89Kj56p6K42J20
$$ -78 61 154 97 92 -116 91 -199 -40 18 -92 42 103 87 -3 49 107 -125 166 -120 69 71 -85 -161 81 201
8027B01k28K53k99j34L66l42K95j39j52o1Q2J57P8k98L45l49K90kNj05oJ28N9
$$ 201 -27 226 -73 -207 159 -183 112 -27 -179 -240 -158 -1 77 -221 124 -225 65 63 68 -37 -43 85 144
8050A44j02Oo5p1j47M20l87K13J37ol54K00J18j26j75N4j06J19K02n7j78K91l
$$ 144 42 48 -17 -88 -235 185 -202 11 148 142 -212 -12 106 -20 -195 -141 -247 -128 74 17 -161 130 127
8073A27j38J70k89Q3j25J25K4L8Pk2O3J8j42K40j67O9k86K98O4k70K23l0j24Q5
$$ 127 -11 159 -130 -47 -172 -47 -23 15 22 0 63 81 -61 179 12 81 -205 93 157 -113 110 80 -44 41
8097D1m7R8O2k59J27k93J98N4L85k09j19j19K51k60M1J1J81j62M2j50q5K45p6
$$ 41 -6 92 154 -105 22 -271 -73 -19 366 157 38 -81 170 -90 -49 -38 143 -19 23 -127 -212 33 -43
8120d3J46P7m69K80L53l17j53j58M67j72P6k73K22K6l96K05QJ68n6j47k0K53m0
$$ -43 103 180 -289 -9 344 27 -126 -284 183 11 87 -186 36 62 -334 -129 -121 47 -9 -156 -176 77 37
8143C7J61l77L15k33j7P8J44L73l14R2j63k48L90l89K46j94N7L0J65m30K31P4
$$ 37 198 -179 136 -97 -114 -36 108 481 167 259 96 -152 238 -151 95 -99 -42 -12 153 -277 -46 28
8165B8l9j37k7K9m8J01l4L48k41k31K44P1O8j34j62J33J52n9q5J52j62K88l89
$$ 28 -11 -148 -175 -146 -194 -93 -127 221 -20 -251 -7 64 132 -2 -164 -31 121 62 -23 129 -33 255 -134
8188a34J69K6J60
$$ -134 35 61 221
8191B21
$$ Imaginary data points
##PAGE= N=2
##DATA TABLE= (X++(I..I)), XYDATA
0@%%%%%%%%Qj6J6j6K4l2M0m8N6p2Q8j05J29j60J92k24K64l12L60m16M81n52O32
$$ 0 0 0 0 0 0 0 0 0 8 -8 8 -8 16 -16 24 -24 32 -40 48 -57 72 -88 104 -120 144 -168 192 -224 257 -295 337
31C37p22Q21r29J050j186J337j498J675j872K085k320K575k851L156l491L856
$$ 337 -385 436 -493 557 -629 708 -790 885 -987 1098 -1222 1353 -1498 1658 -1833 2023
47B023m252M684n161N688o268O908p617Q409r299J0309j1463J2794j4353J6206
$$ 2023 -2229 2455 -2706 2982 -3286 3622 -3995 4414 -4885 5424 -6039 6755 -7598 8608
61H608j8453K1245k4823K9595l6312M6525o4098J02415l30941K46692M52218o58986
$$ 8608 -9845 11400 -13423 16172 -20140 26385 -37713 64702 -266239 -19547 432671 -226315
73b26315J65020M24717m27972l10369N08891n825l21451K64034K10399m07975
$$ -226315 -61295 363422 -64550 -374919 133972 128147 -193304 70730 281129 -126846
83a26846m3829L18697j02808k18279K04058J04392j66616m6454J19254j6286j26263
$$ -126846 -170675 148022 45214 -173065 30993 135385 -31231 -77685 41569 25283 -100980
94a00980L1088J78491o7915j40867J63465N4731k64058M9962K35762j50916q2868
$$ -100980 -69892 108599 40684 -100183 63282 118013 -146045 -96083 139679 -11237 -94105
105i4105K76995o8085l13287J59563J72832k80807L0309L66972j63005k86775
$$ -94105 182890 114805 -198482 -38919 133913 -146894 -116585 250387 87382 -199393
115a99393K23965N3581k56357J33433K12328j74981n9775J64498p2275j45019
$$ -199393 24572 78153 -178204 -44771 167557 -7424 -67199 97299 25024 -119995
125a19995J12334R6790j06673k2843J18955k4252j27054K0798Q3156l4006l6484
$$ -119995 -7661 89129 -17544 -40387 78568 54316 -72738 -51940 31216 -2790 -39274
136c9274Q0874K6944j32281k3525J35848m2559r0815J58941L6295k01854N2610
$$ -39274 41600 68544 -63737 -87262 48586 6027 -84788 74153 110448 -91406 -38796
147c8796J44345j56677m9149K06994l7678j68550J24482Q7496j95906j5200J81985
$$ -38796 105549 -51128 -100277 106717 69039 -99511 24971 112467 -83439 -98639 83346
158H3346p8007j08018J60973K2675j63970N6667R3250j09477j6028J17475j6348
$$ 83346 5339 -102679 58294 80969 -83001 -26334 66916 -42561 -58589 58886 42538
169D2538p1569L8954K9197o1890j6636O5913P475m6048J0624J5900l9743j6618
$$ 42538 -29031 9923 39120 -22770 -39406 26507 33982 -12066 -1442 14458 -25285 -41903
181d1903M3737K9146l3057j8218L9883k0447n4047O2442M2063p3832J7417O7997
$$ -41903 1834 30980 -2077 -20295 19588 -859 -54906 7536 49599 -24233 -6816 61181
193F1181o5608l8765P5478j0206p0031M5309N3013o3560k0153O6869l1490o1868
$$ 61181 -4427 -43192 32286 22080 -47951 -2642 50371 -13189 -33342 33527 2037 -59831
205e9831O4040K5854o5937K8843N0508n3100j6973M7500p630k9056K1652K0994
$$ -59831 4209 30063 -35874 -7031 43477 -9623 -26596 20904 13274 -15782 5870 26864
217B6864k5933j6346K7282j876k9343J9846J8517l0054q698K0531k560j3002Q035
$$ 26864 931 -15415 11867 9991 -19352 494 19011 -11043 -19741 790 -1770 -14772 -6737
230f737J9767r301j6784K2105M362l1406J8700K5208l0089j712K8267j6832j9240
$$ -6737 13030 3729 -13055 9050 13412 -17994 706 25914 -4175 -5887 22380 5548 -13692
243a3692J5627M327j7037O45J6509q366j4717J9374L080k4033J4484J7296j8676
$$ -13692 1935 6262 -10775 -10130 6379 -1987 -16704 2670 5750 -18283 -3799 13497 -5179
256e179K821J3973q075l452N037J359j634m624K913r41j0749Q130N176j4446J720
$$ -5179 -2358 11615 3540 88 5125 6484 4850 226 3139 2198 -8551 -421 4755 -9691 -7971
271g971Q585m897k5J05J66O313k689J030O370o061K821O140j0756J509R476p151
$$ -7971 614 -4283 -4308 -4203 -4037 2276 -413 617 6987 926 3747 9887 -869 640 10116 2965
287B965o054N87J600K212o207j561L679l753N093L441j1530P037J0743j0579N18
$$ 2965 -3089 -2502 -902 1310 -4897 -6458 -2779 -6532 -1439 2002 -9528 -2491 8252 -2327 -1809
302a809R208k868J027q59n734M161K808m138m189l400P253J355j0241J578K785
$$ -1809 7399 4531 5558 4699 -1035 3126 5934 1796 -2393 -5793 1460 2815 -7426 -5848 -3063
317c063k939N058j696l806J0561L27n889N019p48J051L532q143r12Q288j939k909
$$ -3063 -6002 -944 -2640 -6446 4115 4442 -1447 3572 2824 3875 7407 -736 -1648 6640 4701 1792
333A792k956l484M136p27n375J065J86M661K807p828M356P434o726n30L377j762
$$ 1792 -1164 -4648 -512 -1239 -6614 -5549 -5363 -702 2105 -5723 -1367 6067 -659 -1189 2188 426
349D26O437J088p640J961K400k070k348p223K363N869n919J64M745l216J070J960
$$ 426 6863 7951 311 2272 4672 2602 254 -6969 -4606 1263 -4656 -4492 253 -2963 -1893 67
365F7m349O66M169L325l17m002P042M500j2592P59P029j0186O46Q549q144k635
$$ 67 -4282 -3616 553 3878 3561 -441 6601 11101 -1491 -732 6297 -3889 -3243 5306 -2838 -5473
381e473Q096j832q173j15P653j065p105Q638O188r203M183Q186r969j717Q618
$$ -5473 2623 791 -7382 -7497 156 -909 -8014 624 6812 -2391 1792 9978 9 -1708 6910
396F910m105n848L002O454k493j0015M882N335j3419K50J2162q962l701J6286
$$ 6910 2805 -3043 -41 6413 3920 -6095 -1213 4122 -9297 -9047 3115 -5847 -9548 6738
410F738J92j2865M347J1193r679j0331J6859P052j8740O838J4971k0534o900J9545
$$ 6738 6930 -5935 -1588 9605 -74 -10405 6454 13506 -5234 1604 16575 -3959 -10859 8686
424H686r006j6090J6200J0459j7884m160J9832l566j9021J5280J3199k4579J500
$$ 8686 -320 -16410 -210 10249 -7635 -11795 8037 4471 -14550 730 13929 -10650 -9150
437i150K6717j2759j5348K2392M547k6603J099K2570j2559k0283K3487R716l0082
$$ -9150 17567 4808 -10540 11852 16399 -10204 -9105 13465 906 -19377 4110 13826 -16256
450a6256R608K6808k8561j6624L3589N86k6879J8811K2815k4880j3006K7513k340
$$ -16256 -6648 20160 -8401 -25025 8564 9150 -17729 1082 23897 -983 -13989 13524 11184
463A1184k8689J8851J9914l1100l479L2714j3373k6692J9346J2160k3886k031
$$ 11184 -17505 1346 21260 -9840 -13319 19395 6022 -20670 -1324 10836 -13050 -15081
475a5081K7901n563k4739J8556J7417k9153j844L3748j2769k6462K2172J3930
$$ -15081 12820 7257 -17482 1074 18491 -10662 -12506 21242 8473 -17989 4183 18113
487A8113k7795l47L1118j2121l1086K1489J3962l6175O491M2657k0933k8910L0693
$$ 18113 -9682 -10029 21089 8968 -22118 -629 13333 -22842 -16351 26306 5373 -23537 7156
500G156P455l5318J1648L3770k3730k1790L5789N737l8408J7370K9800m0997j7364
$$ 7156 14611 -20707 -9059 24711 981 -20809 14980 20717 -17691 -321 29479 -11518 -28882
513b8882M4741m331l3132K6646J7289m0568n326L9667j0043k8877L1532J5455
$$ -28882 15859 11528 -21604 5042 22331 -18237 -23563 16104 6061 -22816 8716 24171
525B4171m3587K506M2391j8354k4548L2208M059l8521O636L1928j7074k0860L0449
$$ 24171 -19416 -16910 25481 7127 -17421 14787 18846 -19675 -13039 18889 1815 -19045 11404
538A1404P096m0656N794L4957k2427j9499L5565L794l3723J3887K7815k5580j7703
$$ 11404 18500 -22156 -16362 18595 -3832 -23331 12234 16028 -17695 -3808 24007 -1573 -19276
551a9276L1645J957l3007J8247K9291l2314j6917L2011o037k7420K0393J9583
$$ -19276 12369 14326 -18681 -434 28857 -3457 -20374 11637 5600 -21820 -1427 18156
563A8156k6140q693K7052l230k5627J7937K2355k8666r818L3775o098k9006K1551
$$ 18156 -7984 -16677 10375 7145 -18482 -545 21810 -6856 -16674 17101 11003 -18003 3548
576C548J9032k9618o305L0237j1491l0189K5147J8273l5076L488L7263k4706k5599
$$ 3548 22580 -7038 -13343 16894 5403 -24786 361 18634 -16442 -12954 24309 -397 -25996
589b5996L4007L731l1846J9105K5248k7366r984K8592o922k6462K0239J6751k8003
$$ -25996 8011 11742 -20104 -999 24249 -3117 -13101 15491 8569 -17893 2346 19097 -8906
602h906k738K4907j2459j5588J9006L785j9383K893J5314o374j0699J3396Q824
$$ -8906 -11644 13263 804 -14784 4222 8007 -11376 -8483 6831 457 -10242 3154 11978
615A1978j8104j686K0623p449j4595J4681N118j8422J720J7267q745j3599J4375
$$ 11978 -6126 -7812 12811 5362 -9233 5448 10566 -7856 -6136 11131 2386 -11213 3162
628C162M813k2229M093K1668j2647j0333K0150j599j8786J0541J1816j2619l206
$$ 3162 7975 -14254 -10161 11507 -1140 -11473 8677 7078 -11708 -1167 10649 -1970 -5176
641e176J4660k103j5383P613J2035j3818o901J4562m211j1999J0870O922j2310
$$ -5176 9484 7381 -8002 -389 11646 -2172 -9073 5489 1278 -10721 149 7071 -5239
654e239k182J1615l021j0456J0130J0417j4945k243J6160p318j0756J4757K094
$$ -5239 -7421 4194 1173 -9283 847 11264 -3681 -5924 10236 2918 -7838 6919 9013
667I013j5594M843R376j0969n295J3202j24j3501O225Q826j2919p83J5515o486
$$ 9013 -6581 -1738 7638 -3331 -8626 4576 4452 -9049 -2824 6002 -6917 -7700 7815 1329
681A329q610J2533N20j0437N690P032o963n139O271J243o401L256M400p962l271
$$ 1329 -7281 5252 5772 -4665 1025 8057 1094 -4045 2226 3469 -2932 324 4724 -3238 -6509
696f509P469k053l446N087J482m134j535L457L629l024l64N510m128m827P123
$$ -6509 960 -1093 -4539 548 2030 -2104 -3639 -182 3447 423 59 5569 1441 -3386 3737
711C737L3o837M068L231o385k402N042J20n609K758N274p167n26R346m314m250
$$ 3737 3770 -3067 1001 4232 -2153 -4555 487 607 -5002 -2244 3030 -4137 -4663 4683 369 -3881
727c881Q379r02o715M254L344l241r66J892j133l618J291M042m359k316M325j991
$$ -3881 4498 3596 -3119 1135 4479 1238 272 2164 1031 -2587 -1296 2746 -1613 -3929 396 -1595
743a595l635M348K600k463n82K303R31l241R09N250l830k736O750k194n790M428
$$ -1595 -5230 -882 1718 -745 -1327 976 1907 -1334 -425 4825 995 -1741 5009 2815 -2975 1453
759A453J81n190K208K335k735j341K498J143l492J211L753l030n73M563j651j315
$$ 1453 1634 -3556 -1348 987 -1748 -3089 -591 552 -2940 -1729 2024 -1006 -1579 2984 1333 18
775A8L350j825j277J159r74q9n77j308K024o10k401J858k9k541J608J016q14J459
$$ 18 3368 1543 266 1425 451 362 -215 -1523 501 -109 -2510 -652 -681 -3222 -1614 -598 -1412 47
793D7R84R81j267k12K547k162k105L201n79k020K265j079k056R50q98r33Q87l84
$$ 47 1031 2012 745 533 3080 918 -1187 2014 1435 -585 1680 601 -1455 -505 -1403 -2336 -1449 -1833
811a833J049O04j109K464k4j735J688j41o81J710p79l49R64r25j4r96j378J085
$$ -1833 -784 -180 -1289 1175 1151 -584 1104 963 282 1992 1213 864 1828 903 889 -107 -1485 -400
829d00m32j539J952m72r01J897p19p59J967p76L5J571K2L43P57k100P97l38j155
$$ -400 -832 -2371 -419 -891 -1792 105 -614 -1373 594 -182 -147 1424 1446 1789 2546 446 1243 905 -250
848b50J53n12o09J453j136l54M37j344R39L69j449K720Q80j759K221M01j992J245
$$ -250 -97 -609 -1218 235 -901 -1255 -818 -2162 -1223 -854 -2303 417 1297 -462 1759 2160 168 1413
866A413J25j883M71O98K0o07r24P99j035j759K172l59k221K777Q15j547J703P83
$$ 1413 1538 -345 126 824 844 237 -687 112 -923 -2682 -510 -869 -3090 -313 502 -1045 658 1441
884A441q22j89r0J652p36j548K368m22k392J868M5l846O53J513j528J63J992N68
$$ 1441 619 430 340 1992 1256 -292 2076 1654 -738 1130 1175 -2671 -2018 -505 -2033 -1870 122 690
902F90j783l98K609j208j778L603O87l229K779J305l724o6J411l45j853K25J907
$$ 690 -1093 -1491 1118 -90 -1868 1735 2422 -807 1972 3277 -447 -513 898 553 -1300 -1075 832
919H32j789j996L138r4k947K177J447k493Q24K703R1j960K73K907j214l433K952
$$ 832 -957 -2953 185 91 -2856 -679 768 -1725 -901 1802 1893 -67 206 3113 1899 -1534 1418
936A418M9m677K849L306l924j010L599k406m115K957L720l006r51N721j219n284
$$ 1418 1467 -3210 -361 2945 -979 -1989 1610 -796 -4911 -1954 1766 -1240 -2191 3530 2311 -2973
952b973M283J867n594K145M975m124k518L895K14n350Q47M606k923l432M964M8
$$ -2973 1310 3177 -2417 -272 4703 579 -1939 1956 2170 -3180 -2333 2273 -650 -4082 882 930
968I30n326L532M048m777O5N063j866l751K192K710k572r45M556j314n306K131
$$ 930 -4396 -864 3184 -1593 -1528 3535 1669 -2082 110 2820 248 -697 3859 2545 -2761 -630
984f30J591l998R34M054j685k491J796R77k811q01M077J070k785K897J969m681
$$ -630 961 -3037 -2103 1951 266 -2225 -429 548 -2263 -3064 1013 2083 -702 2195 4164 -517
1000e17o58L368j711k093L205J403m210j869L766j100l485M323K452n599O12M332
$$ -517 -1175 2193 482 -1611 1594 2997 -1213 -3082 684 -416 -3901 422 2874 -2725 -2113 2219
1016B219l842q68N440M63l924R31K693l796k415N339L82m818K902K876o253j225
$$ 2219 -1623 -2491 2949 3412 -512 419 3112 -684 -3099 2240 2622 -2196 706 3582 -2671 -3896
1032c896M444j363k344L531K650l783j288M020j944l336M954K639m696J013K972
$$ -3896 548 -815 -3159 372 3022 -761 -2049 1971 27 -3309 1645 4284 -412 601 3573
1047C573m764j623L624L71k416J283J454l316j718K974L09j633K861J480l241
$$ 3573 -1191 -2814 810 1181 -1235 48 1502 -1814 -3532 -558 -249 -1882 979 2459 -782
1062g82l79J645q19N13J613M16l60j719m22Q2j256M58K031p97n84K95o96j624
$$ -782 -1161 484 -335 178 1791 2207 1847 128 -294 -212 -1468 -1010 1021 224 -360 -65 -761 -2385
1080b385L03J267J008o7K029j97l334P32J901j812R02L140k066k019N50n59j488
$$ -2385 -2082 -815 193 126 2155 1958 -1376 -644 1257 -555 347 3487 1421 -598 -48 -607 -2095
1097b095J533K075j255j824J699j050k217K760K157k329J117J874k295j066J993
$$ -2095 -562 1513 258 -1566 133 -917 -3134 -374 1783 -546 571 2445 150 -916 1077
1112A077l36j430J450J455j503j339Q45j267j761K393J389j556O76M67k728r3
$$ 1077 741 -689 761 2216 713 -626 219 -1048 -2809 -416 973 -583 93 560 -2168 -2261
1128b261K367J273l08M17j11j673j070K577K44j573J612l56k759L49J658j107
$$ -2261 106 1379 1071 1488 1377 -296 -1366 1211 1455 -118 1494 1138 -1621 -1272 386 -721
1144g21p11J102K48j224O95J523j017r97J652K29j210K282O04k429P7l81l54O69
$$ -721 -1432 -330 -82 -1306 -611 912 -105 -1102 550 779 -431 1851 2455 26 103 -278 -632 37
1162C7N07M61q62j808M0R09q42J627J432j565j205N72Q08l50O27J645p93k209
$$ 37 544 1005 143 -1665 -1625 -716 -1558 69 1501 -64 -1269 -697 111 -239 388 2033 1240 -969
1180i69J897M12k516J529J617l075m32K447j003j781J452O29j789N00K197n98
$$ -969 928 1340 -1176 353 1970 -1105 -1537 910 -93 -1874 -422 207 -1582 -1082 1115 517
1196E17j525K027J94k570J685J785j683o45J143l95j453O06N82n21q44R65J52
$$ 517 -1008 1019 1213 -1357 328 2113 430 -215 928 533 -920 -314 268 -253 -1097 -132 20
1213B0k475J609J511j270j31J559J54r57O2P86k74p41J510L2j679M71Q91k202
$$ 20 -2455 -846 665 -605 -736 823 977 20 82 868 594 -147 1363 1395 -284 187 1078 -1124
1231a124k50J497p39l59O13K19l77pR58j58j071J401M76r53L53Q51q34k11n2j50
$$ -1124 -1374 123 -616 -975 -362 -143 -520 -527 431 273 -798 603 1079 126 479 1330 496 285 233 83
1251H3Q7r33L74M98j237M85R71j128j63J331q27l73R76O85k85l23J153k96j495
$$ 83 170 -763 -389 109 -1128 -643 328 -800 -963 368 -459 -832 144 829 544 221 1374 1078 -417
1270d17J035M49j454N56R27j809QO23o28l19L61K92k42J43O15K09j31K2J53m13
$$ -417 618 1067 -387 169 1096 -713 -705 -82 -710 -1029 -668 -376 -618 -475 140 349 218 240 393 -20
1290b0M32L11p49Q59m95l00N84r33o09O84p32j26R70n50k8P82o4j03j3J2M69k4
$$ -20 412 723 -26 833 338 38 622 -311 -920 -236 -968 -1094 -124 -674 -702 80 16 -87 -100 -88 381 357
1312C57K14N70q01R0L29r99l4N80j197L36M49o70L30L78n19J15L17m92Q83M2k26
$$ 357 571 1141 340 430 759 -240 -274 306 -891 -555 -106 -776 -446 -68 -587 -472 -155 -647 236 278 52
1333E2P21Lk68K91m55N9r0o98Q91o01j59K47o64m0M67o20K96M08k46M90N27q8
$$ 52 773 776 508 799 344 403 313 -385 506 -95 -254 -7 -671 -711 -244 -864 -568 -160 -406 84 611 523
1355E23j2p3l0o1K4K38L9n81j4P6o51J03K91j026P65P5l70P80r2k37L50J32o36
$$ 523 511 438 408 347 371 609 648 67 53 129 -522 -419 -128 -1154 -389 -314 -684 96 4 -233 117 249 -387
1378c87Q60K31m9L9o7J76m60k55k7n93l17J035p18k16R19n59n4O04l85M6N45k9
$$ -387 473 704 655 694 627 803 343 88 61 -532 -849 186 -532 -748 171 -388 -442 162 -223 -177 368 339
1400C39J07P3L1K32k92n46P11p94k64M03m65j58O99o72N3k9m5N8M22J75N23Km76
$$ 339 446 519 550 782 490 -56 655 -139 -403 0 -465 -623 76 -596 -543 -572 -617 -559 -137 38 561 563 87
1423H7N59l66L5K61o29L1J81k39K13k85p01O67M6r11N99N22m39M75J08j56K87
$$ 87 646 280 315 576 -53 -22 159 -80 133 -152 -853 -186 -140 -1051 -452 70 -369 106 214 58 345
1444C45j81M10qp22P75L34j636Q49O55j031k48K58n24j00L01K04p4j17J048j86
$$ 345 164 574 566 -156 619 953 -683 166 821 -210 -458 -200 -724 -824 -523 -319 -393 -510 538 352
1464C52j406J377L91r09O82N74j040K70K85m25j46m95N82k76m31N95j03r88N43
$$ 352 -1054 323 714 -195 487 1061 21 291 576 151 5 -490 92 -184 -615 -20 -123 -1111 -568
1483e68M96m80L45K21K51K23n12M95N28j268P57Q41j227n65J099p72p13O09L24
$$ -568 -72 -552 -207 14 265 488 -24 471 999 -269 488 1329 102 -463 636 -136 -849 -240 84
1502H4n48o37J098k73j276J485J363j612K43J376j409l52J406o0r85M34M76q58
$$ 84 -464 -1101 -3 -276 -1552 -67 1296 -316 -73 1303 -106 -458 948 888 -97 337 813 -45
1520d5j036J635Q4k075P26R51j031J18J421r43p73M56R95l10n6J242j72k033O25
$$ -45 -1081 554 638 -1437 -711 240 -791 -673 748 -195 -968 -512 483 173 117 1359 1187 -846 -221
1539b21J314j236L41J054j158j532J143J55o17P04O45n27j430R25J154p12J40
$$ -221 1093 -143 198 1252 94 -1438 -295 -140 -757 -53 592 65 -1365 -440 714 2 142
1556A42R83r31o87R41L91m08l83J81Q0j130L02J604j656n19J284r58p34J599R39
$$ 142 1125 194 -493 448 839 431 48 229 309 -821 -519 1085 -571 -1090 194 -764 -1498 101 1040
1575A040j171n13J067k53j095J727J067k255L14J423j499r60K026m11j298K70
$$ 1040 -131 -644 423 170 -925 802 1869 -386 -72 1351 -148 -1108 918 507 -791 -521
1591e21P12j296P3J176K75j817J001J443j626K52J626q90r58J283J96p01o4K99
$$ -521 191 -1105 -1032 144 419 -1398 -397 1046 -580 -328 1298 408 -550 733 929 228 164 463
1609D63k79j150P01Q29j172j28R62o55n82J068K57m56J30O20k26p51O81J149j789
$$ 463 184 -966 -265 564 -608 -736 226 -429 -1011 57 314 -142 -12 608 382 -369 312 1461 -328
1628c28J54J317j144n86J128m80r06Q8M64M6j35O69M2j318J44J511n24l46J408
$$ -328 -174 1143 -1 -587 541 61 -845 -757 -293 -247 -382 287 329 -989 -845 666 142 -204 1204
1647A204l97j331O64N28r6n73N49k55j345K42J296p43p62J377o24j146J408M79
$$ 1204 807 -524 140 668 572 -1 548 293 -1052 -810 486 -257 -1019 358 -266 -1412 -4 475
1665D75p38J42Q00n55m23O42Q59j217P3M65r92q7J255p30l11J64j83l35K52M50
$$ 475 -263 -121 679 124 -299 343 1202 -15 58 523 -469 -556 699 -31 -342 -178 -361 -696 -444 6
1685FJ18k81k43L66J51RQ62o58l4K5j04l6l7j07M03j016j12P12l60j11M39l47
$$ 6 124 -157 -400 -34 117 126 988 330 296 321 217 181 144 37 440 -576 -688 24 -336 -447 -8 -355
1707c55k31Q01K3m51J31P63l93o22N48M71j82l08L41p29j13N46m09j67k9J46r1
$$ -355 -586 215 238 -213 -82 681 288 -334 214 685 503 195 536 -193 -306 240 -169 -336 -365 -219 -310
1728c10J79m01M94j1j65J92M5k91Q69j74n81R87m86n43J97J15j18l88K30Lj73
$$ -310 -131 -532 -38 -49 -214 -22 23 -268 601 427 -154 833 347 -196 1 116 -2 -390 -160 -157 -330
1749c30k47R11q84n6O40O1l84R34K7p26L77L96m93m8K02K8n89M5M29n57j29J17
$$ -330 -577 334 -550 -606 34 95 -289 645 672 -54 323 719 226 178 380 408 -181 -136 293 -264 -393 -276
1771b76j67j08O28n06J19L48k72K85K58J7j18L5j7K48m67JJ15Q1m72qJ00q8l1
$$ -276 -443 -551 77 -429 -310 38 -234 51 309 326 208 243 226 474 7 8 123 204 -268 -276 -176 -264 -295
1794b95k57N94k10j49K86k19K26K40J60l16N29l63k24N53o04K19K0m36L28j30
$$ -295 -552 42 -168 -317 -31 -250 -24 216 376 60 589 226 2 555 -49 170 190 -246 82 -48
1814d8k32L16o71J82L33k77K01K27j28N8O9m2N45j64l07J25j9j06J13l20k14L38
$$ -48 -280 36 -635 -453 -120 -397 -196 31 -97 -39 30 -12 533 369 62 187 168 62 175 -145 -359 -21
1836b1j20k14K13o16M83J17o8N86l49j47N02k35K28K39j64R2l88p0NQ0k80K06
$$ -21 -141 -355 -142 -758 -275 -158 -226 360 11 -136 366 131 359 598 434 526 138 68 73 153 -127 79
1858G9j40k12L10l78r9M81m11J39K53m03N43J65k30K85Q2k97L34l29l40K38q0
$$ 79 -61 -273 37 -341 -440 41 -370 -231 22 -381 162 327 97 382 464 167 501 172 -168 70 -10
1879a0l58L96l46L00k10o1K20n4m16L80J64qJ97M8K9K33J33n90J16q2M2j82o5
$$ -10 -368 28 -318 -18 -228 -289 -69 -123 -539 -159 5 -3 194 242 271 504 637 47 163 81 123 -59 -124
1902a24L61p07J04K99j44n76P26O3j92M75l0j95J49m4K85k72p6L79r4m12K83J9
$$ -124 237 -470 -366 -67 -211 -787 -61 2 -190 285 255 60 209 165 450 178 102 481 387 -25 258 277
1924B77o41K53m8j65J93j11P7l52J91K20L79o26P50L51n25J22r2O1k13oK71p00
$$ 277 -364 -111 -159 -324 -131 -242 -165 -517 -326 -106 273 -353 397 748 223 345 253 314 101 95 366 -334
1946c34L13K52n89l22Q87p8r25P09L50n50J9L07K6k7M95m8l04n15J090m15n57
$$ -334 -21 231 -358 -680 207 129 -796 -87 263 -287 -268 39 65 38 533 485 181 -334 756 341 -216
1967b16J82N48r97J21O67l51o30N60K71n75QQ42j37r62R43K72j048Q41P25j101
$$ -216 -34 514 -483 -362 305 -46 -676 -116 155 -420 -412 430 293 -669 274 546 -502 339 1064 -37
1987c7k64M68J15r21O32M30o51o31J094n60q91R63P30n58j57N42k44k49K81P82
$$ -37 -301 167 282 -639 -7 423 -228 -859 235 -325 -1216 -253 477 -81 -238 304 60 -189 92 874
2007H74o68k24N82j42j193Q35N40j010m3P46o05o53R22K29n15n74J284j54r59
$$ 874 206 -18 564 422 -771 64 604 -406 -449 297 -308 -961 -39 190 -325 -899 385 231 -728
2026g28J116K90j442O97R92p80j80O39j15j181J27R30m43o77J135j11j422J245
$$ -728 388 678 -764 -67 925 145 -35 604 489 -692 -565 365 -78 -755 380 269 -1153 92
2044I2M72p92j73J256l08q17O60K06o51n46J487j57j165L67M76j411M25J005m37
$$ 92 564 -228 -401 855 547 -270 390 596 -55 -601 886 729 -436 -69 407 -1004 -579 426 -11
2063a1m46N85j93k82j91J253k28j217J295J56j189M00Q74q44m81R15k0p13J82
$$ -11 -457 128 -65 -347 -538 715 487 -730 565 721 -468 -68 806 -38 -519 396 376 -337 -155
2082a55N96p21q63J303r3r85Q01M81o27nP04j16l82K34N61q33p73J365j6r24P87
$$ -155 441 -280 -1143 160 67 -918 -117 364 -263 -268 436 320 -62 172 733 -100 -873 492 476 -448 339
2103C39M46j619m5Q50j61m10O94J43n91l33J102o8p60Q58M69j558Q83O71j125
$$ 339 785 -834 -879 -29 -190 -600 94 237 -354 -687 415 347 -413 445 914 -644 239 910 -215
2122b15N2R20n85o03L64O75j070k50R38k65q08Q74N39q60L19J53j62m91Q52K16
$$ -215 -163 757 172 -431 -67 608 -462 -712 226 -39 -847 27 566 -294 25 178 16 -475 377 593
2142E93l92k02J59K6p96R06J07q24K47J95k49j87N28m7l62k45R61m08n59P89L67
$$ 593 201 -1 158 184 -612 294 401 -423 -176 19 -230 -417 111 64 -298 -543 418 10 -549 240 607
2163F07o84K54O89j083n7Q60l98n26K90K78m68k41N64l16l08K25Q99r18N23L36
$$ 607 -77 177 866 -217 -274 586 188 -338 -48 230 -238 -479 85 -231 -539 -314 585 -333 190 526
2183E26k89m62N40N1m71L95J55k07o44M24N8p14K91P94q92j31R09l20n07M15N39
$$ 526 237 -225 315 366 -105 290 445 238 -406 18 76 -638 -347 447 -445 -576 333 13 -494 -79 460
2204D60n03J79K14r3o16Q75J20q54J59P04o89j2L26j69m51Q3M41o29r5N74M5q34
$$ 460 -43 136 350 257 -359 516 636 -218 -59 645 -44 -56 270 101 -350 -267 174 -455 -550 24 69 -765
2226g65O35O51o12J93K85l82j41K73m4J7n58M05K49o28J03M68n53j67Q10m46P5
$$ -765 -130 521 -91 102 387 5 -136 137 93 110 -448 -43 206 -422 -319 149 -404 -571 239 -207 -132
2247a32m5M54l59k3J41L93o18N98j76l89J4L44k53q2J39O1l82J66L06l81n23P33
$$ -132 -177 277 -82 -105 36 429 -189 409 233 -156 -142 202 -51 -133 6 67 -315 -149 157 -224 -747 -14
2269a4M63j190P36N11n99R4M62m63J69J75j22j35n03N13K98p40L5L98o28L6M91
$$ -14 449 -741 -5 506 -93 1 463 0 169 344 222 87 -416 97 395 -345 -310 88 -540 -504 -13
2290a3Rk62M50j13j90K53K83k56k00K37j96j45L69p6k61j0k8J06p8q5L65l33j88
$$ -13 -4 -266 184 71 -119 134 417 161 -39 198 2 -143 226 150 -111 -121 -149 -43 -121 -206 159 -174 -362
2313c62K9L79P6q1K76k64J95l4m36K51P6j2J81k71J50j82l89j9K62j6K82j31j4
$$ -362 -333 46 122 41 317 53 248 214 -222 29 105 93 274 3 153 -29 -418 -437 -175 -191 91 -40 -54
2336e4K09j75nj36J33K59j22J74j88M06m03j18L68o31J98J53n89J67K46p0l7K9
$$ -54 155 -20 -25 -161 -28 231 109 283 95 501 98 -20 348 -283 -85 68 -521 -354 -108 -178 -215 -186
2358a86J51L17k40j36K30k21K78K15j66r9J79k37j01k30J87k79L62m92M57j81
$$ -186 -35 282 42 -94 136 -85 193 408 242 143 322 85 -16 -246 -59 -338 24 -468 -11 -192
2378a92J28L3p7M7Q4j1J97k2q4J68n3l69M39l40j4K74k80k7K49r3k64j40K74K2
$$ -192 -64 -31 -108 -61 23 12 209 187 103 271 218 -151 288 -52 -66 208 -72 -99 150 57 -207 -347 -73 -51
2402e1k1L22j18m05M14J32l14K77k87K83J4M5j96l73J89k0L00m94j69O21l85j7
$$ -51 -72 250 132 -273 141 273 -41 236 -51 232 246 291 95 -278 -89 -109 191 -303 -472 149 -236 -253
2424b53L55k10J59Q5j92K90k16M09l31k52L75m7j65k27K96j68j73L31n39J6N02
$$ -253 102 -108 51 136 -56 234 18 427 96 -156 219 172 7 -220 76 -92 -265 66 -473 -457 45
2445D5k94J76M0k20L51L0O6J46l26k55N84j65l51L79o9l85P5L32j81n30K63L47
$$ 45 -249 -73 -33 -253 98 128 194 340 14 -241 343 178 -173 206 137 -248 -173 159 -22 -552 -289 58
2467E8l12k20P96k26n66O98k41p7R7K78q6k1P7J90n49l8L05n35K1L48J18m72L15
$$ 58 -254 -474 322 96 -470 228 -13 -90 7 285 199 178 255 445 -104 -142 163 -372 -351 -3 115 -357 -42
2490d2K64n02R2K46l7p6J30L29k47j72L65m28j82M67J6k72k61P54m42n58M87J47
$$ -42 222 -280 -188 58 21 -55 75 404 157 -15 350 -78 -260 207 223 -49 -310 444 2 -556 -69 78
2512G8m12J37N25m59j93M78m6o0Q6K11l65j24N42j58k52j16L16l75j01K27Ml60
$$ 78 -334 -197 328 -131 -324 154 108 48 134 345 -20 -144 398 240 -12 -128 188 -187 -288 -61 -57 -417
2534d17L73L19j82m63L81k8r7J93L37n82M5O96n10l60N02M4o49J13O74p47R2K21
$$ -417 -44 275 93 -370 11 -17 -114 79 416 -166 -121 575 65 -295 207 251 -398 -285 389 -358 -266 -45
2556d5L31j017L99P41k37m36N41j86k15K26L42l01j85L94m04m70K45N18j22l64
$$ -45 286 -731 -332 409 172 -264 277 91 -124 102 444 143 -42 352 -52 -522 -277 241 119 -245
2576b45M25l59n40O20M39o41J50L54J73n91J41N85n16k4M69j48o93N83j53k04
$$ -245 180 -179 -719 -99 340 -301 -151 203 376 -215 -74 511 -5 -29 440 292 -401 182 29 -175
2596a75j59O68m22l45Q80n5p31L25N71p57k24Q75m11n10N32J53m12K40L62l04
$$ -175 -334 334 -88 -433 447 392 -339 -14 557 -200 -424 451 40 -470 62 215 -197 43 405 101
2616A01m89M00N03p84j42P52l59p05Q55K20n03O5M78m50l59O70L01p20K14N89
$$ 101 -388 12 515 -269 -411 341 -18 -723 132 352 -151 -86 392 -58 -417 253 554 -166 48 637
2636F37m71k21K82L8o00K28P10q06j2K55K2n79L92L30k60j61Q28o01k75L82L03
$$ 637 166 -55 227 265 -335 -107 603 -203 -215 40 62 -517 -125 205 -55 -216 612 11 -264 118 421
2657D21q29K46M50j50n97M11J28o60M31O90p40j99N19k85m21N24O62n12N6j11
$$ 421 -408 -162 288 138 -459 -48 80 -580 -149 541 -199 -398 121 -164 -585 -61 601 89 145 34
2677C4M51m33J46K59m84p4K73j36l43L04K22k91j21M67l95o4J4L37j43o7M15k28
$$ 34 485 52 198 457 -27 -101 172 36 -307 -3 219 -72 -193 274 -121 -185 -171 166 23 -44 371 143
2699A43m06N50J72p09k09O37m6l00L42k13k44K4M74n88J98J2L02m39j57O18K7
$$ 143 -263 287 459 -250 -459 178 132 -168 174 -39 -283 -259 215 -373 -175 -163 139 -300 -457 161 188
2720A88m00P24j02l89J45K27l84k15L87j99m22N43j14k46k7L45k52J02L00Q1l07
$$ 188 -212 512 410 21 166 393 9 -206 181 -18 -440 103 -11 -257 -284 61 -191 -89 211 292 -15
2741a5k75N23O1o98N18n5k22L62l2M8j28q9J15k44j34K41j97k38K87K97j29Q5
$$ -15 -290 233 294 -404 114 59 -163 199 167 215 87 -2 113 -131 -265 -24 -221 -459 -172 125 -4 81
2763H1J17j64r0K61J50l50jJ67l58J32K57r6m02Q4M58l72l8KJ30k21L24j95J20
$$ 81 198 34 -56 205 355 5 4 171 -187 -55 202 106 -296 -212 246 -126 -164 -162 -32 -253 71 -124 -4
2786dJ63Q3l7l03J67qj25K7m7J95j61R5o7j56L70n6k60J10n3K74l69J66N9k33
$$ -4 159 242 205 -98 69 61 -64 -37 -84 111 -50 45 -22 -178 192 136 -124 -14 -67 207 -162 4 63 -170
2810a70L55K5J90l44p9Rj43k74L34k6R6J5P8k76J88P3j23j10L56Lk03N7r1J29
$$ -170 185 210 400 56 -23 -14 -157 -431 -97 -123 -27 -12 66 -210 -22 51 -72 -182 174 177 -26 31 -60 69
2834F9M6J31j93j58M8N9j06K19j76O0L8n05K92K98m62J10K47j35J40J0M5p8J94
$$ 69 115 246 53 -105 -57 2 -104 115 -61 -1 37 -468 -176 122 -340 -230 17 -118 22 32 77 -1 193
2857A93m1j60J38j41K7j8j59j07J66j20K32j21PJ04O1n1Rj42J41r9J16m6L69k31
$$ 193 152 -8 130 -11 16 -2 -161 -268 -102 -222 10 -111 -104 0 61 10 19 -123 18 -81 35 -11 358 127
2881A27o8j9j39L63k94l3J93k88m0L51j89Q5j38K56k02k8Q7j79K70J12k6k26P1
$$ 127 59 40 -99 264 -30 -63 130 -158 -198 153 -36 49 -89 167 -35 -63 24 -155 115 227 201 -25 46
2904D6k35K70l21K46K07j65k86K85qn7J0q7j93Q9L60k87R7o1K79P4j57M9L5k31
$$ 46 -189 81 -240 6 213 48 -238 47 39 -18 -8 -95 -288 -199 161 -126 -29 -90 189 263 106 155 190 -41
2928d1q8L13l30J66l7K03l56P9P1N1k47K56K90m83K55J4k16q7M05m88K35l0J86
$$ -41 -129 184 -146 20 -17 186 -170 -91 -20 31 -216 40 330 -153 102 116 -100 -187 218 -270 -35 -65 121
2951A21k62o9K07J24q7J01l7j42O7N4l82J21M11k20K6L0J45j88Q6P2J81l58J96
$$ 121 -141 -210 -3 121 34 135 98 -44 23 77 -305 -184 227 7 33 63 208 20 106 178 359 1 197
2974A97Pl72K97k92P8j27J47O8j64R5J06j32j8J09K18j74J28j24J43k76k39M41
$$ 197 204 -168 129 -163 -85 -212 -65 3 -161 -66 40 -92 -110 -1 217 43 171 47 190 -86 -325 116
2996A16n0k23M19j02n39N26k7j35j56M55n97K72J45J70m46M1K75j17K25r8j0k93
$$ 116 66 -157 262 160 -379 147 120 -15 -171 284 -313 -41 104 274 -172 -131 144 27 252 154 144 -149
3018a49J86L64l33k36N9L69m44kK78m2N5J04k22k39K18J50n2o4Q4k58K25K44k46
$$ -149 37 401 68 -168 -109 260 -184 -186 92 50 105 209 -13 -252 -34 116 64 0 84 -174 51 295 49
3041D9j31J1pk7L1K19m9k66K19k04J43j86M26l07J38O3L6k01j8K50J49n89J39
$$ 49 -82 -71 -78 -105 -74 145 96 -170 49 -155 -12 -198 228 -79 59 122 158 -43 -61 189 338 -251 -112
3064a12L46n95J51L38l5o70O44k64J38J1j59L01k08K40N4m74K01K64k9k05J16
$$ -112 234 -361 -210 128 93 -577 67 -197 -59 -48 -207 94 -114 126 180 -294 -93 171 142 -63 53
3085E3j07l94L48M23l71J5J81Qj06j79M35m48J30K63q9j36j40M61k07JJ10n6k06
$$ 53 -54 -448 -100 323 -48 -33 148 156 50 -129 306 -142 -12 251 162 26 -114 347 140 141 251 195 -11
3108a1J75om4m9J93o31K63q7J03J29k39J79L06l70L12k85k48L03j17K09k44L62
$$ -11 164 158 114 65 258 -373 -110 -197 -94 35 -204 -25 281 -89 223 -62 -310 -7 -124 85 -159 203
3130B03p1k91J54P5K2l64O34j88l97j55N39j39j22K29j15j01K10J6k01j20L96
$$ 203 132 -159 -5 70 92 -272 362 174 -223 -378 161 22 -100 129 14 -87 123 139 -62 -182 214
3151B14K6j62j41J53k05j58N10l29j24J17K23l49J81k6M47m98K52lk73L4M09k79
$$ 214 240 78 -63 90 -115 -273 237 -92 -216 -99 124 -225 -44 -70 377 -121 131 128 -145 -111 298 19
3173A9r1K13j90m5J60r9k53L79j52N7j0j55M79m00j18N25k16R0l0M3J78m54nR
$$ 19 -72 141 -49 -94 66 -33 -286 93 -59 -2 -12 -167 312 -88 -206 319 103 193 163 206 384 -70 -75 -66
3197f6j44K04m5R3m22M21l2j37J74R0k4k33J57P5j38k39M76j78k78J91j9J22j51
$$ -66 -210 -6 -51 42 -380 41 9 -128 46 136 112 -121 36 111 -27 -266 210 32 -246 -55 -74 48 -103
3220a03L93l07j02Q3J26k61K04qj88L00k21j7j2L04O2n72J2J93P5K69k78L97n45
$$ -103 290 -17 -119 -36 90 -171 33 25 -163 137 -84 -101 -113 191 253 -319 -307 -114 -39 230 -48 349 -196
$$ [...]
8191B38
##END NTUPLES=NMR FID
##END=
