##TITLE=1H_LR-798-C1M
 200.13MHz,CDCl3,
 8 sc
 
 14.3.2025
##JCAMPDX= 6.0         $$ Bruker NMR JCAMP-DX V2.0
##DATA TYPE= NMR FID
##DATA CLASS= NTUPLES
##ORIGIN= UXNMR, Bruker Analytische Messtechnik GmbH
##OWNER= pz
$$ XWIN-NMR		Version 3.5
$$ Fri Mar 14 13:49:20 2025 Russian Standard Time (UT+4h)  she@DPX200
##.OBSERVE FREQUENCY= 200.1313
##.OBSERVE NUCLEUS= ^1H
##.DELAY= (6, 6)
##.ACQUISITION MODE= SIMULTANEOUS
##.ACQUISITION SCHEME= undefined
##.AVERAGES= 8
##.DIGITISER RES= 18
##SPECTROMETER/DATA SYSTEM= spect
##.PULSE SEQUENCE= zg30
##.SOLVENT NAME= D2O
##.SHIFT REFERENCE= (INTERNAL, D2O, 0, 14.3821)
##AUDIT TRAIL= $$ (NUMBER, WHEN, WHO, WHERE, WHAT)
$$ ##TITLE= Audit trail, XWIN-NMR		Version 3.5
$$ ##JCAMPDX= 5.01
$$ ##ORIGIN= Bruker BioSpin GmbH
$$ ##OWNER= she
$$ F:/spectra/data/she/nmr/H-C/1/audita.txt
$$ ##AUDIT TRAIL=  $$ (NUMBER, WHEN, WHO, WHERE, WHAT)
(   1,<2025-03-14 13:47:15.85 +0400>,<she>,<DPX200>,
      <created by zg, POWCHK disabled, PULCHK disabled
       configuration hash MD5:
       00 E9 B6 7A A2 85 ED C7 34 08 36 98 17 FE 4E 26
       data hash MD5: 16K
       C9 D9 96 F1 DC 66 EC 21 9B EC 60 41 27 F3 F0 8C>)
$$ ##END=
$$ 
$$ hash MD5
$$ 43 72 BF E8 8C 11 B4 28 0F B6 83 8B ED AD 47 06
##$RELAX= 
##$RELAX= 
##$RELAX= 
##$RELAX= 
##$RELAX= 
##$RELAX= 
$$ Bruker specific parameters
$$ --------------------------
##$DU= <F:/spectra>
##$EXPNO= 1
##$NAME= <H-C>
##$PROCNO= 1
##$TYPE= <nmr>
##$USER= <she>
##$AMP= (0..31)
100 100 100 100 100 100 100 100 100 100 100 100 100 100 100 100 100 100 
100 100 100 100 100 100 100 100 100 100 100 100 100 100 
##$AQSEQ= 0
##$AQ_mod= 1
##$AUNM= <au_zg>
##$AUTOPOS= <>
##$BF1= 200.13
##$BF2= 200.13
##$BF3= 200.13
##$BF4= 200.13
##$BF5= 200.13
##$BF6= 200.13
##$BF7= 200.13
##$BF8= 200.13
##$BYTORDA= 1
##$CFDGTYP= 0
##$CFRGTYP= 5
##$CHEMSTR= <none>
##$CNST= (0..31)
1 1 145 1 1 1 1 1 1 1 1 1 1 1 1 1 1 1 1 1 1 1 1 1 1 1 1 1 1 1 1 1 
##$CPDPRG= <>
##$CPDPRG1= <>
##$CPDPRG2= <>
##$CPDPRG3= <>
##$CPDPRG4= <mlev>
##$CPDPRG5= <mlev>
##$CPDPRG6= <mlev>
##$CPDPRG7= <mlev>
##$CPDPRG8= <mlev>
##$CPDPRGB= <>
##$CPDPRGT= <>
##$D= (0..31)
0 0.7 0 0 0 0 0 0 0 0 0 0.03 0 0 0 0 0 0 0 0 0 0 0 0 0 0 0 0 0 0 0 0 
##$DATE= 1741945635
##$DBL= (0..7)
120 120 120 120 120 120 120 120 
##$DBP= (0..7)
150 150 150 150 150 150 150 150 
##$DBP07= 0
##$DBPNAM0= <>
##$DBPNAM1= <>
##$DBPNAM2= <>
##$DBPNAM3= <>
##$DBPNAM4= <>
##$DBPNAM5= <>
##$DBPNAM6= <>
##$DBPNAM7= <>
##$DBPOAL= (0..7)
0.5 0.5 0.5 0.5 0.5 0.5 0.5 0.5 
##$DBPOFFS= (0..7)
0 0 0 0 0 0 0 0 
##$DE= 6
##$DECBNUC= <off>
##$DECIM= 32
##$DECNUC= <off>
##$DECSTAT= 4
##$DIGMOD= 1
##$DIGTYP= 9
##$DL= (0..7)
0 120 120 120 120 120 120 120 
##$DP= (0..7)
150 150 150 150 150 150 150 150 
##$DP07= 0
##$DPNAME0= <>
##$DPNAME1= <>
##$DPNAME2= <>
##$DPNAME3= <>
##$DPNAME4= <>
##$DPNAME5= <>
##$DPNAME6= <>
##$DPNAME7= <>
##$DPOAL= (0..7)
0.5 0.5 0.5 0.5 0.5 0.5 0.5 0.5 
##$DPOFFS= (0..7)
0 0 0 0 0 0 0 0 
##$DQDMODE= 0
##$DR= 18
##$DS= 0
##$DSLIST= <SSSSSSSSSSSSSSS>
$$ [...]
##$SUBNAM0= <"">
##$SUBNAM1= <"">
##$SUBNAM2= <"">
##$SUBNAM3= <"">
##$SUBNAM4= <"">
##$SUBNAM5= <"">
##$SUBNAM6= <"">
##$SUBNAM7= <"">
##$SUBNAM8= <"">
##$SUBNAM9= <"">
##$SW= 18.0517328524113
##$SWIBOX= (0..15)
0 0 2 0 0 0 0 0 0 0 0 0 0 0 0 0 
##$SW_h= 3612.71676300578
##$TD= 16384
##$TD0= 1
##$TE= 0
##$TE2= 300
##$TE3= 300
##$TEG= 300
##$TL= (0..7)
0 120 120 120 120 120 120 120 
##$TP= (0..7)
150 150 150 150 150 150 150 150 
##$TP07= 0
##$TPNAME0= <>
##$TPNAME1= <>
##$TPNAME2= <>
##$TPNAME3= <>
##$TPNAME4= <>
##$TPNAME5= <>
##$TPNAME6= <>
##$TPNAME7= <>
##$TPOAL= (0..7)
0.5 0.5 0.5 0.5 0.5 0.5 0.5 0.5 
##$TPOFFS= (0..7)
0 0 0 0 0 0 0 0 
##$TUNHIN= 0
##$TUNHOUT= 0
##$TUNXOUT= 0
##$USERA1= <user>
##$USERA2= <user>
##$USERA3= <user>
##$USERA4= <user>
##$USERA5= <user>
##$V9= 5
##$VALIST= <valist>
##$VCLIST= <CCCCCCCCCCCCCCC>
##$VD= 0
##$VDLIST= <DDDDDDDDDDDDDDD>
##$VPLIST= <PPPPPPPPPPPPPPP>
##$VTLIST= <TTTTTTTTTTTTTTT>
##$WBST= 1024
##$WBSW= 4
##$XGAIN= (0..3)
0 0 0 0 
##$XL= 0
##$YL= 0
##$YMAX_a= 679630
##$YMIN_a= -827770
##$ZGOPTNS= <>
##$ZL1= 120
##$ZL2= 120
##$ZL3= 120
##$ZL4= 120
##$ABSF1= 10
##$ABSF2= 0
##$ABSG= 5
##$ABSL= 3
##$ALPHA= 0
##$AQORDER= 0
##$ASSFAC= 0
##$ASSFACI= 0
##$ASSFACX= 0
##$ASSWID= 0
##$AUNMP= <proc_1d>
##$AZFE= 0.1
##$AZFW= 0.1
##$BCFW= 1
##$BC_mod= 2
##$BYTORDP= 1
##$COROFFS= 0
##$CY= -3
##$DATMOD= 1
##$DC= 2
##$DFILT= <>
##$DTYPP= 0
##$F1P= 0
##$F2P= 0
##$FCOR= 0.5
##$FTSIZE= 0
##$FT_mod= 4
##$GAMMA= 1
##$GB= 0.15
##$INTBC= 1
##$INTSCL= 1
##$ISEN= 128
##$LB= 0.25
##$LEV0= 0
##$LPBIN= 0
##$MAXI= 10000
##$MC2= 0
##$MEAN= 0
##$ME_mod= 0
##$MI= 1.114404
##$NCOEF= 0
##$NC_proc= 0
##$NLEV= 6
##$NOISF1= 3.799351
##$NOISF2= 2.8
##$NSP= 1
##$NTH_PI= 0
##$NZP= 0
##$OFFSET= 14.38212
##$PC= 1
##$PHC0= -472.2982
##$PHC1= 14.59221
##$PH_mod= 1
##$PKNL= yes
##$PPARMOD= 0
##$PSCAL= 0
##$PSIGN= 0
##$REVERSE= no
##$SF= 200.129724274929
##$SI= 16384
##$SIGF1= 3
##$SIGF2= 2
##$SINO= 400
##$SIOLD= 16384
##$SREGLST= <1H.CDCl3>
##$SSB= 0
##$STSI= 0
##$STSR= 0
##$SW_p= 3205.1282051282
##$SYMM= 0
##$S_DEV= 0
##$TDeff= 0
##$TDoff= 0
##$TI= <>
##$TILT= no
##$TM1= 0
##$TM2= 0
##$TOPLEV= 0
##$USERP1= <user>
##$USERP2= <user>
##$USERP3= <user>
##$USERP4= <user>
##$USERP5= <user>
##$WDW= 1
##$XDIM= 8192
##$YMAX_p= 0
##$YMIN_p= 0
$$ End of Bruker specific parameters
$$ ---------------------------------
##NTUPLES= NMR FID
##VAR_NAME=  TIME,          FID/REAL,        FID/IMAG
##SYMBOL=    X,             R,               I
##VAR_TYPE=  INDEPENDENT,   DEPENDENT,       DEPENDENT
##VAR_FORM=  AFFN,          ASDF,            ASDF
##VAR_DIM=   8192,          8192,            8192
##UNITS=     SECONDS,       ARBITRARY UNITS, ARBITRARY UNITS
##FACTOR=    0.0002768,     1,               1
##FIRST=     0,             0,               0
##LAST=      2.2672688,     0,               0
##MIN=       0,             -827770,         0
##MAX=       2.2672688,     679630,          0
$$ Real data points
##PAGE= N=1
##DATA TABLE= (X++(R..R)), XYDATA
0 0 0 0 0 0 0 0 0 0 0 0 0 -8 8 -8 8 -8 16 -16 16 -21 24 -32 35 -40 46 -53 61 -69 81 -92 106 -116 130 -147
34 -147 168 -186 206 -230 257 -284 316 -350 384 -425 469 -515 566 -623 687 -757 834 -919 1013
53 1013 -1123 1249 -1388 1555 -1748 1981 -2267 2623 -3083 3694 -4547 5805 -7811 11383 -18962
68 -18962 41059 -226907 -827770 247685 348355 -513559 113158 661515 -243372 -368826
78 -368826 309608 -61353 -385355 286463 322551 -277705 -99977 227581 -95641 -207819
88 -207819 104592 126772 -83134 -59065 114803 55177 -178634 -67214 183413 -34459 -149725
99 -149725 243901 163538 -300426 -62282 198240 -192589 -98233 386465 32036 -315162
109 -315162 143097 102327 -392020 361 399256 -93816 -178890 245644 -20185 -305076
119 -305076 97858 168670 -148245 25873 210422 -78294 -154096 75117 36293 -96197
129 -96197 18750 109214 1545 -78546 -26058 21737 -30153 -40418 86000 82435 -91760
140 -91760 -48889 79186 -63898 -88267 149368 78474 -125163 38367 95177 -149069 -66172
151 -66172 158035 -19665 -118037 119193 74897 -151278 -11741 104826 -89664 -68587 125289
162 125289 20697 -82233 59814 43132 -100288 -17328 81088 -6180 -28870 47540 11595
173 11595 -61666 -18457 36737 6503 -15882 14922 12954 -36345 -34905 24211 26138 -19122 10349
186 10349 41831 -29711 -42689 39296 12367 -45217 31510 50988 -44869 -19374 49864 -23176
198 -23176 -55708 35207 26430 -44754 9330 46146 -32870 -31790 36749 -2461 -34963 29917
210 29917 29845 -27201 -3272 25107 -11161 -15672 17428 8015 -15686 -2910 7626 -8637 -11253
223 -11253 7762 8690 -7073 -6037 5335 -260 -10896 1881 15561 -276 -4993 15571 2984
236 2984 -18927 4337 13400 -13905 -5269 17693 -3632 -15255 7061 3355 -16109 -496 12442
249 12442 -7515 -6684 15168 2092 -12683 7160 11012 -8252 -1082 10392 -1790 -5190 3755
262 3755 228 -5786 330 3118 -5799 -6195 3224 1237 -5265 686 3967 608 653 658 892 3364 1834
279 1834 969 758 -1277 2250 2616 -5203 -3900 3160 -65 -5818 -2368 1163 -570 -1721 75 -594
295 -594 385 6570 1687 -5593 3274 7952 -2412 -2844 2775 872 1314 1141 -4496 -3277 2220 -762
311 -762 -6457 -3359 2920 1721 -1606 -455 471 2105 3541 -1454 -2283 4855 4269 35 61 -551 1237
328 1237 1782 -4247 -5609 779 1220 -1590 -2194 -1232 919 1815 -1512 -4176 -5 5554 2804 -1805
344 -1805 2927 5603 1063 -435 -1543 -3689 871 1877 -3784 -2881 2498 1680 -2536 -4986 -2256 516
360 516 -1877 -674 2861 2407 3703 5079 270 -3420 750 3158 -2488 -3919 4975 4242 -4253 -976
376 -976 1702 -7372 -4355 3315 -3998 -5552 7671 5668 -5021 5 7172 -1010 -5421 4358 4330
391 4330 -4565 3248 8420 -3946 -4959 5470 -944 -11513 -3031 5674 -2403 -5449 7101 4854
405 4854 -8180 -274 7336 -8162 -6031 14315 6298 -8929 6817 12968 -9752 -11693 8605
418 8605 -43 -14008 6715 12196 -12626 -5490 13728 -6852 -17029 9972 9761 -13594 -1454
431 -1454 17567 -901 -10466 12443 9104 -16244 -3435 14991 -7898 -14173 15233 9878 -16932
444 -16932 -2627 14473 -11264 -18705 12962 7370 -17830 7568 25715 -11543 -15556 19646 2699
457 2699 -24274 8990 23646 -12933 -9695 21368 -2384 -25621 9272 15593 -23025 -9016 25809
470 25809 -2744 -21270 15076 14221 -22470 -5380 23780 -3391 -17357 17887 14038 -22864 -2650
483 -2650 26715 -6951 -21527 14237 6433 -27083 -286 26928 -6983 -17287 17829 3635
495 3635 -32154 1182 30341 -8629 -14449 25642 6530 -27100 7236 23092 -19578 -15766 24645
508 24645 1092 -26104 15740 24328 -26118 -18070 21375 -4923 -22325 21771 20784 -23650 -7531
521 -7531 22438 -7518 -17939 22915 16000 -26113 -7572 21326 -6783 -15132 21331 11004 -26935
534 -26935 -7229 17804 -10661 -15225 22741 12746 -24623 -938 23521 -12208 -17648 22116 7602
547 7602 -24095 8983 25437 -16466 -14631 21053 -3279 -27810 11864 22041 -17714 -8719 20850
560 20850 -6942 -22145 13960 14347 -17154 -2078 19909 -5849 -16022 15021 13363 -16751 -4771
573 -4771 17508 -6000 -18319 11620 11051 -16874 -1755 19308 -7849 -18587 13029 7459 -20433
586 -20433 3394 24857 -7591 -13435 17486 2038 -22044 6905 18103 -13003 -7116 17097
598 17097 -2650 -18264 8159 11349 -14282 -6009 13128 -3023 -11392 10262 9331 -10703 -2767
611 -2767 11717 -1984 -9921 8446 9802 -10847 -5065 12331 -1637 -11800 7833 6107 -15004
624 -15004 -3521 12884 -4403 -8711 12436 6043 -15083 -187 12666 -6583 -5889 14208 2567
637 2567 -12268 5271 8510 -10319 -4367 10356 -2194 -10577 4554 6492 -7653 -3127 7528
650 7528 -3138 -7987 6010 6267 -5586 582 8327 -2435 -6579 5504 5749 -5899 -1297 6427
664 6427 -4181 -7542 5775 3308 -7894 590 6057 -6465 -6145 7373 3315 -6070 2955 6609
678 6609 -4971 -2749 8189 -333 -6658 4913 4417 -7544 -1176 6879 -2726 -6675 2141 999
692 999 -5303 731 6419 -2358 -4222 3894 1093 -4609 2963 6838 -1999 -3121 2823 544 -4002
707 -4002 1772 4541 -3502 -4515 2775 -898 -5699 2267 4536 -4144 -2385 4760 -207 -3111 3970
722 3970 3536 -4206 -265 5434 -1227 -2717 4227 1194 -5512 -113 2480 -2757 -1586 1980 -1217
737 -1217 -3611 414 2497 -633 -444 3044 742 -3211 620 3335 -210 -453 3319 626 -3775 -427
753 -427 1915 -2998 -2597 2850 -561 -4023 1347 1359 -3769 228 3238 -1547 -762 3542 1519 -1448
769 -1448 1391 2272 -1033 -1067 1008 -509 -1407 467 419 -1648 -649 63 -800 -1424 -1100 1133 748 -379
787 -379 2094 2411 -806 723 1472 -1039 -454 1933 -16 -1120 1004 606 -1969 -1586 -35 -1692 -1269
804 -1269 428 119 -455 1311 1160 -673 98 453 119 648 425 1066 1177 189 -83 80 -1361 -1186 -396
823 -396 -1162 -766 681 435 -326 -414 370 -182 -563 744 937 391 2182 1048 -593 756 224 -1255
841 -1255 -552 -173 -420 -291 -201 -329 -155 -950 -1291 -824 -766 216 819 829 1104 1238 988 -198 -744 496
861 496 -63 -257 725 699 -946 228 133 -2573 -1590 96 -1098 -958 617 1170 269 503 1004 -198 -641
880 -641 691 884 -799 752 2297 299 -1196 156 -259 -2199 -1474 -205 -592 -1039 1169 1326 -1710
897 -1710 -273 1532 -1233 -1311 2504 1891 -302 997 1771 -1274 -1713 992 -187 -2387 534 1647
913 1647 -2333 -1345 1767 -448 -2419 652 1122 -1187 -78 2383 446 -1069 1767 2374 -1861 -1094
929 -1094 2226 -451 -2464 1411 1927 -1793 -847 1407 -1709 -3769 843 1797 -1819 831 4520 -404
945 -404 -2452 2134 878 -2937 614 3824 -653 -1837 2248 279 -4479 -103 2400 -2288 -2149 2697
961 2697 103 -3451 677 2480 -1290 -508 3044 772 -3270 876 2780 -2027 -794 4429 -53
976 -53 -4281 122 985 -3321 -1161 3843 335 -2642 1625 1345 -3934 -1245 4074 331 -1231 3794
992 3794 2248 -3631 -1082 2425 -1254 -1893 2874 2262 -3634 -1038 2037 -3180 -3381 3659 1963 -2571
1008 -2571 90 2267 -2280 -1652 3872 2194 -1751 1476 2297 -3801 -2738 2835 537 -2336 2311
1023 2311 2046 -3825 -2692 1017 -1301 -2094 2746 3312 -1754 -1076 1949 -1671 -2694 2776 3114 -785
1039 -785 603 2359 -2218 -3522 1112 1565 -1860 321 2801 -2494 -3648 1200 488 -1948 2198 3572
1055 3572 -1183 -1861 962 -388 -1544 2283 3521 -829 -1181 742 -2204 -3369 1216 1911 -771 -16
1071 -16 1149 -1437 -2909 210 1086 -480 1529 3578 108 -1566 870 -244 -1967 1380 3090 -148
1087 -148 -942 150 -1656 -2931 122 2630 -293 -20 913 -1874 -2841 1192 1789 390 1898 1918 -1149
1104 -1149 -1121 500 324 -152 1225 1388 -955 -1012 -12 -1552 -2303 68 960 540 972 811 -1226 -1975
1122 -1975 -254 1433 1135 1978 2193 -1141 -2604 -178 418 -252 1656 1414 -1883 -2177 -354 -458 -929
1139 -929 1092 1361 -1811 -1013 1798 273 -1169 1778 1089 -1124 1541 2423 -747 -1263 458 -1174
1155 -1174 -1993 934 2237 -134 -1517 -468 -1643 -1636 1571 2397 26 -267 -280 -862 -1186 1788 3192
1172 3192 469 -989 343 -690 -2181 778 1514 -1520 -1060 1263 -978 -1965 1284 1346 -1771 -781
1188 -781 2459 348 -791 2043 588 -1901 692 1601 -586 -315 1690 -243 -2460 -505 988 -692
1204 -692 -551 852 -233 -1467 111 754 -350 80 1512 700 -1145 -9 1362 -279 -898 1636
1220 1636 890 -1520 -72 264 -2147 -1188 1424 -331 -1381 1248 963 -1543 -446 1589 -227 -516
1236 -516 1404 866 -1035 643 1338 -699 -265 339 -433 -963 -367 206 -294 -799 44 177 -288 -411 401
1255 401 -6 -403 529 1146 202 291 1028 -80 -1444 399 449 -1045 156 987 -883 -682 379 -549
1273 -549 -1106 486 705 -665 381 916 323 81 740 308 -116 298 281 -87 454 333 -541 -79 -533
1292 -533 -784 -171 -406 -329 137 175 -439 476 223 -53 372 550 241 142 1158 493 -378 76 368 -1231
1312 -1231 -436 15 -1176 114 456 -85 -232 245 21 -229 156 268 83 390 637 382 449 208 -103
1331 -103 2 -119 -628 -618 304 -390 -471 272 -529 -753 321 -170 -168 653 445 376 824 616 -213 34 436
1352 436 -90 -326 328 -112 -225 -251 -227 -592 -196 -168 -469 -132 337 -6 660 443 -73 296 321 -10 476
1373 476 603 491 441 -102 -111 -527 -589 -578 -780 -465 121 -504 -84 412 -177 -272 488 -11 154 435 627 198
1395 198 247 140 -51 -394 -114 -42 -816 -257 48 -133 -637 -60 -148 -46 -144 -164 219 409 607 358 313 123
1417 123 754 391 -278 -34 380 -154 -498 -326 -242 -382 -443 -127 -505 -357 474 108 -308 434 417 -44 -74
1438 -74 209 418 84 113 -58 -80 -204 -202 -157 -937 -240 239 -200 -542 41 475 -117 -217 297 -71 -290 610
1460 610 556 -229 295 1023 -321 -692 37 204 -666 -286 96 -520 -356 415 52 -1054 54 221 -209
1479 -209 64 817 461 -191 102 699 -291 -366 497 228 -868 -211 197 -823 -845 551 186 -694 -268 578
1499 578 -718 -529 1217 656 -562 949 857 -1097 -542 1134 63 -593 707 753 -1183 -442 472 -273
1517 -273 -860 186 501 -769 -40 999 197 -679 10 849 -283 385 1010 -142 -1053 331 580 -988
1535 -988 -133 1210 -711 -1849 25 204 -995 258 1507 -282 -1276 777 416 -696 986 1877
1551 1877 -486 -754 657 -40 -785 546 937 -1129 -1204 651 -55 -679 214 890 -1064 -675 1230 712
1569 712 -99 718 602 -1059 -626 1010 797 -249 39 438 -1787 -1164 1055 243 -630 438 132 -1264
1587 -1264 -311 1290 348 -590 614 957 -705 123 1153 140 -714 791 79 -968 106 679 -549
1604 -549 -868 393 79 -753 176 808 -544 -874 412 871 -36 461 1206 -940 -658 693 635 -745
1622 -745 -24 573 -861 -743 827 -26 -998 -102 207 -873 -333 1032 118 -819 55 262 -406 589 1049
1641 1049 -112 -608 76 -54 -260 385 348 -414 -966 -319 87 -365 400 715 -132 -799 353 306 -179 612
1661 612 702 -398 -563 900 510 -567 350 418 -834 -542 718 -19 -327 186 -321 -835 134 817 208
1680 208 305 498 154 -429 155 667 121 21 -77 -236 -440 -134 152 59 -341 -339 33 -318 -73 608 254 -186
1702 -186 695 195 -218 481 497 -210 -148 583 198 -283 209 108 -564 -413 -224 -198 -269 394 97 -493 634
1723 634 320 -318 -70 176 271 -95 -89 307 -12 18 -83 -283 -505 -404 -60 -255 -401 -85 -188 46 -151
1744 -151 106 -47 17 396 108 -234 813 235 -39 -89 237 -288 -321 151 8 -115 -183 -114 -481 -20 20 -353
1766 -353 -102 661 390 -138 125 -6 -211 298 110 101 -3 95 112 -265 -341 -159 108 -243 -392 159 -217 155
1788 155 395 216 19 167 128 -194 -163 22 118 24 94 -37 -225 55 27 74 -415 -209 62 -61 -287 17
1810 17 -100 2 179 -8 134 391 247 366 -54 387 30 -84 56 -8 -220 -66 -50 59 -365 -314 -174
1831 -174 -221 -68 -25 -306 -7 235 397 105 86 216 128 -58 76 93 -160 -308 154 68 -241 -389 -210 122
1853 122 31 51 25 -166 387 205 -199 7 268 131 65 73 32 112 218 85 -22 -241 -22 231 -298 10 -265
1876 -265 -116 -15 285 93 -2 166 -218 33 -114 243 281 -190 26 148 -317 -303 -189 -94 -155 106 146 -234
1898 -234 -197 19 167 -131 383 242 -67 107 182 42 129 110 87 -197 -65 2 -30 -669 -13 69 -522 4 102
1921 102 -65 -113 159 149 -165 305 297 -172 -162 -36 147 -472 36 308 -75 -231 395 -86 -348 60 259 -309
1943 -309 -53 499 89 -256 235 458 -671 312 535 -38 -294 429 -115 -453 40 371 -244 -533 348 -20
1963 -20 -387 -97 523 15 -418 455 383 -708 210 570 -190 -580 344 246 -760 120 544 -435 -666 183
1983 183 -38 -745 445 604 -430 -141 412 159 -415 900 1047 -460 -85 556 -137 -861 614 404
2001 404 -298 -120 402 -555 -799 476 266 -659 -224 712 -400 -921 856 592 -569 363 832 -390
2019 -390 -487 671 305 -794 -504 696 -733 -368 863 -124 -1147 194 503 -722 -25 1136 -343
2036 -343 -781 432 736 -456 50 1180 235 -653 644 255 -1017 88 861 -193 -764 282 350 -1073
2054 -1073 46 1147 -7 -297 881 154 -1056 442 1047 -196 -331 824 -42 -1035 -30 750 -637
2071 -637 -690 1112 -270 -1288 257 436 -1002 -54 893 21 -505 956 653 -743 96 766 141 -274
2089 -274 911 274 -939 -333 518 -703 -451 1074 399 -1116 -280 474 -506 194 1334 661 -601 231
2107 231 544 -743 100 1255 56 -1222 154 425 -1032 -343 1037 -302 -1099 733 428 -760 133
2124 133 770 -796 -325 929 379 -526 318 653 -804 -593 891 151 -723 -238 -68 -964 -431 669
2142 669 177 -590 114 317 -697 -381 648 190 -559 740 569 -532 -203 810 -255 -525 279 316
2160 316 -672 -44 629 -551 -556 679 227 -787 408 817 -91 -10 641 191 -447 357 579 -897 -243
2179 -243 360 -181 -508 398 -53 -482 -122 308 -413 -590 438 680 -451 118 698 49 -346 605 449
2198 449 -771 -259 549 -232 -603 555 61 -816 347 610 -457 -487 622 -399 -456 509 617 -396
2216 -396 42 818 -70 -620 356 278 -418 60 230 -441 -251 217 -207 -623 23 11 -536 -255 594 411 -523
2237 -523 315 542 -118 -241 469 296 -474 303 268 -423 -100 71 -6 -425 114 160 -287 -14 416 -145 -329
2258 -329 299 358 -314 63 525 334 18 200 -261 -492 -326 327 -45 -447 246 -41 -582 -47 354 -155
2278 -155 -101 389 91 -188 22 517 -114 -177 844 195 -291 319 109 -37 -266 -24 -117 -353 -44 38 -427
2299 -427 -29 216 -119 39 248 107 -67 -79 198 127 -247 177 22 -426 -16 -75 -45 -430 12 -30 -402 122
2321 122 -32 -131 -69 63 224 17 394 324 -195 85 289 148 -129 27 298 -56 -49 297 -97 -313 73 33
2343 33 -474 -290 6 -57 -275 358 -41 -132 174 298 292 -207 7 85 120 -395 97 93 -221 -351 -173 -41 59
2366 59 -94 10 14 313 9 -111 -39 78 -105 -104 151 152 -176 40 368 -288 177 7 -193 -483 130 50 -507
2389 -507 -247 220 -54 -13 243 231 244 256 389 -100 -77 272 -115 -176 16 175 -387 -228 74 -78 -363 23
2411 23 -43 78 59 -53 91 -123 69 -79 -22 -175 359 -190 -78 176 93 -449 -302 -47 -41 -17 91 -117 -412
2434 -412 52 214 -167 -163 308 157 147 -104 164 -171 -370 269 41 -124 -14 388 32 -247 252 -256 -491
2455 -491 -59 420 -141 -82 324 -68 -344 429 514 -200 51 475 -77 -496 400 293 -294 108 179 -342 -376
2476 -376 257 -18 -274 -219 270 -322 -198 667 156 -530 301 496 -422 -48 635 156 -517 107 230 -506
2496 -506 -138 650 -3 -450 7 103 -482 5 355 9 -91 579 145 -561 -71 539 -299 -281 443 40 -609
2517 -609 -5 320 -471 -297 370 -197 -743 202 460 -177 -375 500 264 -261 591 340 -419 -71 471 140
2537 140 -624 415 206 -698 -536 372 -213 -482 218 34 -678 2 666 -354 -191 690 113 -450 129
2556 129 373 -508 -225 532 -22 -584 27 57 -617 -165 548 -42 -462 205 300 -177 -352 701 -43 -147
2576 -147 638 637 -532 122 561 -338 -682 342 -144 -404 -192 311 -226 -544 104 234 -494 307 344 -455
2596 -455 -361 570 302 -589 271 375 -596 -448 649 -434 -558 302 457 -674 -389 650 -169 -412 500
2615 500 275 -505 60 706 -93 -299 728 -25 -436 -92 763 -185 -616 470 181 -571 123 303 -538
2634 -538 -190 277 -187 -406 342 776 -420 -84 623 -100 -491 189 425 -638 -229 778 -395 -561 504
2653 504 112 -609 -259 450 -502 -545 542 428 -349 -115 549 -305 -526 634 388 -474 24 292 -394 -531
2673 -531 285 7 -715 117 369 -533 -20 516 213 -465 517 503 -429 -56 836 57 -332 528 122 -353
2693 -353 -147 325 -440 -446 296 470 -523 -51 909 -365 -589 699 7 -297 -18 419 -130 -122 642 312 -635
2714 -635 51 160 -501 -497 317 161 -366 -186 398 -187 -434 88 -132 -398 134 550 -169 -252 548 288 -332
2735 -332 410 367 -165 -133 396 -172 -565 294 87 -525 -181 251 -369 -312 307 127 -313 105 177 46 73 183
2757 183 -10 -198 155 169 -513 -117 73 3 -301 -43 90 -257 -239 326 -22 -339 67 334 -170 149 282
2778 282 -156 -419 -137 346 -484 -21 112 -92 -78 509 148 -139 -24 298 -340 -66 90 -93 30 2 274
2799 274 119 -130 91 80 -343 20 152 -255 -236 336 84 -704 -112 119 -144 173 86 36 -141 -52 206 -289
2821 -289 112 -20 104 -12 54 145 -229 -32 -44 -295 -317 18 -27 38 -42 -25 -150 -223 33 53 110 -33 -111 132
2845 132 -291 -25 248 39 92 87 -75 -235 -128 204 -261 -272 -13 -36 -109 235 -116 156 109 74 137 64 464
2868 464 -53 11 143 -156 -282 26 9 -318 174 -168 77 -395 37 -327 -244 84 105 -15 77 36 126 308
2890 308 107 127 100 34 257 -22 -179 -187 -227 -139 -236 -103 -4 -65 -49 7 -139 -49 185 178 -174 -87 53 -184 -43
2915 -43 41 166 -44 56 -271 -215 -21 -165 -95 -223 -184 138 -205 -133 -255 3 -116 19 306 76 176 74
2937 74 68 -286 -17 -388 -102 240 231 -307 25 -309 20 20 37 -63 -181 -22 384 257 -335 285 84 -24 110
2960 110 102 -159 -158 43 30 -71 125 100 -161 -114 101 49 85 27 3 58 211 190 -33 -172 -150 160 -25 -81 328
2985 328 -122 -107 -71 81 -302 -122 -22 85 43 53 7 -173 -89 151 -53 -49 160 173 -131 -77 192 -86 -115 141
3009 141 -161 -297 -131 258 -70 -144 305 166 -113 193 247 82 -180 157 184 -129 -20 349 234 -314 223
3030 223 76 -115 53 143 -167 -313 122 -69 -263 7 118 -147 -90 89 -159 -194 80 185 -75 -64 42
3051 42 -224 -249 95 -265 -242 -406 243 -132 -12 90 133 -91 165 208 40 -44 150 307 -102 127 111 -273
3073 -273 -298 186 -436 -232 131 303 -301 -61 200 -132 -267 261 132 -493 -266 388 -159 167 252 184 -296
3094 -296 175 306 -133 -420 183 -211 -637 -124 190 -179 -300 273 3 -77 129 306 -97 61 262 -147
3114 -147 -211 489 203 -186 -73 542 -28 -169 42 157 -291 -293 563 168 -198 188 281 -471 -58 320 -211
3135 -211 41 259 -22 -60 8 234 -119 -76 112 53 -536 91 27 -137 -244 210 5 -77 290 323 -89 -288
3157 -288 607 200 -96 138 206 -76 -333 310 257 -574 37 371 -290 -622 178 -27 -325 220 374 -203 -64
3178 -64 284 37 -29 500 159 -525 58 302 -124 -357 28 112 -232 185 112 -125 -209 95 21 -194 266 286
3200 286 -123 -87 549 -131 -120 112 209 -56 -167 83 -130 -397 -201 -146 -174 -31 99 -50 108 452 139 -416
3222 -416 316 265 -16 -185 15 194 -432 400 195 1 -180 78 391 -272 142 -83 -178 -170 -29 -135 -219 231
3244 231 79 77 88 214 -88 -200 -142 139 -486 27 86 0 -264 52 160 -289 -27 92 -17 -264 136 -50
3266 -50 2 -142 -1 -71 8 264 -240 -123 136 130 -160 141 81 -143 -140 8 71 -45 65 78 -288 -34 79 134
3290 134 15 129 61 -239 78 -54 -240 138 -87 163 -8 -126 65 -6 58 -102 129 -257 35 -154 205
3311 205 -129 48 75 95 -84 135 299 -315 -60 -46 -45 -441 63 36 -43 141 -19 67 18 -56 164 8 -41 16
3335 16 -28 174 201 -127 167 81 223 -226 66 -33 163 -122 -204 -70 47 -70 94 63 -41 106 70 -32 123
3358 123 20 -92 4 157 242 269 386 -148 -165 9 293 74 -2 -74 -12 -59 -180 119 -309 121 137 -1 217
3381 217 70 304 -111 -24 -96 68 -114 164 -99 -99 43 -165 190 -99 -188 30 -81 -66 -60 151 61 52 392 -259
3405 -259 105 65 91 82 24 105 122 137 -131 -162 -34 -190 92 -173 -54 73 -83 -4 50 -18 77 -63 64 -45
3429 -45 17 -103 0 41 -165 -172 -308 -227 -121 -78 -128 -12 293 87 -226 279 23 -35 171 337 192 -140 87
3452 87 82 -22 136 -63 -84 8 -95 -450 -280 -95 -92 -218 29 -10 101 279 134 -169 195 143 36 -278 133
3475 133 -102 251 -122 -177 -322 -358 -72 139 125 -111 113 -14 108 154 -26 -50 -2 81 26 345 -68 94 154
3498 154 -251 236 -49 -264 -24 -84 -269 -233 -25 -404 302 -86 5 51 -39 -39 -297 -119 246 141 -146 -8
3520 -8 124 188 -86 16 -60 -126 220 -257 8 -130 111 224 -18 131 61 -272 165 80 186 226 133 281 65
3543 65 -32 149 -5 49 72 243 -37 -180 2 -85 149 224 -67 142 3 214 -74 -152 58 122 144 269 226
3566 226 127 -100 227 -70 -182 107 383 -56 -127 201 133 38 -2 117 135 -156 6 -192 -146 208 228 62 64
3589 64 -83 53 -61 17 -214 -171 -106 -39 -121 -546 -48 -116 -88 -51 63 -146 -57 148 82 -8 -10 188 -108 -58 122
3614 122 -51 -352 -162 -4 -217 -51 286 -236 28 -87 -101 31 -172 251 -214 -113 93 -69 -226 150
3634 150 -74 184 -301 54 -176 -127 -54 134 -71 -437 -29 -84 26 -117 66 267 125 17 355 215 -119
3655 -119 252 5 -237 182 15 46 -253 40 -64 -61 221 -134 68 52 2 -3 99 269 -51 253 2 205
3677 205 238 -54 -297 -36 -48 -48 352 -82 20 -46 -107 -214 -74 112 -166 50 244 178 -77 -35 167 -186 -245
3700 -245 9 133 -279 111 -143 -279 -226 436 104 -2 262 90 136 -32 96 3 50 280 -230 133 79 -269
3722 -269 -53 261 93 -67 -157 25 9 -140 124 -60 213 12 261 182 -106 94 228 85 21 117 27 14
3744 14 -50 91 63 -270 -169 -88 -136 12 102 75 58 16 344 -24 67 154 83 -24 85 147 -38 -2 43 13 -127
3769 -127 -8 -30 221 222 -141 418 41 -219 153 -143 -241 -6 125 161 43 0 7 -84 53 -92 99 -58 -137
3792 -137 -95 -25 -95 -239 -14 -69 -57 -177 180 21 40 133 16 -53 63 150 -18 315 137 111 -1 47 -115 -119
3816 -119 12 41 -201 -176 114 5 -173 -312 163 -98 -34 152 -28 173 162 209 120 94 98 -17 -67 -144 -137 -226 -273
3841 -273 18 107 -113 169 -307 -82 162 4 55 -131 -17 -17 225 168 -35 167 -116 9 198 -60 -102 18
3863 18 21 65 -131 32 -44 72 -14 -49 140 198 -228 152 -22 -181 42 11 225 76 -109 -103 -80 -9 -180 -8
3887 -8 72 252 74 -120 70 1 -128 -1 -60 -6 -28 -48 51 -159 187 -240 197 -157 173 -14 -171 -18 87
3910 87 -166 -105 -17 26 216 148 150 39 -175 -56 146 -109 77 259 -27 185 70 -16 -249 121 38 -150 -92
3933 -92 -215 -65 -195 -83 -45 166 59 -169 195 -133 79 230 -120 51 -153 -134 84 -55 -231 48 -152
3954 -152 191 -33 -8 -149 -68 -151 366 67 39 162 -33 -36 132 -93 19 -184 53 -20 -134 -157 -148 -142 -40 201
3978 201 154 -133 216 93 145 113 91 237 28 221 43 -204 -2 298 -132 46 -222 94 45 -312 -277 24
4000 24 -326 76 -203 69 -83 36 31 -106 -44 7 49 -53 -37 -11 -93 86 -45 -235 -302 -260 -80 -89 -27 -108 -111 25
4026 25 -20 50 30 -139 -2 5 -68 255 -249 -10 130 -33 -237 -129 -191 175 -101 -283 -34 -139 3 -121 216
4049 216 24 -236 179 231 -112 -79 222 74 25 121 -96 -9 -75 14 55 4 -62 175 32 57 48 -46 28 14 -77 -94
4075 -94 -16 26 -73 -124 42 110 70 87 -16 -110 -81 -111 -79 -114 -133 -119 -73 -137 118 216 -286 -114 303 -77 -184 23
4101 23 115 160 56 48 73 51 48 -214 60 223 -31 -77 63 -2 -9 -90 -58 117 -317 -25 84 -167 -80 -131 -279 -159
4127 -159 -96 -124 116 24 -70 -266 86 0 -32 -103 134 -15 16 45 68 -104 -234 181 162 205 -37 -102 -48 133 -336
4152 -336 159 -102 -46 -149 69 -124 100 63 -30 23 191 74 -37 -110 43 296 40 65 -40 -255 18 300
4174 300 -206 123 44 -50 -153 -44 17 89 -231 149 128 -54 -42 -282 37 94 81 73 5 -2 353 -100 0 53 -166
4199 -166 -16 -44 60 -57 -62 32 -6 -16 58 -125 32 65 21 79 175 -35 -88 -134 1 -119 -293 225 30 -252
4223 -252 177 432 230 -84 -222 -283 -125 -235 107 -10 285 -234 46 94 -177 150 -114 233 264 -56 7
4244 7 -19 -2 87 86 17 -212 84 50 102 180 34 132 190 9 14 -369 146 -52 238 -95 18 -116 51 -413 -135
4269 -135 -140 -239 115 57 116 146 85 72 256 155 6 50 1 206 25 81 -93 61 -111 176 92 47 -118 -143 -141
4294 -141 86 209 -235 -69 -153 -40 236 147 163 -15 -11 -8 359 196 -248 -166 -63 -79 -14 -61 -296 218 55 36
4318 36 -180 -157 57 86 -42 22 99 -76 -282 236 -20 -198 44 -49 -219 -36 48 -224 105 -49 -16 150 -51
4341 -51 241 114 -73 -20 137 -131 167 -295 9 276 23 82 27 -97 37 24 -87 -17 124 -62 78 121
4363 121 69 46 -11 38 33 -16 267 148 4 -48 -316 -43 88 264 -19 77 134 65 55 32 337 -82 12 130 27
4388 27 173 279 31 -74 -48 -109 -263 -164 -46 50 101 89 -164 -78 -22 -154 55 192 -71 273 -219 169 -150
4411 -150 -84 103 200 -202 94 168 -168 75 -222 -47 -199 -350 -12 -18 -4 11 -167 -181 281 42 123 -78 252
4434 252 138 118 -1 146 -46 58 -20 -8 135 -344 196 59 9 54 -89 -267 -36 -18 -54 -144 331 63 123
4457 123 -39 133 -48 83 77 -172 -306 131 -32 6 -21 2 -17 -45 146 29 70 157 -217 -172 194 -48 -223
4480 -223 -72 -208 -114 -47 -261 -38 214 125 100 120 -67 166 150 -86 -27 -44 -133 42 -245 84 104 -108 -183 153
4504 153 82 -50 160 50 59 163 -347 73 42 181 133 75 -104 -71 -86 -169 157 -123 -222 -186 262 113 -130 17
4528 17 91 -40 140 -186 93 88 77 52 -133 -76 75 30 -282 -170 270 -135 -48 -40 262 -72 -5 -81 -24 -65 -223
4553 -223 -172 19 137 -17 -76 -119 -67 -122 -119 -68 -52 -15 -90 -17 -3 36 101 281 -1 -101 -164 10 -194 -16 -71 -97
4579 -97 279 -225 189 294 34 -13 -74 -191 49 -27 68 87 214 122 -71 -84 -42 -29 107 -166 25 -24 -150 14
4603 14 72 -144 243 -90 -104 161 -138 329 89 -248 -32 144 115 -337 -156 -5 109 -152 -458 -114 -40 -6
4625 -6 -34 -152 -74 64 -133 -275 86 -31 -47 -31 337 44 -115 84 -96 -233 -227 -311 154 -80 132 -69 -131
4648 -131 -94 -141 -124 116 -118 -143 264 -19 -15 49 -156 -2 -46 -148 6 -126 1 -158 -89 -134 61 52 53 217 -29
4673 -29 259 -207 160 -150 -3 53 231 76 -98 94 -373 -41 -156 -101 140 11 -109 -89 -1 -86 -114 280
4695 280 284 -84 41 50 78 -115 -163 143 -50 -230 236 -157 157 4 -179 -72 34 -22 132 -146 -117 -115 32
4718 32 -224 11 -38 -96 -51 197 -260 216 -46 28 -4 -60 -123 -129 116 281 -33 29 -276 -112 85 26 336 -40
4742 -40 -19 192 52 -79 -77 25 -122 33 251 -75 -11 187 -144 91 -86 33 199 -72 63 -115 -81 -105
4764 -105 -75 55 134 107 94 -193 48 168 -66 57 126 40 234 -139 -131 -51 -387 -30 -33 184 142 42 182 103
4788 103 73 -105 -229 -48 -41 -179 46 -158 26 -4 -158 -205 -83 -144 0 -91 -50 -159 -94 0 -320 -99 129
4811 129 168 -16 124 -38 -118 -238 -4 -70 -130 -10 60 61 92 55 -4 180 139 -38 3 83 108 97 35 79 -100 -28
4837 -28 129 -162 -85 89 -85 103 -168 -142 -100 -41 -81 28 55 13 175 -139 -38 -187 -57 125 142 64 -102
4860 -102 -88 383 105 -32 -44 57 -144 99 1 -132 -41 -87 -179 31 -96 189 -63 142 71 73 106 135 -264 -79
4884 -79 139 -338 -60 228 119 -33 -56 -36 -336 353 118 -114 -87 150 -127 -237 184 20 117 -46 260 8
4906 8 150 22 -7 181 -241 65 109 -261 65 -151 59 -140 181 40 -98 183 -51 210 -150 -221 -125 23
4928 23 -202 32 -19 -95 -131 -146 -118 -273 -39 -262 -127 -21 -95 19 76 12 -167 -166 39 -253 106 17 341 -148
4952 -148 -29 63 124 172 21 -149 99 -58 115 52 143 290 -39 105 28 136 -130 -55 74 -34 -16 17 -176
4975 -176 -132 -301 81 -32 89 226 92 115 127 121 15 36 -70 29 -144 91 -61 -302 -103 84 -104 123
4997 123 -204 -131 -122 91 -19 -81 -119 164 146 150 295 134 -134 -144 229 -73 19 102 123 -138 -82 41 236 -116
5021 -116 -60 131 107 -47 97 -85 244 -57 -9 -199 -170 160 -99 3 29 93 -1 -193 238 -127 -70 9 9 166
5045 166 42 -128 -82 -69 97 19 35 -30 156 148 70 -129 3 -5 56 -82 -14 -160 -82 50 51 163 -112 -226 243
5070 243 170 -77 -4 25 -346 -258 22 1 128 41 113 -151 -75 -141 -200 326 -65 207 67 64 223 155 -115 -79 -133
5095 -133 -289 36 -133 17 44 -17 71 117 40 176 106 -35 29 12 77 -82 -70 -50 290 -180 125 0 122 104
5119 104 87 -190 86 -116 268 21 -408 -62 35 17 50 271 -245 99 151 -25 52 -96 -108 -184 58 117 -191
5142 -191 -83 169 -23 -67 163 83 -126 -134 -205 -240 -60 73 -208 150 -237 73 83 18 120 34 -19 -52 130 107
5166 107 -174 254 -287 89 -1 38 94 -42 -12 -91 117 18 -54 -111 -78 -77 -80 51 45 -13 -134 222 169 54 269 92
5192 92 107 31 101 72 -316 -235 22 -80 115 0 -54 -39 151 -222 -76 -10 177 -191 -135 27 -147 -99 7 -10
5216 -10 -100 -101 19 -118 102 -14 -166 115 -87 150 244 174 -131 6 216 -76 -25 16 295 125 98 69 73 91
5240 91 -314 -191 127 33 -26 -141 -97 -123 37 -119 157 226 -122 87 230 166 -198 324 -29 268 149 -196
5262 -196 -153 -12 247 -1 -75 -130 48 -33 -2 -168 12 56 420 -448 -85 -22 153 104 -75 -237 60 -73 -111
5285 -111 96 -96 -62 -240 18 -35 -16 30 57 -22 -249 -253 102 -207 -77 111 24 -95 6 73 159 185 61 -164
5309 -164 -117 -362 -69 111 13 -29 62 -40 74 -181 -154 39 79 -43 -292 -221 -58 -108 5 87 27 -224 -151 54
5333 54 -74 235 -112 36 244 -132 113 194 39 -69 -1 328 143 62 28 75 213 -103 91 88 87 307 -138
5356 -138 -103 -103 97 115 -49 279 458 77 -45 51 -14 -321 336 325 -121 52 274 -348 178 -20 324 -34
5378 -34 -235 392 84 230 46 54 -280 254 -39 -9 233 22 -173 -15 168 99 -35 159 -297 -106 -278 66
5400 66 -49 -133 98 -92 15 -21 -119 -196 303 144 205 16 64 15 6 185 86 -169 -219 22 -204 -165 2 117
5424 117 -251 -155 14 -182 -318 25 185 45 103 -79 335 -104 -29 204 272 -36 39 374 -12 -33 -34 -90 116
5447 116 -25 -91 64 76 159 -62 -205 -99 -10 70 25 103 284 302 -96 -45 -96 -130 -4 -384 76 49 -29 -13 134
5472 134 -245 -104 -82 1 96 -180 113 42 -38 211 -79 -95 -256 281 -31 90 -372 -151 198 60 -125 73
5494 73 -44 -121 -209 -144 -31 -295 238 -189 103 -36 131 -168 -107 -195 -128 79 444 176 -328 172 75 -120 -113
5517 -113 102 -107 155 70 123 243 19 84 -148 -212 139 191 -144 194 4 -134 -88 -125 221 -220 12 124
5539 124 121 15 -285 -208 141 -175 140 78 157 -92 -152 -35 -208 36 90 38 63 233 64 53 58 -164 -69 72
5563 72 -216 -44 1 79 -68 138 127 244 140 -64 -78 -101 -173 92 -54 -253 149 -55 -50 19 -85 -181 124 26
5587 26 -63 -89 282 -346 -31 -94 175 -143 81 -30 69 37 -154 312 87 -109 -244 -16 22 35 -42 -152 15
5610 15 5 65 7 57 187 -49 -39 -30 113 -100 160 203 216 -58 52 -137 -171 42 102 -113 -108 -284 -186 -78 -43
5635 -43 4 -46 0 80 2 15 -62 133 160 176 391 176 52 151 3 207 -250 192 90 241 -32 -208 -133 -128 -89
5660 -89 307 42 99 -119 -12 -184 95 -350 -161 -10 -211 351 94 196 -183 -65 47 35 -2 82 -97 -22
5682 -22 212 -37 109 47 20 7 74 184 -179 -10 5 -132 -129 283 -33 -303 -274 -298 41 -30 91 43 90 -23
5706 -23 -88 51 -127 -126 -154 -481 -250 -198 27 -39 -85 184 -177 -65 180 112 -285 83 0 -85 -66 -27 98 -176
5730 -176 -194 -247 198 -125 -32 -198 80 55 -60 164 24 162 -238 153 114 27 122 82 159 -47 159 55 -320
5753 -320 303 10 20 -128 41 102 -32 12 72 151 113 -16 51 1 139 13 -139 126 -156 11 97 -122 -102
5776 -102 -223 -23 28 299 23 -439 -135 -154 128 -114 107 -95 199 -74 -175 -9 -157 100 -158 -167 -329
5797 -329 -72 -11 149 -43 -319 44 -290 -136 71 -138 195 -46 -235 -107 144 -61 136 -35 -140 21
5817 21 -34 -42 170 196 -108 -49 -169 23 116 183 -58 2 -162 80 -139 13 117 169 -16 -111 199 19 62 48
5841 48 180 10 -39 25 148 -55 5 -230 6 -104 -8 -12 -20 5 71 -79 175 -54 -206 113 -63 58 -93 181
5865 181 328 425 198 75 -203 83 -135 67 283 -160 60 207 -152 -26 56 -121 56 -34 -307 133 160
5886 160 -189 -98 51 -150 -152 -89 -86 142 147 -76 199 -201 -53 -9 108 161 84 1 -118 76 276 175 -47 -203
5910 -203 -262 19 184 25 228 -16 -386 9 -21 -44 101 57 3 113 -380 26 -142 -31 -109 52 243 -116
5932 -116 -128 -221 79 -41 72 -29 -59 -176 -102 -113 8 239 14 29 -131 98 53 -154 -248 39 -111 -42 51
5955 51 139 150 -64 89 -168 -202 -155 -194 -103 29 257 -85 40 269 43 -7 -37 111 46 -108 181 -52 241
5978 241 37 -148 -40 -228 -217 89 20 7 -304 244 55 -26 86 -179 -73 83 -4 12 237 59 -27 53 -28
6001 -28 58 49 -3 -151 16 -1 -113 -280 -115 -1 213 -166 -61 -52 17 -203 -186 262 -61 76 -1 -188 7 6
6025 6 -39 119 34 -59 -54 152 311 -48 -17 -49 -18 136 -84 -184 76 292 2 -108 -122 102 -207 -117 164 394
6049 394 -149 -140 -15 -202 9 -121 28 43 166 115 -138 -137 336 27 -68 -194 -55 -159 3 140 -113 234
6071 234 57 -5 -112 -61 -37 83 -204 225 -95 206 154 -366 0 -176 -130 -92 286 -139 -18 74 233 -112
6093 -112 41 -203 49 -159 -20 -134 153 56 -183 63 155 288 14 30 163 197 -48 -59 -68 -18 11 -64 267
6116 267 -158 2 -74 -122 81 53 -15 -72 -136 -104 -37 -141 -9 -146 -146 84 236 -293 24 -45 -51 63 110 -168 -141
6141 -141 41 176 -26 83 -90 -146 108 154 206 -94 -224 453 -137 120 -78 -113 126 52 -207 -27 -218 121
6163 121 -59 20 -59 -65 48 -211 -155 -70 -98 21 -261 -66 -262 -120 79 -142 -42 14 53 262 100 -79 -26
6186 -26 -57 173 -139 -65 129 151 -76 142 -16 273 160 41 258 17 -23 280 -29 55 117 105 -150 -88 81
6209 81 -27 -102 156 158 -267 -248 -192 208 -183 -105 65 -150 200 80 -60 25 -118 83 -62 155 298 87 -126
6232 -126 -104 -20 -54 210 247 -264 9 132 30 203 -85 -168 88 -90 -49 -129 125 -54 -195 164 -170 296
6254 296 103 -139 -34 -39 -131 41 -35 52 146 77 128 130 187 2 49 -320 -46 147 -38 -193 54 -49 -71 129
6278 129 10 108 16 57 -55 174 146 41 -3 -232 -180 108 36 -221 -70 -83 -384 -268 -47 237 56 -59 42
6301 42 -14 108 -154 15 158 -125 -31 -14 82 -238 -123 3 -172 -77 -127 196 84 -98 247 -233 -123 67
6323 67 185 -368 224 108 32 26 259 23 -218 320 -80 -58 49 89 314 180 -79 -194 -4 -130 49 36
6345 36 -17 -36 -229 -2 -109 -195 58 -112 107 101 -273 -98 271 -252 223 17 68 -47 -6 4 -171 279 83
6368 83 -130 306 -85 8 1 -86 89 -190 -29 60 -298 -117 133 -104 -275 31 -158 81 -154 70 -138 24
6390 24 11 157 -64 154 53 237 -143 35 70 -180 -337 -177 -4 -3 115 102 345 286 134 128 -48 -8 142
6413 142 48 -215 -148 -15 -49 -46 -68 147 -22 87 -67 27 -88 5 362 87 -96 -111 -167 -175 -42 83 -200 223
6437 223 17 -19 208 156 -117 55 -117 97 -123 50 256 -170 135 -259 -1 -248 43 -255 66 -106 70
6458 70 301 -103 50 -191 169 -68 148 135 68 316 -115 486 30 -45 -41 -20 -22 88 -52 78 117 -342 -10
6481 -10 -7 -170 50 15 -1 -224 -138 8 64 26 154 155 205 -21 120 160 -140 289 -114 -128 122 194 -19 -52 -92
6506 -92 -83 -116 -39 277 135 -47 -390 32 -71 99 223 -287 96 -60 -146 -9 74 225 -267 -12 -32 -36 197
6529 197 -51 -286 141 -200 -56 91 -49 -248 120 -145 -73 -67 24 -326 -152 92 1 120 -272 -76 -26 80
6551 80 -56 -26 -3 22 -63 -117 203 146 -37 16 -174 -50 -9 -25 -55 -305 -9 -280 -219 -60 12 149 -93 139
6575 139 70 -97 -114 138 54 -272 -170 -5 -136 39 -117 109 30 145 26 1 -142 -13 4 -233 -27 -8
6597 -8 -244 -263 139 -196 -157 127 144 67 304 250 117 -322 2 108 160 -151 -43 94 12 151 -111 -322 8
6620 8 8 78 91 -5 -172 -91 78 69 -18 -36 -151 99 19 -95 12 -362 42 -70 -50 245 133 138 -43 108 68 -436
6646 -436 108 -287 185 -90 61 65 -124 -253 -174 160 63 220 -203 -45 -31 -134 179 17 140 -129 61 -207
6668 -207 -54 68 -229 107 61 264 -180 -121 -165 -109 -282 -81 -93 96 -97 -24 286 142 47 -59 -104 -106 -126 -48
6692 -48 46 -21 132 -161 -67 -45 -228 124 -212 -8 254 -41 177 -5 -149 -366 -81 -109 23 -53 -177 58
6714 58 254 -64 -80 -12 -97 10 -229 -70 -238 -282 84 -325 104 -37 97 59 -181 -77 -19 -104 90 49 198
6737 198 241 68 114 -6 -198 89 66 -53 -177 166 -219 -160 11 39 10 71 206 -33 -42 14 296 -42 -208
6760 -208 -178 161 -301 51 226 119 -228 141 200 -104 -219 -379 7 -56 -87 -322 205 95 -78 80 -108
6781 -108 22 44 152 -167 56 48 350 -124 -197 -191 23 85 -68 -90 -349 279 -14 -63 -58 268 -204 138 36 -172
6805 -172 79 -164 119 -4 -115 -75 151 -30 277 -130 -49 28 1 140 -11 -27 -129 -143 43 -16 12 221 179
6828 179 -21 65 -32 44 75 45 299 -94 121 10 -292 46 -100 -103 207 18 143 70 -187 5 -132 -437 36
6851 36 -149 -32 56 87 -158 -89 63 17 -42 -104 -43 46 283 69 207 -39 43 122 103 -168 61 141 -167 -24
6875 -24 -98 451 -290 108 77 -157 -233 80 -292 -267 -83 173 -52 -34 223 164 19 -52 -161 38 214 2 93
6898 93 373 -46 -65 201 -136 44 -145 -29 -85 72 -18 146 0 165 -9 -59 -208 -195 -169 29 312 -28
6920 -28 29 58 -41 -25 -44 -42 -84 -79 183 -77 53 -38 -5 -33 -58 -336 53 -196 123 -164 108 -48 91 147 -34
6945 -34 324 -80 -141 6 97 -56 -99 -44 36 6 57 149 209 -13 -37 123 224 -322 -266 -125 -116 -167 30 -33 239
6970 239 -13 147 -215 -475 -59 -3 165 54 59 39 226 6 -56 326 -81 -117 -129 -150 -150 -8 228 172 -197 -103
6994 -103 -13 -208 25 -62 92 278 -48 -102 -55 -105 -194 6 -228 115 187 -76 -41 -118 -41 -46 -249 3 -89 -41 -96
7019 -96 -246 43 27 38 -264 249 243 -185 -174 72 -119 324 -37 12 -222 -15 53 -87 13 -27 264 86 -249
7042 -249 265 -161 4 -38 -69 221 297 26 -90 -41 -279 -46 25 -67 49 96 67 18 103 -46 198 -53 62
7065 62 -109 -304 -94 106 -53 245 58 9 122 8 46 -105 -20 -59 106 -61 -261 97 -17 -56 -192 39
7087 39 147 231 114 -88 -27 -224 -166 89 -26 -59 -89 203 -95 91 -136 175 181 -221 261 -36 -68 -342 -69
7110 -69 3 58 -198 -100 -261 169 332 64 20 49 101 146 302 -186 237 172 140 57 196 192 -117 -95 85 96 -11
7135 -11 -416 -73 -333 133 225 -43 358 -20 -111 159 -14 -147 55 -14 32 133 -158 -186 -101 -141 214 -30 76
7158 76 -73 168 -252 -86 188 -8 -53 -207 30 165 -54 -113 -188 -8 108 35 -45 -67 -49 120 -140 -204 222
7181 222 -214 -295 -208 -234 22 -136 -143 2 165 -257 -455 68 191 -10 -111 -54 -201 -191 -11 -228 -299 13 121
7204 121 52 175 -5 22 23 30 -47 34 255 80 84 153 86 240 154 8 -47 -136 -164 22 49 -22 132 320 -47 -203
7230 -203 -306 33 304 55 1 -209 114 29 73 52 -77 90 -72 -202 -72 -121 -109 -170 147 -203 -41 36 -219
7253 -219 131 -33 -246 113 -83 23 90 20 -85 -35 19 -212 -71 -138 -152 29 -98 152 -338 404 -123 -168
7275 -168 21 107 -61 64 -37 131 -136 72 -52 40 121 90 278 253 89 38 45 42 -115 0 -65 -124 15 68
7299 68 237 -160 185 -85 106 -181 -315 7 181 -18 105 95 -228 38 -136 -346 -112 -86 33 49 10 -100
7321 -100 119 126 -86 42 -133 -174 31 -298 169 243 144 -169 256 -67 160 -244 -47 -124 -91 89 -334 104
7343 104 -240 100 -59 -104 121 -16 -45 -217 -158 105 28 -127 6 -271 -101 183 61 68 183 -298 269 102
7365 102 215 155 13 -37 178 104 78 73 59 44 146 22 64 -24 100 22 -144 -11 156 213 22 -78 -35 110
7389 110 36 -181 -58 61 -57 -227 75 76 35 -1 -13 -239 -207 92 -81 7 211 -16 8 -148 -162 131 132 -185
7413 -185 -100 70 -63 332 56 -54 207 96 -83 12 47 18 110 -85 83 -73 -185 118 -103 93 -150 -19
7435 -19 215 -215 184 97 -96 -206 83 -195 30 28 306 149 73 163 -90 25 -61 -252 -84 190 111 -146 -153
7458 -153 -55 160 -24 -196 175 -588 -166 88 22 -139 -37 -19 101 17 -158 -58 109 176 -101 -87 -279 -166
7480 -166 -153 -81 135 0 87 -92 252 -44 -138 121 20 -49 11 108 105 -108 59 -61 115 -8 321 -139 12
7503 12 -183 -166 153 86 -86 77 208 -62 -50 -90 -156 210 96 269 -55 -20 173 50 -31 212 116 118 124 134 -6
7528 -6 22 -98 -82 -150 -24 55 -193 82 1 -109 -67 70 -2 197 82 32 231 -97 -68 230 -295 -179 81 -36
7552 -36 107 -65 351 -23 -82 126 119 -74 276 20 177 -182 6 143 156 -185 -103 -97 -91 -10 -23 -325 -168 13
7576 13 -149 -42 -224 8 -372 4 -311 178 -59 -191 116 169 84 -26 105 35 -54 -29 -71 209 144 92 101 -236
7600 -236 -64 -158 -23 -161 100 255 -122 -48 395 -187 -93 202 -9 92 172 104 -147 -205 -64 352 -27 142
7622 142 -198 99 -178 -148 -141 189 -128 -186 123 70 -74 -225 -191 33 -125 50 47 -118 154 123 91 73 -97 142
7646 142 -12 -154 -240 18 -3 261 -6 -123 176 51 -31 -61 18 -33 89 -34 59 -104 -37 -22 -49 0 -120 -9
7670 -9 -52 -38 229 -90 -91 -14 120 -33 -112 182 -259 32 99 -244 -29 -359 244 -94 223 -49 7 144 55 4
7694 4 -28 141 -39 -74 -86 -112 -181 -41 -122 -47 -148 34 168 91 -202 -46 43 -182 -115 -15 -170 162 -82 121
7718 121 -81 103 163 13 -175 351 249 6 108 114 78 -150 56 -176 135 57 -148 175 256 -76 66 264
7740 264 165 107 37 56 -185 -136 -4 -9 79 -31 -129 -181 -94 -62 63 60 -55 -27 86 19 97 91 274 219 -175 -173 75
7767 75 -113 -165 54 292 48 31 325 289 -27 22 -9 109 231 263 -197 293 0 106 130 -72 -131 70 -121
7790 -121 -300 -219 136 -52 -261 83 -277 -61 110 -12 -150 -7 -174 -242 280 -23 174 74 132 118 -80
7811 -80 -117 -77 -202 -81 164 -5 -129 88 -191 70 166 -6 -164 -394 317 -3 -187 126 109 -70 4 217
7833 217 -142 182 -56 -149 -62 -58 158 -222 -190 -32 -170 49 -60 58 -27 -246 124 61 44 -355 -5 -208 69
7856 69 41 -47 113 154 55 112 -144 -176 40 5 157 -182 -181 8 143 -60 -146 -1 249 116 -130 -99 25 -110
7880 -110 -71 -156 43 -147 32 -32 -99 52 209 34 -163 -1 6 -58 0 192 40 141 -82 101 -180 78 5
7903 5 402 90 -72 93 22 -71 -27 -179 25 161 -211 -80 -43 230 305 147 167 112 -191 -62 -67 -187 -61 -70
7927 -70 174 127 -54 -283 116 -79 11 106 45 202 -167 225 -70 12 359 -247 -174 -14 66 -89 -58 -267 -354
7950 -354 134 -130 160 -107 -196 -125 153 -69 -122 -98 18 -90 -269 -228 62 111 -36 -288 40 60 86 276 -95
7973 -95 -82 178 -174 79 331 -279 -34 163 -34 -48 244 -4 -16 35 -45 -260 -42 75 149 158 -111 68 -17
7996 -17 326 -280 -285 -191 136 -21 -147 292 38 -30 -196 66 -19 -174 -45 -201 83 -56 79 -276 50 -26
8018 -26 -5 -39 -115 -220 -66 166 -32 37 -32 -6 -446 45 92 206 35 -111 139 170 175 -75 102 -171 43 280
8042 280 51 43 168 83 -28 -225 6 120 -104 181 143 91 57 30 -39 325 163 -26 18 -228 229 119 139
8065 139 -43 204 113 2 -53 -81 -92 99 49 62 -111 -20 180 -142 323 -17 158 262 -71 28 147 31 -20
8088 -20 -195 -29 -28 -96 -53 -27 -123 69 219 283 -242 48 -33 73 -149 -203 -84 -13 -138 176 231 82 -23 -26 -2
8113 -2 94 39 -329 162 117 -431 31 -60 -70 117 -343 -162 -141 24 -179 152 -148 33 -41 -153 -235 -207 -92 90
8137 90 -172 -53 -8 134 -32 -94 144 100 189 -98 -142 -122 -10 211 -207 20 92 35 119 -8 255 73 -7 -73
8161 -73 192 55 23 -322 -35 128 -127 101 59 165 -77 222 158 -66 364 -8 12 -148 -187 -207 73 -40
8183 -40 -177 -149 101 142 -98 122 95 -103
8191a03
$$ Imaginary data points
##PAGE= N=2
##DATA TABLE= (X++(I..I)), XYDATA
0 0 0 0 0 0 0 0 0 -8 8 -8 8 -16 24 -24 32 -40 49 -64 80 -96 112 -136 160 -190 222 -257 302 -348 401 -459
30 -459 527 -600 681 -772 872 -984 1104 -1237 1383 -1543 1717 -1909 2116 -2343 2595 -2867
46 -2867 3163 -3486 3840 -4233 4664 -5137 5660 -6246 6900 -7640 8477 -9439 10554 -11869
60 -11869 13444 -15370 17787 -20924 25183 -31311 40925 -58236 99032 -397458 55378 679630
72 679630 -422240 -52097 602606 -188416 -580322 289982 135497 -334413 209064 398426
82 398426 -298305 -206573 247695 -6590 -223251 122988 166131 -89571 -96931 85760 36748
93 36748 -155651 -78500 186087 29886 -163954 138488 160063 -297469 -129891 265784 -44916
104 -44916 -131932 325012 75916 -378472 38267 208081 -278876 -39043 431231 -43411
114 -43411 -309789 160632 55798 -305722 64251 254418 -121488 -61812 187785 -66071
124 -66071 -194022 81285 100518 -75858 9522 112561 -10746 -97879 -20327 44985 2665
135 2665 -25585 58140 59194 -100914 -84482 78763 -6588 -82799 117966 94498 -144268 -26650
147 -26650 111059 -98809 -79453 170790 35843 -135331 76299 97681 -147680 -50903 128907
158 128907 -43746 -89009 115388 44620 -113158 15295 56877 -89689 -29270 98950 9839
169 9839 -50689 31303 19072 -55578 -11176 55288 17742 -22604 3663 9354 -31139 -27057 29347
182 29347 31916 -22172 -12317 25871 -25242 -48398 34438 32334 -39650 14279 54186 -37820 -36072
195 -36072 49957 -1115 -53000 33690 45164 -40324 -9269 44619 -27045 -45803 32339 12207
207 12207 -38955 17266 33621 -31063 -17455 27245 -3663 -17740 18628 14344 -14378 -3122
219 -3122 12989 -1628 -8233 8726 9466 -9565 -10749 2605 -308 -10421 -508 12799 -1054
232 -1054 -11279 7542 4533 -17338 2419 19888 -6644 -6285 19612 2652 -16382 5553 8637
245 8637 -13167 -3387 13045 -5496 -12279 9600 2394 -16627 1112 12047 -7702 -4986 11391
258 11391 1107 -5349 5300 4971 -2818 1598 5540 -2475 -5096 3598 2222 -6047 -2204 2623 -2499
273 -2499 -3883 -1623 -1023 811 588 278 1242 386 2679 4263 -1735 -1477 5900 2769 -4605 -1403 2953
290 2953 -287 -3457 -1399 -1604 -2079 1909 -625 -7538 -24 7070 -2181 -3895 4784 3916 1403 2191
306 2191 -1327 -770 4731 1576 -4717 -1651 3538 1463 -4290 -3300 -1248 -771 -391 -3135 -3741 3630
322 3630 4511 -1321 -353 1902 2221 3005 -1160 -2252 4466 4500 -892 -1912 -1110 -482 -838 -4009 -5268
339 -5268 -1041 3628 954 -3825 84 4307 -681 -2108 567 -35 3638 5671 -254 -559 4000 2207
355 2207 -2984 -5058 -1964 788 -1739 -2172 1184 384 -935 18 -2766 -4973 539 4376 863 -709
371 -709 6515 7070 -2951 -1780 3508 -3813 -3660 5315 -533 -5763 4461 3931 -8114 -5495 3866
386 3866 -2106 -7410 2728 5928 -2786 1754 8985 -2010 -5744 6273 3140 -8099 -273 9550
400 9550 801 -5895 3380 3184 -10928 -6002 5660 -5566 -7789 12105 7671 -11396 1014 12195
414 12195 -7713 -11362 11196 8361 -8991 5783 14757 -9816 -10111 12267 -2836 -17881 6757
427 6757 12003 -13394 -6916 15058 -373 -14726 6281 10026 -14293 -5116 18050 370 -12123
440 -12123 14518 13981 -15762 -6904 15026 -6114 -18365 11094 12670 -16369 -1344 20423 -12117
453 -12117 -23673 14161 9107 -22143 5269 27174 -8918 -15213 18958 4667 -23987 6929
465 6929 22123 -15830 -12444 24888 1770 -25785 7107 15611 -21488 -11551 23158 676 -20945
478 -20945 11507 16934 -20011 -7290 27077 -518 -23421 11811 15264 -19852 -2058 28724
490 28724 -3710 -24491 9744 7579 -28018 -2644 31766 -4828 -23193 17139 10093 -27617
502 -27617 835 26866 -12273 -17880 25208 10620 -23858 8692 25918 -22595 -23598 23089
514 23089 6019 -22692 13614 20876 -25390 -16604 22365 -337 -20352 16098 18111 -24843 -11331
527 -11331 26292 2546 -16602 16216 13522 -25745 -10038 22251 -1501 -16989 16502 13466
539 13466 -26004 -9341 22945 -7094 -22168 18021 13775 -22648 2329 26849 -12208 -20347
551 -20347 19620 6841 -23915 9371 26948 -15225 -16868 18352 -812 -23856 9568 18103
563 18103 -16971 -9431 18107 -2298 -17975 11312 15847 -15642 -8887 18365 213 -17114 10906
576 10906 16301 -14232 -6761 17770 -4804 -21420 9188 12399 -17853 -2575 23263 -6252 -20696
589 -20696 12065 7567 -19903 3888 22496 -9078 -11766 16664 2683 -18177 5735 15051 -11736
602 -11736 -9729 13412 602 -13086 6025 9337 -12011 -7311 10679 238 -10338 6288 10982
615 10982 -8628 -6626 12933 3316 -11393 5309 9146 -12094 -5388 14238 -897 -12067 7400
628 7400 6056 -16008 -4216 13658 -3494 -9004 11427 4780 -13172 2045 11419 -6847 -5667
641 -5667 11839 1930 -10050 3859 8826 -6850 -5812 6411 -1331 -9225 3948 6681 -6556
654 -6556 -3370 7060 -1726 -7481 4932 7384 -4762 -2646 7398 -590 -6293 5923 5842 -7080
668 -7080 -2023 6213 -4815 -7381 6346 4069 -7555 -1128 5870 -4603 -4791 7148 2113 -6822
682 -6822 3667 6626 -5123 -1721 8249 -391 -6811 2444 3669 -4199 -430 5430 -2844 -6779 2095
697 2095 1676 -5013 1160 5630 -2265 -4764 2920 2979 -2110 1696 5353 -1570 -4301 3403 2017 -4486
713 -4486 1016 4677 -4392 -4528 3487 -156 -4602 1594 2722 -4622 -1653 5537 389 -3127 3823
728 3823 2571 -4295 -3 4662 -524 -1650 2385 -704 -3392 -57 2144 -1493 -2853 838 -76
743 -76 -3543 -455 3776 6 -1302 2606 1459 -2716 390 3432 -617 -1408 3720 985 -3789 482
759 482 2409 -3898 -1814 2406 -1866 -2730 2079 773 -2494 469 1798 -491 -800 1916 1379 -347
775 -347 1313 1764 -568 -653 127 -386 -1154 -831 447 -156 -1593 -75 1085 -1913 -954 1308 -736 -324
793 -324 2437 1641 -450 1922 1465 -1030 -758 956 61 -914 901 196 -1330 -254 -380 -2061 -1041
810 -1041 -270 -471 354 788 915 1056 488 -225 611 96 199 1414 376 254 568 -76 -1356 -1195 -822
829 -822 -1295 -1707 -88 331 -277 636 756 -1007 65 1095 -379 332 1523 1064 1047 513 -277 -440 -711
848 -711 -1086 -1068 -423 -308 186 -442 -670 -473 -314 -867 -443 722 1490 337 1278 1935 0 106 546 -1342
868 -1342 -1041 1211 -84 -839 383 374 -1093 -1185 -224 -998 -1186 743 1145 -567 566 2416 342 -733
886 -733 643 612 -676 -195 891 595 -836 624 627 -2352 -1842 750 -1632 -1691 1800 1980 -1133 202
904 202 1455 -726 -1351 1910 1675 -1423 1090 2658 -1505 -2211 1831 -47 -2768 -691 779 -1216
920 -1216 -1240 1208 -132 -2122 264 1810 -1910 -1647 3038 1082 -1551 1561 3130 -1080 -1409 1497
936 1497 -682 -3424 668 2627 -1877 -1156 3044 -1302 -4891 940 1747 -2209 534 3711 -51 -2115
952 -2115 1936 1424 -2886 187 3773 -1137 -2566 2287 760 -3938 -613 2404 -1687 -2342 1687 104
968 104 -3490 195 3526 -950 -1310 4132 1083 -3923 380 2882 -1380 -788 4069 510 -3828 -170
984 -170 941 -3572 -2175 3881 760 -2739 2066 1820 -3696 -1564 3146 968 -1274 3028 2707 -2962
1000 -2962 -1572 2498 -978 -2604 3326 2238 -3881 -1459 1757 -2187 -2262 2955 2201 -2732 -510 2181
1016 2181 -2006 -1873 4175 2490 -1805 1641 2223 -3397 -2975 2241 778 -1403 1794 2250 -2655 -3221
1032 -3221 932 -616 -2444 2443 3554 -1273 -941 1925 -1078 -2661 2188 3361 -802 -185 2351
1047 2351 -1792 -3860 1085 1887 -1803 787 2113 -2825 -3365 688 514 -965 2068 3008 -1233 -2137
1063 -2137 998 -9 -1605 2371 3338 -786 -1255 730 -1757 -3188 303 1520 -609 -169 1479 -962
1079 -962 -3138 -217 648 -931 2111 3643 -339 -1716 351 -678 -1452 1534 3029 -98 -1656 -343
1095 -343 -2058 -2575 1264 2266 -746 44 537 -1893 -1546 1358 1387 581 1269 1840 -587 -1239 454 46
1113 46 -1308 972 1746 -164 -780 -512 -2261 -2113 239 1572 888 475 426 -1643 -2234 852 2664 1180
1131 1180 1266 1199 -1780 -2120 761 961 -237 913 1037 -2345 -2068 1048 -7 -2173 705 882 -1801
1148 -1801 496 2324 -498 -1648 817 429 -697 1488 2625 -696 -2359 -431 -559 -862 1452 1716
1164 1716 -1381 -2044 -602 -667 -415 1647 2412 -36 -1971 -73 795 -992 1483 2307 -1072 -839 1138
1181 1138 -192 -1757 429 944 -2098 -1473 1609 259 -1905 911 291 -1932 185 2196 -72 -90
1197 -90 2073 372 -1856 30 1862 49 -855 221 1 -1559 -499 826 -595 -635 425 76 -1617
1214 -1617 -228 1549 478 -638 1745 1752 -1239 -55 1165 -1071 -641 2009 319 -1362 69 491
1230 491 -1869 -1338 990 -51 -1149 1006 685 -980 410 1447 -395 -523 1022 367 -657 497
1246 497 746 374 -738 -194 -15 -600 -611 68 -444 -664 187 548 -146 -331 729 -41 -1154 172 1354
1265 1354 -342 201 1392 -802 -936 646 -258 -834 8 112 -1103 -609 168 -255 -901 451 272 -422
1283 -422 358 817 75 504 858 -171 147 -122 -233 119 89 -244 259 -281 -621 -388 -236 -564 -556 84 82
1304 82 -171 714 833 75 463 774 -573 13 802 122 109 647 10 -803 88 -310 -1074 -430 -37 -280
1324 -280 111 481 100 -218 333 -56 157 548 312 381 544 120 -419 117 -352 -491 -108 -239 -588 55
1344 55 155 -526 -360 -117 -34 -40 268 497 755 650 78 166 266 218 -211 -332 130 -329 -37 42 -465 -298
1366 -298 -98 -648 -321 297 55 124 316 634 120 315 256 -124 316 65 130 45 505 -118 -290 272 -613
1387 -613 -836 -394 -251 -678 98 256 78 325 365 -37 367 109 450 157 87 589 -70 -26 -212 -306 -663
1408 -663 -521 -490 -384 538 -272 94 45 -477 6 254 -145 291 818 682 40 143 306 -154 -139 39 -235
1429 -235 -297 134 -335 -776 230 263 -743 -238 57 248 379 183 418 165 476 405 354 -6 148 334 -140
1450 -140 -393 -317 29 -180 -521 -343 -461 -588 4 483 -633 110 666 15 -478 636 607 -501 101 665
1470 665 -97 -199 441 4 -967 -458 339 -440 -446 525 167 -505 -299 377 175 47 870 700 -365 -49
1490 -49 1097 -311 -666 800 97 -1221 -423 278 -616 -635 538 226 -1235 32 451 -692 -447 1033
1508 1033 404 -445 565 787 -599 -337 757 233 -702 25 473 -737 -428 380 -399 -1227 158 324
1526 324 -553 -53 975 226 -1260 60 1325 -213 52 1343 -8 -1712 -128 813 -657 114 1062
1543 1062 -806 -1720 129 690 -518 562 1710 -605 -1249 586 873 -275 771 946 -560 -754
1559 -754 647 576 -860 103 417 -1072 -968 561 517 -1102 -331 655 -731 -630 1082 1066 -545 115
1577 115 627 -666 -419 1548 888 -984 -28 149 -1216 -543 1099 158 -836 286 542 -752 -413 1465
1595 1465 -100 -894 566 715 -212 89 1003 -181 -713 186 693 -429 -252 535 -463 -1109 208 550
1613 550 -722 -182 490 -622 -581 768 1208 -437 279 1111 -523 -626 1016 335 -1072 18 540 -707
1631 -707 -298 907 0 -899 105 421 -345 127 1108 -18 -861 377 513 103 372 677 -325 -827
1649 -827 -100 345 -281 -49 499 -431 -1118 58 519 -334 -124 501 -334 -551 753 601 -264 -116 610
1668 610 -251 -357 1071 379 -720 -324 -97 -546 -319 497 213 -716 -44 129 -327 48 913 185 -368
1687 -368 280 91 203 475 804 -25 -603 28 196 -279 -141 289 -367 -801 -27 143 -169 -138 418 -230
1707 -230 -3 388 734 -57 112 342 -347 -76 72 205 -186 228 -90 -621 -365 363 -235 -139 199 -161
1727 -161 30 244 456 186 221 162 72 -53 310 379 -100 132 50 114 7 -243 -47 -242 -257 -13 146 131 238
1750 238 590 -186 -189 426 305 107 581 387 -199 -82 102 -277 -286 238 -286 -514 41 -66 -512 -25 62 -122
1772 -122 -3 191 133 184 117 420 89 -130 106 96 -178 -189 -38 -40 -149 -162 -197 -376 -483 -411 81 -447 173
1795 173 489 -105 348 205 -47 52 372 126 201 64 203 -34 -123 213 -149 -609 -58 -204 -371 5 -59
1816 -59 -8 15 315 310 -124 147 348 234 -4 117 190 -66 -179 -72 -423 -208 -228 -292 -176 -45 42 -124 -366
1839 -366 43 274 15 276 387 156 123 145 -106 -7 49 103 -125 -66 126 -54 -70 13 148 -316 74 -42 279
1862 279 70 282 265 23 31 188 -50 -404 -83 186 -602 -79 178 -390 -136 -168 -25 35 -88 257 -72 -142
1884 -142 -18 86 244 -36 204 -49 130 204 -12 -80 111 -118 -287 -286 -27 -58 -439 -255 370 -460 -31 142
1906 142 -253 9 394 188 -161 185 168 256 -178 -204 168 -475 -368 208 -57 -348 -119 -157 -551 -253 78
1927 78 -60 -91 255 195 -255 261 660 -206 -239 519 -115 -224 -112 82 -317 -353 10 31 -415 146 352 -427
1949 -427 -182 510 228 13 288 289 -267 21 405 -188 -267 363 197 -473 -239 324 -56 -448 200 -23 -722
1970 -722 -8 864 -468 -517 351 384 -427 -60 1001 -108 -288 508 261 -486 75 428 -546 -683 356
1989 356 31 -310 239 752 -444 -491 622 10 -677 485 755 -369 -299 791 -8 -618 482 548 -746
2008 -746 -600 565 -257 -821 592 524 -663 -118 866 -252 -605 854 609 -426 59 1114 -129 -206
2026 -206 747 -65 -1388 -76 956 -525 -630 457 -233 -1027 -244 790 -608 43 1058 -61 -790
2043 -790 91 595 -614 -21 1244 -329 -896 140 347 -445 -212 1224 -526 -1165 111 452 -873
2060 -873 16 1093 -115 -526 808 129 -902 44 1211 -72 -490 819 -83 -1115 124 767 -666
2077 -666 -532 599 118 -913 270 635 -963 -20 1036 40 -486 537 446 -737 -222 1048 -53
2094 -53 -409 812 235 -1367 -747 562 -190 -55 905 437 -1157 -306 716 -344 -167 960 397 -784
2112 -784 191 1202 -483 69 1095 -232 -920 381 276 -895 -502 584 -300 -630 464 396 -696
2129 -696 58 568 -601 -452 710 634 -388 156 632 -451 -453 689 263 -505 -83 112 -798 -439 750
2148 750 79 -637 459 579 -553 -49 931 177 -637 478 421 -493 -21 881 -222 -792 713 203 -1117
2167 -1117 242 496 -751 -645 466 203 -691 487 622 -467 -250 948 239 -311 299 384 -635 -459
2185 -459 405 -294 -364 -14 103 -516 -478 440 -281 -571 339 507 -697 -92 580 -115 -529 509 148 -437
2205 -437 257 604 -466 -228 476 102 -808 -47 24 -564 -335 306 -358 -432 35 197 -33 -52 564 228 -311
2226 -311 366 129 -555 -273 315 -370 -525 188 245 -398 -220 208 -261 -477 623 348 -246 -39 400 -32
2246 -32 -17 649 413 -627 -133 575 -231 -362 -43 82 -391 225 104 -200 -184 446 -57 -321 637 262 -349
2267 -349 -72 407 116 -190 240 70 -435 -276 -12 -21 -465 182 66 -350 -181 279 -45 -417 207 215 -107
2288 -107 26 595 -40 -51 89 47 -92 169 599 -109 83 4 -253 -250 -93 211 -281 -91 79 85 150 -10 315
2311 315 -217 11 116 316 -223 164 232 -436 121 263 -55 -57 -27 -86 -232 57 330 203 -36 134 -73 129
2333 129 202 159 83 90 186 -6 -97 79 110 -122 -432 -51 -173 -242 -173 -304 -80 20 192 -11 -45 -187 108 157
2357 157 -32 292 -123 -12 160 53 -203 -123 -131 -525 -26 -115 -308 -134 -20 105 -183 347 80 31 85 233
2379 233 228 288 -47 -171 112 -96 109 34 -103 -27 220 -195 -424 -32 -145 -203 83 114 102 50 44 274 16 -31
2403 -31 501 173 -181 116 -21 -205 -263 9 -179 -90 -186 -70 -356 -41 -37 -205 -261 149 251 -229 473 31
2425 31 -98 237 243 -94 -94 127 512 -240 -340 282 -315 -286 31 190 -350 110 388 -378 -223 479 72 10
2447 10 -25 413 221 26 198 161 -464 72 162 -323 -16 189 -64 -265 199 -28 -155 -45 477 331 -188
2468 -188 165 357 -298 171 611 -122 -446 247 63 -516 32 435 -567 -473 114 29 -502 227 278 -152 73
2489 73 444 213 -318 262 551 -287 -53 758 -36 -651 15 273 -650 -260 495 -401 -434 108 296 -425 -20
2510 -20 534 202 -365 401 556 -293 -54 543 -337 -233 811 -39 -696 -291 394 -274 -472 334 -146 -447
2530 -447 -198 516 -53 -133 452 223 -693 154 446 -332 -417 548 28 -314 361 446 -480 -701 188 -284 -471
2551 -471 268 12 -792 -133 118 105 -20 616 333 -195 87 393 -465 -21 703 207 -597 16 -29 -648 -172
2572 -172 229 78 -285 360 528 -506 -244 590 -245 -400 423 173 -504 34 650 -264 -429 340 300 -616
2592 -616 80 570 -651 -599 715 409 -538 57 504 -95 -55 459 120 -634 455 288 -680 -594 366 -143
2612 -143 -244 240 444 -575 -249 729 -506 -576 834 385 -228 -160 927 -85 -314 555 449 -463 121
2631 121 271 -200 -427 235 -169 -946 -118 539 -554 -452 340 96 -367 581 544 -397 -123 390 124 -493
2651 -493 398 397 -471 -47 171 -305 -373 472 372 -573 -264 359 53 -318 785 555 -350 123 579 23 -236
2672 -236 271 129 -560 -43 190 -344 -400 276 68 -626 149 434 -497 -240 470 -247 -640 243 462 -592
2692 -592 216 721 344 -378 277 625 -470 -324 640 -529 -650 -38 -85 -358 -260 251 -49 -510 430 141
2712 141 -281 116 511 -109 -395 455 483 -464 -17 363 -214 -495 260 70 -314 -50 343 -275 -336 288 212
2733 212 -321 319 590 -253 -131 584 221 -463 269 240 -438 -76 370 -68 -188 244 140 -635 -295 70
2753 70 -167 -181 324 354 -193 -32 287 -67 79 260 77 -285 -72 296 -55 -459 253 -81 -583 -204 471
2774 471 -267 -367 245 -132 -316 43 418 -183 50 576 120 -353 145 91 -201 -9 223 142 -171 11 -356
2795 -356 -161 64 -37 -201 -18 54 293 -175 41 372 163 44 386 197 34 43 133 -224 -249 137 -76 -508
2817 -508 202 -230 -343 70 -32 36 -148 392 147 -121 306 421 31 -93 4 -217 -173 -67 -2 5 -224 -92
2839 -92 -127 56 -204 -177 -6 -190 -126 -13 283 -49 280 -22 -38 90 188 -170 -128 106 -150 -66 -71 -70 -144 198
2863 198 -268 -164 -116 -28 113 -180 -120 195 -101 298 269 -69 -64 327 -102 -123 -229 -175 -142 -83 -112 -247 305 -316
2887 -316 329 -21 514 -12 -9 269 195 235 -152 143 218 -22 -62 -181 73 24 -58 -9 -124 -231 -92 -195 -120
2910 -120 193 78 -147 -103 84 115 -119 110 233 -238 -88 95 -148 -112 -36 -126 -11 -166 -140 -44 -233 166
2932 166 -68 -86 -67 -22 -165 -96 134 148 110 -92 136 205 -2 142 219 -3 -171 64 76 -349 46 -10 -248
2955 -248 -86 133 -28 -324 14 61 -136 348 213 9 -26 118 -7 -61 -27 -209 -33 -142 -117 -364 -29 153
2977 153 0 -219 84 110 162 -176 -48 54 -249 -13 354 108 -109 103 114 -104 171 -166 -226 -162 510 -70
2999 -70 -248 146 106 46 -138 192 16 -274 -46 163 -159 149 117 -177 -164 -27 -185 -341 -317 141 -98 -99 385
3022 385 -86 -539 -146 589 -280 115 118 384 -138 41 70 -88 -25 99 111 -463 -43 188 -226 -111 241 -22
3044 -22 -44 70 292 -169 376 335 -82 -309 283 89 -190 288 203 -136 -72 84 -71 -67 14 -36 -339 -266 -24
3067 -24 103 250 -125 56 -322 -238 375 122 -119 58 28 -252 -158 410 -228 -379 35 415 -199 -89 538
3088 538 -49 -38 217 315 -223 -21 502 -131 -20 211 40 -353 55 322 -49 -101 183 200 -638 -112 55
3109 55 -117 -186 300 -68 -338 140 320 45 -224 77 169 -321 162 217 -139 -169 316 -28 -400 234 235 -251
3131 -251 -260 268 -90 -253 96 156 -332 -61 407 -259 2 341 114 -214 -195 295 -402 -456 34 -71 -76 20 188
3154 188 -50 -276 158 305 -377 -263 205 -416 46 382 -13 -335 394 241 -189 -10 48 -210 -223 106 11
3175 11 -337 -96 196 44 -353 270 153 -102 133 190 -167 -177 228 458 -240 38 187 -105 -49 71 -262
3196 -262 -302 152 174 -65 -220 38 324 -239 -365 258 33 -69 259 150 -117 43 402 159 86 26 -34 -41
3218 -41 42 108 -131 22 85 -187 -141 58 191 -431 -19 378 161 29 249 238 -208 -297 97 -129 -60 142 142
3241 142 -411 106 42 -48 -51 174 116 -137 168 530 214 -75 -47 -71 -231 -52 393 -13 61 219 -209 -162 -34
3264 -34 247 -111 7 226 -137 51 181 155 -144 102 147 -11 -178 -103 108 110 143 -58 -46 152 51 55 -211
3287 -211 -46 14 -342 -33 83 -101 -158 -99 -24 -145 162 31 253 1 241 93 -133 35 -80 77 -232
3308 -232 -32 -123 22 -40 -229 -100 74 137 133 111 249 92 144 -149 -180 -154 247 -175 -50 84 -20 77 -36
3331 -36 -177 -224 -64 15 -19 334 -22 32 20 -21 -44 -41 213 -203 -165 142 -52 -23 -182 -61 -68 -209 -57 178 -53
3356 -53 -303 -21 -13 -270 -301 90 153 165 439 8 195 -155 -86 -13 10 -98 -175 -195 -242 45 245 -78 91 -124
3380 -124 -102 -11 -193 96 5 -299 76 -310 72 -142 19 148 93 -25 -101 155 -219 28 -37 -63 -160 182 300
3403 300 -213 159 108 123 100 229 -99 71 -56 124 -144 8 121 143 -77 175 64 -154 110 -49 -170
3424 -170 141 121 245 54 -9 17 -34 23 120 80 3 150 31 57 214 -108 148 368 -53 -279 -123 -189 -188 38
3448 38 -40 60 37 108 -54 140 137 24 207 61 -69 15 -236 -109 -82 -122 31 59 -339 -224 -75 -314 -179
3471 -179 -190 169 -90 -75 139 -37 43 -112 -238 -69 -114 -84 -31 -203 49 -180 -153 47 -107 -112 256 -156 -298
3494 -298 -38 198 -2 -141 -36 195 -30 81 -131 -77 -23 -98 -130 -223 -255 43 -254 180 436 83 -35 60
3516 60 253 -48 -160 227 115 4 292 20 -19 -32 211 -393 -347 -182 247 -138 180 -32 -383 -322 12 -9
3538 -9 228 243 -22 20 61 287 96 -62 211 215 -128 -153 15 -70 -196 -3 156 -230 -52 -247 27 -53 121
3561 121 10 163 -15 62 107 -152 -111 91 123 -122 119 -131 -300 9 21 -137 153 118 -314 -373 -51 -147 49
3584 49 -1 100 -130 -43 136 59 -166 133 220 -86 45 -51 67 -172 -25 92 39 -16 -68 55 -28 300 -71
3607 -71 -383 139 186 2 71 46 -125 -277 35 219 -185 -139 -18 -113 -372 -132 150 -189 4 331 -70 -199
3629 -199 -105 182 -111 7 -17 96 36 -243 -105 -68 -7 21 19 14 231 62 17 -195 -266 -83 -236 33 244 -166
3653 -166 -187 -88 -136 -129 53 -29 -296 123 96 -191 -42 392 188 -102 -225 96 -325 89 87 90 46 45 131 -107 -93
3678 -93 129 135 -287 127 30 -52 5 337 -90 -51 -105 232 50 -212 19 -169 22 285 -26 -97 -60 -117 -43 -135
3702 -135 269 -171 -141 -52 29 -257 -128 105 42 -357 -43 307 -147 -101 -175 50 -14 -160 -24 -237 14 219
3724 219 23 288 59 245 -198 -204 44 -28 -56 -177 -8 -377 100 285 -35 237 -118 117 -62 -75 315 72
3746 72 -285 88 68 -73 18 1 24 -302 -49 -71 -268 -4 -282 -128 142 -88 -61 -6 -187 311 -35 154 38
3769 38 86 32 -30 131 -65 -94 -156 27 -138 245 236 -72 -136 119 19 -329 264 181 -97 91 78 50 -80 121
3793 121 -99 -214 29 93 -334 -209 -137 212 166 -13 -202 -24 68 -189 33 -88 -295 -25 120 -86 339
3814 339 141 -203 121 7 -61 11 -97 11 -122 -206 46 -183 -138 10 -26 244 -50 74 140 -9 100 -121
3836 -121 156 -234 199 168 79 -76 -90 207 -84 -87 -37 -145 -32 313 -43 -301 -92 -128 -199 149 108 -153 -2
3859 -2 -57 46 -71 261 90 -143 80 -133 -35 70 36 -42 -278 -175 -7 160 20 -231 287 -219 -149 -89 -31
3882 -31 79 -104 -46 -64 44 179 -6 -101 -167 18 110 121 -56 -70 -141 66 80 -54 40 -169 200 117 109 77 -187
3907 -187 118 -74 -287 2 -303 -190 -107 153 126 45 -36 -141 -14 -41 -42 298 27 125 139 -7 -70 -169 164 -90
3931 -90 19 46 -210 90 244 57 21 -8 -128 30 241 -267 -17 235 8 112 -34 -165 263 147 18
3952 18 -134 -132 -176 -22 -70 20 38 -14 -24 134 93 -140 49 214 14 -285 -46 13 189 15 260 -30 -153 209
3976 209 21 -48 -179 -111 -135 -187 140 127 -86 398 166 208 -49 5 10 306 75 200 156 117 24 105 57 -27 27
4001 27 -158 130 -297 -80 -202 -50 62 -96 33 2 199 69 -4 155 122 85 -161 213 -57 -108 150 124
4023 124 -23 104 -169 -143 308 -185 -60 85 -115 -259 60 -240 20 -161 164 210 -119 -164 -39 -51 35 -292
4045 -292 6 -132 89 99 -44 -28 -6 150 51 -264 -97 98 -124 1 87 -130 -157 -231 -16 11 -110 95 324
4068 324 43 -169 5 -148 -4 -245 152 323 151 79 -248 47 -271 -32 -105 -253 -58 -89 143 -218 259
4089 259 51 -99 76 -102 -28 41 -72 -442 62 -81 -24 103 21 194 15 141 90 -122 -191 -35 1 193
4111 193 -278 -241 123 100 -132 -87 169 218 40 -141 119 164 -246 132 1 -71 85 -128 88 150 -118 127
4133 127 -166 -184 27 -37 48 -117 -384 -113 171 173 59 95 -165 24 85 100 99 -306 -115 -42 129 42 -119 -181
4157 -181 -24 -120 -126 177 2 3 -41 121 73 130 306 27 65 84 -43 -138 4 93 -61 196 27 188 404 154
4181 154 -197 -24 -214 57 -77 -121 113 -5 80 42 73 -84 -215 91 -76 -218 -27 291 -78 152 -18
4202 -18 -1 -200 11 236 69 -80 56 1 -206 -50 158 119 52 190 169 -51 -101 55 27 292 89 80 -298
4225 -298 -4 -33 -69 -94 -34 -221 188 -121 94 -12 117 106 132 -113 36 38 -61 -111 188 50 -159 36 -109
4248 -109 -168 98 -193 -21 58 -128 11 -292 -92 125 -26 -117 206 -18 -50 103 -97 41 57 206 310 -231
4270 -231 -170 125 60 26 99 -3 -179 -156 -23 -50 -103 66 -139 66 -20 61 131 43 93 -190 58 39 -103 -246
4294 -246 13 -116 133 -69 -28 23 166 -142 75 181 36 22 44 1 332 -245 -30 -261 -96 28 -172 147
4316 147 -149 111 -99 -223 -114 41 213 121 4 179 129 -145 162 76 -98 -114 235 -7 -107 -113 -238 -38
4338 -38 -448 134 247 -73 -102 212 -57 11 -16 -70 -145 9 151 71 104 -289 -94 -34 -82 51 35 168 3 -180
4362 -180 11 -212 -86 36 129 -48 43 13 157 100 31 234 -162 91 -254 -123 100 -38 325 -55 -52 -122 63
4385 63 -34 8 -95 333 -232 19 -125 -27 -140 32 156 -180 162 -76 20 -49 34 -84 -340 -6 -92 -210 3
4408 3 -149 255 -56 256 73 -177 -96 -58 -29 194 -213 73 -312 -129 108 -271 150 135 189 -193 123 -44
4430 -44 99 -76 -4 85 -91 51 -34 27 23 -156 -186 257 -400 20 -157 -63 258 -383 33 -144 241 -28 -136
4453 -136 -225 265 -150 71 -122 34 38 8 -5 -31 -54 -278 209 -223 -65 26 83 -92 -56 -272 77 53 -278 -75
4477 -75 -19 233 3 172 -217 31 -96 -71 -48 -330 -159 45 3 -172 -69 -171 -74 -161 26 -157 222 3
4499 3 -49 -115 -174 -8 -59 -188 -37 128 -183 79 -37 193 108 278 157 -272 18 295 -23 122 -259 144
4521 144 255 14 -148 -33 264 -47 -118 9 -11 -54 276 30 -59 179 51 -184 256 129 -37 22 125 155
4543 155 251 2 -268 27 90 -97 -36 -297 -14 -4 -260 137 61 234 122 188 -174 191 -253 33 141 -43
4565 -43 71 -35 125 -234 -31 160 105 -248 -103 148 285 -116 11 -7 111 131 27 46 -124 -66 26 -112
4587 -112 -71 -37 36 -69 1 -92 -139 25 -271 266 -164 -44 -27 38 -171 -16 -81 41 -149 45 25 51 79 66
4611 66 -47 97 113 76 -77 144 25 -93 -47 209 -16 -83 250 -200 69 92 195 -167 -112 51 -20 175 -136
4634 -136 206 -15 1 -80 -212 -300 75 148 -46 364 33 -104 -88 -40 -28 -32 34 38 -130 -265 269 -67 157 120
4658 120 -184 47 -14 -47 37 112 -7 20 -118 -43 145 114 -112 63 -40 -33 51 175 113 121 78 -29 -148 232 -157
4683 -157 -355 153 -128 -147 55 -251 59 257 -100 -104 -7 216 -243 7 -252 -128 -7 17 35 267 44 133
4705 133 300 119 291 77 90 -43 279 49 -41 -256 -90 243 -139 120 180 -155 141 61 129 99 49 -132
4727 -132 320 -242 63 164 -129 -160 -145 184 -164 71 -247 -73 44 -68 -120 291 37 -78 41 146 -170
4748 -170 -164 -19 -42 3 -107 -235 -162 35 -169 -118 53 -81 121 40 106 -137 -43 209 200 118 -70 -198 11 68
4772 68 -14 -193 -162 -107 -171 -263 -136 85 -20 -18 -279 140 27 -243 176 -374 -59 -79 30 -64 117 -84 45
4795 45 -86 -187 -24 -80 279 -375 132 83 -100 -232 -148 226 -159 -76 239 -69 38 98 307 113 -101 227
4817 227 175 84 -59 -34 -21 -247 -276 110 -161 -145 99 21 36 131 -351 -342 193 -154 -108 135 97 -153 25 -289
4841 -289 -258 26 -191 112 244 319 165 -286 170 130 -122 -91 280 116 95 157 92 115 0 -253 -91 37 -37
4864 -37 48 -127 -205 -135 -208 -7 -83 -113 117 240 135 36 -38 16 103 -71 155 29 -165 -162 -102 142 -106 57 34
4889 34 -59 67 223 -103 -107 135 123 23 -162 41 137 214 -88 -179 447 -226 -36 67 0 87 72 157 -120 18
4913 18 -17 83 -82 -225 229 -130 174 -310 -321 83 -49 279 -347 -28 -111 85 90 -207 294 180 -210 25
4935 25 -71 14 39 98 144 19 -109 -219 -100 62 232 -6 -164 251 -35 -14 -104 -116 -121 74 4 151 -239 51
4959 51 -49 -96 123 141 70 63 28 100 -169 -182 -127 -33 44 73 -99 -79 28 -397 -168 107 98 -180 35 -105 122
4984 122 296 -127 -135 -23 52 -136 221 182 -181 45 35 81 164 150 121 -12 65 242 -68 -116 441 42 -187 -209
5008 -209 206 -448 195 234 -20 50 8 273 20 185 142 -16 -153 -132 40 77 -131 29 157 -25 -77 -5 -66
5031 -66 -42 -196 98 -88 -217 -63 -209 22 -53 -93 -14 76 -77 -167 -264 -26 204 -95 144 195 45 159 -225
5054 -225 -195 -94 0 50 -186 -200 83 96 -95 124 -16 34 -133 -96 107 35 68 116 -78 -259 -56 -70 50 -26
5078 -26 136 47 134 236 -66 65 70 -179 -101 101 -71 -74 42 111 17 87 356 112 155 -192 23 218 86 -265
5102 -265 187 -136 86 291 95 17 -160 139 13 71 -42 152 119 -64 -186 -102 -16 172 179 -157 -53 72
5124 72 -274 178 87 -61 -156 18 -186 -229 -70 107 -175 80 -56 9 293 89 35 -67 -110 -128 -384 175 -69
5147 -69 -222 -192 -243 -24 10 -64 26 21 15 -48 -107 -58 23 -140 -11 221 39 38 -1 -72 22 118 35 -132 -315 -158 -118
5174 -118 -34 -245 -66 -74 185 -62 269 -169 -48 -38 8 64 -171 -42 250 -55 -247 101 56 -117 141 72 101
5197 101 51 164 -124 -71 215 165 18 -122 179 -240 -6 72 -376 -137 245 -162 -139 143 207 -149 48 73
5219 73 -55 47 106 -126 -277 -3 61 121 -82 -215 -197 -166 336 66 -75 -76 -96 116 -40 202 -23 -44 202
5242 202 -57 -71 -7 19 29 -239 -188 -150 61 -244 -257 121 -118 101 -371 -65 -36 -208 160 -99 162 71 -40
5265 -40 -25 -452 -115 -210 14 42 -164 -7 205 -268 -68 -37 75 -87 167 91 118 -43 14 126 96 27 -99
5288 -99 -65 -257 75 3 -4 -409 140 -80 2 -19 -36 -8 -106 163 -474 298 -8 167 82 -119 -246 397 120 -167
5312 -167 101 156 -71 -125 111 -455 -234 29 305 138 255 -18 -65 -119 -20 44 117 -51 40 -76 71 57 -439
5335 -439 -115 -282 -257 -56 96 -145 9 139 -302 -161 68 -220 22 -182 -168 -33 224 -15 -12 144 -43
5356 -43 -199 0 -77 -129 -104 -103 72 10 -23 -75 146 47 70 93 254 54 128 -60 116 -197 61 -55 -19 -58 5
5381 5 147 -185 -8 -207 -18 103 100 77 210 74 31 -313 -243 100 0 -179 124 -197 -38 -182 156 -75
5403 -75 -238 68 -24 -9 192 55 143 97 128 -21 122 215 -16 3 -198 26 11 169 -224 -139 -84 -293 -89 -220
5427 -220 55 203 99 86 -89 -75 58 182 206 97 92 113 32 264 -12 -112 -103 267 -60 -149 46 107 -117 -291
5451 -291 -6 31 -52 6 80 -87 16 -107 253 31 -156 -111 97 134 76 -145 -89 -29 83 146 -206 -29 -169
5474 -169 60 119 -49 29 -6 -80 -82 23 -14 24 -215 0 -92 235 -103 -100 -107 133 -9 123 69 -16 24 -46 -18 -45
5500 -45 5 -70 -272 -92 -41 123 -21 24 70 4 -156 -73 317 -45 156 10 231 -316 -257 -46 -126 210 -72
5523 -72 116 338 33 59 3 -48 -42 33 -42 -14 -148 -12 253 192 87 -35 69 185 -156 -204 170 331 16 109
5547 109 -12 117 113 24 89 183 -275 -30 -102 -1 9 -124 215 -88 -205 -35 148 -36 147 -3 -273 33
5569 33 24 -163 84 91 -141 31 9 183 165 138 -56 -57 -53 87 -13 187 244 -206 26 29 -182 -23 290 -195 30
5594 30 18 12 -199 130 -26 70 -364 -150 -196 -97 268 -83 -138 13 112 -170 81 -85 50 102 -103 288 -138
5617 -138 31 124 93 78 -327 17 351 171 -283 -8 21 158 50 210 79 -43 82 43 54 -27 44 -66 -130
5640 -130 137 160 293 76 -34 -83 28 -16 7 -35 28 113 150 243 133 -237 48 50 -275 14 157 91 -405 147
5664 147 262 32 148 82 450 -120 -36 -156 257 264 -162 -101 -87 99 -296 -54 -357 -152 -34 -102 -26 167 -188
5687 -188 -204 -13 -38 -9 -91 -191 148 57 -194 -183 121 -234 -141 60 9 165 247 136 209 -43 -5 199 90 -227
5711 -227 69 -135 -89 -167 83 -5 -115 81 21 -14 -75 -66 103 -2 186 227 -247 86 -165 -172 -221 32 321 -101
5735 -101 68 89 156 54 -22 -47 0 -90 59 -108 -57 162 197 -53 84 -265 -131 73 -47 140 -160 213 -116
5758 -116 -80 -219 -152 120 30 65 -41 -227 -217 39 81 -12 -85 -11 161 -110 272 18 170 22 244 -11 249
5781 249 182 88 46 80 -107 -59 -27 89 51 149 46 -69 -185 4 -220 -35 -59 -317 -43 239 31 40 235 -60
5805 -60 54 -256 -345 -220 -154 -79 25 -143 331 31 101 -135 -7 18 169 -68 -64 38 182 -8 -111 -133 -87
5828 -87 4 77 85 156 -55 -11 134 -10 84 -28 -82 -53 101 -169 -230 -62 59 31 -203 -56 220 -298 58 -26
5852 -26 -30 73 182 87 172 76 -78 -7 -115 -222 10 -27 -170 310 204 253 -199 -93 61 155 200 259 -101 -29
5876 -29 -32 -82 -82 290 -107 -138 -121 -210 146 -58 -61 15 141 -53 243 62 242 46 204 3 -154 311 -32 -114
5900 -114 224 -86 51 55 53 219 39 -96 -168 -7 47 -25 -102 52 45 -268 -121 25 -66 178 52 -48 -74 375
5924 375 180 -80 -58 -8 -326 147 60 -20 163 -72 -47 32 478 99 -221 66 87 -155 -65 -101 344 229 -143
5947 -143 275 -283 60 55 -105 3 35 151 -48 39 -44 -42 -164 -70 -12 -204 111 -232 49 44 204 53 -153 -387
5971 -387 77 -326 136 -24 -209 43 -186 138 141 19 77 -38 101 81 250 167 199 220 -170 -113 199 -23 57
5994 57 -104 -98 108 36 -64 -202 187 -4 6 211 120 246 -146 3 1 -52 107 281 -53 323 4 -165 5
6017 5 -5 -145 41 188 289 -123 -246 -81 97 -121 -10 -53 -85 -202 -82 -19 46 118 -64 -240 75 -137 225
6040 225 -187 -155 -82 50 -21 -6 108 100 408 65 25 167 -306 39 -579 157 -207 16 -68 -4 410 132 -45
6063 -45 51 64 -73 23 50 293 -318 -166 95 221 9 41 -136 122 -159 -101 -28 196 54 -319 -249 28 26 361
6087 361 -161 -188 41 -18 28 149 16 94 103 131 228 -67 -4 -26 4 160 185 -196 15 -139 59 314 -129 -36
6111 -36 -72 73 -15 111 64 -60 -84 -7 -9 -73 -336 -17 33 72 -280 -88 66 -55 -162 -44 -132 -2 -38 -106 -233
6136 -233 -150 -216 -12 -168 -35 -222 89 -49 202 266 183 -75 100 258 72 -303 112 -43 -52 -94 -70 -296 -183
6159 -183 137 -231 176 -299 -152 -57 -280 77 -167 65 -24 -283 -379 -94 139 22 -252 -46 42 235 -107
6180 -107 -125 158 67 78 314 -75 -8 -193 381 206 -50 -37 -39 -218 -53 -4 67 106 94 119 -7 168 -158 20
6204 20 85 -86 75 21 92 -82 -36 22 98 -105 -49 -3 -140 -139 -16 -2 -211 -90 -192 -75 -31 215 45 183
6228 183 77 107 -67 -108 67 262 106 -204 -126 298 -283 276 -5 313 63 69 -19 -94 -5 -178 71 250 -64
6251 -64 117 -69 323 192 109 -142 188 -50 -179 -130 -107 170 151 235 114 131 88 56 54 6 -69 -35 -36 53 -260 -18
6277 -18 234 18 -196 9 149 94 -30 44 46 67 -145 127 -16 -45 -15 -245 97 -84 153 150 -176 119 101 -90
6301 -90 -134 -83 -34 391 -35 -4 218 150 37 -198 -123 -185 76 -185 85 -326 -80 -18 -99 9 -136 40 -144
6324 -144 6 62 -121 31 -172 -58 -101 -193 213 38 44 -230 -123 496 311 131 -29 -121 86 253 -156 111
6346 111 91 -187 403 69 348 -67 71 85 45 -199 103 13 219 -105 31 207 -183 160 -130 169 125 61
6368 61 -109 48 411 94 58 -39 146 -85 2 220 -152 319 57 -224 12 -101 -5 -147 3 -20 38 -269
6390 -269 146 47 -183 -45 318 171 -121 -167 -82 -116 -92 -246 150 -27 -181 -311 -198 -122 -83 -60 -20 71 18 -11
6414 -11 138 80 -344 -165 181 45 160 -244 132 123 -139 0 -1 8 54 15 -78 56 82 110 121 140 -121 399 59
6439 59 -24 185 121 -45 -92 -87 -114 5 -40 -203 -118 229 -62 218 -100 -1 -29 74 219 149 143 136 -56 177 -119
6464 -119 -135 125 -49 81 -4 -24 -47 88 -283 -27 142 19 -105 117 289 204 -55 84 -184 -178 -16 181
6486 181 42 -107 136 -90 7 -148 -69 57 59 -94 164 95 343 18 -30 -139 -95 7 -206 -231 -69 1 7 -84
6510 -84 -297 -120 -189 79 14 187 5 73 -83 -94 -194 212 -235 -267 166 -183 213 52 94 -66 269 36
6532 36 -141 262 -276 -45 -84 -135 114 69 -163 -251 10 -18 129 220 -65 -87 -170 267 -311 90 -37 87 -154
6555 -154 -71 -95 -89 235 186 35 -7 257 129 -3 -194 46 58 -65 9 -256 -248 118 231 -132 -309 320 46
6578 46 102 283 98 -197 6 138 59 -50 -294 385 152 64 125 52 235 41 -108 30 -58 61 -16 176 36
6601 36 -65 221 -13 -123 152 -27 -240 -80 -51 171 -94 27 -29 116 -16 87 -93 201 -96 -147 63
6622 63 -54 218 -208 140 13 182 67 -181 -53 185 -8 102 -18 296 -239 76 17 21 -270 -82 -37 92
6644 92 -43 -170 -24 -53 -192 -95 174 -72 -98 -310 129 197 110 -56 11 -184 -93 9 36 14 301 95 70 -163
6668 -163 4 -145 333 309 -180 1 313 60 -81 -83 67 193 241 -72 52 -18 15 -185 170 -19 -195 41
6690 41 129 117 187 149 -22 162 -236 -95 142 -94 130 -78 -309 -7 49 -38 -46 -140 -9 168 -425 -24 2 -141
6714 -141 -24 110 22 -69 155 63 -156 317 50 -60 42 35 207 156 5 170 97 59 37 148 58 79 -148 -179
6738 -179 6 59 -100 -172 -244 52 174 -111 -225 3 -315 254 -36 301 -6 -71 112 109 -63 -186 36 -230
6760 -230 -214 112 -227 -158 172 -278 -111 -18 39 161 81 -113 9 185 135 -209 5 51 -104 -89 181 207 -81
6783 -81 -199 158 -116 79 -36 -148 132 -179 -26 -164 -124 115 -296 -46 189 -61 52 266 -37 -11 97
6804 97 -84 27 -326 196 -262 -24 56 40 -147 118 -71 232 -196 149 -41 96 -106 -42 -74 -137 31 -34
6826 -34 28 142 -79 9 301 -72 184 -16 50 -65 -95 9 152 200 25 -14 -83 -174 -250 -124 68 -12 125 -271
6850 -271 252 -96 -132 21 -30 195 133 4 90 -121 283 199 64 155 -17 85 23 45 75 36 -51 -108 -245 44
6874 44 -41 -44 -64 -24 -126 57 -170 288 141 79 264 -147 -116 -200 -20 -445 171 -248 -204 181 -48 50 -171 -124
6898 -124 -168 92 -64 128 73 -144 -144 91 -13 51 -225 4 62 -167 -64 -33 -150 -139 41 32 6 120 50 -44
6922 -44 151 -133 -211 -9 -253 4 96 0 13 -72 -285 139 -37 233 272 -23 93 -54 341 -5 -42 -97 38
6945 38 184 1 -32 -92 15 201 -108 66 -194 -355 69 -121 299 -29 89 73 -212 -173 95 -381 75 16
6967 16 132 -64 -58 69 101 33 -159 253 -152 -92 -116 184 -405 16 -40 34 -27 20 25 71 -447 -331 -391 -141 -9
6992 -9 34 -54 -2 -66 -219 -268 -113 -10 99 135 36 90 -110 -23 102 -171 137 -127 -284 -233 19 125 -131 20
7016 20 -265 41 -3 111 40 -132 23 -34 -16 56 91 -153 -71 -132 97 76 -95 7 -129 330 -250 62 41 -35
7040 -35 237 43 14 11 -27 187 154 67 193 59 138 -49 169 -20 -152 -243 -109 -148 89 210 -258 -114 37
7063 37 114 96 199 -156 -113 -180 -134 -347 -315 -77 -134 -282 -112 -28 -185 -80 20 66 -108 77 -49 -71 -60 -47
7087 -47 -172 -4 -74 224 170 27 -93 108 -66 -186 -288 95 9 -247 64 -97 -30 -72 -110 74 -190 100
7109 100 -77 -6 -47 216 -260 33 265 -118 -41 -241 -19 163 -211 -158 -120 278 -118 22 25 -288 275 -2
7131 -2 42 41 -40 86 73 143 -41 14 107 -163 132 93 -139 195 8 -209 188 53 27 -226 -122 -59 53 80 28
7156 28 277 -196 20 -170 -133 -185 105 78 -23 321 17 -147 104 -93 -79 -170 -249 68 95 63 -62 -332 -59
7179 -59 -94 130 -38 69 106 -218 -4 139 42 -150 125 -221 83 -112 -92 94 -38 -227 -248 181 -195 77
7201 77 114 -122 377 171 87 -165 -413 -25 141 128 103 -8 2 -46 -100 43 76 143 35 -368 147 28 87 85
7225 85 3 15 105 -87 74 217 -23 49 -157 114 -14 53 -42 199 -28 -123 -61 -219 262 -121 265 -258 12
7248 12 -180 52 49 43 -106 253 269 98 270 109 87 -40 -72 -69 -227 137 -61 -87 -67 -126 78 -82 144 -234
7272 -234 56 247 81 147 204 50 -275 137 -75 -143 16 37 153 -145 148 -72 11 82 38 -49 2 344 171
7295 171 2 -160 78 -2 35 -32 -71 -214 85 10 58 -93 -3 145 265 175 196 94 82 144 -2 184 149 -270
7319 -270 -5 -27 271 -164 4 -74 -177 -198 -298 -10 -343 -9 -412 -13 -75 287 29 -38 82 95 -39 -53
7341 -53 49 -76 288 -30 -133 -167 86 -116 -47 -25 39 169 52 45 -64 19 112 -411 -303 91 -132 8 -118
7364 -118 80 -145 -39 174 79 46 -301 -64 200 96 108 -94 -28 10 129 74 95 -82 -39 -125 75 60 -119
7387 -119 -77 -225 -18 135 16 182 432 144 16 202 -44 395 93 -87 -274 -157 -84 69 -50 35 105
7408 105 48 -215 -289 -103 259 10 110 345 -99 209 74 -93 101 25 10 84 -45 -46 -69 429 250 60 -127
7431 -127 190 -80 -156 29 -214 98 -93 48 -132 -70 -52 -172 93 137 114 -238 126 -39 -269 151 10 -220
7453 -220 110 5 -128 -47 -35 -68 -65 16 -20 22 91 -5 -164 155 94 130 141 164 186 -267 12 -4 125 -32 -274
7478 -274 256 6 -6 12 13 -144 -59 44 41 -49 -108 -149 86 187 -75 -109 202 -70 -70 174 -126 -243 52 93 42
7503 42 222 -29 -99 -3 -27 -197 -43 366 -154 -13 -17 140 65 160 8 58 -130 55 85 -262 -316 150 54 135
7527 135 -106 -47 80 -6 107 134 14 53 -97 -221 -6 99 171 144 22 37 80 170 -64 -194 -86 -7 -16 70
7551 70 -104 324 52 169 -172 43 54 -47 -33 215 422 -83 -272 232 -85 166 -33 59 -23 -71 -102 -14 128
7574 128 -224 -149 16 54 18 -164 -233 72 -55 34 -101 20 -132 342 2 -181 15 -93 -119 -71 300 -126
7596 -126 -108 -30 40 36 205 219 96 67 121 -178 -106 59 18 80 -15 -42 41 129 -61 -275 72 -91 10 6 -116 7
7622 7 -65 -221 161 -68 -121 145 -69 20 -158 44 -111 -184 16 121 23 126 74 205 -71 -68 29 15 -285 -196
7646 -196 63 57 -376 -219 77 -143 15 47 294 23 -59 137 -254 -279 61 -138 -46 -63 102 82 131 -24 -72
7669 -72 36 119 48 35 -276 -62 -50 -55 20 20 294 -94 95 -339 94 -99 3 118 46 48 -156 -194 -288 -237 57
7694 57 -278 -88 114 -102 -111 -128 -3 -147 23 64 -66 -85 -50 -20 136 -142 -89 7 141 -170 -24 -108 -267 -64
7718 -64 23 -94 -147 -140 64 204 -80 56 -6 31 109 173 -31 54 72 10 -7 -12 -11 -34 -91 114 -150 -8 95 -29
7744 -29 -13 222 -142 150 98 137 208 19 171 118 184 -417 -97 -128 -168 90 165 190 247 -199 62 134 4 -154
7768 -154 -124 -59 20 121 -201 -197 6 -231 6 -1 -48 163 132 -79 9 45 -85 -8 18 159 -78 -244 110 280
7792 280 389 69 59 -33 -109 -102 57 -98 -68 130 244 -87 58 63 -398 152 107 -5 241 -33 97 368 -22
7815 -22 75 83 350 71 81 184 278 41 206 -103 221 194 -112 -119 30 21 -128 264 58 86 -267 8 223 -90
7839 -90 -91 210 -48 -28 58 66 -57 140 -32 -99 2 -48 -68 57 108 -343 -104 264 -82 48 -68 -2 80 -75
7863 -75 -235 -50 114 33 135 -17 -76 12 111 95 126 27 -105 241 -131 132 -66 160 -132 -3 -49 118 162
7886 162 39 52 -198 176 56 -49 92 21 -56 11 201 -29 193 -230 -253 189 -65 145 -13 -164 -103 85
7908 85 47 256 -381 -76 -4 -74 190 -1 279 47 -43 -23 27 361 -21 -105 145 -58 97 423 220 182 -42
7931 -42 -120 14 -216 -314 80 -139 -44 -288 119 -39 338 -78 -75 -84 -25 75 -117 314 112 -74 -17 -28 -148 106
7955 106 -236 -68 120 60 -346 -41 -45 111 47 -141 -130 -168 -144 176 356 101 64 180 143 -3 -109 31 17
7978 17 87 -177 116 129 -217 -73 149 -80 -170 99 -35 -179 264 220 -109 -60 -131 -87 149 -17 -141 16 25
8001 25 222 -232 46 128 236 71 -112 50 -51 121 -168 -50 149 145 196 -107 -74 -163 215 166 226 149 31
8024 31 -31 0 -40 -69 222 19 -244 9 84 96 -127 -167 215 -44 -234 -26 -9 221 -125 100 14 124 65 -55
8048 -55 105 268 -19 -162 61 133 5 -152 143 -123 282 -286 146 84 5 33 161 312 -39 8 322 150
8070 150 169 -65 -36 -143 68 -63 -42 -66 -198 -220 -37 117 -268 8 60 -274 1 38 -210 149 -72 1 -226
8093 -226 -85 5 -89 142 -44 -154 22 -262 -103 26 91 75 224 -47 254 -193 160 178 -55 -61 -201 110
8115 110 -88 -85 -92 -304 -287 -113 50 69 113 68 -17 199 100 -147 -179 303 22 16 -114 -69 -166 8 -87 55 -45
8140 -45 -74 73 -22 105 234 -34 -226 7 51 29 128 61 9 -38 137 -14 -234 -30 -119 249 -307 180 -141
8163 -141 260 25 15 161 -246 69 -286 -312 -78 -88 61 227 -2 -27 205 8 -56 60 -62 60 -39 154
8185 154 -109 26 46 -23 -96 -79
8191g9
##END NTUPLES=NMR FID
##END=
