##TITLE=1H_LR-796-CMK-OST
 200.13MHz, CDCl3,
 8 sc
 
 17.1.2025
##JCAMPDX= 6.0         $$ Bruker NMR JCAMP-DX V2.0
##DATA TYPE= NMR FID
##DATA CLASS= NTUPLES
##ORIGIN= UXNMR, Bruker Analytische Messtechnik GmbH
##OWNER= pz
$$ XWIN-NMR		Version 3.5
$$ Fri Jan 17 13:51:36 2025 Russian Standard Time (UT+4h)  she@DPX200
##.OBSERVE FREQUENCY= 200.1313
##.OBSERVE NUCLEUS= ^1H
##.DELAY= (6, 6)
##.ACQUISITION MODE= SIMULTANEOUS
##.ACQUISITION SCHEME= undefined
##.AVERAGES= 8
##.DIGITISER RES= 18
##SPECTROMETER/DATA SYSTEM= spect
##.PULSE SEQUENCE= zg30
##.SOLVENT NAME= DMSO
##.SHIFT REFERENCE= (INTERNAL, DMSO, 0, 14.3821)
##AUDIT TRAIL= $$ (NUMBER, WHEN, WHO, WHERE, WHAT)
$$ ##TITLE= Audit trail, XWIN-NMR		Version 3.5
$$ ##JCAMPDX= 5.01
$$ ##ORIGIN= Bruker BioSpin GmbH
$$ ##OWNER= she
$$ F:/spectra/data/she/nmr/H-C/1/audita.txt
$$ ##AUDIT TRAIL=  $$ (NUMBER, WHEN, WHO, WHERE, WHAT)
(   1,<2025-01-17 13:49:15.00 +0400>,<she>,<DPX200>,
      <created by zg, POWCHK disabled, PULCHK disabled
       configuration hash MD5:
       00 E9 B6 7A A2 85 ED C7 34 08 36 98 17 FE 4E 26
       data hash MD5: 16K
       12 7F 94 E5 B4 E5 C5 16 AD FF 1A E1 42 9A C1 71>)
$$ ##END=
$$ 
$$ hash MD5
$$ 27 CD 2F D0 68 32 40 D6 D0 89 C2 E3 54 F8 38 EA
##$RELAX= 
##$RELAX= 
##$RELAX= 
##$RELAX= 
##$RELAX= 
##$RELAX= 
$$ Bruker specific parameters
$$ --------------------------
##$DU= <F:/spectra>
##$EXPNO= 1
##$NAME= <H-C>
##$PROCNO= 1
##$TYPE= <nmr>
##$USER= <she>
##$AMP= (0..31)
100 100 100 100 100 100 100 100 100 100 100 100 100 100 100 100 100 100 
100 100 100 100 100 100 100 100 100 100 100 100 100 100 
##$AQSEQ= 0
##$AQ_mod= 1
##$AUNM= <au_zg>
##$AUTOPOS= <>
##$BF1= 200.13
##$BF2= 200.13
##$BF3= 200.13
##$BF4= 200.13
##$BF5= 200.13
##$BF6= 200.13
##$BF7= 200.13
##$BF8= 200.13
##$BYTORDA= 1
##$CFDGTYP= 0
##$CFRGTYP= 5
##$CHEMSTR= <none>
##$CNST= (0..31)
1 1 145 1 1 1 1 1 1 1 1 1 1 1 1 1 1 1 1 1 1 1 1 1 1 1 1 1 1 1 1 1 
##$CPDPRG= <>
##$CPDPRG1= <>
##$CPDPRG2= <>
##$CPDPRG3= <>
##$CPDPRG4= <mlev>
##$CPDPRG5= <mlev>
##$CPDPRG6= <mlev>
##$CPDPRG7= <mlev>
##$CPDPRG8= <mlev>
##$CPDPRGB= <>
##$CPDPRGT= <>
##$D= (0..31)
0 0.7 0 0 0 0 0 0 0 0 0 0.03 0 0 0 0 0 0 0 0 0 0 0 0 0 0 0 0 0 0 0 0 
##$DATE= 1737107354
##$DBL= (0..7)
120 120 120 120 120 120 120 120 
##$DBP= (0..7)
150 150 150 150 150 150 150 150 
##$DBP07= 0
##$DBPNAM0= <>
##$DBPNAM1= <>
##$DBPNAM2= <>
##$DBPNAM3= <>
##$DBPNAM4= <>
##$DBPNAM5= <>
##$DBPNAM6= <>
##$DBPNAM7= <>
##$DBPOAL= (0..7)
0.5 0.5 0.5 0.5 0.5 0.5 0.5 0.5 
##$DBPOFFS= (0..7)
0 0 0 0 0 0 0 0 
##$DE= 6
##$DECBNUC= <off>
##$DECIM= 32
##$DECNUC= <off>
##$DECSTAT= 4
##$DIGMOD= 1
##$DIGTYP= 9
##$DL= (0..7)
0 120 120 120 120 120 120 120 
##$DP= (0..7)
150 150 150 150 150 150 150 150 
##$DP07= 0
##$DPNAME0= <>
##$DPNAME1= <>
##$DPNAME2= <>
##$DPNAME3= <>
##$DPNAME4= <>
##$DPNAME5= <>
##$DPNAME6= <>
##$DPNAME7= <>
##$DPOAL= (0..7)
0.5 0.5 0.5 0.5 0.5 0.5 0.5 0.5 
##$DPOFFS= (0..7)
0 0 0 0 0 0 0 0 
##$DQDMODE= 0
##$DR= 18
##$DS= 0
##$DSLIST= <SSSSSSSSSSSSSSS>
$$ [...]
##$SUBNAM0= <"">
##$SUBNAM1= <"">
##$SUBNAM2= <"">
##$SUBNAM3= <"">
##$SUBNAM4= <"">
##$SUBNAM5= <"">
##$SUBNAM6= <"">
##$SUBNAM7= <"">
##$SUBNAM8= <"">
##$SUBNAM9= <"">
##$SW= 18.0517328524113
##$SWIBOX= (0..15)
0 0 2 0 0 0 0 0 0 0 0 0 0 0 0 0 
##$SW_h= 3612.71676300578
##$TD= 16384
##$TD0= 1
##$TE= 0
##$TE2= 300
##$TE3= 300
##$TEG= 300
##$TL= (0..7)
0 120 120 120 120 120 120 120 
##$TP= (0..7)
150 150 150 150 150 150 150 150 
##$TP07= 0
##$TPNAME0= <>
##$TPNAME1= <>
##$TPNAME2= <>
##$TPNAME3= <>
##$TPNAME4= <>
##$TPNAME5= <>
##$TPNAME6= <>
##$TPNAME7= <>
##$TPOAL= (0..7)
0.5 0.5 0.5 0.5 0.5 0.5 0.5 0.5 
##$TPOFFS= (0..7)
0 0 0 0 0 0 0 0 
##$TUNHIN= 0
##$TUNHOUT= 0
##$TUNXOUT= 0
##$USERA1= <user>
##$USERA2= <user>
##$USERA3= <user>
##$USERA4= <user>
##$USERA5= <user>
##$V9= 5
##$VALIST= <valist>
##$VCLIST= <CCCCCCCCCCCCCCC>
##$VD= 0
##$VDLIST= <DDDDDDDDDDDDDDD>
##$VPLIST= <PPPPPPPPPPPPPPP>
##$VTLIST= <TTTTTTTTTTTTTTT>
##$WBST= 1024
##$WBSW= 4
##$XGAIN= (0..3)
0 0 0 0 
##$XL= 0
##$YL= 0
##$YMAX_a= 120516
##$YMIN_a= -152048
##$ZGOPTNS= <>
##$ZL1= 120
##$ZL2= 120
##$ZL3= 120
##$ZL4= 120
##$ABSF1= 10
##$ABSF2= 0
##$ABSG= 5
##$ABSL= 3
##$ALPHA= 0
##$AQORDER= 0
##$ASSFAC= 0
##$ASSFACI= 0
##$ASSFACX= 0
##$ASSWID= 0
##$AUNMP= <proc_1d>
##$AZFE= 0.1
##$AZFW= 0.1
##$BCFW= 1
##$BC_mod= 2
##$BYTORDP= 1
##$COROFFS= 0
##$CY= -3
##$DATMOD= 1
##$DC= 2
##$DFILT= <>
##$DTYPP= 0
##$F1P= 0
##$F2P= 0
##$FCOR= 0.5
##$FTSIZE= 0
##$FT_mod= 4
##$GAMMA= 1
##$GB= 0.15
##$INTBC= 1
##$INTSCL= 1
##$ISEN= 128
##$LB= 0.25
##$LEV0= 0
##$LPBIN= 0
##$MAXI= 10000
##$MC2= 0
##$MEAN= 0
##$ME_mod= 0
##$MI= 1.114404
##$NCOEF= 0
##$NC_proc= 0
##$NLEV= 6
##$NOISF1= 3.799351
##$NOISF2= 2.8
##$NSP= 1
##$NTH_PI= 0
##$NZP= 0
##$OFFSET= 14.38212
##$PC= 1
##$PHC0= 250.9713
##$PHC1= 11.7922
##$PH_mod= 1
##$PKNL= yes
##$PPARMOD= 0
##$PSCAL= 0
##$PSIGN= 0
##$REVERSE= no
##$SF= 200.129724274929
##$SI= 16384
##$SIGF1= 3
##$SIGF2= 2
##$SINO= 400
##$SIOLD= 16384
##$SREGLST= <1H.CDCl3>
##$SSB= 0
##$STSI= 0
##$STSR= 0
##$SW_p= 3205.1282051282
##$SYMM= 0
##$S_DEV= 0
##$TDeff= 0
##$TDoff= 0
##$TI= <>
##$TILT= no
##$TM1= 0
##$TM2= 0
##$TOPLEV= 0
##$USERP1= <user>
##$USERP2= <user>
##$USERP3= <user>
##$USERP4= <user>
##$USERP5= <user>
##$WDW= 1
##$XDIM= 8192
##$YMAX_p= 0
##$YMIN_p= 0
$$ End of Bruker specific parameters
$$ ---------------------------------
##NTUPLES= NMR FID
##VAR_NAME=  TIME,          FID/REAL,        FID/IMAG
##SYMBOL=    X,             R,               I
##VAR_TYPE=  INDEPENDENT,   DEPENDENT,       DEPENDENT
##VAR_FORM=  AFFN,          ASDF,            ASDF
##VAR_DIM=   8192,          8192,            8192
##UNITS=     SECONDS,       ARBITRARY UNITS, ARBITRARY UNITS
##FACTOR=    0.0002768,     1,               1
##FIRST=     0,             0,               0
##LAST=      2.2672688,     0,               0
##MIN=       0,             -152048,         0
##MAX=       2.2672688,     120516,          0
$$ Real data points
##PAGE= N=1
##DATA TABLE= (X++(R..R)), XYDATA
$$ [...]
$$ plain form
1908 74 109 247 48 152 472 14 141 281 103 58 -147 -133 -145 -237 -214 -494 -167 -147 4 57 -11 -262 -27
1931 -27 191 289 297 159 404 11 -167 276 18 -16 -13 -142 -281 -27 23 -117 -373 -210 -80 -89 73 -94 172
1954 172 103 320 575 292 -79 78 228 -187 -247 -168 -322 46 -347 -149 26 -37 -185 -216 -30 21 162 -40
1976 -40 -14 -157 47 54 228 35 -54 71 -100 169 137 -90 -119 -40 -321 -456 -167 -27 -143 -208 -57 18 7 281
2000 281 81 -116 29 342 146 209 54 165 421 47 264 -333 15 -151 28 -41 179 -170 -53 -172 217
2021 217 3 -51 168 158 334 411 268 399 110 70 121 181 -102 -283 -10 -115 -194 -235 -25 -268 -163 -338 152
2044 152 313 55 119 5 173 414 -204 250 421 57 -99 57 -191 -184 -127 -346 -356 -444 -261 -260 170 110 -106
2067 -106 85 363 323 465 192 0 64 126 187 74 -266 -98 -223 -146 -237 -431 -207 -157 174 -239 -189 -22 282
$$ packed form
1908G4L5J38j99J04L20m58J27J40j78m5k05J4j2r2K3k80L27K0J51N3o8k51K35
1931b7K18R8Qj38K45l93j78M43k58l4Lj29j39K54N0j40k56J63J30rJ62j67K66
1954A72o9K17K55k83l71J57J50m15o0P9j54L68l93J98J75o3j48l1J86N1J41k02
1976d0K6j43K04PJ74j93q9J25j71K69l2k27k9P9k81j35K89J40j16o5J51P5j1K74
2000B81k00j97J45L13j96O3j55J11K56l74K17n97L48j66J79o9K20l49J17j19L89
2021B17k14n4K19j0J76P7j43J31k89m0N1O0k83j81K73j05p9m1K10k43J05j75M90
2044A52J61k58O4j14J68K41o18M54J71l64j56J56k48PN7k19j0q8J83JM30o0k16
2067a06J91K78m0J42k73j92O4O2O1j13l40J68j25P7r1j94K24N0L31m13N0J67L04
$$ plain form
2090 282 130 318 168 262 473 236 164 -69 -171 -333 -298 -590 -358 -388 -195 -495 6 -162 190 -285 257
2111 257 531 152 40 289 366 253 299 39 56 -137 -225 -338 170 -177 -46 -411 -87 -110 122 -51 -227 68
2133 68 160 75 327 341 258 246 204 81 88 -164 245 44 -55 -277 -55 -287 -305 -105 -143 -218 47 -46 324 294 330
2158 330 72 167 308 36 93 -143 -52 -69 -106 -440 -229 -253 -117 71 -20 -159 187 -50 369 -268 177 43
2180 43 132 15 24 -142 51 76 155 42 -304 137 -71 18 -126 -12 -272 -96 -34 -118 -277 -125 3 44 188
2203 188 -127 230 137 244 21 -193 284 86 -201 -176 -44 -110 -115 -196 -110 -24 -35 150 102 39 37 214 46 -132
2227 -132 226 167 10 33 95 -92 322 281 -185 81 48 -372 43 -292 -373 -3 -182 -363 159 184 39 -45 306
2250 306 357 206 137 229 71 77 30 3 -256 -298 -68 -281 -205 -332 -173 -89 22 -35 -66 281 203 155 -7 113 41
$$ packed form
2090B82j52J88j50R4K11k37p2k33j02j62L5k92K32l0J93l00N01j68L52m75N42
2111B57K74l79j12K49P7j13M6k60J7j93q8j13N08l47J31l65L24k3K32j73j76K95
2133F8R2q5K52J4q3j2m2j23Pk52M09k01r9k22K22k32j8K00l8p5K65r3L70l0L6
2158C30k58R5J41k72N7k36R1j7l7l34K11k4J36J88r1j39L46k37M19o37M45j34
2180D3Q9j17Rj66J93K5P9j13l46M41k08Q9j44J14k60J76O2q4j59J52J28M1J44
2203A88l15L57r3J07k23k14M77j98k87K5J32o6nq1Q6Q6j1J85m8o3kJ77j68j78
2227a32L58n9j57K3O2j87M14m1m66K66l3m20M15l35q1L70j79j81N22K5j45q4L51
2250C06N1j51o9R2j58Om7k7k59m2K30k13P6j27J59Q4J11n7l1L47p8m8j62J20p2
$$ plain form
2275 41 70 -26 163 -3 -171 115 -78 -169 -152 -360 -271 -290 -251 -359 100 103 -96 116 144 250 189 170 364 -79
2299 -79 225 -176 -11 -339 -284 -345 -164 -290 -181 -245 -303 44 115 120 17 324 261 341 493 234 199 418 -158 -252
2323 -252 -59 -144 -144 -192 -208 -48 121 71 -1 8 128 10 -25 3 83 238 186 178 29 37 166 198 -202 -84 -212 -277
2349 -277 -53 -239 -313 -253 -195 114 5 -17 333 -18 109 325 408 205 -57 25 -234 -282 -12 -59 -106 45 -44
2372 -44 52 -34 12 330 -38 160 97 -139 -80 59 -133 67 95 103 47 55 -50 87 18 -130 -181 -309 -67 -95 1
2397 1 25 109 -241 45 142 -76 -123 311 -99 136 136 227 332 -21 377 -118 92 21 132 69 -135 -336 -61 -393
2421 -393 77 -57 -68 -61 -38 87 -42 32 160 66 -27 222 -92 124 -283 103 -12 -421 -156 210 -133 11
2443 11 -73 92 -11 121 -109 51 290 67 265 193 -1 24 204 74 16 -191 -67 -190 20 -255 -333 -257
$$ packed form
2275D1K9r6J89j66j68K86j93r1J7k08Q9j9L9j08M59Lj99K12K8J06o1j9J94m43
2299g9L04m01J65l28N5o1J81j26J09o4n8L47P1Nj03L07o3Q0J52k59l5K19n76r4
2323b52J93q5%m8j6J60J69n0p2RJ20j18l5K8Q0J55n2qj49QJ29L2m00J18j28o5
2349b77K24j86p4O0N8L09j09k2L50l51J27K16Q3k03k62Q2k59m8K70m7m7J51q9
2372d4R6q6M6L18l68J98o3k36N9J39j92K00K8Qn6Qj05J37o9j48n1j28K42k8R6
2397AK4Q4l50K86R7k18m7M34m10K35%R1J05l53L98m95K10p1J11o3k04k01K75l32
2421c93M70j34j1PK3J25j29P4J28r4r3K49l14K16m07L86j15m09K65L66l43J44
2443A1q4J65j03J32k30J60K39k23J98p2j94K5J80j30n8k07J24j23K10k75p8P6
$$ plain form
2465 -257 138 -103 -231 -47 181 173 20 72 248 72 79 50 54 143 -109 93 44 33 20 -202 -107 -25 -140 61 32
2490 32 42 4 236 31 182 263 246 120 247 211 -11 132 -72 174 -224 -273 -102 -146 159 -178 -427 -283 -42
2513 -42 22 109 -5 376 225 124 65 140 149 45 13 230 -82 -121 -13 -186 -291 -481 -210 -167 280 56 -114
2536 -114 312 -163 -8 -65 333 407 18 -197 -16 313 186 20 8 -276 -380 145 -9 121 -83 -61 137
2557 137 -99 99 101 60 3 162 198 -127 169 48 -36 12 -179 -307 -27 179 17 -203 -282 -87 -306 137 -36
2580 -36 -209 141 464 186 79 267 104 57 -57 294 -112 -172 -149 -216 -566 -86 -141 370 -79 -196 177 -32
2602 -32 -182 -93 139 -24 186 151 113 224 181 287 433 176 155 204 -309 -134 85 -161 -157 -301 -285 -113 337
2625 337 135 133 416 283 62 -53 52 178 79 0 -38 101 -40 104 40 -65 -128 31 -146 -254 -146 -31
$$ packed form
2465b57L95k41j28J84K28qj53N2J76j76Pk9MQ9k52K02m9j1j3k22R5Q2j15K01k9
2490C2J0l8K32k05J51Q1j7j26J27l6k22J43k04K46l98m9J71m4L05l37k49J44K41
2513d2O4Q7j14L81j51j01n9P5Rj04l2K17l12l9J08j73j05j90K71M3M47k24j70
2536a14M26m75J55n7L98P4l89k15J81L29j27j66j2k84j04N25j54J30k04K2J98
2557A37k36J98Km1n7J59L6l25K96j21q4M8j91j28K80K06j62k20p9J95k19M43j73
2580c6j73L50L23k78j07J88j63m7j14L51m06o0K3o7l50M80n5N11m49j17L73k09
2602c2j50Q9K32j63K10l5l8J11m3J06J46k57k1M9n13J75K19k46Mj44J6J72M50
2625C37k02kK83j33k21j15J05J26r9p9l8J39j41J44o4j05o3J59j77j08J08J15
$$ plain form
2647 -31 35 -204 -19 174 174 173 -92 44 52 48 132 -89 101 -22 234 -65 -155 46 -41 -292 -90 -2 -103 -114 -235
2672 -235 112 -15 -53 329 33 42 -105 -8 159 128 -131 -264 123 -254 -55 -108 -93 -46 -142 125 -8 -201 71
2695 71 190 229 -12 -123 45 132 240 306 16 -230 -143 -216 -102 -293 -202 -200 -150 28 -76 -101 -80 -49 -17 210 323
2720 323 83 193 128 108 -155 -73 43 -105 -229 -257 -88 187 -143 -87 -248 -257 -24 226 -117 104 271 282 29
2743 29 77 -276 185 141 270 -64 256 20 -318 -329 -340 -259 17 305 -254 -276 136 149 131 -28 83 113 465
2766 465 261 -105 166 87 -352 -114 -91 -96 109 -206 -115 25 -160 -46 168 -159 113 -13 183 137 175 289
2788 289 86 -14 200 30 -79 100 62 -47 -124 147 -189 -125 -320 54 63 -208 -111 56 102 86 361 -83 224
2811 224 223 233 -149 219 88 -271 -170 -13 10 -154 -165 -158 -109 -121 -71 44 318 -173 75 57 113 191 148 368 264
$$ packed form
2647c1O6k39J85J93%jk65J36QmQ4k21J90j23K56k99r0K01q7k51K02Q8j01j1j21
2672b35L47j27l8L82k96Rj47R7J67l1k59j33L87l77J99n3J5M7r6K67j33j93K72
2695G1J19L9k41j11J68Q7J08O6k90k46Q7p3J14j91R1KN0J78j04k5K1L1L2K27J13
2720C23k40J10o5k0k63Q2J16j48j24k8J69K75l30N6j61rK33K50l43K21J67J1k53
2743B9M8l53M61m4J29l34L20k36l38j1j1Q1K76K88n59k2M12J3j8j59J11L0L52
2766D65k04l66K71p9m39K38K3nK05l15R1J40j85J14K14l27K72j26J96m6L8J14
2788B89k03j00K14j70j09J79l8j09p7K71l36O4j95L74Rk71R7J67M6j6K75m44L07
2811B24jJ0l82L68j31l59J01J57K3j64j1PM9j2N0J15K74m91K48j8N6P8m3K20j04
$$ plain form
2836 264 78 -101 -107 3 -9 -258 176 -150 -312 -206 117 118 393 -114 -19 92 360 -203 -177 117 48 54 210
2859 210 28 101 175 47 -137 -210 -70 -46 33 -65 41 123 109 -65 142 -244 -86 43 232 196 1 -94 -21 -182
2883 -182 205 -140 -12 -59 -187 -138 -196 -136 -11 60 -88 -128 98 -12 26 -82 371 113 -112 235 83 77 160
2906 160 -73 -137 -116 -177 -138 -54 214 -10 -158 -150 -32 66 63 -81 45 -32 -108 245 302 202 139 -22 -38 114 -273
2931 -273 -249 -156 -3 -317 -268 -322 32 -142 -263 -105 149 111 -211 117 -331 14 -99 181 46 -93 7 189
2953 189 -91 -98 -52 36 -208 -146 11 -71 -119 38 268 -5 189 23 51 152 259 184 161 9 136 193 -277 56
2977 56 78 -212 48 153 -16 2 -132 -130 275 91 217 -253 72 177 -43 -29 74 54 51 258 -286 93 -370
3000 -370 -92 30 -68 -192 -111 164 -104 341 -57 98 -73 102 31 201 418 252 122 -47 132 -92 -30
$$ packed form
2836B64j86j79oJ10j2k49M34l26j62J06L23JK75n07R5J11K68n63K6K94o9OJ56
2859B10j82P3P4j28j84p3J40K4P9r8J06Q2j4j74K07l86J58J29J89l6j95r5P3j61
2883a82L87l45J28m7j28M9n8O0J25P1j48m0K26j10L8j08M53k58k25L47j52oQ3
2906A60k33o4K1o1L9Q4K68k24j48QJ18R8lj44J26p7p6L53N7j00o3j61j6J52l87
2931b73K4R3J53l14M9n4L54j74j21J58K54l8l22L28m48L45j13K80j35j39J00J82
2953A89k80pM6Q8k44O2J57q2m8J57K30k73J94j66K8J01J07p5k3j52J27N7m70L33
2977E6K2k90K60J05j69J8j34KM05j84J26m70L25J05k20J4J03k0lK07n44L79m63
3000c70K78J22r8j24Q1K75k68M45l98J55j71J75p1J70K17j66j30j69J79k24O2
$$ plain form
3021 -30 71 -98 128 -273 -207 125 35 199 -63 282 -136 -196 211 309 69 164 82 -126 205 19 79 -286 36
3044 36 195 -383 4 145 -4 -186 104 53 16 139 -73 365 96 236 -160 -80 185 25 -67 -234 128 -120
3066 -120 5 -310 -29 -24 6 -205 -186 36 -84 128 65 409 -19 74 34 201 -140 219 106 -129 106 -186
3088 -186 -81 -122 3 8 -168 -144 -119 59 15 257 268 -18 384 189 57 61 -81 -69 278 -81 129 -13 -97 42
3112 42 -14 -24 -181 -129 -42 -150 262 -226 159 -152 143 -131 26 160 47 -277 -49 -127 -8 41 -55 -166 -109
3135 -109 -14 105 -146 -121 0 4 -168 194 426 -62 278 44 -12 -67 -163 102 46 -173 -46 112 -67 181 -89
3158 -89 -144 -172 165 -23 -172 99 152 166 -69 -131 -116 11 12 173 -147 -117 -69 -21 -323 -309 -16 -36 -57 -253 -56
3183 -56 -56 179 -223 -10 215 134 416 269 272 58 210 148 15 -245 -114 -89 -236 -394 -179 -39 261 -80 91
$$ packed form
3021c0J01j69K26m01O6L32r0J64k62L45m18o0M07R8k40R5q2k08L31j86O0l65L22
3044C6J59n78L87J41j49j82K90n1l7J23k12M38k69J40l96Q0K65j60r2j67L62k48
3066a20J25l15K81NL0k11J9K22j20K12o3L44m28R3m0J67l41L59j13k35K35k92
3088a86J05m1J25Nj76K4K5J78m4K42J1k86M02j95j32Mj42J2L47l59K10j42q4J39
3112D2n6j0j57N2Q7j08M12m88L85l11K95k74J57J34j13l24K28p8J19M9r6j11N7
3135a09R5J19k51K5J21Mj72L62K32m88L40k34n6n5r6K65n6k19J27J58j79K48k70
3158h9n5k8L37j88j49K71N3J4k35o2J5J27JJ61l20L0M8M8l02J4K93k0k1j96J97
3183e6%K35m02K13K25q1K82j47Lk14J52o2j33k60J31K5j47j58K15J40L00l41J71
$$ plain form
3206 91 -225 188 -25 -107 329 -183 -31 191 141 -110 -53 -108 114 58 -99 -175 -107 -319 -160 -49 -239 207 -216
3229 -216 -45 -205 8 21 118 144 -66 89 136 144 -82 -21 14 169 -27 -47 -202 -331 -357 61 -168 -189 72 -8
3253 -8 63 -10 -326 67 -15 -48 204 175 126 185 80 -82 -29 -233 53 -4 93 -255 -36 -284 -167 -44 146 106
3277 106 166 66 101 -177 -269 38 15 58 155 44 -97 -114 -258 -133 -360 -54 -100 49 58 -140 72 -200 312
3300 312 63 -134 160 136 -47 -49 107 101 225 -106 -12 232 158 -92 146 -88 115 -76 81 -145 -75 41 73
3323 73 -67 91 30 74 -30 169 117 197 36 -160 -26 1 -150 84 51 -98 -135 62 -94 146 8 62 109
3346 109 218 48 297 -15 268 18 -207 98 13 8 -114 -95 6 -133 49 141 39 -249 -303 -47 -117 98
3368 98 -297 -46 159 -149 94 -33 10 9 -299 79 48 -87 -116 -86 93 -81 -139 101 0 103 91 15 107 -51
$$ packed form
3206I1l16M13k13q2M36n12J52K22n0k51N7n5K22n6j57p6O8k12J59J11j90M46m23
3229b16J71j60K13J3R7K6k10J55M7Qk26O1L5J55j96k0j55j29k6M18k29k1K61q0
3253hP1p3l16L93q2l3K52k9m9N9j05j62N3k04K86n7R7l48K19k48J17J23J90m0
3277A06O0j00L5k78r2L07k3M3R7j11j41j7j44J25k27L06m6J49Rj98K12k72N12
3300C12k49j97K94k4j83kJ56oJ24l31R4K44p4k50K38k34K03j91J57k26P0J16L2
3323G3j40J58o1M4j04J99n2Q0j61j96J34K7j51K34l3j49l7J97j56K40j38N4M7
3346A09J09j70K49l12K83k50k25L05q5nj22J9J01j39J82R2j02k88n4K56p0K15
3368I8l95K51K05l08K43j27M3jl08L78l1j35k9L0J79j74n8K40j01J03j2p6R2j58
$$ plain form
3392 -51 358 12 228 -1 -96 93 236 -116 -22 -129 -48 103 -81 -285 -219 76 -18 85 126 145 -178 33 148
3415 148 -250 -151 147 -152 186 4 -156 -14 -188 144 -113 -29 5 -232 222 -227 -3 201 111 31 -141 236
3437 236 -69 65 30 66 -122 241 230 363 160 147 71 -72 1 24 -25 27 131 230 -8 96 -32 -48 58 87
3461 87 -13 -204 200 -160 -108 -173 -169 29 -90 136 -139 -59 -77 70 72 -185 128 -158 226 -65 506 104 40
3484 40 -182 -72 -112 22 143 -484 262 84 206 -251 -435 24 149 -258 -65 253 -250 253 427 -106 -36
3505 -36 -65 107 214 -9 134 140 -133 -59 -35 -232 -115 -246 237 -21 -54 182 14 -29 29 -34 43 -170 -93 286
3529 286 2 61 22 157 -10 -124 226 -167 -82 26 -273 -73 -90 -110 -39 154 -62 140 167 360 53 181
3551 181 -199 -185 -16 112 -57 73 -157 -26 -228 50 -19 -111 -194 261 -77 -159 1 -44 -115 -205 248 125 256
$$ packed form
3392e1M09l46K16k29r5J89J43l52R4j07Q1J51j84k04O6K95r4J03M1J9l23K11J15
3415A48l98R9K98k99L38j82j60J42j74L32k57Q4L4k37M54m49K24K04r0q0j72L77
3437B36l05J34l5L6j88L63j1J33k03j3p6j43P3K3m9N2J04R9k38J04j28j6J06K9
3461H7j00j91M04l60N2o5MJ98j19K26k75Q0j8J47Kk57L13k86L84k91N71m02o4
3484D0k22J10m0J34J21o27P46j78J22m57j84M59J25m07J93L18n03N03J74n33P0
3505c6k9J72J07k23J43Ok73P4K4j97J17j31M83k58l3K36j68m3N8o3P7k13P7L79
3529B86k84N9l9J35j67j14L50l93Q5J08k99K00j7k0P1J93k16K02K7J93l07J28
3551A81l80J4J69J28j69J30k30J31k02K78o9r2q3M55l38q2J60m5p1r0M53j23J31
$$ plain form
3574 256 241 86 168 -164 -22 -66 -319 -272 -158 -407 -205 239 -192 -95 13 21 -81 -9 246 217 294 -74 70
3597 70 -63 -144 -190 101 -32 -115 -177 -89 -136 -113 356 -1 227 -237 199 238 -159 108 -34 -132 -50 -20 59 -24 -129
3622 -129 19 100 50 21 -66 -303 -37 -225 57 -81 -163 -8 134 20 41 -36 9 101 27 -134 -41 172 80 135
3646 135 -34 103 -227 338 -100 -45 -112 -265 78 414 171 91 450 102 318 -66 -3 70 -84 15 14 -70 256
3669 256 71 -225 -150 -35 124 -341 -265 -109 -65 44 16 360 204 103 -102 153 226 78 43 -20 -61 -30 116
3692 116 165 190 79 -67 95 79 138 155 83 -143 111 98 23 176 115 90 -98 -69 280 176 -179 77 39 -2
3716 -2 -31 -51 -50 -17 240 -165 319 -32 75 -7 189 -152 -61 -38 21 114 182 -99 85 -147 160 90 -203 -110 -175
3741 -175 -147 78 -154 -133 -83 -213 -71 -102 283 50 -94 69 -21 178 -171 -115 -33 -238 -136 42 -35 49 -40
$$ packed form
3574B56j5j55Q2l32J42m4k53M7J14k49K02M44m31R7J08Qj02P2K55k9P7l68J44
3597G0j33q1m6K91j33q3o2Q8m7K3M69l57K28m64M36L9l97K67j42r8Q2L0P9q3j05
3622a29J48Q1n0k9q7k37K66j88K82j38q2J55J42j14K1p7M5R2p4j61R3K13r2N5
3646A35j69J37l30N65m38N5o7j53L43L36k43q0L59l48K16l84O3P3j54R9jq4L26
3669B56j85k96P5J15J59m65P6J56M4J09k8L44j56j01k05K55P3j48l5o3m1L1J46
3692A16M9K5j11j46J62j6N9J7p2k26K54j3p5J53o1k5j88K9L49j04l55K56l8m1
3716bk9k0JL3K57m05M84l51J07q2J96l41R1K3N9R3O8k81J84k32L07p0k93R3o5
3741a75K8K25k32K1N0j30J42l1L85k33j44J63r0J99l49N6Q2k05J02J78p7Q4q9
$$ plain form
3764 -40 1 181 -267 76 254 -78 105 270 -103 -75 -247 -210 4 9 169 -37 -138 -148 51 91 -84 -211 -32
3787 -32 34 -96 -27 -216 135 264 157 -24 -50 179 -8 300 28 300 -115 -163 28 -30 -26 78 -4 -57 91
3810 91 -260 150 -70 142 226 -199 160 -50 161 121 -21 -31 151 113 152 -98 -54 37 104 -367 -136 -294 29
3833 29 132 209 151 -260 113 -333 52 145 273 15 149 24 91 -58 75 21 -156 -68 78 -59 -332 -25
3855 -25 -302 222 -16 10 -76 -64 -136 299 189 282 74 -177 -56 -117 133 67 -100 -112 -452 -28 -19 -321 -10 -9
3879 -9 461 85 7 -13 62 -57 194 -42 -30 -15 222 7 -83 92 -192 -109 -36 -102 -351 -224 146 -357 -59 38
3903 38 40 -139 242 193 303 143 56 121 38 -63 61 -312 -47 -206 -180 -13 122 -81 -122 -181 4 46 68 307
3927 307 47 -92 -132 -59 -4 4 -65 165 356 17 -25 182 164 48 -24 -227 -122 89 86 28 191 104 200 -165 -67
$$ packed form
3764d0M1J80m48L43J78l32J83J65l73K8j72L7K14NJ60k06j01j0J99M0j75j27J79
3787c2O6j30O9j89L51J29j07j81k6K29j87L08k72K72m15m8J91n8MJ04q2n3J48
3810I1l51M10k20K12Q4m25L59k10K11m0j42j0J82l8L9k50M4R1O7m71K31j58L23
3833B9J03P7n8m11L73m46L85R3J28k58J34j25O7j49J33n4j77Q8J46j37k73L07
3855b5k77N24k38K6q6J2p2M35j10R3k08k51J21o1K50o6j67j2l40M24Rl02L11J
3879iM70l76p8k0P5j19K51k36J2J5K37k15r0J75k84Q3P3o6k49J27L70n03K98R7
3903C8Kj79L81m9J10j60q7O5q3j01J24l73K65j59K6J67J35k03m1n9J85M2K2K39
3927C07k60j39m0P3N5Qo9K30J91l39m2K07j8j16p2k03J05K11ln8J63q7R6l65R8
$$ plain form
3952 -67 32 -36 -89 6 -88 7 -221 59 165 20 111 -52 -156 -51 -92 1 -50 -43 -38 146 -157 28 150 -201 80
3977 80 -96 -15 -37 20 -5 -128 -355 -1 -27 94 -11 55 -188 115 -6 -30 -108 216 135 -158 18 190 201 94
4001 94 -151 -197 -102 254 39 -6 -53 492 23 -56 -6 -144 65 -20 -104 226 134 -77 142 72 -232 23 -199 244
4025 244 140 62 -52 -123 -85 -4 3 -21 121 -154 -215 -26 238 5 124 -172 60 -96 105 166 -312 -63 96
4048 96 110 -111 4 63 -143 -35 22 104 58 -180 209 156 52 281 312 39 30 220 146 -32 161 -186 44 -10
4072 -10 -215 -31 -255 -199 -9 -132 -390 30 -162 97 4 -61 309 185 -35 -59 147 95 -45 93 -43 -167
4094 -167 201 59 -48 -138 -241 -292 -16 57 -84 163 -66 161 186 -38 41 -19 59 -128 158 -77 38 232
4116 232 -191 -37 -131 5 196 -342 -113 20 25 58 -132 188 68 -2 -165 -233 -315 56 -58 -78 -27 -21 -223 -232
$$ packed form
3952f7R9o8n3R5r4R5k28K80J06j45R1j63j04J05m1R3n1PNJ84l03J85J22l51K81
3977H0j76Q1k2N7k5j23k27L54k6J21j05O6k43L03j21k4p8L24q1k93J76J72J1j07
4001I4k45m6R5L56k15m5m7N45m69p9N0j38K09q5q4L30r2k11K19p0l04K55k22M43
4025B44j04p8j14p1L8Q1Pk4J42k75o1J89K64k33J19k96K32j56K01O1m78K49J59
4048I6J4k21J15N9k06J08N7Q2m6k38L89n3j04K29L1k73rJ90p4j78J93l47K30n4
4072a0k05J84k24N6J90j23k58M20j92K59r3o5L70j24k20k4K06n2j40J38j36j24
4094a67L68j42j07r0j03n1K76P3j41K47k29K27K5k24P9o0P8j87K86k35J15J94
4116B32m23J54r4J36J91n38K29J33NL3j90L20j20p0j63o8q2L71j14k0N1Ok02r
$$ plain form
4140 -232 -9 67 -24 19 306 -178 -28 47 39 163 -85 25 -44 78 55 48 172 -21 330 109 -1 84 32 1
4164 1 -210 -82 -111 -134 5 136 -79 4 6 201 7 -107 -29 315 81 -427 -167 -312 -179 -53 -115 -41 -84 -152
4188 -152 -69 25 183 34 22 118 -13 88 -80 -206 38 72 -252 -188 84 182 -117 -249 175 -1 67 86 163
4211 163 -90 -26 90 164 225 -161 -16 87 111 252 81 -140 -282 -138 -211 138 -203 -70 -231 -233 6 -264
4233 -264 -132 -373 -36 179 -233 43 -27 199 60 50 -77 474 -46 -59 126 45 -42 -14 -65 65 -6 9 78
4256 78 -217 184 51 -202 4 -182 80 -233 -129 181 105 223 138 63 114 -78 207 199 -29 -124 70 18 60
4279 60 -91 -245 153 -103 -176 -43 277 -308 -2 404 -49 318 18 -5 109 64 -150 -68 -108 -70 182 -184
4301 -184 78 -190 107 43 172 -219 219 33 -64 -6 7 240 8 92 -119 76 -139 -265 -39 -167 8 -215
$$ packed form
4140b32K23P6r1M3K87m84J50P5qJ24k48J10o9J22k3pJ24j93L51k21j10Q5n2l1
4164Ak11J28k9k3J39J31k15Q3KJ95j94j14P8L44k34n08K60j45J33J26o2P4m3o8
4188a52Q3R4J58j49j2R6j31J01j68j26K44L4l24O4K72R8k99j32M24j76O8J9P7
4211A63k53O4J16P4O1l86J45J03K4J41j71k21j42J44p3L49l41J33j61kK39k70
4233b64J32k41L37K15m12K76p0K26j39j0j27N51n20j3J85q1q7K8n1J30p1J5O9
4256G8k95M01j33k53K06j86K62l13J04L10p6J18q5p5N1j92K85qk28r5J94n2M2
4279F0j51j54L98k56p3J33L20n85L06M06m53L67l00k3J14m5k14Q2m0L8K52l66
4301a84K62k68K97o4J29l91M38j86r7N8J3K33k32Q4k11J95k15j26K26j28J75k23
$$ plain form
4323 -215 125 147 23 -165 -76 66 -161 -152 52 9 70 -31 117 35 -66 -174 -156 90 25 -78 -225 -361 -23
4346 -23 -146 44 51 -80 181 -11 212 -252 -56 -255 20 202 4 215 103 -13 0 -100 68 -152 -179 -205
4368 -205 -242 -45 -215 -159 -67 -91 66 -98 -173 -14 202 -182 -111 126 -19 31 187 -19 76 80 64 65 207 10
4392 10 -38 -153 -298 12 -39 185 42 89 218 -62 174 241 63 -38 83 -211 -276 -116 35 -121 -268 -67
4414 -67 94 -252 18 -104 -191 -8 59 262 287 198 -218 -124 -46 -64 -2 -78 100 109 227 -144 -161 -104 10 -55 -141
4439 -141 -95 89 137 45 -282 18 132 -94 238 124 -8 -149 -50 88 -139 -175 -47 133 -243 66 1 113
4461 113 -55 107 13 -130 91 91 276 175 112 -224 42 17 -151 -149 -48 38 -35 -9 -39 158 -336 170 7 -16
4485 -16 -163 157 146 -38 -27 -40 88 -45 -79 210 -226 314 -21 -168 -5 -83 159 -65 0 218 175 -87 86
$$ packed form
4323b15L40K2j24j88Q9J42k27RK04m3O1j01J48q2j01j08J8K46o5j03j47j36L38
4346b3j23J90Pj31K61j92K23m64J96j99K75J82j98K11j12j16J3j00J68k20k7k6
4368b05l7J97j70N6R2k4J57j64p5J59K16l84P1K37j45N0J56k06R5Mj6JJ42j97
4392A0m8j15j45L10n1K24j43M7J29k80K36O7j78j01J21k94o5J60J51j56j47K01
4414f7J61l46K70j22q7J83O7K03K5q9m16R4P8j8O2p6J78RJ18l71j7N7J14o5q6
4439a41M6J84M8r2l27L00J14k26L32j14j32j41R9J38k27l6J28J80l76L09o5J12
4461A13j68J62r4j43K21%J85j01o3l36K66k5j68KJ01Q6p3K6l0J97m94N06j63k3
4485a6j47L20j1j84J1j3J28j33l4K89m36N40l35j47J63p8K42k24O5K18m3k62J73
$$ plain form
4508 86 284 134 139 -95 -434 -27 295 -12 -98 119 -167 -285 152 -14 -99 -188 40 -82 73 -27 216 150
4530 150 202 146 -40 69 61 149 -54 -75 28 210 46 113 -129 -177 -63 -127 99 122 168 -345 -36 -103 216 -50
4554 -50 -242 171 -184 199 -40 -333 42 6 29 -102 4 168 -184 -88 -202 154 -50 201 145 200 -68 -100
4576 -100 31 241 -2 74 110 45 71 75 -44 -227 42 8 116 309 329 -32 -60 46 -190 -110 -166 -52 1 25
4600 25 88 37 80 46 -57 155 30 -3 197 94 -44 -228 79 -168 -154 -298 151 232 -96 -306 146 14 46
4623 46 -117 238 301 -46 -137 -68 133 70 -44 172 120 23 73 -266 71 -60 204 -103 67 -55 0 -92 7 233
4647 233 -244 -16 121 53 11 -62 170 22 -198 -75 -94 -13 -64 172 -131 -309 -19 119 324 -166 156 263
4669 263 96 32 253 188 142 125 120 -3 -38 -16 105 32 12 -74 145 -24 -89 -78 -183 -424 -84 26 121 45 -12
$$ packed form
4508H6J98j50Nk34l39M07L22l07q6K17k86j18M37j66q5q9K28j22J55j00K43o6
4530A50N2n6j86J09qQ8k03k1J03J82j64O7k42m8J14o4K26K3M6n13L09o7L19k66
4554e0j92M13l55L83k39k93L75l6K3j31J06J64l52R6j14L56k04K51n6N5k68l2
4576a00J31K10k43P6L6o5K6Mj19j83K69l4J08J93K0l61k8J06k36Q0n6J14N3K4
4600B5O3n1M3l4j03K12j25l3K00j03j38j84L07k47J4j44M49Q1l28k10M52j32L2
4623D6j63L55O3l47r1O9K01o3j14K16n2r7N0l39L37j31K64l07J70j22N5r2R9K26
4647B33m77K28J37o8m2p3K32j48k20J23j9Q1n1K36l03j78K90J38K05m90L22J07
4669B63j67o4K21o5m6j7nj23l5K2J21p3k0q6K19j69o5J1j05k41L40J10R5p6n7
$$ plain form
4694 -12 7 -78 99 -367 -51 -104 -76 -53 -231 108 50 114 31 41 60 -38 78 -239 96 158 126 -70 -180 40 -132
4719 -132 -88 29 194 196 28 -113 33 -38 148 107 -309 -225 -216 -171 206 56 -176 273 97 62 -129 185 6
4742 6 34 -116 115 181 -223 -175 -115 121 -59 81 -67 65 186 33 -90 -10 15 36 25 203 46 140 -71 -45
4766 -45 -158 -123 3 -205 57 456 -85 -43 135 -381 -22 -224 -91 14 109 104 207 34 86 140 295 85 -183
4789 -183 -83 -39 -153 42 -29 -320 -94 216 -120 -158 -18 13 -82 -107 168 139 132 101 250 -176 14 34 166 -112
4813 -112 6 55 -120 -17 -70 56 255 68 94 -130 72 59 -254 -100 155 23 77 -107 -317 41 -25 -58
4835 -58 139 -85 -318 -16 3 135 -120 -163 122 138 -41 -175 -220 148 -149 139 -29 -20 270 52 -49 -39 -75
4858 -75 -75 -135 -239 222 468 107 -25 -128 -73 12 61 40 68 105 37 159 300 -76 -65 -6 -31 89 151 8 -63
$$ packed form
4694a2J9q5J77m66L16n3K8K3j78L39n8O4q3J0J9r8J16l17L35O2l2j96j10K20j72
4719a32M4J17J65Kj68j41J46p1J86m1m16Q4RM5L77j50k32M49j76l5j91L14j79
4742FK8j50K31O6m04M8O0K36j80J40j48J32J21j53j23Q0K5K1j1J78j57R4k11K6
4766d5j13L5J26k08K62L99n41M2J78n16L59k02J33J05R5nJ03j73N2N4J55k10k68
4789a83J00M4j14J95p1k91K26L10l36l8J40L1r5k5K75k9pl1J49m26J90K0J32k78
4813a12J18M9j75J03n3J26J99j87K6k24K02j3l13J54K55j32N4j84k10L58o6l3
4835e8J97k24k33L02J9J32k55m3K85J6j79j34m5L68k97K88j68RK90k18j01J0l6
4858g5%o0j04M61K46l61j32j03N5Q5M9k1K8L7o8J22J41l76J1N9k5J20O2j43p1
$$ plain form
4883 -63 -176 -121 -175 64 8 133 81 -158 96 210 -33 -85 126 -182 -41 -62 -98 54 256 26 6 -126 -92
4906 -92 84 196 28 57 -112 225 -59 31 -40 129 139 56 -264 -81 -65 -184 -7 124 101 74 34 -15 314 -239
4930 -239 -246 19 104 -195 -100 -82 387 59 171 -162 -104 92 -271 74 294 170 164 25 -5 -194 -96 -155 36 341
4954 341 3 -183 173 133 3 192 200 -17 55 67 209 -44 222 14 -51 -138 137 -125 -14 171 -72 75
4976 75 -226 227 -111 -150 329 -271 74 -123 -129 -5 48 465 -9 -159 -215 165 85 -121 -85 -125 327 -137 -88
4999 -88 -83 -44 -14 -234 33 -5 152 -59 204 -143 7 121 265 50 -34 184 -5 -235 138 27 -211 -91
5021 -91 107 -291 -78 -7 -37 91 157 115 223 54 -38 227 -31 -3 -171 79 72 124 272 -135 64 164 -55
5044 -55 153 -112 -107 -38 29 183 -44 151 -188 23 -76 60 -76 -148 -171 -62 -179 77 125 44 -6 70 117 14
$$ packed form
4883f3j13N5n4K39n6J25n2k39K54J14k43n2K11l08J41k1l6J52K02k30k0j32L4
4906i2J76J12j68K9j69L37k84R0p1J69J0q3l20J83J6j19J77J31k3k7m0m9L29n53
4930b39pK65Q5k99R5J8M69l28J12l33N8J96l63L45K20j24oj39l0j89R8n9J91L05
4954C41l38j86L56m0j30J89Qk17P2J2J42k53K66k08o5q7K75k62J11J85k43J47
4976G5l01M53l38l9M79o00L45j97oJ24N3M17m74j50n6L80q0k06L6m0M52m64M9
4999h8NL9L0k20K67l8J57k11K63l47J50J14J44k15q4K18j89k30L73j11k38J20
5021i1J98l98K13P1l0J28O6m2J08j69r2K65k58K8j68K50pN2J48m07J99J00k19
5044e5K08k65NO9O7J54k27J95l39K11r9J36j36p2k3J09j17K56M8q1n0P6M7j03
$$ plain form
5068 14 135 21 147 -130 197 -50 65 -40 -76 152 -166 -87 -95 -40 -96 108 -165 0 -92 -11 315 45 -140
5091 -140 94 -94 0 -61 -101 15 73 12 -11 175 -18 -27 -131 -170 -25 -83 96 -145 51 71 167 78 -285 139
5115 139 -37 84 89 -14 159 299 -173 65 149 -153 19 -161 19 -38 39 -190 -13 226 72 144 -92 63
5137 63 31 -108 491 -104 167 -188 -147 -48 2 5 33 88 104 -131 -354 110 164 291 221 34 -113 34 193 -64
5161 -64 25 85 184 249 114 131 235 -50 -198 173 -66 -6 -151 315 64 -114 67 -19 193 90 -137 -157 126
5184 126 105 0 100 -213 -201 19 -381 48 197 19 22 83 -170 226 165 134 -37 69 -132 -83 22 -7 24
5207 24 -203 -62 -87 -153 -4 -129 -37 62 -98 13 -262 142 -159 231 74 231 129 -8 -25 74 29 207 -41
5230 -41 -189 80 55 -208 56 47 206 76 -178 -143 -134 -271 14 162 -20 82 -116 -325 -50 185 -85 150
$$ packed form
5068A4J21j14J26k77L27k47J15j05l6K28l18P9qN5n6K04k73J65r2Q1L26k70j85
5091a40K34j88R4o1m0J16N8o1k3J86j93rj04l9J45n8J79k41J96K0R6q9l63M24
5115A39j76J21Nj03J73J40m72K38Q4l02J72j80J80n7P7k29J77K39j54P2k36J55
5137F3l2j39N99n95K71l55M1R9N0LK8N5J6k35k23M64N4J27p0j87j47J47J59k57
5161f4Q9O0R9O5j35J7J04k85j48L71k39O0j45M66k51j78J81q6K12j03k27k0K83
5184A26k1j05J00l13J2K20m00M29J49j78LO1k53L96o1l1j71J06k01M9J05k9L1
5207B4k27J41k5o6J49j25R2R9j60J11k75M04l01L90j57J57j02j37j7R9m5J78k48
5230d1j48K69k5k63K64rJ59j30k54L5Rj37K85J48j82J02j98k09K75K35k70K35
$$ plain form
5252 150 414 90 213 173 -19 199 -95 -90 -12 -3 107 -127 -43 307 -102 -114 107 342 -130 120 -88 -28 129
5275 129 139 52 182 102 -169 -12 -110 37 55 -130 -160 19 -59 58 -81 -12 -52 51 146 143 276 95 16 -108
5299 -108 -281 154 20 27 124 9 129 -29 -213 -42 67 379 -161 52 163 -127 -128 29 88 -39 -27 -237
5321 -237 -27 160 58 78 -189 121 -36 -105 111 -39 -37 -105 -168 -172 -180 -85 -6 129 50 -226 -60 157 -63 -302
5345 -302 98 -18 -84 67 -31 -9 232 8 -130 -163 169 270 139 94 231 -40 -101 70 394 148 1 189
5367 189 159 -109 44 153 44 15 94 -166 -48 -107 -33 -34 69 137 200 -11 -245 67 -150 39 -81 -35 -182
5390 -182 -88 -12 82 -65 -60 79 175 187 30 -85 -77 183 156 325 -167 27 95 -262 274 -72 -34 20 59 10 -250
5415 -250 -114 47 121 20 32 156 157 314 39 -103 -146 10 201 -64 -23 -175 -14 140 -228 -345 -13 58
$$ packed form
5252A50K64l24J23m0j92K18k94NP8RJ10k34Q4L50m09j2K21K35m72K50k08O0J57
5275A29J0q7J30q0k71J57r8J47J8j85l0J79p8J17j39O9m0J03R5lJ33j81p9j24
5299a08j73M35j34PR7j15J20j58j84J71J09L12n40K13J11k90jJ57N9j27J2k10
5321b37K10J87j02K0k67L10j57o9K16j50Ko8o3mqR5P9J35p9k76J66K17k20k39
5345c02M00j16o6J51r8K2K41k24j38l3L32J01j31m5J37k71o1J71L24k46j47J88
5367A89l0k68J53J09j09k9P9k60J18n9P4jJ03O8O3k11k34L12k17J89j20M6j47
5390a82R4P6R4j47NJ39R6J2j57j15QK60k7J69m92J94O8l57N36l46L8N4L9m9k60
5415b50J36J61P4j01J2J24JJ57k75j42m3J56J91k65M1j52J61J54l68j17L32P1
$$ plain form
5437 58 14 8 117 -49 -169 289 -16 11 -130 71 -220 181 -65 -123 -308 -46 -119 -129 -235 62 -168 180 -89
5460 -89 -213 -4 -30 328 58 289 -133 118 -73 -317 -23 -143 -227 -44 96 -103 95 -98 291 85 26
5481 26 132 181 -207 71 -43 -179 -55 77 -184 64 -119 278 146 133 -187 23 -81 -96 -162 -199 -125 -288
5503 -288 249 122 -160 126 -46 61 -158 -91 -125 -206 -35 51 -143 3 -22 147 -93 89 -72 14 -111 88
5525 88 -24 149 -4 -25 -114 -44 118 65 -10 28 216 26 150 65 -300 -69 -4 264 -219 304 34 12 -129
5548 -129 -140 7 172 161 -124 7 -126 -21 -112 -47 -54 -123 -54 67 -3 142 -165 -5 130 -15 166 27 35 -134
5572 -134 254 -179 -75 54 -23 138 -209 -12 111 40 57 224 43 37 -149 -121 103 40 249 78 101 -52 130
5595 130 7 -164 -156 178 -160 -223 220 -106 -54 34 138 -100 -56 185 63 71 -269 219 -111 -54 -63 97 183 -124
$$ packed form
5437E8m4oJ09j66j20M58l05K7j41K01k91M01k46n8j85K62p3j0j06K97k30L48k69
5460h9j24K09k6L58k70K31m22K51j91k44K94j20q4J83J40j99J98j93L89k06n9
5481B6J06M9l88K78j14j36J24J32k61K48j83L97j32j3l20K10j04j5o6l7P4j63
5503b88N37j27k82K86j72J07k19O7l4q1J71Q6j94J46k5J69k40J82j61Q6j25J99
5525H8j12J73j53k1q9P0J62n3p5L8J88j90J24q5l65K31O5K68m83N23k70k2j41
5548a29j1J47J65j1k85J31j33J05r1O5po9O9J21p0J45l07J60J35j45J81j39Qj69
5572a34L88m33J04J29p7J61l47J97J23p1J7J67j81oj86K8K24o3K09j71K3j53J82
5595A30j23j71QL34l38o3M43l26N2Q8J04k38M4K41j22Ql40M88l30N7rJ60Q6l07
$$ plain form
5619 -124 -50 -45 -265 -305 -373 43 -112 35 118 138 -7 240 -56 205 307 -339 105 -255 -106 49 289 36
5641 36 -128 28 73 -38 -25 -251 37 156 156 -165 142 159 59 -342 -72 -21 102 284 -106 -95 227 190 31
5664 31 -16 244 -36 -70 -35 -10 -100 161 -46 140 27 -33 -154 94 87 -102 39 -178 -137 181 -55 186 -15
5687 -15 17 95 -97 128 -185 -171 173 141 -99 114 107 3 160 -101 -44 281 -28 109 -58 280 -13 -61 -159
5710 -159 -48 308 27 91 267 84 -259 -16 202 -41 168 -89 209 18 -208 -166 383 -28 -197 -123 214
5731 214 -49 202 149 -149 96 98 179 -104 183 103 229 -72 -26 290 -5 24 -123 -161 -44 -37 58 17 -128 -107
5755 -107 -59 81 283 122 -89 22 -133 143 -20 -125 -23 -138 93 -131 -45 84 97 -46 -147 91 40
5776 40 -83 -289 -261 -10 42 44 -207 -59 -25 -195 -38 84 74 172 216 -79 -353 -126 225 -102 105 -66 143
$$ packed form
5619a24P4Nk20m0o8M16j55J47Q3K0j45K47k96K61J02o46M44l60J49J55K40k53
5641C6j64J56M5j11J3k26K88J19%l21L07J7j00m01K70N1J23J82l90J1L22l7j59
5664C1m7K60k80l4L5K5r0K61k07J86j13o0j21K48pj89J41k17M1L18k36K41k01
5687a5L2P8j92K25l13J4L44l2k40K13pj04J57k61N7L25l09J37j67L38k93m8r8
5710a59J11L56k81O4J76j83l43K43K18k43K09k57K98j91k26M2N49m11j69P4L37
5731B14k63K51n3k98K45KQ1k83K87q0J26l01M6L16k95K9j47l8J17PR5m1j45K1
5755a07M8J40K02j61k11J11j55K76j63j05J02j15K31k24Q6J29J3j43j01K38n1
5776D0j23k06K8K51N2Kk51J48L4j70J57J22j0R8M4k95k74K27L51l27K07j71K09
$$ plain form
5799 143 220 28 38 -10 28 -81 105 -9 38 -18 24 -75 2 65 -55 -160 272 -125 81 126 94 -3 92 28 -38
5824 -38 -5 63 9 88 -46 13 -7 174 29 -136 216 66 64 269 -30 -53 -83 -15 -27 204 40 -34 -44 201 -118
5849 -118 -64 60 204 -30 -37 -54 122 28 210 24 -272 -11 206 -27 205 -111 -186 88 90 -152 -87 -59 -126 -63
5873 -63 -212 25 188 56 15 100 132 -58 186 75 171 217 -254 190 -105 247 -80 234 301 189 42 259
5895 259 -62 -37 390 -163 -91 -194 -326 297 279 57 -124 -130 54 -149 -129 -331 -178 142 45 114 -113 83 -263
5918 -263 -107 -63 240 -32 115 89 -95 251 133 135 228 -351 21 -32 -165 43 -49 -253 -58 7 188 58 52
5941 52 -110 -40 -49 -95 -150 -265 143 120 -91 239 -5 -89 -301 -368 -22 -168 -47 -336 311 -327 -209 -22 -125
5964 -125 164 305 -80 49 -154 0 -65 -120 202 64 189 -155 151 -89 198 -82 -11 -15 69 -130 198 -27
$$ packed form
5799A43P7j92J0m8L8j09J86j14M7n6M2r9P7O3j20j05M32l97K06M5l2r7R5o4o6
5824c8L3O8n4P9j34N9k0J81j45j65L52j50kK05k99k3l0O8j2K31j64p4j0K45l19
5849a18N4J24J44k34pj7J76r4J82j86k96K61K17k33K32l16p5K74Kk42O5K8o7O3
5873f3j49K37J63j32m1Q5L2j90K44j11R6M6m71M44k95L52l27L14O7j12j47K17
5895B59l21K5M27n53P2j03j32O23j8k22j81oJ84k03K0k02J53L20r7O9k27J96l46
5918b63J56M4L03k72J47k6j84L46j18KR3n79L72n3j33K08r2k04J95O5J81j30o
5941E2j62P0rm6n5j15M08k3k11L30k44q4k12o7L46j46J21k89O47o38J18J87j03
5964a25K89J41l85J29k03J54o5n5L22j38J25l44L06k40K87k80P1mQ4j99L28k25
$$ plain form
5986 -27 -8 116 83 143 -291 -218 -58 150 147 163 -81 -249 123 -50 120 -80 -93 -124 -8 21 92 -214 -78 200
6010 200 302 13 11 -34 -96 195 65 9 301 -311 399 -75 41 38 18 -55 142 266 -47 -96 -114 -290 66 144
6034 144 61 -131 100 -298 35 135 85 100 -270 71 -252 344 -104 -77 183 -215 244 -236 -70 -199 -117 -87
6056 -87 98 -260 -16 125 -22 -131 55 -103 -7 -272 -202 306 149 -67 -257 -234 -144 -5 3 114 -272 70
6078 70 -181 -53 -142 222 -36 -219 75 17 -122 -289 192 -101 -48 -193 98 158 -237 87 -236 -35 -28 -223
6100 -223 61 40 -146 385 28 -40 282 134 139 18 113 -8 125 -29 -177 -80 -215 165 -140 108 -47 249
6122 249 -32 -50 -41 114 401 244 -24 112 180 -10 -109 176 43 -144 28 -266 -106 -20 -5 106 87 -1 -170
6145 -170 -110 -196 149 -58 33 -60 82 63 -111 20 48 113 81 -208 -48 125 -30 -82 -147 125 123 8 -169 55
$$ packed form
5986b7J9J24l3O0m34P3J60K08lJ6k44j68L72j73J70k00j3l1J16K9P1l06J36K78
6010B00J02k89km5o2K91j30n6K92o12P10m74J16lk0p3J97J24l13m9j8j76L56P8
6034A44q3j92K31l98L33J00n0J5l70L41l23N96m48K7K60l98M59m80J66j29Q2L0
6056h7J85l58K44J41j47j09J86j58R6k65P0N08j57k16j90K3R0J39QJ11l86L42
6078G0k51J28q9L64k58j83K94n8j39j67M81k93N3j45K91O0l95L24l23K01Pj95
6100b23K84k1j86N31l57o8L22j48Nj21R5j21J33j54j48R7j35L80l05K48j55K96
6122B49k81j8RJ55K87j57k68J36O8j90r9K85j33j87J72k94J60Q6J5J11j9q8j69
6145a70O0q6L45k07R1r3J42j9j74J31K8O5l2k89J60J73j55n2o5K72kj15j77K24
$$ plain form
6169 55 -60 301 -79 -3 -125 -150 -21 -125 -7 -98 75 -166 23 -52 12 -229 15 -149 -44 97 174 -40
6191 -40 135 -2 78 108 155 49 110 38 -15 43 -165 8 33 238 -66 78 62 -17 -29 109 -21 -16 -187 -130 -221
6216 -221 -200 72 -87 -135 8 42 281 174 -192 2 -36 -27 72 -81 -201 9 -85 37 203 9 -119 60 205
6239 205 87 -257 -22 66 113 11 -29 -39 -203 49 -44 -30 63 -61 -79 -132 -40 182 -239 25 12 48 -8 411
6263 411 -28 119 97 136 3 -90 30 -134 185 138 46 -214 -36 27 24 249 -24 -2 88 -46 369 139 69 -54
6287 -54 9 -52 161 4 184 -251 -74 54 120 30 24 216 66 194 -183 -91 -193 -73 130 -199 -66 -49 -185
6310 -185 -63 -11 26 -146 -7 45 23 -55 6 181 -84 239 -21 76 39 156 70 200 63 -298 282 472 -122
6333 -122 -88 53 68 65 105 123 43 9 -71 -3 185 -26 291 -68 26 165 183 -99 178 263 -118 -183 16 32 -144
$$ packed form
6169E5j15L61l80P6j22k5J29j04J18r1J73k41J89p5O4k41K44j64J05J41P7k14
6191d0J75j37Q0L0M7j06O1p2n3N8k08J73K5K05l04J44j6p9j2J38j30Nj71N7r1
6216b21K1K72j59m8J43L4K39j07l66J94l8RR9j53j20K10r4J22J66j94j28J79J45
6239B05j18l44K35Q8M7j02m0j0j64K52r3J4R3j24j8n3R2K22m21K64j3L6n6M19
6263D11m39J47k2L9j33r3J20j64L19m7r2k60J78O3lK25k73K2R0j34M15k30p0j23
6287e4O3o1K13j57J80m35J77J28O6r0oJ92j50J28l77R2j02J20K03l29J33J7j36
6310a85J22N2L7j72J39N2k2p8O1J75k65L23k60R7l7J17q6J30j37l61N80J90n94
6333a22L4J41J5lM0J8q0l4q0O8J88k11L17l59R4J39J8k82K77Q5l81o5J99J6j76
$$ plain form
6358 -144 69 111 -119 76 133 85 -110 141 23 -27 -98 210 28 -35 41 217 -24 -116 66 -1 -125 -151 84
6381 84 -103 -235 37 -208 -97 -60 -41 190 46 -34 66 -19 -77 -9 -88 -97 10 123 81 -166 -157 -237 3 -88 302
6406 302 -55 -91 -364 100 190 -33 156 117 -88 -205 -5 -79 186 -32 -24 -161 -143 -119 235 -228 -174 1 40
6429 40 56 -218 -196 32 -155 44 216 207 57 -158 -24 -89 -104 -72 -20 -348 -45 -136 314 23 57 6 -22 -65 18
6454 18 87 0 -155 -110 -182 -167 -102 -158 165 -96 -28 62 -325 63 -224 -112 -34 139 90 125 -247 174 -82 191
6478 191 -54 206 91 -77 -129 36 -119 208 -68 196 -303 213 160 19 33 -81 83 10 176 -93 97
6499 97 209 -20 -175 68 -112 209 114 -123 47 -26 12 45 -169 -102 -383 82 90 -89 238 121 -375 30 89
6522 89 167 -37 68 5 35 -352 257 -41 92 22 -52 293 273 150 -28 -97 213 -83 232 7 34 -38 142
$$ packed form
6358a44K13M2k30J95N7m8j95K51j18n0p1L08j82o3P6J76k41r2J82o7j24k6K35
6381H4j87j32K72k45J11L7J9K31j44q0J00q5n8O8p9rJ07J13m2k47Rq0K40r1L90
6406C02l57l6k73M64R0k23J89l9k05j17K00p4K65k18Qj37J8K4L54m63N4J75L9
6429D0J6k74K2K28j87J99J72rj50k15J34o5j5L2N2l28L03r1M50k91L4n1k8m3Q3
6454A8O9q7j55M5p2J5O5n6L23k61O8R0l87L88k87J12P8J73m9L5l72M21k56K73
6478A91k45K60j15j68n2J65j55L27k76K64m99N16n3j41J4j14J64p3J66k69J90
6499I7J12k29j55K43j80L21r5k37J70p3L8L3k14O7k81M65Qj79L27j17m96M05N9
6522H9P8k04J05o3L0l87O09k98J33p0p4L45k0j23j78o9L10k96L15k25K7p2J80
$$ plain form
6545 142 -212 132 82 48 120 201 173 312 56 75 -265 -50 -49 95 145 189 -15 -5 77 -24 114 92 154 -16 103
6570 103 -5 -41 -81 91 212 123 177 -98 -131 169 -142 231 22 -174 191 34 29 24 193 -274 124 61 -9 234
6594 234 -34 143 35 -2 80 -479 -181 164 79 -1 102 -55 -21 186 27 -67 -267 19 -26 -327 -137 131
6616 131 -20 -183 229 -217 -229 -65 73 60 -56 7 -259 271 242 -309 77 35 83 65 219 -60 138 -52
6638 -52 49 173 -77 -40 313 -1 37 50 -127 210 -75 96 49 -215 212 134 -12 -35 136 177 206 70 -3
6661 -3 97 143 146 92 -36 -181 149 118 -199 18 90 42 184 -177 -108 -24 6 -193 -65 -25 -38 -49 107 -132 -16
6686 -16 190 -45 -43 -119 305 76 -35 -63 -44 -260 -24 -125 -198 -129 -127 39 31 -265 188 -244 -88 145 113 -56
6710 -56 -167 55 247 -276 25 165 32 -335 -35 -95 -68 -95 20 49 331 -28 209 113 -9 -131 -7 87
$$ packed form
6545A42l54L44n0l4P2Q1k8J39k56J9l40K15JJ44N0M4k04J0Q2j01J38k2O2j70J19
6570A03j08l6m0J72J21q9N4k75l3L00l11L73k09j96L65j57nnJ69m67L98o3p0K43
6594B34k68J77j08l7Q2n59K98L45q5q0J03j57L4K07j59r4k00K86m5l01J90K68
6616A31j51j63M12m46j2J64J38j3j16O3k66N30k9n51L86m2M8j8J54k79J98j90
6638e2J01J24k50L7L53l14L8J3j77L37k85J71m7k64M27p8j46k3J71M1K9j36p3
6661cJ00M6Ln4j28j45L30l1l17K17P2m8J42l61O9Q4L0j99J28M0j3j1J56k39J16
6686a6K06k35Kp6M24k29j11k8J9k16K36j01p3O9KJ66qk96M53m32J56K33l2j69
6710e6j11K22J92n23L01J40j33l67L00o0K7k7J15K9K82l59K37r6j22j22J24R4
$$ plain form
6732 87 -46 138 -313 -14 -72 -109 251 -163 68 119 10 110 -20 -240 -18 115 -256 168 268 158 33
6753 33 -78 71 -172 105 -247 -19 -83 60 -210 -308 234 -19 -9 -396 76 -97 -75 -166 -106 94 200 79
6775 79 121 -137 -58 207 54 32 281 -3 -182 3 -49 127 -43 -349 25 12 -139 109 -14 404 -154 -21
6797 -21 170 -9 226 142 110 -250 204 156 239 64 -376 -90 103 -104 218 102 247 17 -107 -229 -276 158
6819 158 -115 86 -94 50 136 127 -88 58 108 -66 86 -11 -181 -161 -120 -97 68 126 43 -9 -188 -221 -25 -64
6843 -64 -92 -106 -260 -71 -188 -45 -107 -287 144 14 -285 147 51 -279 46 -71 -137 214 -114 -43 -28 276 -178
6866 -178 -2 -10 -59 -201 -58 -79 -37 -65 -61 69 78 -46 54 123 -102 -94 -83 -102 -113 -41 170 78 50 -84 16 137
6892 137 172 -45 131 -144 340 -12 65 157 92 -255 -438 26 -137 -44 -12 230 113 128 -85 -156 65 589 333
$$ packed form
6732H7j33J84m51K99n8l7L60m14K31N1j09J00j30k20K22J33l71M24J00j10j25
6753C3j11J49k43K77l52K28o4J43k70r8N42k53J0l87M72j73K2r1O0K00J06j21
6775G9M2k58P9K65j53k2K49k84j79J85n2J76j70l06L74j3j51K48j23M18n58J33
6797b1J91j79K35q4l2l60M54m8Q3j75m40K86J93k07L22j16J45k30j24j22m7M34
6819A58k73K01j80J44Q6rk15J46N0j74J52r7j70K0M1K3J65N8q3n2j79l3J96l9
6843f4k8j4j54J89j17J43o2j80M31j30k99M32r6l30L25j17o6L51l28P1J5L04m54
6866a78J76qm9j42J43k1M2k8MJ30Rj24J00O9k25QJ1j9j1P2K11r2k8j34J00J21
6892A37L5k17J76k75M84l52P7R2o5l47j83M64j63R3L2K42j17J5k13p1K21N24k56
$$ plain form
6915 333 268 158 -11 86 12 -168 78 28 144 -79 -109 199 19 24 125 26 -71 -123 99 178 208 241 16 74 3
6940 3 -99 133 -223 288 -360 17 -100 16 209 -130 -300 -267 -151 143 -10 117 135 36 -2 -173 184 -56
6962 -56 39 100 80 -254 109 169 203 -284 143 -58 -19 -44 17 235 -73 -113 28 248 -151 -163 -13 -125 195 128
6986 128 -158 80 -95 0 49 123 -99 41 67 47 123 168 52 154 -140 93 -62 -31 81 34 -23 207 -46
7009 -46 -308 -96 104 81 196 14 82 351 -73 87 -4 -111 -29 18 -118 222 -7 194 -47 -42 -110 -66 38
7032 38 212 -175 8 104 -29 -172 83 -372 -288 -75 248 -77 -190 175 -4 -131 169 -144 -59 24 -82 -173
7054 -173 -79 170 90 18 -81 50 -234 135 -50 92 -54 122 11 78 -55 -31 31 107 103 18 -290 -236 38 -61
7078 -61 -102 -159 -88 -138 84 206 263 57 23 72 39 42 151 210 164 -175 63 58 -90 60 -185 -3 -454 -153 -266
$$ packed form
6915C33o5j10j69R7p4j80K46n0J16k23l0L08j80NJ01r9r7n2K22P9L0L3k25N8p1
6940Cj02K32l56N11o48L77j17J16J93l39j70L3J16K94j53J27J8r9l8j71L57k40
6962e6R5O1k0l34L63O0L4m87M27k01L9k5O1K18l08m0J41K20l99j2J50j12L20o7
6986A28k86K38j75R5M9P4k22J40K6k0P6M5j16J02k94K33j55L1J12m7n7K30k53
7009d6k62K12K00k3J15j82O8K69m24J60r1j07Q2M7j36L40k29K01k41No8M4J04
7032C8J74l87J83R6j33j43K55m55Q4K13L23l25j13L65j79j27L00l13Q5Q3j06r1
7054a73R4K49q0p2r9J31k84L69j85J42j46J76j11O7j33K4O2P6mq5l08N4K74r9
7078f1m1n7P1n0K22J22N7k06l4M9l3LJ09N9m6l39K38nj48J50k45J82m51L01j13
$$ plain form
7103 -266 -39 17 150 99 -134 118 71 61 60 150 -143 253 22 -23 -250 -142 -99 -365 11 177 34 -159 -123
7126 -123 476 -110 -181 -256 257 -83 -158 120 -292 164 -268 123 -135 -146 0 -92 56 -258 60 168 16 -59
7148 -59 178 -148 -33 -30 274 -35 301 61 6 1 -150 -35 22 84 185 60 146 201 23 182 102 -29 -20 -320
7172 -320 -75 133 -254 46 70 -14 51 80 -13 109 41 66 -172 -193 -94 -90 7 -323 -49 -131 -5 -62 -41 87 160
7197 160 -76 51 183 -141 276 -207 -49 -155 -141 6 307 59 10 -99 -70 -83 -161 -96 -69 109 -362 94
7219 94 233 19 -157 185 139 -31 -63 -51 -186 -216 5 69 2 -52 -199 -166 -17 117 60 -306 -10 -291 -147
7242 -147 -261 -114 -23 73 130 38 315 -81 38 -47 -90 68 70 -41 92 -172 -54 103 -177 -149 46 12 -205
7265 -205 19 42 -250 -115 -61 227 -12 209 74 -16 421 221 299 -119 -175 161 165 33 -210 -80 193 389
$$ packed form
7103b66K27N6J33n1k33K52m7j0jR0k93L96k31m5k27J08M3k66L76J66j43j93L6
7126a23N99n86p1p5N13l40p5K78m12M56m32L91k58j1J46r2J48l14L18J08j52p5
7148e9K37l26J15LL04l09L36k40n5nj51J15N7O2J01j25Q6N5j78J59q0j31Rl00
7172c20K45K08l87L00K4q4O5K9r3J22o8K5k38k1R9MR7l30K74q2J26n7K1J28P3
7197A60k36J27J32l24M17m83J58j06J4J47L01k48m9j09K9j3p8O5K7J78m71M56
7219I4J39k14j76L42m6j70l2J2j35l0K21O4o7n4j47L3J49J34n7l66K96k81J44
7242a47j14J47R1R6N7r2K77l96J19q5m3J58Kj11J33k64J18J57k80K8J95l4k17
7265b05K24K3k92J35N4K88k39K21j35r0M37k00P8m18n6L36Mj32k43J30K73J96
$$ plain form
7287 389 160 49 -114 190 163 -241 -180 -15 -173 31 151 -8 -260 130 -107 -257 -266 68 -106 -30 -142 -101
7309 -101 -24 116 115 -21 34 -56 -19 -88 77 -145 11 28 -145 -248 218 55 -99 91 -228 -61 -2 177 56
7332 56 76 -203 -283 -114 51 0 -128 -53 271 36 -438 -124 73 -141 128 11 71 -35 47 50 40 -169 16
7355 16 199 205 -87 -38 -42 170 21 -25 -99 -22 9 -161 -251 7 -59 -43 189 88 -67 197 69 -227 -328 122
7379 122 -172 136 68 -153 -59 135 151 -195 -231 53 227 -31 -7 72 104 16 30 -22 -72 285 -168 21 159 258
7403 258 263 -166 121 -178 134 167 316 -61 -35 -118 247 56 342 -114 -92 -72 -59 -187 262 -46 6 -304 -175
7426 -175 53 -53 23 41 -187 -109 -80 51 154 50 -39 122 -341 123 166 -22 -204 313 195 -109 188 244
7448 244 -38 -20 53 -120 -10 -82 -396 177 -14 -69 -161 -154 153 58 116 -197 71 51 -143 228 -224 -211 -49 -232
$$ packed form
7287C89k29j11j63L04k7m04O1J65j58K04J20j59k52L90k37j50rL34j74P6j12M1
7309a01P7J40jj36N5r0L7o9J65k22J56J7j73j03M66j63j54J90l19J67N9J79j21
7332E6K0k79q0J69J65n1j28P5L24k35m74L14J97k14K69j17O0j06Q2Lj0k09J85
7355A6J83Ok92M9mK12j49m6p4P7L1j70r0K58o6J6K32j01j55K64j28k96j01M50
7379A22k94L08o8k21R4J94J6l46l6K84J74k58K4P9L2q8J4n2n0L57m53J89J38R9
7403B58Nm29K87k99L12L3J49l77K6q3L65j91K86m56K2K0J3j28M49l08N2l10J29
7426a75K28j06P6J8k28P8K9J31J03j04q9J61m63M64M3j88j82N17j18l04K97N6
7448B44k82J8P3j73J10p2l14N73j91n5r2PL07r5N8l13K68k0j94L71m52J3J62j83
$$ plain form
7472 -232 38 -66 88 -1 -165 261 198 -9 79 1 0 64 125 -223 92 36 18 -93 -172 415 -43 252 27 128
7496 128 -72 17 161 72 -10 77 16 -1 -152 -57 0 391 -100 -133 -138 -22 2 -79 -134 137 -135 -99 41 222 -139
7521 -139 41 131 101 37 -315 -268 -65 135 137 -186 208 53 93 -40 158 221 129 -214 210 74 -296 -276 -177 -10
7545 -10 -168 196 22 144 -77 -103 -54 -12 -146 61 229 271 -175 -188 73 28 140 314 163 252 -218 59 -168
7568 -168 57 -10 -287 -59 156 -17 -267 71 25 83 -193 -314 68 57 100 55 130 65 -266 114 320 47 -153
7591 -153 111 -143 -182 -71 -122 57 10 -5 -44 40 -111 -183 -19 344 -98 -403 -106 -45 -148 -147 -100 270 8 42
7615 42 -132 145 71 -155 -150 -381 154 164 217 31 27 -70 -17 -223 241 117 111 -355 103 168 354 148 -51 -8 -150
7640 -150 -1 -379 120 220 -39 113 -32 142 236 346 105 72 -8 126 49 -132 25 -252 114 -127 171
$$ packed form
7472b32K70j04J54q9j64M26o3k07Q8p8jO4O1l48L15n6j8j11p9N87m58K95k25J01
7496A28k00Q9J44q9q2Q7o1j7j51R5N7L91m91l3nJ16K4q1n5K71k72L6J40J81l61
7521a39J80R0l0o4l52M7K03K00Kl23L94j55M0j33J98O3r2l43M24j36l70K0R9J67
7545a0j58L64j74J22k21k6M9M2j34K07J68M2m46j3K61m5J12J74j51Q9m70K77k27
7568a68K25o7k77K28K15j73k50L38m6N8k76j21L82j1M3m5P5o5l31L80K06k73k00
7591a53K64k54l9J11n1J79m7j5l9Q4j51p2J64L63m42l05K97O1j03JM7L70k62L4
7615D2j74K77p4k26Nk31N35J0N3j86mr7N3k06M64j24om66M58O5J86k06j99M3j42
7640a50J49l78M99J00k59J52j45J74R4J10k41l3q0J34p7j81J57k77L66k41K98
$$ plain form
7661 171 113 -349 -130 43 -215 -142 85 35 129 58 -224 -244 -142 34 -90 44 35 -209 -214 27 -356 -77 48
7684 48 50 339 4 248 -5 -118 -116 -138 -37 69 7 -365 -51 67 12 -38 5 -31 102 94 126 -12 268 0 142
7709 142 -218 -155 -46 164 176 -39 -27 -30 -25 51 -18 -112 -64 108 183 -137 -139 11 -40 -10 224 95 -140 -54 46 -10
7735 -10 -54 155 -98 -200 50 -230 -73 151 82 106 27 -196 36 182 328 -1 -20 -126 -239 211 103 46
7757 46 14 -69 -176 325 -208 261 125 -84 8 140 -14 41 72 -93 -35 -103 -46 4 -3 -97 -212 -70 24 164 144
7782 144 -53 -66 225 120 230 0 -72 -180 138 131 -198 140 53 -6 235 159 -3 -9 -66 -3 190 -147 -110 -273
7806 -273 63 -31 148 -107 -56 345 -76 345 -263 -321 -20 81 72 15 53 49 -89 -56 62 104 241 -62 212 -205
7830 -205 -117 212 -74 86 -40 -113 20 -151 -24 -373 130 -13 39 -17 295 37 -242 2 -2 -195 126 -91
$$ packed form
7661A71n8m62K19J73k58P3K27n0R4p1k82k0J02J76j24J34rk44nK41l83K79J25
7684D8KK89l35K44k53j13Kk2J01J06o2l72L14J18n5n0M3l6J33qL2j38K80k68J42
7709A42l60O3J09K10J2k15J2lNP6o9r4M8J72P5l20kJ50n1L0K34j29k35Q6J00n6
7735a0m4K09k53j02K50k80J57K24o9K4p9k23K32J46J46l29j9j06j13M50j08n7
7757D6l2q3j07N01n33M69j36k09R2J32j54N5L1j65N8o8N7N0pr4j15J42R4J40k0
7782A44j97j3K91j05J10k30p2j08L18pl29L38q7n9K41p6j62on7O3J93l37L7j63
7806b73L36r4J79k55N1M01m21M21o08n8L01J01rn7L8mj38L3J18M2J37l03K74m17
7830b05Q8L29k86J60j26p3J33j71J27l49N03j43N2n6L12k58k79K44mj93L21k17
$$ plain form
7852 -91 144 116 -41 -74 -63 -347 119 -109 -24 98 -257 -46 79 -86 179 -232 49 145 -200 -99 -92 112 151
7875 151 -120 30 -144 -162 237 57 28 178 49 -145 146 73 -148 116 24 82 179 31 -11 14 -247 -167 -117
7898 -117 -272 121 -31 5 49 60 -140 -171 -34 -229 -127 231 -76 -32 26 226 -228 -359 -43 285 31 89
7920 89 -111 63 -251 52 -175 -32 -33 34 51 349 -87 -89 130 96 -92 -107 -106 -84 25 -203 -72 -233 189 -224
7944 -224 18 34 239 91 -243 -29 -100 277 -221 -242 -49 13 307 131 14 231 346 -70 -170 -224 227 45
7966 45 142 -22 -45 -105 123 184 -118 -68 116 -6 98 192 -51 72 -35 -70 8 153 39 120 72 441 173 -9
7990 -9 -188 -95 -163 104 198 301 -71 -80 -223 -149 -24 -301 -29 25 -237 -29 -66 107 45 -117 -40 1 -105 181
8014 181 263 58 -156 -17 -90 -5 16 98 75 -29 -190 145 57 232 -55 33 -168 58 -60 -35 -61 -53 42 -162
$$ packed form
7852i1K35k8j57l3J1k84M66k28Q5J22l55K11J25j65K65m11K81R6l45J01PK04L9
7875A51k71J50j74j8L99j80k9J50j29j94K91p3k21K64r2N8R7j48m2K5k61Q0N0
7898a17j55L93j52L6M4J1k00l1J37j95J02L58l07M4N8K00m54j31L16L28k54N8
7920H9k00J74l14L03k27J43jO7J7K98m36kK19l4j88j5JK2J09k28J31j61M22m13
7944b24K42J6K05j48l34K14p1L77m98k1J93O2K94j76j17K17J15m16j00n4M51j82
7966D5R7j64k3o0K28O1l02N0J84j22J04R4k43J23j07l5P8J45j14Q1m8L69k68j82
7990ij79R3o8K67R4J03l72rj43P4J25k77K72N4k62K08l7J73o2j62P7M1j06K86
8014A81Q2k05k14J39p3Q5K1Q2k3j04j61L35q8J75k87Q8k01K26j18K5k6QR5k04
$$ plain form
8038 -162 -42 264 15 348 -5 89 -199 154 -99 108 196 45 112 -87 67 168 63 22 86 -22 235 51
8060 51 -156 -32 -20 1 -20 56 -299 -86 142 22 291 208 71 -156 -123 266 -7 -174 109 45 34 -191 -238
8083 -238 -69 143 112 81 -287 3 241 -40 220 -52 28 83 196 91 -237 -111 -244 -70 -58 -93 -162 -136 -80
8106 -80 114 -75 10 -75 -97 -112 -122 -164 -7 39 -144 -260 -165 27 -9 -210 -164 -74 97 220 -6 -248 54 -48
8130 -48 -55 12 53 20 -302 99 -146 63 -168 80 186 226 98 16 -22 41 70 24 -31 -100 -70 25 46 -71 221 -215
8156 -215 109 -34 63 -290 -185 -275 -45 99 60 60 132 129 41 -151 -211 163 -154 207 -28 65 57 44 40 -289 77
8181 77 -93 237 167 -123 -106 -132 -70 -143 65 -50
$$ packed form
8038a62J20L06k49L33l53R4k88L53k53K07Q8j51O7j99J54J01j05m1O4j08K57j84
8060E1k07J24J2K1k1P6l55K13K28j20K69q3j37k27L3L89k73j67K83o4j1k25m7
8083b38J69K12l1l1l68K90K38k81K60k72Q0N5J13j05l28J26j33J74J2l5o9K6N6
8106h0J94j89Q5q5k2j5j0m2J57M6j83j16R5J92l6k01M6R0J71J23k26k42L02j02
8130d8pO7M1l3l22M01k45K09k31K48J06M0j28q2l8O3K9m6n5o9L0R5K1j17K92m36
8156b15L24j43R7l53J05r0K30J44l9%P2lq8j92o0L74l17L61k35R3qj3ml29L66
8181G7j70L30p0k90J7k6O2p3K08j15
8191e0
$$ Imaginary data points
##PAGE= N=2
##DATA TABLE= (X++(I..I)), XYDATA
$$ plain form
0 0 0 0 0 0 0 0 0 0 0 0 0 -8 8 -8 8 -8 16 -16 24 -24 32 -32 40 -48 56 -71 80 -95 104 -120 141 -160 183 -207
34 -207 232 -262 294 -328 367 -409 455 -506 561 -623 688 -760 839 -927 1021 -1124 1239 -1363
52 -1363 1503 -1658 1832 -2029 2251 -2508 2806 -3156 3574 -4091 4738 -5582 6730 -8394 11034
67 11034 -15873 27694 -124252 -75777 91650 -108960 -43415 113981 24451 -63799 72723
78 72723 51748 -28894 60524 99831 -20445 -3141 42529 -44855 -59712 37451 -5298 -68313
90 -68313 -7494 7754 -60515 -39603 -4157 -27922 -8986 38794 22132 16272 44898 40893 30814
103 30814 40357 17034 1530 17619 -11201 -53934 -36460 -33866 -63233 -33082 2048 -22679
115 -22679 -9720 39630 20746 -1924 39159 42222 5545 23488 37023 -6013 -13126 13435
$$ packed form
0@%%%%%%%%%%%qJ6j6J6j6K4l2M0m8N6o4P2q8J04j27J51j75J99k24K61l01L43l90
34b07M39m94N56o22O95p76Q64r61J067j184J311j448J599j766J948k145K363k602
52a363K866l161L490l861M280m759N314n962O730p665Q829j0320J2312j5124J9428
67A1034k6907M3567j51946M8475J67427k00610O5545J57396q9530q8250J36522
78G2723k0975q0642Q9418L9307j20276J7304M5670q7384j4857R7163m2749o3015
90f8313O0819J5248o8269K0912L5446k3765J8936M7780j6662n860K8626m005j0079
103C0814R543k3323j5504J6089k8820m2733J7474K594k9367L0151L5130k4727
115b2679J2959M9350j8884k2670M1083L063l6677J7943J3535m3036p113K6561
$$ plain form
127 13435 -9017 -29215 -4201 -7011 -32160 -17674 -8816 -29067 -19179 6797 649 -1364 22864
140 22864 28037 18689 25361 30819 18427 9124 7361 -2679 -17111 -23334 -24832 -26827 -26818 -19507 -9203
155 -9203 -4238 2999 14363 15940 13252 20383 21151 10910 10879 12915 902 -4799 -444 -8761 -14676
170 -14676 -5262 -7535 -18633 -10724 -4341 -15380 -9740 7570 2531 519 18412 18616 6951 17575
184 17575 22486 5450 3040 8120 -9022 -19490 -9817 -15213 -26010 -13120 -4899 -12909 -4273 12074
198 12074 8477 7615 20047 17256 7011 11497 11698 -162 -1959 478 -7646 -11570 -7102 -9669 -12880
213 -12880 -8400 -6418 -7183 -3766 394 2475 6099 9330 10357 12991 13116 9704 8939 6889 -537 -4117
229 -4117 -5352 -12094 -16173 -11741 -12400 -14645 -7198 71 -833 3989 13058 11570 8890 14408 12549 4568
$$ packed form
127A3435k2452k0198K5014k810k5149J4486Q858k0251R888K5976o148k013K4228
140B2864N173r348O672N458j2392r303j763j0040j4432o223j498j995RP311J0304
155i203M965P237J1364J577k688P131P68j0241l1K036j2013n701M355q317n915
170a4676R414k273j1098P909O383j1039N640J7310n039k012J7893K04j1665J0624
184A7575M911j7036k410N080j7142j0468R673n396j0797J2890Q221q010Q636J6347
198A2074l597q62J2432k791j0245M486K01j1860j797K437q124l924M468k567l211
213a2880M480J982p65L417M160K081L624L231J027K634J25l412p65k050p426l580
229d117j235o742m079M432o59k245P447P269r04M822R069j488k680N518j859p981
$$ plain form
245 4568 5400 5406 -3143 -6336 -2708 -7135 -11932 -8006 -6812 -11042 -7881 -2323 -3291 -2280 5108 7316
261 7316 6344 10943 13447 10151 8780 9567 4644 -1726 -3657 -6558 -12043 -13541 -11644 -12093 -11015 -5619
277 -5619 -1376 798 5291 9551 10127 10288 11078 9754 6231 4319 2023 -1608 -3537 -4280 -7153 -8576
293 -8576 -7391 -7160 -8110 -6218 -2951 -2145 -347 2967 5388 6655 8478 9858 9287 8073 6857 3277
309 3277 -279 -2166 -4833 -8390 -9088 -8938 -9333 -8129 -5076 -2414 158 3093 5461 7148 7732 8045
325 8045 7586 6551 5037 2773 442 -1773 -3299 -4428 -5804 -6677 -7334 -5990 -5638 -4610 -2002 790
341 790 3031 3892 5378 6699 7250 6040 5237 4749 2406 -599 -2510 -3660 -4720 -5870 -6223 -5360 -4122
358 -4122 -3485 -2573 -216 1596 2812 3550 4731 5062 4636 4069 3714 2284 1360 -3 -2064 -3097 -3581
$$ packed form
245D568Q32Oq549l193L628m427m797L926J194m230L161N558r68J011P388K208
261G316r72M599K504l296j371P87m923o370j931k901n485j498J897m49J078N396
277e619M243K174M493M260N76J61P90j324l523j912k296l631j929p43k873j423
293h576J185K31r50J892L267Q06J798L314K421J267J823J380n71j214j216l580
309C277l556j887k667l557o98J50l95J204L053K662K572K935K368J687N84L13
325H045m59j035j514k264k331k215j526j129j376q73o57J344L52J028K608K792
341G90K241Q61J486J321N51j210q03m88k343l005j911j150j060j150l53Q63J238
358d122O37R12K357J812J216P38J181L31m26n67l55j430r24j363k061j033m84
$$ plain form
375 -3581 -4676 -5203 -4568 -3655 -2700 -1461 434 1567 2905 4677 4341 3874 4238 3310 1475 398 -6
392 -6 -1223 -3196 -3292 -2948 -3993 -3695 -2581 -1982 -1525 258 1235 1501 3052 4009 3602 3469 3598 2398 628
411 628 -231 -1007 -3100 -4134 -3433 -3995 -3855 -2799 -1302 -1076 1173 2765 3274 3651 4031 3295 2150 1533
429 1533 824 -782 -1231 -1484 -2595 -2584 -2555 -2651 -2212 -1489 -1224 -997 139 670 1366 2591 3180 2813 3544 3570
449 3570 1870 1576 1173 -1003 -2577 -2447 -4151 -5986 -3598 -2848 -4132 -1280 2130 891 2444 5877
465 5877 4516 3217 5342 4084 230 928 1137 -3150 -3739 -1126 -4458 -6116 -1868 -2329 -4565 -826
481 -826 1388 -955 1226 5011 2665 2064 5849 4402 1572 3175 3223 -2071 -2387 -840 -4827 -5852
497 -5852 -2688 -4020 -5548 -1537 -279 -1651 1612 4514 2514 3473 6096 3753 2120 3878 2018
$$ packed form
375c581j095n27O35R13R55J239J895J133J338J772l36m67L64r28j835j077m04
392fj217j973r6L44j045K98J114N99M57J783R77K66J551R57m07j33J29j200j770
411F28q59p76k093j034P01n62J40J056J497K26K249J592N09L77L80p36j145o17
429A533p09j606m49k53j111J1K9r6M39P23K65K27J136N31O96J225N89l67P31K6
449C570j700k94m03k176j574J30j704j835K388P50j284K852L410j239J553L433
465E877j361j299K125j258l854O98K09m287n89K613l332j658M248m61k236L739
481h26K214k343K181L785k346o01L785j447k830J603M8n294l16J547l987j025
497e852L164j332j528M011J258j372L263K902k000R59K623k343j633J758j860
$$ plain form
512 2018 -1301 -306 -495 -4144 -3551 -2785 -4739 -4259 -1796 -2547 -2359 655 972 857 3722 4628 3402 4272
530 4272 4783 1916 1716 1825 -1237 -2843 -1965 -3637 -5804 -3726 -3099 -4288 -1946 521 -377 1392 4193
547 4193 3053 3136 4871 3870 1225 1966 1678 -1799 -1748 -397 -3116 -4017 -1628 -2235 -3623 -1528 -765
564 -765 -1403 -345 1709 1723 1781 3176 3088 2507 2304 2378 1180 -129 -639 -1231 -2279 -2866 -2527 -2538 -3081 -2225
584 -2225 -258 -606 -16 2437 2291 1426 3274 3208 752 1047 2072 -490 -1466 316 -1577 -2911 -1144
601 -1144 -1044 -2610 -1464 127 -1200 -711 2098 925 508 2826 2304 311 1788 2108 -882 -582 -23
618 -23 -1860 -2182 -917 -1228 -2229 -231 70 -802 629 1840 464 1676 2479 423 406 1521 -297
635 -297 -618 294 -925 -1901 -364 -446 -1920 -454 239 -1244 -541 1427 196 -33 2323 1654 84 1990
$$ packed form
512B018l319R95j89l649N93P66j954M80K463p51J88L014L17j15K865R06j226Q70
530D272N11k867k00J09l062j606Q78j672k167K078O27j189K342K467q98J769K801
547D193j140Q3J735j001k645P41k88l477N1J351k719r01K389o07j388K095P63
564g65o38J058K054J4N8J395q8n81k03P4j198j309n10n92j048n87L39j1n43Q56
584b225J967l48N90K453j46q65J848o6k456K95J025k562r76J782j893j334J767
601a144J00j566J146J591j327M89K809j173m17K318n22j993J477L20k990L00N59
618b3j837l22J265l11j001J998L01q72J431J211j376J212Q03k056j7J115j818
635b97l21R12j219r76J537q2j474J466O93j483P03J968j231k29K356o69j570J906
$$ plain form
653 1990 1733 -494 37 629 -1818 -1938 -705 -1791 -2586 -866 -324 -1469 301 1887 703 1233 2709
670 2709 1909 1106 2109 857 -674 167 -717 -2153 -1810 -1505 -2261 -2031 -787 -679 -335 586 1161 1010
688 1010 1692 2071 1620 1919 1551 817 225 84 -668 -1458 -1433 -1955 -1918 -1551 -1836 -1235 -740 -311 159 602 1290
709 1290 1876 2042 2167 2124 1731 1332 591 -316 -550 -1362 -2037 -2148 -2153 -2655 -1944 -1644 -1297 -237 899 934 1470
730 1470 2312 2688 2257 2414 2276 940 506 -93 -1236 -1925 -1811 -2413 -2805 -2006 -1913 -1458 -414 -115 672
749 672 1203 1969 2343 2362 2553 2162 1580 1262 545 -407 -838 -1361 -2165 -2159 -2025 -2151 -1612 -1090 -569 52 602
770 602 1213 1536 1841 1868 1887 1806 1359 808 521 40 -565 -1069 -1136 -1853 -2209 -1788 -1469 -1568 -932 -153 164 625
792 625 1324 1973 2099 1977 1907 1293 895 498 -322 -1092 -1178 -1553 -1942 -1533 -1155 -1198 -799 -67 45 377 1004
$$ packed form
653A990k57k227N31N92k447j20J233j086p95J720N42j145J770J586j184N30J476
670B709q00q03J003j252j531Q41q84j436L43L05p56K30J244J08L44R21N75j51
688A010O82L79m51K99l68p34n92j41p52p90K5n22L7L67k85O01M95M29M70M43O88
709A290N86J66J25m3l93l99p41r07k34q12o75j11nn02P11L00L47J060J136L5N36
730A470Q42L76m31J57j38j336m34n99j143o89J14o02l92P99R3M55J044K99P87
749F72N31P66L74J9J91l91n82l18p17r52m31n23q04OJ34j26N39N22N21O21N50
770F02O11L23L05K7J9q1m47n51k87m81o05n04o7p17l56M21L19r9O36P79L17M61
792F25O99O49J26j22p0o14l98l97q20p70q6l75l89M09L78m3L99P32J12L32O27
$$ plain form
813 1004 1437 1146 1423 1393 1135 395 398 93 -500 -356 -697 -1030 -1008 -957 -877 -704 -549 90 160 441 548 938
835 938 984 1113 794 873 359 20 -125 -422 -573 -746 -819 -699 -438 -431 -303 -253 180 67 411 444 657 762 749
858 749 803 497 4 -182 -519 -677 -485 -678 -545 -410 -284 -13 -27 483 794 766 924 939 660 304 222 -360
880 -360 -611 -900 -897 -895 -951 -611 -346 27 -37 361 583 679 1052 1116 727 852 439 457 -119 -338 -411 -850 -876 -1184
904 -1184 -892 -1180 -775 -469 -255 91 330 511 975 1032 1247 999 1234 1174 264 38 -238 -541 -1340 -1311 -1180
925 -1180 -1296 -1190 -899 -962 -221 -59 495 919 1146 1174 1477 1550 1313 1039 812 -84 -376 -876 -1463 -1725 -1878
946 -1878 -1499 -1565 -1085 -502 40 363 1079 1323 1434 1706 1607 1387 1087 959 222 -170 -695 -914 -1686 -1355 -1396
967 -1396 -1263 -1121 -791 -998 -211 504 828 520 1141 1301 1437 1601 1513 1207 372 384 -161 -880 -1363 -1466 -2007
$$ packed form
813A004M33k91K77l0k58p40Ll05n93J44l41l33K2N1Q0J73J55O39P0K81J07L90
835I38M6J29l19P9n14l39j45k97j51j73p3J20K61PJ28N0M33j13L44L3K13J05j3
858G49N4l06m93j86l37j58J92j93J33J35J26K71j4N10L11k8J58J5k79l56q2n82
880c60k51k89LKn6L40K65L73o4L98K22R6L73O4l89J25m13J8n76k19p3m39k6l08
904a184K92k88M05L06K14L46K39J81M64N7K15k48K35o0r10k26k76l03p99K9J31
925a180j16J06K91o3P41J62N54M24K27K8L03P3k37k74k27q96k92n00n87k62j53
946a878L79o6M80N83N42L23P16K44J11K72r9k20l00j28p37l92n25k19p72L31m1
967a396J33J42L30k07P87P15L24l08O21J60J36J64q8l06q35J2n45p19m83j03n41
$$ plain form
988 -2007 -1664 -1543 -1391 -648 -264 288 1040 1265 1424 1444 1563 1103 1218 1228 215 -146 -63 -1026 -1140 -1200 -1213
1009 -1213 -1510 -1209 -812 -819 -82 345 398 724 1267 1088 1333 1197 1164 336 266 319 -519 -918 -770 -1049 -1238 -668
1031 -668 -964 -685 -78 -39 266 728 660 573 1074 889 322 545 516 264 115 125 -310 -547 -427 -600 -1070 -736
1053 -736 -365 -601 -194 288 378 177 846 1081 662 812 686 -95 -492 48 -903 -1005 -638 -905 -867 -174 146
1074 146 1 562 743 281 405 840 158 -117 112 -193 -443 -256 -404 -323 -144 122 -270 163 381 -221
1094 -221 172 396 394 104 516 355 79 233 273 -157 -146 -36 -488 -681 -397 -587 -441 -290 11 -60 345 906
1116 906 509 661 1167 436 217 517 33 -259 -239 -441 -846 -679 -551 -843 -628 -183 -345 -175 435 827
1136 827 853 1043 1211 994 1047 838 253 -90 64 -952 -1213 -1083 -1353 -1578 -1119 -709 -626 -92 685 783 1069
$$ packed form
988b007L43J21J52P43L84N52P52K25J59K0J19m60J15J0j013l61Q3r63j14o0j3
1009a213k97L01L97pP37M27N3L26N43j79K45j36l3q28p0N3q38l99J48k79j89N70
1031f68k96K79O07L9L05M62o8q7N01j85n67K23k9k52j49J0m35k37J20j73m70L34
1053g36L71k36M07M82R0k01O69K35m19J50j26p81l97N40r51j02L67k67L8O93L20
1074A46j45N61J81m62J24M35o82k75K29l05k50J87j48Q1J79K66l92M33K18o02
1094b21L93K24kk90M12j61k76J54M0m30J1J10m52j93K84j90J46J51L01p1M05N61
1116I06l97J52N06p31k19L00m84k92K0k02m05J67J28k92K15M45j62J70O10L92
1136H27K6J90J68k17N3k09n85l43J54j016k61J30k70k25M59M10Q3N34P77R8K86
$$ plain form
1157 1069 1531 1058 1146 1234 891 335 110 -271 -656 -735 -722 -1016 -1247 -822 -976 -1046 -464 -225 159 346 433 902
1179 902 1414 1233 1435 1118 743 405 -56 -20 -743 -845 -1211 -1563 -1434 -1187 -1178 -465 114 111 835 967 1238 1251
1201 1251 1212 1263 860 496 -63 -239 -682 -768 -757 -1495 -1223 -1138 -1030 -591 -396 -498 333 868 799 933 1173 1095
1223 1095 999 663 653 226 -426 -579 -892 -910 -934 -1120 -705 -389 -232 -314 -78 293 368 565 548 698 697 677 454
1246 454 457 338 90 -65 -417 -509 -827 -736 -745 -703 -519 -508 -315 30 261 513 736 861 662 434 358 63 133
1269 133 -297 -418 -290 -757 -508 -430 -474 -300 72 290 164 75 346 421 432 295 87 22 -185 15 -399 -61
1291 -61 -192 -34 -78 -135 -77 -51 71 -18 238 303 158 62 150 120 -52 -146 -18 -248 -524 -115 9 -143 -237 198
1315 198 144 238 325 529 414 231 223 377 100 -54 -95 96 -182 -300 -291 -532 -409 -555 -365 -158 149 203 394
$$ packed form
1157A069M62m73Q8Q8l43n56k25l81l85p9J3k94k31M25j54p0N82K39L84J87Q7M69
1179I02N12j81K02l17l75l38m61L6p23j02l66l52J29K47RP13N79lP24J32K71J3
1201A251l9N1m03l64n59j76m43q6J1p38K72Q5J08M39J95j02Q31N35o9J34K40p8
1223A095r6l36j0m27o52j53l13j8k4j86M15L16J57q2K36L71P5J97j7J50jk0k23
1246D54Lj19k48j55l52r2l18R1rM2J84J1J93L45K31K52K23J25j99k28p6k95P0
1269A33m30j21J28m67K49P8m4J74L72K18j26q9K71P5J1j37k08o5k07K00m14L38
1291f1j31J58m4n7N8K6J22q9K56O5j45r6Q8l0j72r4J28k30k76M09J24j52r4M35
1315A98n4R4Q7K04j15j83qJ54k77j54m1J91k78j18Rk41J23j46J90K07L07N4J91
$$ plain form
1338 394 503 403 540 742 661 395 174 -74 -402 -516 -667 -607 -797 -909 -557 -279 -261 478 242 93 729
1359 729 626 786 508 790 478 224 83 -244 -587 -498 -512 -639 -720 -393 -800 -513 -222 -195 286 326 554 472
1381 472 833 871 701 669 368 182 89 47 -582 -623 -807 -856 -761 -815 -279 -302 -256 101 626 439 1022 713 760 759
1405 759 534 599 113 66 -258 -549 -566 -869 -900 -637 -844 -609 -534 -70 238 415 801 836 634 1013 530 470
1427 470 110 -216 -113 -264 -546 -535 -273 -362 -490 -279 -284 -210 -117 55 63 183 103 411 427 480 236 430 257 366
1451 366 -47 -130 -318 -475 -498 -294 -381 -641 -648 -397 -121 134 431 140 368 405 491 605 106 -58 -69 -113 -236
1474 -236 -137 -360 -19 -181 -214 -221 -509 83 327 70 -86 105 144 129 -88 121 189 231 -159 30 -289 278 2
1497 2 -12 -185 -64 3 -7 84 -193 218 30 -135 -176 -309 -107 -29 69 15 -259 151 157 154 215 237 348 -74 231
$$ packed form
1338C94J09j00J37K02q1k66k21k48l28j14j51O0j90j12L52K78J8P39k36j49O36
1359G29j03J60k78K82l12k54j41l27l43Q9j4j27q1L27m07K87K91K7M81M0K28q2
1381D72L61L8j70l2l01j86r3m2o29m1j84m9R5n4N36k3M6L57N25j87N83l09M7j
1405G59k25O5m86m7l24k91j7l03l1K63k07K35P5M64L08J77L86L5k02L79m83o0
1427D70l60l26J03j51k82J1K62q9j28K11nP4R3J72QJ20q0L08J6N3k44J94j73J09
1451C66m13q3j88j57k3K04q7k60pK51K76K55K97k91K28L7Q6J14m99j64j1m4j23
1474b36R9k23L41j62l3pk88N92K44k57j56J91L9j5k17K09O8M2l90J89l19N67k76
1497Bj4j73J21O7j0R1k77M11j88j65m1j33K02P8R8n4k74M10OlO1K2J11m22L05
$$ plain form
1522 231 -135 -483 -129 -141 -118 -29 284 -388 -80 35 -290 -176 -58 -163 -7 302 249 38 284 199 279 338
1544 338 170 165 -186 190 -217 -170 -762 -548 -292 -557 -279 -153 73 298 418 458 692 433 349 407 160 -42
1566 -42 42 -34 -234 -158 -533 -183 -669 -337 -123 22 -15 -180 -78 265 276 128 441 596 409 285 442 -39
1588 -39 14 -26 -242 -142 -286 -570 -505 -372 -234 -402 -346 -164 145 -156 394 462 365 439 410 449 304 -12 19 26
1612 26 -228 -241 -665 -327 -596 -637 -116 -356 -230 -95 172 523 537 622 361 464 165 238 -174 291 -80 -289
1634 -289 -342 3 -106 -73 -236 -198 -115 -51 62 -185 258 361 153 504 372 359 247 537 376 185 11 118
1656 118 -177 -468 -263 -413 -467 -338 -217 -210 -262 -178 288 257 215 -25 140 312 207 260 213 120 -54 88 -151
1679 -151 -463 -332 -283 -519 -290 -89 -369 -138 106 80 60 96 154 127 456 150 311 206 45 37 -134 -26 87
$$ packed form
1522B31l66l48L54j2K3Q9L13o72L08J15l25J14J18j05J56L09n3k11K46q5Q0N9
1544C38j68nl51L76m07M7n92K14K56k65K78J26K26K25J20M0K34k59q4N8k47k02
1566d2Q4p6k00P6l75L50m86L32K14J45l7j65J02L43J1j48L13J55j87j24J57m81
1588c9N3m0k16J00j44k84O5J33J38j68N6J82L09l01N50O8r7P4k9L9j45l16L1P
1612B6k54j3m24L38k69m1N21k40J26J35K67L51J4Q5k61J03k99P3m12M65l71k09
1634b89n3L45j09L3j63L8Q3O4J13k47M43J03k08L51j32j3j12K90j61j91j74J07
1656A18k95k91K05j50n4J29J21Pn2Q4M66l1m2k40J65J72j05N3m7r3j74J42k39
1679a51l12J31M9k36K29K01k80K31K44k6k0L6N8k7L29l06J61j05j61qj71J08J13
$$ plain form
1702 87 -88 -77 -220 -375 -338 -482 -213 -167 11 73 1 311 341 308 533 267 314 120 111 -142 -264 -59 -236 -45
1726 -45 -105 -100 -278 -298 -137 -41 -249 26 184 64 -150 268 278 221 -86 144 -17 -86 -9 -127 -29 -66 -244 -17
1750 -17 -294 -12 -7 -111 -18 151 123 -188 93 146 297 35 339 459 372 191 19 292 -135 -235 -354 -121
1772 -121 -324 -354 -414 -393 -203 -197 -100 10 260 132 379 516 222 242 461 178 77 18 21 7 -14 -280 100 -310
1796 -310 -74 -133 -180 -333 -327 -229 196 174 40 458 126 314 556 -3 329 398 -127 318 -274 -253 -721 -437 -416
1819 -416 -15 -20 -151 -179 -166 138 1 250 424 128 237 243 308 219 313 -11 -253 -23 -269 -115 -167 -331 -467
1842 -467 -389 -185 -52 -110 -244 70 194 -126 577 130 439 358 36 256 91 283 -92 -35 -243 -298 -165 -414
1864 -414 -216 -670 -343 -155 101 73 85 311 240 525 516 270 298 165 4 -192 67 -295 -399 -339 -282 -272 -176
$$ packed form
1702H7j75J1j43j55L7j44K69M6J78O2p2L10L0l3K25k66M7j94rk53j22K05j77J91
1726d5o0Nj78k0J61R6k08K75J58j20k14M18J0n7l07K30j61o9P7j18R8l7j78K27
1750a7k77K82Nj04R3J69k8l11K81N3J51k62L04J20q7j81j72K73m27j00j19K33
1772a21k03l0o0K1J90OR7J10K50j28K47J37k94K0K19k83j01n9Lj4k1k66L80m10
1796c10K36n9m7j53OR8M25k2j34M18l32J88K42n59L32O9n25M45n92K1m68K84K1
1819d16M01nj31k8J3L04j37K49J74k96J09OO5q9R4l24k42K30k46J54n2j64j36
1842d67P8K04J33n8j34L14J24l20P03m47L09q1l22K20j65J92l75N7k08n5J33k49
1864d14J98m54L27J88K56k8J2K26p1K85rk46K8j33j61j96K59l62j04O0N7J0R6
$$ plain form
1887 -176 -64 82 -176 60 60 123 5 285 250 65 207 -40 -10 -191 27 61 82 -48 -246 -571 -340 49
1909 49 -110 -156 -54 -177 124 18 94 531 471 565 228 464 -85 21 81 -117 -255 -36 -231 -411 -268 -41
1931 -41 -49 -67 110 -31 301 217 348 283 384 363 -65 370 123 -67 1 -198 -200 -402 -425 -214 -63 -71 -247 94
1955 94 280 36 83 -17 28 411 103 71 164 87 -1 -25 21 273 123 264 -48 -99 -98 75 -174 -248 -112 78
1979 78 -43 -43 184 399 138 297 10 43 -8 70 269 -153 -242 95 -176 49 93 -218 -6 -43 213 -279 -45
2002 -45 -406 11 -63 38 -184 240 -34 246 115 406 437 109 13 -79 -179 -601 -133 -85 6 -440 -177 -167 -75
2025 -75 -60 -74 180 27 161 -1 235 93 228 124 -134 276 -76 -258 113 -314 -124 -190 -60 -93 -229 -77
2047 -77 -141 120 60 357 -57 183 379 346 78 154 149 401 30 129 -156 -177 -98 -339 -249 -345 -56 -119 139 -33
$$ packed form
1887a76J12J46k58K36%O3j18K80l5j85J42k47L0j81K18L4K1j30j98l25K31L89
1909D9j59m6J02j23L01j06P6M37o0R4l37K36n49J06O0j98j38K19j95j80J43K27
1931d1qj8J77j41L32q4J31o5J01k1m28M35k47j90O8j99kk02k3K11J51qj76L41
1955I4J86k44M7j00M5L83l08l2R3p7q8k4M6K52j50J41l12n1JJ73k49p4J36J90
1979G8j21%K27K15k61J59k87L3n1P8J99m22q9L37k71K25M4l11K12l7K56m92K34
2002d5l61M17p4J01k22M24k74K80j31K91L1l28r6r2j00m22M68M8R1m46K63J0R2
2025g5J5j4K54j53J34j62K36j42J35j04k58M10l52j82L71m27J90o6J30l3j36J52
2047g7o4K61o0K97m14K40J96l3k68P6nK52l71R9k85k1P9k41R0r6K89o3K58j72
$$ plain form
2071 -33 235 -13 378 319 248 579 264 509 324 306 -104 -186 -325 -275 -396 -297 -251 -187 -15 -2 80 156 207 258 307
2096 307 282 464 275 251 283 -34 -138 1 -226 -129 -336 -95 -463 -514 46 -477 -23 -305 11 -14 134 114
2118 114 235 395 133 386 130 261 -82 52 -32 -111 -220 -458 -197 -308 -84 -241 -8 32 -12 91 278
2139 278 -23 330 406 305 379 -10 118 -115 -334 -203 63 1 -106 -93 -38 -360 0 -74 -48 -186 19 82 194
2162 194 256 25 159 4 141 108 109 -93 63 -158 -119 42 -84 -19 -148 -36 6 -34 112 -109 -136 428 181
2185 181 -6 461 383 290 152 -204 37 -140 -306 -62 -253 -88 85 -75 -201 -131 32 -34 -69 23 223 92
2207 92 75 197 -131 65 111 123 224 153 187 194 -2 -91 -137 94 -233 -253 -418 -93 -116 -121 98 133 -87 51 7
2232 7 134 350 305 133 104 -55 -40 -385 -39 -123 -311 30 -640 204 -106 185 -27 -168 -51 54 47 42 66 169
$$ packed form
2071c3K68k48L91n9p1L31l15K45j85j8m10q2j39N0j21R9M6O4J72J3Q2P6N1N1M9
2096C07k5J82j89k4L2l17j04J39k27R7k07K41l68n1N60n23M54k82L16k5J48k0
2118A14J21J60k62K53k56J31l43J34q4p9j09k38K61j11K24j57K33M0m4J03J87
2139B78l01L53P6j01P4l89J28k33k19J31K66o2j07J3N5l22L60p4K6j38K05O3J12
2162A94O2k31J34j55J37l3Jk02J56k21L9J61j26O5j29J12M2m0J46k21k7N64k47
2185A81j87M67p8r3j38l56K41j77j66K44j91J65J73j60j26P0J63o6l5R2K00j31
2207I2j7J22l28J96M6J2J01p1L4Pj96q9m6K31l27k0j65L25k3nK19L5k20J38m4
2232GJ27K16m5j72k9j59J5l45L46q4j88L41o70Q44l10K91k12j41J17J05pnK4J03
$$ plain form
2256 169 152 30 189 106 41 271 -75 1 -293 -129 -244 -140 -198 -347 -233 -118 231 126 274 78 -25 475
2278 475 264 194 141 190 202 195 -23 -154 -238 -11 -6 -184 -367 -45 -292 -115 71 7 -117 -76 237 91 135 83
2302 83 41 384 -19 -136 -64 -45 -35 -165 -137 37 -254 -34 24 -8 47 -67 269 -20 152 104 445 121 432
2325 432 136 -116 45 47 -181 98 -234 -514 -382 -272 -157 141 -190 152 -234 199 275 -3 50 253 201 144
2347 144 154 -68 -375 40 -186 -319 -263 -18 -67 -176 -316 -49 -2 19 -15 -10 218 251 -72 113 57 260 -14
2370 -14 163 68 -130 -376 -35 -141 -436 -119 -73 20 -143 133 -19 122 173 77 131 206 -242 62 383 -258 232
2393 232 -180 -79 31 -337 48 -3 -216 -269 -1 -189 90 65 -88 79 -117 140 185 24 22 -32 2 15 -33
2416 -33 125 118 16 30 -16 226 -51 -83 13 205 -130 -6 57 -187 -30 -89 -192 -7 410 -374 336 188 199
$$ packed form
2256A69j7j22J59q3o5K30l46P6k94J64j15J04n8j49J14J15L49j05J48j96j03N00
2278D75k11p0n3M9J2pk18j31q4K27Nj78j83L22k47J77J86o4j24M1L13j46M4n2
2302H3m2L43m03j17P2J9J0j30K8J74k91K20N8l2N5j14L36k89J72m8L41l24L11
2325D32k96k52J61Kk28K79l32k80J32J10J15K98l31L42l86M33P6k78N3K03n2n7
2347A44J0k22l07M15k26j33N6K45m9j09j40K67M7K1l4NK28L3l23J85n6K03k74
2370a4J77r5j98k46L41j06k95L17M6R3j63K76j52J41N1r6N4P5m48L04L21o41M90
2393B32m12J01J10l68L85n1k13n3K68j88K79k5j53J67j96K57M5j61kn4L4J3m8
2416c3J58pj02J4m6K42k77l2R6J92l35J24O3k44J57n9j03J85M17p84P10j48J1
$$ plain form
2439 199 91 -108 24 -82 -493 -335 -356 -89 -176 57 14 -168 -65 104 -154 5 95 321 15 129 121 29
2461 29 197 31 371 -7 -240 5 -69 -122 -331 -151 -241 -128 -78 -64 275 61 235 66 264 -74 71 219
2483 219 47 311 55 -130 128 -111 -309 -228 -242 -433 -168 -48 -90 -21 -136 104 293 396 184 35 -20 109
2505 109 200 -66 -6 -206 -123 -197 -252 108 130 -147 -191 68 -41 164 179 134 147 158 114 61 -72 194 -27 -185
2529 -185 -44 -165 -168 -143 -215 -260 -549 -176 -111 -99 214 -29 33 59 374 253 196 171 106 89 192 117 -30 27 73
2554 73 43 -195 -123 -171 16 87 117 -117 414 336 133 32 235 -15 56 362 -388 -58 -90 52 -120 16 -271
2577 -271 -27 -75 -32 -83 -362 166 -64 -8 -45 -157 122 56 -60 292 304 145 5 208 -322 -323 307 -373 77
2600 77 -263 -212 6 -49 -2 -52 36 -174 226 169 138 192 212 205 45 77 -96 140 72 22 17 274 -90 -105 -399 -107
$$ packed form
2439A99j08j99J32j06m11J58k1K67q7K33m3j82J03J69k58J59R0K26l06J14qr2
2461B9J68j66L40l78k33K45p4n3k09J80r0J13N0J4L39k14J74j69J98l38J45J48
2483B19j72K64k56j85K58k39j98Q1j4j91K65J20m2O9j15K40J89J03k12j49n5J29
2505A09R1k66O0k00Q3p4n5L60K2k77m4K59j09K05J5m5J3J1m4n3j33K66k21j58
2529a85J41j21lK5p2m5k89L73O5J2L13k43O2K6L15j21n7k5o5j7J03p5j47N7M6
2554G3l0k38P2m8J87P1L0k34N31p8k03j01K03k50P1L06p50L30l2J42j72J36k87
2577b71K44m8M3n1k79N28k30N6l7j12K79o6j16L52J2j59j40K03n30jO30o80M50
2600G7l40N1K18n5M7n0Q8k10M00n7l1N4K0pj60L2j73K36o8n0nK57l64j5k94K92
$$ plain form
2626 -107 -333 -171 -12 -71 26 -97 38 204 212 270 286 28 132 70 113 5 -141 -194 -18 39 -311 -57 -241
2649 -241 -221 27 214 -23 -27 60 -310 208 116 101 7 62 -184 -6 -96 33 69 18 119 102 -438 -250 178 -226
2673 -226 115 -165 134 -122 -142 400 197 508 75 20 -120 -10 97 190 -215 126 7 -34 -348 -347 -113 -247
2695 -247 -199 -204 141 39 85 -123 8 -42 444 180 86 231 -230 16 -103 -167 -77 -197 -104 9 -257 -223 399
2718 399 -119 -4 -96 138 63 409 221 267 141 -18 302 273 264 100 56 -93 -39 -97 -429 -462 -146 -341 -110
2741 -110 1 1 269 170 -13 -103 75 285 215 174 210 254 -47 -18 -137 -158 -363 6 -2 76 -211 -210 -200 -5 56 -78
2767 -78 241 -35 34 111 107 200 -40 -47 -172 -131 162 -74 -90 -139 45 -70 67 -201 -50 -46 -165 -15 101 50 136
2792 136 -4 -27 187 55 -30 4 208 -65 -308 195 -126 5 -351 -111 -15 75 -30 -117 10 -137 -4 372
$$ packed form
2626a07k26J62J59n9R7j23J35J66QN8J6k58J04o2M3j08j46n3J76N7l50K54j84
2649b41K0K48J87k37mQ7l70N18r2j5r4N5k46J78r0J29L6n1J01j7n40J88M28m04
2673b26L41k80K99k56k0N42k03L11m33n5j40J10J07R3m05L41j19m1l14JK34j34
2695b47M8nL45j02M6k08J31n0M86k64r4J45m61K46j19o4R0j20R3J13k66L4O22
2718C99n18J15r2K34p5L46j88M6j26j59L20k9rj64m4j49N4n8l32l3L16j95K31
2741a10J11%K68r9j83r0J78K10p0m1L6M4l01K9j19k1k05L69qP8k87JJ0J95O1j34
2767g8L19k76O9P7mR3k40pj25M1K93k36j6m9J84j15J37k68J51Mj19J50J16n1Q6
2792A36j40k3K14j32q5L4K04k73k43N03l21J31l56K40R6R0j05q7J27j47J33L76
$$ plain form
2814 372 36 -310 55 279 139 27 42 -367 -7 208 -161 -153 -46 -52 -210 2 -93 -80 -75 33 91 -60 39 77
2838 77 110 -242 -33 43 -178 218 76 134 32 -342 -144 -329 -305 -246 -39 -157 2 185 83 -90 -186 26
2860 26 -206 129 16 168 86 172 -84 -259 -56 98 -81 -238 26 -198 -30 -178 -142 -302 5 -3 -256 -180
2882 -180 30 167 4 -7 177 159 6 -208 -255 -3 -128 30 -57 -16 -308 77 0 -99 141 122 152 114 174 185
2906 185 263 -35 109 20 27 -497 -369 -341 24 19 -336 220 -301 41 -118 247 -66 -103 123 143 309 24 141
2929 141 180 139 254 12 49 199 -45 174 -48 -124 -262 -90 -78 164 -25 -2 85 -171 36 103 106 37 157 -89
2953 -89 -67 -58 -12 -6 -129 -216 -180 -323 5 -179 97 -173 -20 -233 -214 298 197 49 63 236 79 236 123 -55
2977 -55 -63 -57 -71 101 -91 -27 391 -78 -237 -158 -203 -246 -99 52 49 236 135 92 -277 106 -123 256 69 -389
$$ packed form
2814C72l36l46L65K24j40j12J5m09L60K15l69QJ07oj58K12r5J3NJ08N8j51R9L8
2838G7L3l52K09P6k21L96j42N8j02l74J98j85K4N9K07j18J59J83j02j73r6K12
2860B6k32L35j13J52q2Q6k56j75K03J54j79j57K64k24J68j48L6j60L07qk53P6
2882a80K10J37j63j1J84j8j53k14m7K52j25J58q7M1k92L85p7r9K40j9L0l8O0J1
2906A85P8k98J44q9Pn24J28K8L65nl55N56n21L42j59L65l13l7K26K0J66k85J17
2929A41L9m1J15k42L7J50k44K19k22p6j38J72J2K42j89K3Q7k56K07O7Lo9J20k46
2953h9K2RM6Oj23q7L6j43L28j84K76k70J53k13J9N12j01j48J4J73j57J57j13j78
2977e5qOj4J72j92O4M18m69j59P9m5m3J47J51lJ87j01m3l69L83k29L79j87m58
$$ plain form
3001 -389 -149 131 16 180 29 199 24 -41 24 -25 -17 -16 151 -39 -3 184 200 160 -92 -118 113 -217 -165 286
3025 286 -89 -188 -105 133 -162 -55 27 -234 31 228 78 -207 -50 19 120 77 42 199 -17 186 -69 -230
3047 -230 9 -50 130 31 -133 -52 106 210 156 95 -12 105 162 112 103 69 2 -35 11 119 -113 -46 90 227 149
3072 149 -40 -136 -65 89 -67 -2 147 -226 269 -254 247 150 73 63 90 88 85 -117 98 117 -204 -118 -14 -174
3096 -174 127 -41 -371 56 -131 25 140 77 86 188 32 47 -59 118 215 142 329 -186 -162 -18 -103 -228 -77
3119 -77 -70 -61 -329 -244 295 113 330 -159 86 111 165 256 138 32 -27 52 76 -11 -337 -13 -94 -17 132 249 -16
3144 -16 -246 -180 127 -176 126 -64 155 88 134 215 -76 185 -19 162 -113 -119 138 94 -300 -139 -228 -32 -26 260
3168 260 99 -122 51 68 132 -74 -74 -68 79 3 17 6 -252 -200 103 -183 -49 328 -184 24 -7 142 6 184
$$ packed form
3001c89K40K80j15J64j51J70j75o5O5m9QJJ67j90L6J87J6m0k52k6K31l30N2M51
3025B86l75r9Q3K38k95J07Q2k61K65J97j50k85J57O9J01m3l5J57k16K03k55j61
3047b30K39n9J80r9j64Q1J58J04n4o1j07J17N7n0rl4o7l7M6J08k32O7J36J37p8
3072A49j89r6P1J54j56O5J49l73M95n23N01r7p7j0K7klk02K15J9l21Q6J04j60
3096a74L01j68l30M27j87J56J15o3RJ02j56J5j06J77R7p3J87n15K4J44q5j25J51
3119g7PRk68Q5N39j82K17m89K45K5N4R1j18j06n9P9K4q7l26L24q1P7J49J17k65
3144a6k30O6L07l03L02j90K19o7M6Q1k91K61k04J81k75oK57m4l94J61q9J96OK86
3168B60j61k21J73J7O4k06%OJ47p6J4j1k58N2L03k86J34L77n12K08l1J49j36J78
$$ plain form
3192 184 -91 148 12 163 12 -56 121 113 40 284 197 156 -139 -116 -286 17 12 -249 -270 -143 -239 239 2 177
3216 177 22 -164 302 174 -151 4 -127 -68 17 11 -134 69 170 -149 -137 -101 -100 90 -72 -280 6 48 79
3239 79 2 -86 -138 153 122 -126 149 -72 -107 -45 -21 -9 92 -34 -114 -68 -130 169 35 -22 59 273 206 106 96
3264 96 205 -105 1 -73 86 234 201 -114 -288 -285 -340 -131 64 -133 243 6 -14 238 -239 69 -76 -8 95
3287 95 -78 94 121 -146 -116 -52 21 -167 155 -296 -161 -143 -54 159 -68 -134 -156 -68 103 69 74 -166 255 251 4
3312 4 264 110 13 206 3 138 16 47 -131 29 6 -48 108 180 85 86 198 -9 225 -199 91 80 112 78
3336 78 1 -104 -59 60 -150 -95 -10 -7 -77 -64 54 255 -52 -188 191 -175 372 92 -23 48 61 22 46 -107
3360 -107 25 56 202 -157 -254 -165 167 33 41 32 -47 -112 -35 208 -23 -104 -30 8 -51 -94 36 -114 -132 11 -108
$$ packed form
3192A84k75K39j36J51j51o8J77qp3K44q7m1k95K3j70L03nk61k1J27r6M78k37J75
3216A77j55j86M66j28l25J55j31N9Q5oj45K03J01l19J2L6JJ90j62k08K86M2L1
3239G9p7q8n2K91l1k48K75k21l5O2K4J2J01j26q0M6o2K99j34n7Q1K14o7j00j0
3264I6J09l10J06p4J59J48l3l15j74Ln5K09J95j97L76k37k0K52m77L08j45O8J03
3287I5j73J72K7k67L0O4P3j88L22m51J35J8Q9K13k27o6k2Q8J71l4Nk40M21mk47
3312DK60j54r7J93k03J35j22L1j78J60k3n4J56P2r5JJ12k07K34m24K90j1L2l4
3336G8p7j05M5J19k10N5Q5Lp0J3J18K01l07j36L79l66N47k80j15P1J3l9K4j53
3360a07J32L1J46l59r7Q9L32j34Qrp9o5P7K43k31q1P4L8n9m3J30j50j8J43j19
$$ plain form
3385 -108 16 -324 -160 21 229 -123 107 -93 41 101 305 50 247 359 208 19 124 31 -32 61 59 218
3407 218 -24 -77 -75 57 146 11 -165 -50 121 -201 138 101 112 269 183 153 -398 318 16 20 62 -93 -197 -308
3431 -308 -45 12 -247 19 130 -74 202 114 98 160 -129 -93 403 -139 36 35 -93 59 -129 16 -209 68
3453 68 -164 -288 -32 -253 126 28 -151 152 306 -203 280 258 166 5 -9 189 96 25 139 -142 -207 -122 190
3476 190 372 -12 23 16 187 38 65 129 50 299 165 -8 89 200 21 -54 -30 -236 -114 -47 -153 -67 -462 70
3500 70 -170 306 -145 241 -76 -223 163 -169 435 -151 100 269 34 -28 -265 40 -40 245 -24 -387 -20
3521 -20 -119 66 -201 -179 12 -215 123 114 -107 246 -221 83 149 61 24 -239 68 -48 -49 -199 -95 144 -10
3544 -10 26 173 -47 -322 14 -13 -59 289 -229 127 -95 -138 155 82 -39 218 -18 -48 -60 -164 -356 84 -42
$$ packed form
3385a08J24l40J64J81K08l52K30k00J34O0K04k55J97J12j51j89J05r3o3R3kJ59
3407B18k42n3KJ32Q9j35j76J15J71l22L39l7J1J57q6l0n51P16l02MM2j55j04j11
3431c08K63N7k59K66J11k04K76q8j6O2k89L6M96n42J75jj28J52j88J45k25K77
3453F8k32j24K56k21L79r8j79L03J54n09M83k2r2j61j4J98r3p1J14k81o5Q5L12
3476A90J82l84L5pJ71j49K7O4p9K49j34j73R7J11j79p5K4k06J22O7j06Q6l95N32
3500G0k40M76m51L86l17j47L86l32O04n86K51J69k35o2k37L05q0K85k69l63L67
3521b0r9J85k67K2J91k27L38rk21L53m67L04O6q8l7k63L07j16jj50J04K39j54
3544a0L6J47k20k75L36k7m6L48n18L56k22m3K93p3j21K57k36l0j2j04j92M40j26
$$ plain form
3567 -42 257 -103 -240 75 -16 -44 -4 -74 238 107 -66 -17 -330 3 -64 128 41 -314 -206 -1 -226 -1 164
3590 164 326 -110 29 45 148 34 -54 -20 -232 307 324 90 -95 -112 -107 176 -35 39 -13 -27 55 34 -297 -36
3614 -36 -468 -56 110 -81 239 239 99 35 -269 -15 226 314 -46 -44 -72 90 -129 122 -136 -166 -100 238 96
3637 96 77 -139 -153 95 124 -27 -20 168 -92 128 174 -111 43 162 -83 -349 -6 -16 -171 -46 -326 26 -137
3660 -137 95 -86 -107 174 -102 97 -69 92 188 -149 61 48 -244 102 -110 264 79 243 -30 -55 111
3681 111 93 -314 -34 -236 56 105 121 151 -222 -88 -45 206 -7 116 28 8 -326 58 155 -52 -213 -109 91
3704 91 146 -244 -306 -15 5 73 -84 -495 10 -208 354 249 -12 161 -116 132 24 75 -76 -140 29 -21 -188
3727 -188 75 -43 39 -34 -73 -70 486 -86 -11 91 204 181 26 114 -86 255 -193 -98 -128 -156 25 34 31 15 219
$$ packed form
3567d2K99l60j37L15r1k8M0p0L12j31j73M9l13L33o7J92q7l55J08K05k25K25J65
3590A64J62m36J39J6J03j14q8L4k12N39J7k34j85j7NK83k11P4n2j4Q2k1l31K61
3614c6m32M12J66j91L20%j40o4l04K54K41Q8l60Kk8J62k19K51k58l0O6L38j42
3637I6j9k16j4K48K9j51PJ88k60K20M6k85J54J19k45k66L43j0j55J25k80L52j63
3660a37K32j81k1K81k76J99j66J61R6l37K10j3k92L46k12L74j85J64k73k5J66
3681A11j8m07K80k02K92M9J6L0l73J34M3K51k13J23q8k0l34L84R7k07j61J04K00
3704I1N5l90o2K91K0O8j57m11N05k18N62j05k61J73k77K48j08N1j51o4J69n0j67
3727a88K63j18Q2p3l9LN56n72P5J02J13k3j55Q8k00L41m48R5l0k8J81Rlj6K04
$$ plain form
3752 219 -140 142 -68 57 2 80 -93 -46 173 -32 212 16 184 77 -108 406 -277 -109 -219 10 -186
3773 -186 1 4 5 183 -120 200 174 251 198 250 218 40 -38 -51 -80 -180 -48 -74 -4 -150 304 -9 47 112 -52
3798 -52 145 161 134 10 290 83 111 221 56 -68 -41 -105 -192 -69 -92 154 -56 -74 24 -179 142 -466 -47
3821 -47 51 207 -37 33 66 101 124 237 29 -118 -96 -107 -58 -290 -242 28 -129 -60 -104 170 -16 60 12 -137 -120
3846 -120 20 80 -116 4 5 -45 91 152 149 123 -146 -84 102 160 32 -47 -149 -36 -51 -177 207 109 -56 -133 -20
3871 -20 -74 206 52 169 -4 11 -74 30 -46 20 -63 -246 29 65 -11 164 -17 -146 201 -247 -68 -58 -283
3894 -283 26 -116 174 3 284 -108 90 -26 -9 -3 -91 -13 -43 -141 -22 185 226 -54 16 45 164 -85 270
3917 270 102 121 -189 -64 -253 -55 -8 -149 -286 -124 69 -33 16 -8 52 71 -117 -65 29 145 78 89 -13
$$ packed form
3752B19l59K82k10J25n5P8j73M7K19k05K44j96J68j07j85N14o83J68j10K29j96
3773a86J87LJJ78l03L20k6P7n3N2l2j78p8j3k9j00J32k6P0j46M54l13N6O5j64
3798e2J97J6k7j24K80k07K8J10j65j24K7o4q7J23k3K46k10j8R8k03L21o08M19
3821d7R8J56k44P0L3L5K3J13k08j47K2j1M9k32M8K70j57O9m4K74j86P6m8j49J7
3846a20J40O0j96J20Jn0J36O1lk6k69O2J86N8j28p9j02J13j5j26L84r8j65p7J13
3871b0n4K80j54J17j73J5q5J04p6O6q3j83K75L6p6J75j81j29L47m48J79J0k25
3894b83L09j42K90j71K81l92J98j16J7Oq8P8l0r8J19K07M1k80P0K9J19k49L55
3917B70j68J9l10J25j89J98M7j41j37J62J93j02M9k4O0J9j88N2R4J16o7J1j02
$$ plain form
3940 -13 -181 -68 -22 17 -194 29 -88 -142 165 -65 38 -130 87 114 128 210 -261 -154 -53 -88 -174 1 -59
3963 -59 73 145 221 52 -219 -70 -69 38 106 114 53 -119 -39 142 -54 -84 -203 -2 293 38 20 355 94 -87
3987 -87 -254 17 60 -117 -48 -169 -63 25 -179 135 -270 56 333 7 282 65 -208 -6 156 154 -85 -196
4009 -196 -11 -32 -183 85 -121 -7 -106 -45 -31 -344 -76 -152 -6 49 239 227 279 84 203 -85 -63 -3 -7 -141
4033 -141 -134 6 -70 -57 -5 92 -108 71 -118 -198 -121 128 -107 282 -147 -146 165 -279 -48 31 206 -29 -113 -56
4057 -56 197 219 127 -32 -67 27 -142 200 45 193 -179 -95 -108 21 60 202 -82 -28 179 139 155 -108 122 -76
4081 -76 -104 0 -99 -25 48 126 156 106 -86 313 227 100 148 -206 239 -349 -135 -201 -154 -79 -85 9 -62 -103 -38 177
4107 177 5 59 69 172 45 294 -55 -143 -164 -105 5 -91 136 -20 50 -31 23 72 21 -173 218 56 -174 -203
$$ packed form
3940a3j68J13M6L9k11K23j17n4L07k30J03j68K17K7J4Q2m71J07J01l5q6J75o0
3963e9J32P2P6j69k71J49JJ07O8Qo1j72Q0J81j96l0j19K01K95k55j8L35k61j81
3987h7j67K71M3j77O9j21J06Q8k04L14m05L26K77l26K75k17k73K02J62kk39j11
4009a96J85k1j51K68k06J14r9O1J4l13K68p6J46N5J90j2N2j95J19k88K2O0mj34
4033a41PJ40p6J3N2R7k00J79j89q0P7K49k35L89m29JL11m44K31P9J75k35q4N7
4057e6K53K2r2j59l5R4j69L42j55J48l72Q4j3J29L9J42k84N4K07m0J6k63K30j98
4081g6k8J04r9P4P3P8L0n0j92L99q6j27M8l54M45n88K14o6M7P5oR4p1m1O5K15
4107A77j72N4J0J03j27K49l49q8k1N9J10r6K27j56P0q1N4M9n1j94L91j62k30k9
$$ plain form
4131 -203 205 -123 -70 26 -160 186 -193 206 -13 -23 -51 -138 -89 10 309 -212 -36 -380 -414 -278 -61 -209 40
4154 40 27 242 -101 71 -87 124 112 26 -76 233 -71 32 166 -55 150 -164 -7 -187 -202 -47 25 -153
4176 -153 88 14 -207 308 343 -140 199 -34 -274 -83 -160 -28 -86 36 45 12 80 -73 -34 -161 21 28 -59 -13
4200 -13 153 387 108 -82 -79 -33 27 -173 -32 72 -111 -35 118 147 -354 -186 -22 -55 38 -146 -118 233 75
4223 75 -141 242 101 -8 -30 84 -59 -221 -265 42 -174 -55 -212 66 -39 55 -50 -159 -61 46 -280 40
4245 40 162 28 160 325 195 -29 285 250 102 147 -87 143 -103 32 9 129 122 -185 -293 195 -203 -21
4267 -21 36 3 57 -60 -95 -118 -75 147 -274 -131 74 344 31 -63 155 -64 18 13 183 36 52 7 -5 -22 127
4292 127 -88 227 77 231 34 7 223 63 40 -69 -63 88 -283 -16 72 -63 39 -76 0 -43 133 56 80
$$ packed form
4131b03M08l28N3R6j86L46l79L99k19j0k8q7M9R9K99n21J76l44l4J36K17j48K49
4154D0j3K15l43J72j58K11j2q6j02L09l04J03J34k21K05l14J57j80j5J55P2j78
4176a53K41p4k21N15L5m83L39k33k40J91p7J32n8J22Rl3O8j53L9j27J82Pq7M6
4200a3J66K34k79j90LM6O0k00J41J04j83P6J53K9n01J68J64l3R3j84K8L51j58
4223G5k16L83j41j09k2J14j43j62m4L07k16J19j57K78j05R4j05j09R8J07l26L20
4245D0J22j34J32J65j30k24L14l5j48M5k34K30k46J35k3J20pl07j08M88l98J82
4267b1N7l3N4j17l5k3M3K22m21J43K05K70l13r4K18k19Q2nJ70j47J6m5j2j7J49
4292A27k15L15j50J54j97k7K16j60k3j09OJ51l71K67Q8j35J02j15P6m3J76p7K4
$$ plain form
4315 80 -81 138 101 -153 232 106 280 112 -48 97 -71 -113 159 75 128 135 -123 26 261 -42 -74 172 326
4338 326 -131 224 300 47 -48 27 40 247 45 149 100 12 -237 -218 -50 161 37 97 -234 232 27 124 -36
4361 -36 -211 150 25 104 18 243 -138 119 -22 207 -156 -353 -109 57 -198 -193 285 -251 -100 -25 -284 -4
4383 -4 -72 -149 71 -125 -16 -91 124 25 126 -137 -139 88 -90 -87 -134 -76 -275 125 76 -56 -132 -46 -98 13 286
4408 286 -4 118 149 103 11 74 -404 -55 -125 44 111 -73 -119 151 -425 -208 -61 -492 29 -195 37 147
4430 147 110 -1 41 -60 95 -122 -18 -322 3 -105 67 47 45 1 270 -84 106 -131 97 8 -87 -66 158
4453 158 -29 -48 47 69 82 -56 46 -165 168 -12 -74 106 259 -69 77 50 81 124 -80 143 -111 -46 248
4476 248 -133 -49 -101 -27 -46 -9 145 -119 58 -189 -201 -263 121 -103 -220 -70 -54 46 -77 14 143 -113 -24
$$ packed form
4315H0j61K19l7k54L85j26J74j68j60J45j68m2K72q4N3Pk58J49K35l03l2K46J54
4338C26m57L55P6k53r5P5J3K07k02J04m9q8k49J9J68K11j24O0l31M66k05R7j60
4361c6j75L61j25P9q6K25l81K57j41K29l63j97K44J66k55NM78n36J51P5k59K80
4383do8p7K20j96J09p5K15r9J01k63kK27j78Lm7N8j99M00m9j32p6Q6n2J11K73
4408B86k90J22L1m6r2O3m78L49p0J69O7j84m6K70n76K17J47m31N21k24K32J10
4430A47l7j11M2j01J55k17J04l04L25j08J72k0km4K69l54J90k37K28q9r5K1K24
4453A58j87j9R5K2J3j38J02k11L33j80o2J80J53l28J46k7L1M3k04K23k54O5K94
4476B48l81Q4n2P4j9L7J54k64J77k47j2o2L84k24j17J50J6J00j23R1J29k56Q9
$$ plain form
4499 -24 148 16 52 71 -25 9 -112 70 121 7 -156 0 -150 -42 48 83 -47 103 88 32 182 -141 320
4522 320 233 -84 32 -74 -278 -23 203 229 -72 -147 -49 30 -53 144 547 -78 28 69 70 8 -13 -155 -16 46
4546 46 -149 -87 118 -83 -44 57 -339 -6 -99 430 -71 223 29 34 171 41 71 -99 -163 49 140 345 67
4569 67 -157 -171 -251 -236 -64 -13 32 -105 -15 245 229 -132 63 -108 -78 -165 265 -54 -194 9 -108 191 5
4592 5 39 -134 -124 123 73 -113 192 16 102 3 -15 169 239 176 377 -224 -240 -220 -85 -76 16 -270 -41 -127 -406
4617 -406 106 248 -77 143 -21 48 -8 199 14 -77 11 93 150 -207 159 -3 -148 89 -319 -160 110 -370
4639 -370 79 -134 28 188 -347 -21 -96 82 -248 44 7 190 -150 6 242 -69 104 250 16 -142 -36
4660 -36 90 -12 -17 56 82 212 -73 210 130 34 -31 106 -98 278 -1 18 8 -95 -11 94 -127 24 79 -142
$$ packed form
4499b4J72j32L6J9r6L4j21J82N1j14j63J56j50J08R0L5j30J50j5n6J50l23M61
4522C20q7l17J16j06k04K55K26K6l01p5R8P9q3J97M03o25J06M1Jo2k1j42J39O2
4546D6j95O2K05k01L9J01l96L33r3N29n01K94j94NJ37j30L0j70o4K12R1K05k78
4569F7k24j4q0J5J72N1M5j37R0K60j6l61J95j71L0q7M30l19j40K03j17K99j86
4592EL4j73J0K47n0j86L05j76Q6r9j8J84P0o3K01o01j6K0J35RR2k86K29q6k79
4617d06N12J42l25K20j64O9n6K07j85r1Q8Q2N7l57L66j62j45K37m08J59K70m80
4639c70M49k13J62J60n35L26p5J78l30K92l7J83l40J56K36l11J73J46k34j58J06
4660c6J26j02nP3K6J30k85K83q0r6o5J37k04L76k79J9j0j03Q4J05k21J51N5k21
$$ plain form
4684 -142 23 -7 20 22 -95 -249 -57 36 -242 -80 89 60 -218 -88 40 -3 202 -178 28 -181 194 -97
4706 -97 46 -53 340 -202 21 377 38 -172 219 -65 155 81 123 -11 371 52 2 32 44 -28 -233 -30 -17
4729 -17 26 54 -158 121 265 -18 161 91 46 -156 288 171 95 244 277 240 61 10 220 98 -11 60 -179
4752 -179 -173 13 126 -167 -161 345 65 80 -335 73 -145 189 80 229 -90 83 -55 -181 -264 95 -163 -39
4774 -39 -273 94 -328 15 25 -249 -188 32 -141 180 -14 -5 35 155 117 -189 -13 -193 290 252 24 46 347
4797 347 38 157 -127 -26 -75 158 -11 -2 -195 158 172 99 118 282 -257 -9 6 42 -232 -193 -21 -84 171
4820 171 -5 102 -42 9 108 146 88 -95 -92 120 172 126 31 105 17 71 -204 -4 124 49 223 123 -65 -104 -39
4845 -39 -14 95 181 -109 33 -6 -176 25 181 117 171 -41 -219 198 -159 -1 31 134 -35 -163 50 -31 89
$$ packed form
4684a42J65l0K7Kj17j54J92R3k78J62J69k9k78J30J28m3K05l80K06k09L75k91
4706i7J43r9L93n42K23L56l39k10L91k84K20p4M2j34L82l19n0L0J2p2k05K03J3
4729a7M3K8k12K79J44k83J79p0m5k02M44j17p6J49L3l7j79n1K10j22j09P1k39
4752a79OJ86J13k93ON06k80J5m15M08k18L34j09J49l19J73j38j26q3L59k58J24
4774c9k34L67m22L43J0k74O1K20j73L21j94RM0J20l8l06J76j80M83l8k28K2L01
4797C47l09J19k84J01m9K33j69Rj93L53J4p3J9J64n39K48J5L6k74L9J72o3K55
4820A71j76J07j44N1R9L8n8j83LK12N2m6r5P4q8N4k75K00J28p5J74j00j88l9O5
4845c9K5J09Q6k90J42l9j70K01J56o4N4k12j78M17l57J58L2J03j69j28K13q1J20
$$ plain form
4868 89 -246 -215 32 131 224 154 -15 -95 -31 171 -54 -51 -128 98 84 -134 186 -299 -88 1 -103 -341 -18 150
4892 150 290 31 -299 183 145 163 -369 -85 131 57 290 63 -100 16 -1 9 -97 -306 -1 64 80 -55
4914 -55 74 -87 290 -13 48 -23 -3 140 -245 347 -24 -83 108 -115 86 -32 -182 -88 -107 -178 215 -18 -76
4937 -76 341 -38 173 316 -273 146 -181 -134 -76 -24 -107 92 -44 18 5 13 -236 -183 -16 -110 -97 2 5 -37 -191
4962 -191 236 195 209 62 144 91 416 -11 -97 -164 -116 226 -80 -48 19 -109 108 -170 -175 -61 -126 -36 58 96 -79
4987 -79 179 224 1 62 20 -158 152 -164 -205 -299 -32 -26 -15 -285 -288 -2 168 25 -159 -88 -211 57 -197 198
5011 198 -1 -55 -206 22 -147 -20 -12 73 -152 103 -102 -16 4 -97 6 2 -86 177 -86 84 31 297 87
5034 87 -183 156 -114 49 -90 77 -178 -97 -103 154 141 -104 51 -103 -149 -97 162 -269 93 -233 -72 -112 -88
$$ packed form
4868H9l35L1K47R9R3p0j69q0O4K02k25Lp7K26j4k18L20m85K11Q9j04k38L23J68
4892A50J40k59l30M82l8J8n32K84K16p4K33k27j63J16j7J0j06k09L05O5J6j35
4914e5J29j61L77l03O1p1K0J43l85N92l71n9J91k23K01j18j50R4j9p1L93k33n8
4937g6M17l79K11J43n89M19l27M7N8N2q3J99j36O2j3Qk49N3J67r4J3R9Lm2j54
4962a91M27m1J4j47Q2n3L25m27q6o7M8L42l06L2O7j28K17k78nJ14o5R0R4L8j75
4987g9K58M5k23O1m2j78L10l16m1r4K67OJ1k70lK86J70j43j84P1j23K68k54L95
5011A98j99n4j51K28j69J27QQ5k25K55k05Q6K0j01J03mq8K63k63J70n3K66k10
5034H7k70L39k70J63j39J67k55Q1oK57j3k45J55j54m6N2K59m31L62l26J61m0K4
$$ plain form
5057 -88 131 -164 -74 -44 -171 -103 -198 8 -277 164 -80 179 -146 128 -268 165 35 -113 135 -104 8 -46
5079 -46 130 -109 111 -182 85 15 14 24 -85 61 -16 230 -37 2 49 -146 -35 -151 96 -305 -140 51 19
5102 19 -147 157 -82 177 22 55 31 108 -41 358 79 -451 -297 -17 92 -41 -174 -102 183 -308 -26 55
5124 55 173 339 -43 142 -59 152 -73 46 212 -332 221 16 -247 -70 62 -118 18 -126 -89 151 176
5145 176 6 -142 230 297 181 -106 110 25 -58 219 -168 16 -133 -147 -27 -56 -70 -44 62 -73 119 -217
5167 -217 259 -134 64 -89 71 132 107 60 -67 68 -189 20 -118 -50 -374 132 -152 74 146 29 25 78 171
5190 171 64 278 -214 -148 -120 130 -166 -320 67 79 13 271 -111 -71 236 108 -99 463 299 192 10 201
5212 201 -79 -36 -234 191 -97 187 -34 64 81 -90 -61 -215 33 -21 -61 -319 -48 -8 -310 91 -61 -73 222
$$ packed form
5057h8K19k95R0L0j27O8r5K06k85M41k44K59l25K74l96M33j30j48K48k39J12n4
5079d6J76k39K20k93K67p0jJ0j09J46p7K46k67L9M7j95J11j16K47m01J65J91l2
5102A9j66L04k39K59j55L3k4P7j49L99k79n30J54K80J09j33j33P2K85m91K82Q1
5124E5J18J66l82J85k01K11k25J19J66n44N53k05k63J77J32j80J36j44L7K40K5
5145A76j70j48L72O7j16k87K16q5q3K77l87J84j49j4J20k9j4K6J06j35J92l36
5167b17M76l93J98j53J60O1k5m7j27J35k57K09j38O8l24N06k84K26P2j17mN3R3
5190A71j07K14m92O6K8K50k96j54L87J2o6K58l82M0L07j28k07N62j64j07j82J91
5212B01k80M3j98M25k88K84k21R8J7j71K9j54K48n4m0k58K71M0l02M01j52j2K95
$$ plain form
5235 222 148 -80 -42 63 -196 -167 -52 157 96 -322 -164 -268 -37 -12 -19 67 50 25 23 61 -65 209 211 -141 -272
5260 -272 141 115 -59 -107 34 -194 -117 63 8 48 72 119 -206 -67 -89 -480 -141 397 35 -78 42 9 222
5283 222 -17 -89 -109 148 -7 30 -47 139 -288 314 112 120 239 -6 103 -206 67 23 -292 170 29 37 -86
5306 -86 -19 97 -248 -107 106 -76 -169 100 186 -192 208 -45 80 166 90 85 -55 -150 79 219 104 181 -181
5329 -181 -34 168 -161 -47 32 -292 110 104 232 136 259 -119 1 -160 187 71 257 116 -5 6 84 291
5351 291 295 51 110 99 -84 131 151 -329 -64 -43 13 -112 175 -77 285 -2 99 225 66 79 151 232 -144
5374 -144 31 39 -5 15 -75 -196 -254 73 43 -45 31 -64 -272 130 -29 -82 -177 26 -271 -52 55 -39 -47 -254 -211
5399 -211 4 -157 -99 79 -187 -153 -184 -144 -15 -22 -37 221 -62 -234 116 -134 -273 144 174 -261 -111 45 -65
$$ packed form
5235B22p4k28L8J05k59K9J15K09o1m18J58j04K31K5pQ6j7k5kL8j26K74Kl52j31
5260b72M13k6j74m8J41k28P7J80n5M0K4M7l25J39k2l91L39N38l62j13J20l3K13
5283B22k39p2k0K57j55L7p7J86m27O02k02QJ19k45J09l09K73m4l15M62j41Qj23
5306h6O7J16l45J41K13j82r3K69Q6l78M00k53J25Q6p6nj40r5K29J40j15P7l62
5329a81J47K02l29J14P9l24M02oJ28r6J23l78J20j61L47j16J86j41j21J1P8K07
5351B91Mk44N9j1j83K15K0m80K65K1N6j25K87k52L62k87J01J26j59J3P2Q1l76
5374a44J75Qm4K0r0j21n8L27l0q8P6r5k08M02j59n3r5K03k97K19J07r4qk07M3
5399b11K15j61N8J78k66L4l1M0J29pj5K58k83j72L50k50j39M17L0m35J50J56j10
$$ plain form
5422 -65 124 85 -41 -56 93 122 -346 -269 11 168 -187 160 144 -141 214 137 81 152 -139 -9 349 0 49
5445 49 179 12 -1 -75 -60 -142 -52 -143 225 -108 -113 -105 -8 -19 96 245 -43 296 111 -133 217 40 -141 163
5469 163 -132 -158 -50 -200 99 -33 -171 168 127 -60 43 160 155 -48 -161 354 186 15 -264 -29 -119 -128
5491 -128 -154 -233 -85 151 -84 41 93 359 13 -114 -33 -41 -297 91 93 -5 -10 -244 171 -25 223 -372 10 209
5515 209 52 -253 -25 -3 -115 -258 -199 51 226 292 112 -143 171 -38 135 147 -142 146 74 -231 -266 194
5537 194 -78 235 -21 110 135 91 87 322 34 369 4 314 -252 -12 -50 -110 121 56 -17 -63 -60 111 27 -115
5561 -115 -103 -48 179 -46 12 65 -78 270 -21 -180 146 177 -44 -48 -88 139 265 -110 -117 90 -97 -96 76 -48
5585 -48 -186 -77 120 -264 -54 -129 55 -234 -147 129 291 70 141 230 -223 238 -6 -4 12 64 -151 122 -124
$$ packed form
5422f5J89l9j26j5J49K9m68P7K80J57l55L47j6k85L55p7n6P1k91J30L58l49M9
5445D9J30j67j3p4J5q2R0r1L68l33nQR7j1J15J49k88L39j85k44L50j77j81L04
5469A63k95k6J08j50K99j32j38L39m1j87J03J17nk03j13N15j68j71k79K35r0r
5491a28k6p9J48K36k35J25N2K66l46j27Q1qk56L88Kr8nk34M15j96K48n95L82J99
5515B09j57l05K28K2j12j43N9K50J75O6j80k55L14k09J73J2k89K88p2l05l5M60
5537A94k72L13k56J31K5m4mK35k88L35l65L10n66K40l8o0K31o5p3m6LJ71q4j42
5561a15J2N5K27k25N8N3j43L48k91j59L26L1k21mm0K27J26l75pK07j87JJ72j24
5585d8j38J09J97l84K10p5J84k89Q7K76J62k21P1Q9m53M61k44KJ6N2k15K73k46
$$ plain form
5608 -124 96 4 261 129 -105 231 -106 26 -136 -227 -18 -191 -265 30 31 57 -6 127 161 -117 16 178 64
5631 64 59 -209 14 -275 318 76 -23 -26 -62 -98 -201 25 33 139 63 279 -276 -16 -191 -240 278 -115 -278 -157
5655 -157 -281 253 231 194 138 29 128 213 90 54 -119 -140 -47 48 216 192 -173 -135 -89 136 -9 -122 -159 168
5679 168 45 214 75 240 89 -172 82 -25 196 226 -63 111 -67 -123 -236 9 3 -123 146 -77 233
5700 233 -33 49 257 -95 -94 -136 -155 29 -131 3 114 76 -466 -9 -81 -187 212 46 22 -40 -3 -117 -139 -112
5724 -112 -106 -39 -30 0 60 50 -144 -87 -58 -68 56 54 169 25 35 -2 -173 -172 151 -15 -262 -159 -223 125 -30 -73
5750 -73 -344 -309 -37 -76 -28 -158 124 -118 144 134 -163 146 83 -68 -2 0 -85 -99 21 18 75 73 52 314 184 57
5776 57 -21 159 -34 -123 -91 -203 43 32 -252 42 37 -57 30 247 -219 27 475 127 141 198 -18 10 -172 159
$$ packed form
5608a24K20r2K57j32k34L36l37J32j62r1K09j73p4K95JK6o3J33L4k78J33J62j14
5631F4nk68K23k89N93k42r9ll6l6j03K26QJ06p6K16n55K60j75m9N18l93j63J21
5655a57j24N34k2l7n6j09R9Q5j23l6j73k1R3R5J68k4l65L8M6K25j45j13l7L27
5679A68j23J69j39J65j51k61K54j07K21L0k89J74j78n6j13K45oj26K69k23L10
5700B33k66Q2K08l52Jm2j9J84j60J34J11l8n42M57p2j06L99j66k4o2L7j14k2K7
5724a12OO7RL0O0j0j94N7K9j0J24kJ15j44J0l7j71JL23j66k47J03o4L48j55m3
5750g3k71L5K72l9M8j30K82k42K62j0k97L09o3j51O6Kq5j4J20lN7kk1K62j30j27
5776E7p8J80j93q9L2j12K46j1k84K94nr4Q7K17m66K46M48l48J4N7k16K8j82L31
$$ plain form
5800 159 194 -90 18 27 95 -35 24 180 229 -434 91 -79 40 247 230 167 -109 -8 -70 -289 -149 -179 17
5823 17 -103 104 98 163 223 119 2 47 217 52 21 171 -169 -82 -196 -22 -12 -34 154 22 -202 -116 51 -19
5847 -19 -12 222 -241 -114 169 -57 -64 -10 18 72 -163 -240 48 -124 135 260 -20 -3 17 95 -260 94 -50 110
5871 110 -133 -102 -18 -105 101 144 -153 -76 -91 70 124 -54 202 152 -22 97 142 -43 59 -201 -115 -144 138 -91
5895 -91 96 165 -84 229 -108 -4 47 -207 -3 -157 -6 -34 -109 334 261 95 22 217 -152 -135 0 -96 -188
5918 -188 -43 93 -155 -24 -306 -38 -69 2 75 144 118 -216 -282 -116 18 390 140 173 20 69 215 -87 215
5941 215 -256 134 126 121 -45 -11 -9 157 -205 17 -17 66 266 -203 226 -102 -176 8 114 -145 15 173 -150
5964 -150 134 -30 -54 348 -186 -103 49 -16 -293 112 130 -107 148 -85 -257 -133 -239 210 245 -10 25 162
$$ packed form
5800A59L5k84J08RO8j30N9J56M9o63N25j70J19K07j7o3k76J01o2k19J40l0J96
5823A7j20K07oO5O0j04j17M5J70j65l1J50l40Q7j14J74J0k2J88j32k24Q6J67p0
5847a9PK34m63J27K83k26pN4K8N4k35p7K88j72K59J25k80J7K0P8l55L54j44J60
5871A10k43L1Q4q7K06M3k97P7j5J61N4j78K56n0j74J19M5j85J02k60Q6k9K82k29
5895i1J87O9k49L13l37J04N1k54K04j54J51k8p5M43p3j66p3J95l69J7J35r6r2
5918a88J45J36k48J31k82K68l1P1P3O9k6l34o6J66J34L72k50L3j53M9J46l02L02
5941B15m71L90qnj66L4KJ66l62K22l4Q3K00m69M29l28p4J84J06k59J60J58l23
5964a50K84j64k4M02n34Q3J52o5k77M05J8k37K55k33j72J24j06M49L5k55L5J37
$$ plain form
5986 162 -82 18 -117 42 31 -160 258 -91 90 297 143 -72 -137 56 197 143 -96 90 -145 29 -196
6007 -196 -102 383 -109 -35 76 -160 -72 81 -94 72 -132 46 34 1 75 102 -56 -94 26 -52 -56 -35 -247 90
6031 90 -120 -125 -65 243 161 76 85 -4 318 -86 346 208 148 108 181 91 -227 329 -109 -248 -215 220 -66 71 -55
6056 -55 113 -100 -256 1 -67 185 16 70 -36 86 141 242 -11 84 44 150 119 39 -65 -329 -30 45 202
6079 202 -345 53 -119 -121 -174 64 -225 -31 122 196 -251 144 -67 -34 -55 68 83 -175 -303 21 -15 45 -131
6102 -131 -49 -187 -82 144 -93 -27 71 18 -17 6 20 407 31 -158 -233 111 182 133 23 240 36 135 -17 -119
6126 -119 57 -129 62 200 -67 20 -25 -100 -78 78 -64 -306 173 23 -104 -317 170 318 88 295 225 153
6148 153 -267 -85 93 132 -10 -92 -186 -108 137 46 18 -171 3 -180 -169 -302 -238 -121 88 100 146 143 -148 -25
$$ packed form
5986A62k44J00j35J59j1j91M18l49J81K07j54k15o5J93J41n4k39J86k35J74k25
6007a96R4M85m92P4J11k36Q8J53j75J66k04J78j2l3P4K7j58l8J20p8mK1k12L37
6031I0k10nO0L08q2q5Rq9L22m04M32j38o0m0P3r0l18N56m38j39L3M35k86J37j26
6056e5J68k13j56K57o8K52j69N4j06J22N5J01k53R5m0J06l1q0j04k64K99P5J57
6079B02n47L98j72kn3K38k89J94J53P4m47L95k11L3k1J23J5k58j28L24l6O0j76
6102a31Q2j38J05K26k37O6R8n3l5K3J4L87l76j89p5L44P1m9j10K17k04R9j52j02
6126a19J76j86J91J38k67Q7m5p5K2J56j42k42M79j50j27k13M87J48k30K07p0p2
6148A53m20J82J78L9j42q2r4P8K45r1k8j89J74j83J1j33O4J17K09J2M6lk91J23
$$ plain form
6172 -25 -97 37 -281 -46 29 143 -63 285 318 60 41 111 -62 -122 -333 -11 230 -27 -112 -282 209 -138 96
6195 96 131 -34 -8 131 209 -141 231 -231 -59 -58 -161 121 -224 -175 -233 -177 -116 56 29 -142 -41 17 99 250
6219 250 -227 -21 -12 -60 -194 -166 29 19 -95 -110 -150 -190 -42 -26 -86 31 104 -203 -71 42 194 120 -54 -100
6243 -100 -57 -96 -110 184 249 26 65 45 262 -16 -270 -12 13 -183 87 -33 -41 -56 -32 152 101 -84 -133 157
$$ packed form
6172b5p2J34l18K35P5J14k06L48L3k58j9P0j73o0k11L22K41k57q5j70M91l47K34
6195I6L5j65K6J39P8l50L72m62J72Jj03K82l45M9n8N6O1J72k7j71J01N8Q2J51
6219B50m77K06Rm8j34K8J95j0j14j5m0m0J48J6o0J17P3l07J32J13J52p4j74m6
6243a00M3l9j4K94O5k23L9k0K17k78k54K58K5j96K70j20qj5K4J84n1j85m9K90
$$ [...]
8191A25
##END NTUPLES=NMR FID
##END=
