##TITLE=1H_LR-796-C1-K2
 200.13MHz, CDCl3,
 8 sc
 
 20.1.2025
##JCAMPDX= 6.0         $$ Bruker NMR JCAMP-DX V2.0
##DATA TYPE= NMR FID
##DATA CLASS= NTUPLES
##ORIGIN= UXNMR, Bruker Analytische Messtechnik GmbH
##OWNER= pz
$$ XWIN-NMR		Version 3.5
$$ Mon Jan 20 16:29:55 2025 Russian Standard Time (UT+4h)  she@DPX200
##.OBSERVE FREQUENCY= 200.1313
##.OBSERVE NUCLEUS= ^1H
##.DELAY= (6, 6)
##.ACQUISITION MODE= SIMULTANEOUS
##.ACQUISITION SCHEME= undefined
##.AVERAGES= 8
##.DIGITISER RES= 18
##SPECTROMETER/DATA SYSTEM= spect
##.PULSE SEQUENCE= zg30
##.SOLVENT NAME= D2O
##.SHIFT REFERENCE= (INTERNAL, D2O, 0, 14.3821)
##AUDIT TRAIL= $$ (NUMBER, WHEN, WHO, WHERE, WHAT)
$$ ##TITLE= Audit trail, XWIN-NMR		Version 3.5
$$ ##JCAMPDX= 5.01
$$ ##ORIGIN= Bruker BioSpin GmbH
$$ ##OWNER= she
$$ F:/spectra/data/she/nmr/H-C/1/audita.txt
$$ ##AUDIT TRAIL=  $$ (NUMBER, WHEN, WHO, WHERE, WHAT)
(   1,<2025-01-20 16:28:47.07 +0400>,<she>,<DPX200>,
      <created by zg, POWCHK disabled, PULCHK disabled
       configuration hash MD5:
       00 E9 B6 7A A2 85 ED C7 34 08 36 98 17 FE 4E 26
       data hash MD5: 16K
       4A 8C 22 50 18 18 66 EB 53 14 75 E7 91 25 7A 1E>)
$$ ##END=
$$ 
$$ hash MD5
$$ 8C 9A 7B A8 06 A2 C1 27 39 84 53 53 A8 DD 54 EF
##$RELAX= 
##$RELAX= 
##$RELAX= 
##$RELAX= 
##$RELAX= 
##$RELAX= 
$$ Bruker specific parameters
$$ --------------------------
##$DU= <F:/spectra>
##$EXPNO= 1
##$NAME= <H-C>
##$PROCNO= 1
##$TYPE= <nmr>
##$USER= <she>
##$AMP= (0..31)
100 100 100 100 100 100 100 100 100 100 100 100 100 100 100 100 100 100 
100 100 100 100 100 100 100 100 100 100 100 100 100 100 
##$AQSEQ= 0
##$AQ_mod= 1
##$AUNM= <au_zg>
##$AUTOPOS= <>
##$BF1= 200.13
##$BF2= 200.13
##$BF3= 200.13
##$BF4= 200.13
##$BF5= 200.13
##$BF6= 200.13
##$BF7= 200.13
##$BF8= 200.13
##$BYTORDA= 1
##$CFDGTYP= 0
##$CFRGTYP= 5
##$CHEMSTR= <none>
##$CNST= (0..31)
1 1 145 1 1 1 1 1 1 1 1 1 1 1 1 1 1 1 1 1 1 1 1 1 1 1 1 1 1 1 1 1 
##$CPDPRG= <>
##$CPDPRG1= <>
##$CPDPRG2= <>
##$CPDPRG3= <>
##$CPDPRG4= <mlev>
##$CPDPRG5= <mlev>
##$CPDPRG6= <mlev>
##$CPDPRG7= <mlev>
##$CPDPRG8= <mlev>
##$CPDPRGB= <>
##$CPDPRGT= <>
##$D= (0..31)
0 0.7 0 0 0 0 0 0 0 0 0 0.03 0 0 0 0 0 0 0 0 0 0 0 0 0 0 0 0 0 0 0 0 
##$DATE= 1737376126
##$DBL= (0..7)
120 120 120 120 120 120 120 120 
##$DBP= (0..7)
150 150 150 150 150 150 150 150 
##$DBP07= 0
##$DBPNAM0= <>
##$DBPNAM1= <>
##$DBPNAM2= <>
##$DBPNAM3= <>
##$DBPNAM4= <>
##$DBPNAM5= <>
##$DBPNAM6= <>
##$DBPNAM7= <>
##$DBPOAL= (0..7)
0.5 0.5 0.5 0.5 0.5 0.5 0.5 0.5 
##$DBPOFFS= (0..7)
0 0 0 0 0 0 0 0 
##$DE= 6
##$DECBNUC= <off>
##$DECIM= 32
##$DECNUC= <off>
##$DECSTAT= 4
##$DIGMOD= 1
##$DIGTYP= 9
##$DL= (0..7)
0 120 120 120 120 120 120 120 
##$DP= (0..7)
150 150 150 150 150 150 150 150 
##$DP07= 0
##$DPNAME0= <>
##$DPNAME1= <>
##$DPNAME2= <>
##$DPNAME3= <>
##$DPNAME4= <>
##$DPNAME5= <>
##$DPNAME6= <>
##$DPNAME7= <>
##$DPOAL= (0..7)
0.5 0.5 0.5 0.5 0.5 0.5 0.5 0.5 
##$DPOFFS= (0..7)
0 0 0 0 0 0 0 0 
##$DQDMODE= 0
##$DR= 18
##$DS= 0
##$DSLIST= <SSSSSSSSSSSSSSS>
$$ [...]
##$SUBNAM0= <"">
##$SUBNAM1= <"">
##$SUBNAM2= <"">
##$SUBNAM3= <"">
##$SUBNAM4= <"">
##$SUBNAM5= <"">
##$SUBNAM6= <"">
##$SUBNAM7= <"">
##$SUBNAM8= <"">
##$SUBNAM9= <"">
##$SW= 18.0517328524113
##$SWIBOX= (0..15)
0 0 2 0 0 0 0 0 0 0 0 0 0 0 0 0 
##$SW_h= 3612.71676300578
##$TD= 16384
##$TD0= 1
##$TE= 0
##$TE2= 300
##$TE3= 300
##$TEG= 300
##$TL= (0..7)
0 120 120 120 120 120 120 120 
##$TP= (0..7)
150 150 150 150 150 150 150 150 
##$TP07= 0
##$TPNAME0= <>
##$TPNAME1= <>
##$TPNAME2= <>
##$TPNAME3= <>
##$TPNAME4= <>
##$TPNAME5= <>
##$TPNAME6= <>
##$TPNAME7= <>
##$TPOAL= (0..7)
0.5 0.5 0.5 0.5 0.5 0.5 0.5 0.5 
##$TPOFFS= (0..7)
0 0 0 0 0 0 0 0 
##$TUNHIN= 0
##$TUNHOUT= 0
##$TUNXOUT= 0
##$USERA1= <user>
##$USERA2= <user>
##$USERA3= <user>
##$USERA4= <user>
##$USERA5= <user>
##$V9= 5
##$VALIST= <valist>
##$VCLIST= <CCCCCCCCCCCCCCC>
##$VD= 0
##$VDLIST= <DDDDDDDDDDDDDDD>
##$VPLIST= <PPPPPPPPPPPPPPP>
##$VTLIST= <TTTTTTTTTTTTTTT>
##$WBST= 1024
##$WBSW= 4
##$XGAIN= (0..3)
0 0 0 0 
##$XL= 0
##$YL= 0
##$YMAX_a= 146923
##$YMIN_a= -160408
##$ZGOPTNS= <>
##$ZL1= 120
##$ZL2= 120
##$ZL3= 120
##$ZL4= 120
##$ABSF1= 10
##$ABSF2= 0
##$ABSG= 5
##$ABSL= 3
##$ALPHA= 0
##$AQORDER= 0
##$ASSFAC= 0
##$ASSFACI= 0
##$ASSFACX= 0
##$ASSWID= 0
##$AUNMP= <proc_1d>
##$AZFE= 0.1
##$AZFW= 0.1
##$BCFW= 1
##$BC_mod= 2
##$BYTORDP= 1
##$COROFFS= 0
##$CY= -3
##$DATMOD= 1
##$DC= 2
##$DFILT= <>
##$DTYPP= 0
##$F1P= 0
##$F2P= 0
##$FCOR= 0.5
##$FTSIZE= 0
##$FT_mod= 4
##$GAMMA= 1
##$GB= 0.15
##$INTBC= 1
##$INTSCL= 1
##$ISEN= 128
##$LB= 0.25
##$LEV0= 0
##$LPBIN= 0
##$MAXI= 10000
##$MC2= 0
##$MEAN= 0
##$ME_mod= 0
##$MI= 1.114404
##$NCOEF= 0
##$NC_proc= 0
##$NLEV= 6
##$NOISF1= 3.799351
##$NOISF2= 2.8
##$NSP= 1
##$NTH_PI= 0
##$NZP= 0
##$OFFSET= 14.38212
##$PC= 1
##$PHC0= 250.4059
##$PHC1= 13.5922
##$PH_mod= 1
##$PKNL= yes
##$PPARMOD= 0
##$PSCAL= 0
##$PSIGN= 0
##$REVERSE= no
##$SF= 200.129724274929
##$SI= 16384
##$SIGF1= 3
##$SIGF2= 2
##$SINO= 400
##$SIOLD= 16384
##$SREGLST= <1H.CDCl3>
##$SSB= 0
##$STSI= 0
##$STSR= 0
##$SW_p= 3205.1282051282
##$SYMM= 0
##$S_DEV= 0
##$TDeff= 0
##$TDoff= 0
##$TI= <>
##$TILT= no
##$TM1= 0
##$TM2= 0
##$TOPLEV= 0
##$USERP1= <user>
##$USERP2= <user>
##$USERP3= <user>
##$USERP4= <user>
##$USERP5= <user>
##$WDW= 1
##$XDIM= 8192
##$YMAX_p= 0
##$YMIN_p= 0
$$ End of Bruker specific parameters
$$ ---------------------------------
##NTUPLES= NMR FID
##VAR_NAME=  TIME,          FID/REAL,        FID/IMAG
##SYMBOL=    X,             R,               I
##VAR_TYPE=  INDEPENDENT,   DEPENDENT,       DEPENDENT
##VAR_FORM=  AFFN,          ASDF,            ASDF
##VAR_DIM=   8192,          8192,            8192
##UNITS=     SECONDS,       ARBITRARY UNITS, ARBITRARY UNITS
##FACTOR=    0.0002768,     1,               1
##FIRST=     0,             0,               0
##LAST=      2.2672688,     0,               0
##MIN=       0,             -160408,         0
##MAX=       2.2672688,     146923,          0
$$ Real data points
##PAGE= N=1
##DATA TABLE= (X++(R..R)), XYDATA
$$ plain form
0 0 0 0 0 0 0 0 0 0 0 0 0 0 0 0 0 0 0 -5 8 -8 8 -8 8 -8 16 -16 16 -21 24 -26 30 -35 38 -44 49 -53 61 -69 77
39 77 -85 94 -105 114 -129 140 -154 171 -189 207 -228 251 -277 305 -339 374 -416 464 -521 587 -667
60 -667 767 -892 1057 -1281 1603 -2106 2977 -4759 9748 -50610 -137110 122199 124654 -129404
74 -129404 -48998 146923 65395 31789 97096 -29066 -107643 47636 71087 -59114 -59798 -60939
86 -60939 -146924 -66124 84086 36536 -49670 -1669 47878 68098 105614 79259 7313 -4005
98 -4005 11351 16864 20382 -30422 -93786 -63723 -19817 -28946 380 22233 -49686 -62436 34313
111 34313 55638 15766 40185 28143 -30834 25328 102823 39223 -16399 18405 -4605 -40047
123 -40047 21511 26021 -81001 -97818 -21863 -11219 -18769 16241 1149 -32147 23201 81797
$$ packed form
0@%%%%%%%%%%%%%%%%%nJ3j6J6j6J6j6K4l2L2l7M5n0N6o5P3q2R3j02J14j30J46
39G7j62J79j99K19k43K69k94L25l60L96m35M79n28N82o44P13p90Q80r85J108j254
60f67J434j659J949k338K884l709N083p736J4507o0358q6500K59309K455k54058
74a29404Q0406J95921q1528l3606O5307j26162p8577J55279K3451j30201o84j141
86f0939q5985Q0800J50210m7550q6206M8001M9547K0220L7516k6355p1946j1318
98d005J5356N513L518n0804o3364L0063M3906r129K9326K1853p1919j2750R6749
111C4313K1325l9872K4419j2042n8977N6162P7495o3600n5622L4804k3010l5442
123d0047O1558M510j07022j6817P5955J0644p550L5010j5092l3296N5348N8596
$$ plain form
135 81797 55327 28607 32309 5667 -11826 21303 23112 -32528 -56557 -33924 -21149 -13127 5324
148 5324 -2738 -29172 -16753 22198 32906 23172 16190 1285 -7891 17634 40962 19336 -12521
161 -12521 -15472 -8495 -5672 717 -6675 -34247 -44598 -21643 2558 7697 2620 -1935 1521 18663
175 18663 39657 42992 23186 837 -3249 3074 1864 -5871 -18805 -37156 -39654 -15250 1120
188 1120 -6929 -10605 -4345 -2354 11425 33733 26707 1792 1961 13298 11765 14356 15150 -8398
202 -8398 -25366 -9243 1087 -10593 -15006 -16958 -27898 -19146 7323 10155 -2261 1996 11289
215 11289 14322 25267 31356 13569 -3662 -633 2361 -2348 -6418 -15897 -28418 -24482 -8490 -1406
229 -1406 -2795 -4379 -4019 2783 15328 21117 15885 7598 2357 5502 12580 10685 -100 -8208 -11979
$$ packed form
135H1797k6470k6720L702k6642j7493L3129J809n5640k4029K2633J2775Q022J8451
148E324q062k6434J2419L8951J0708r734o982j4905r176K5525K3328k1626l1857
161a2521k951O977K823O389p392k7572j0351K2955K4201N139n077m555L456J7142
175A8663K0994L335j9806k2349m086O323j210p735j2934j8351k498K4404J6370
188A120q049l676O260J991J3779K2308p026k4915J69J1337j533K591P94k3548
202h398j6968J6123J0330j1680m413j952j0940Q752K6469K832j2416M257R293
215A1289L033J0945O089j7787j7231L029K994m709m070r479j2521L936J5992P084
229a406j389j584L60O802J2545N789n232q287n241L145P078j895j0785q108l771
$$ plain form
244 -11979 -11530 -5156 -2907 -13025 -19949 -13148 -5500 130 8118 7800 767 6627 19607 20370 14346
259 14346 10785 1180 -6855 -1471 901 -10780 -18600 -16840 -15059 -9941 955 1733 -4480 -1695 7603
274 7603 11926 13434 12145 5030 936 4884 8025 4406 -1022 -6686 -10077 -7094 -2711 -4941 -10768
289 -10768 -12944 -9832 -3280 2561 5254 4867 3984 6581 12934 16834 11922 3826 -422 -2124 -4246
304 -4246 -5087 -7979 -14120 -16021 -10016 -3692 -701 596 640 1754 7150 11702 10810 6961 3163 541
320 541 984 4283 2881 -3165 -6342 -5466 -4250 -3442 -3424 -6159 -8345 -6668 -1384 2632 3047 1928 2675
337 2675 6847 10654 11178 8552 3611 -794 -2393 -2418 -3941 -7664 -11164 -10577 -7134 -2650 436 1781
353 1781 2193 3614 6972 9742 8442 4350 885 -465 447 933 -732 -3824 -5052 -4174 -2959 -743
$$ packed form
244a1979M49O374K249j0118o924O801P648N630P988l18p033N860J2980P63o024
259A4346l561r605q035N384K372j1681p820J760J781N118J0896P78o213K785R298
274G603M323J508j289p115m094L948L141l619n428n664l391K983M383k230n827
289a0768k176L112O552N841K693l87q83K597O353L900m912q096m248j702k122
304d246q41k892o141j901O005O324K991J297M4J114N396M552q92l849l798k622
320E41M43L299j402o046l177Q76J216Q08J8k735k186J677N284M016M15j119P47
337B675M172L807N24k626m941m405j599k5j523l723l500N87L443M484L086J345
353A781M12J421L358K770j300m092l465j350R12M86j665l092j228Q78J215K216
$$ plain form
369 -743 -248 -3545 -4999 -1527 1363 996 2107 3021 2194 3834 8022 7646 3989 2454 192 -2492 -2144
386 -2144 -2421 -7048 -9453 -6900 -4911 -3309 970 2925 1574 3922 8300 7482 5454 4412 1329 -1768
402 -1768 -128 -26 -3168 -5041 -4521 -4085 -2181 416 2 -2067 -1397 59 617 2284 2498 985 1587
419 1587 3395 3509 3708 3025 -148 -1403 -141 -1612 -4045 -4259 -5551 -7193 -3545 900 213 426 3841
436 3841 3869 3635 7145 6438 704 677 1558 -2497 -3530 -1276 -4403 -7008 -2050 32 -3043 -760 1418
453 1418 -1695 -463 4810 2949 -305 2680 2619 43 2692 4718 -72 -1262 1053 -1806 -3440 -1423
469 -1423 -3532 -6462 -3400 -1008 -2286 73 2553 892 2088 5836 4595 2844 3569 936 -1328
484 -1328 621 -579 -4178 -3207 -2147 -3989 -2253 1151 -1018 -1952 1997 1376 -8 3152 2927 -1103
$$ packed form
369g43M95l297j454L472K890l67J111R14q27J640M188l76l657j535k262k684L48
386b144k77m627k405K553J989J602M279J955j351K348M378q18k028j042l083l097
402a768J640J02l142j873N20M36J904K597m14k069O70J456N58J667K14j513O02
419A587J808J14J99o83l173j255J262j471k433k14j292j642L648M445o87K13L415
436C841K8k34L510p07n734k7Q81m055j033K254l127k605M958K082l075K283K178
453A418l113J232N273j861l254K985o1k576K649K026m790j190K315k859j634K017
469a423k109k930L062K392j278K359K480j661J196L748j241j751P25k633k264
484a328J949j200l599R71J060j842J736L404k169r34L949o21j384L160k25m030
$$ plain form
500 -1103 766 3738 873 100 2568 -207 -2801 369 420 -3640 -2647 -1258 -3506 -2703 1255 493 -913
517 -913 2082 3383 2005 3037 4002 1072 -418 725 -179 -2121 -2065 -2047 -3093 -2132 -773 -437 -558 -227
535 -227 683 1223 1570 1556 1280 566 810 1248 1347 259 -42 -3 -882 -1064 -368 -836 -2364 -2114 -1059 -941
555 -941 -803 676 965 377 1624 2928 2239 1020 1323 843 -685 -657 -196 -2104 -2738 -1038 -627 -1548
573 -1548 -280 1057 -545 -323 1818 1702 148 875 1155 -306 24 1672 234 -1015 388 472 -1208
590 -1208 -418 28 -1780 -1684 -132 -298 -743 633 950 259 1220 2272 1351 497 714 315 -742 -553 -467
609 -467 -1487 -1679 -850 -618 -393 403 393 60 659 794 906 621 476 66 489 469 105 73 -91 -411 -307
630 -307 -111 -710 -915 -420 -716 -998 -137 586 -75 150 1152 972 747 1830 714 -624 489 51 -1265
$$ packed form
500a103J869K972k865p73K468k775k594L170N1m060R93J389k248Q03L958p62j406
517i13K995J301j378J032R65k930j490J143r04j942N6J8j046R61J359L36j21L31
535b27R10N40L47j4k76p14K44M38R9j088l01L9q79j82O96m68j528K50J055J18
555i41J38J479K89n88J247J304o89j219L03m80j528K8M61j908o34J700M11r21
573a548J268J337j602K22K141j16j554P27K80j461L30J648j438j249J403Q4j680
590a208P90M46j808R6J552j66m45J376L17o91R61J052r21q54K17l99j057J89Q6
609d67j020j92Q29K32K25P96j0l33N99J35J12k85j45m10M23k0l64l2j64l20J04
630c07J96n99k05M95k96k82Q61P23o61K25J002j80k25J083j116j338J113m38j316
$$ plain form
649 -1265 -1081 -527 -1400 -1455 25 235 -415 664 962 112 468 1595 312 -172 679 153 -524 24 195
668 195 -836 -417 218 -567 -549 -92 -947 -792 -280 -294 -463 575 381 297 1052 1299 588 522 614 -261 -351 -93
690 -93 -951 -1486 -623 -771 -1295 97 338 -331 227 868 598 261 886 364 -313 467 407 -488 16 310 -456
711 -456 -252 340 -244 -414 -181 -477 -721 -181 50 -319 260 839 423 695 929 435 251 324 -151 -421 -290
732 -290 -617 -978 -717 -28 -541 -186 230 -55 143 725 304 49 394 372 -223 243 540 -218 -221 135 -153
753 -153 -341 9 -42 -369 -188 -177 -235 -223 5 -146 168 407 346 399 520 275 100 141 76 -437 -596 -195 -497
776 -497 -295 2 -237 -30 78 228 264 281 462 171 106 177 134 -69 177 234 -176 207 -155 -116 -335 5 -297
799 -297 -354 -61 42 -180 -5 277 292 517 312 238 42 303 77 -353 -303 -388 -401 -589 -311 -251 -146 -191 333
$$ packed form
649a265J84N54q73n5J480K10o50J079K98q50L56J127j283m84Q51n26o77N48J71
668A95j031M19O35p85J8M57q55J55N12j4j69J038j94q4P55K47p11o6R2q75r0K58
690i3q58n35Q63j48n24J392K41o69N58O41k70l37O25n22o77P80o0q95N04K94p66
711d56K04N92n84j70K33k96k44N40K31l69N79N79m16K72K34m94j84P3m75k70J31
732b90l27l61K61O89n13L55M16k85J98N82m21k55L45k2n95M66K97p58lL56k88
753a53j88L50n1l27J81J1n8J2K28j51L14K39o1N3J21k45j75M1o5n13j59M01l02
776d97K02K97k39K07J08J50L6J7J81k91o5P1m3k03K46N7m10L83l62L9k19L40l02
799b97n7K93J03k22J75K82J5K25k05p4j96K61k26m30N0q5j3j88K78O0J05m5N24
$$ plain form
822 333 161 312 265 269 170 -45 -104 0 -155 56 19 -139 149 70 57 -214 64 -221 -77 63 -134 -65 99
845 99 336 280 176 414 256 218 244 30 -143 145 9 -529 -450 -344 -87 23 6 71 87 113 168 59 213 -36
869 -36 -120 126 128 -254 0 11 -78 -94 23 -193 -277 -50 146 -153 -55 -160 79 -86 415 378 -106 125 178 -15
893 -15 -15 15 -105 -473 -536 -229 -364 -26 -135 84 98 324 22 258 254 215 232 89 33 -69 -6 -113 -45 98 -231
918 -231 -47 -221 9 -258 116 -2 -123 165 191 178 453 325 258 -47 83 200 62 -103 -215 -154 -383 -100
940 -100 -413 -246 8 39 7 147 214 75 280 370 56 50 30 57 -48 66 -98 1 -63 -191 -164 6 -82 102
964 102 152 160 -79 183 348 -115 185 350 143 39 155 -35 -179 -182 -224 -381 -365 100 -129 -32 90 138 100 224
988 224 150 0 223 161 -14 73 -4 4 -236 -49 -132 -123 -37 33 -299 -248 185 -328 -63 -34 119 25 218 183 102 259
$$ packed form
822C33j72J51m7Mr9k15n9J04j55K11l7j58K88p9j3k71K78k85J44J40j97O9J64
845I9K37n6j04K38j58l8K6k14j73K88j36n38P9J06K57J10j7O5J6K6N5j09J54k49
869c6q4K46Kl82K54J1q9j6J17k16q4K27J96k99R8j05K39j65N01l7m84K31N3j93
893a5%L0j20l68o3L07j35L38j09K19J4K26l02K36ml9J7j43n6j02O3j07O8J43l29
918b31J84j74K30k67L74j18j21K88K6j3K75j28o7l05J30J17j38j65j12O1k29K83
940a00l13J67K54L1l2J40O7j39K05R0l14ok0K7j05J14j64R9o4j28K7J70q8J84
964A02N0Qk39K62J65m63L00J65k07j04J16j90j44lm2j57J6M65k29R7J22M8l8J24
988B24p4j50K23o2j75Q7p7Qk40J87q3RQ6P0l32N1M33n13K65K9J53r4J93l5q1J57
$$ plain form
1014 259 158 -167 -25 90 -110 -36 -85 -8 -119 28 -114 -79 241 135 -100 45 152 8 158 93 125 -275
1036 -275 -99 -318 -199 -66 -195 -163 -211 25 33 -78 161 25 45 97 262 77 -67 302 42 -59 -148 25
1058 25 -93 33 -4 -104 2 -2 -417 -67 -77 65 236 -112 -60 86 -9 79 -101 87 -42 -69 -70 -162 -91 -44 -7
1083 -7 -247 -175 143 66 -166 131 148 11 57 -40 136 70 83 132 -220 91 22 -8 -102 -171 -53 97 19 -22 -8 114
1109 114 148 269 294 271 -42 -21 93 -93 -80 45 -106 -164 -69 35 -139 -39 112 -54 -112 84 57 -96 67
1132 67 30 33 159 148 -249 -60 224 -75 -45 158 -100 8 -145 -29 -24 115 197 -18 74 234 -110 20 402
1155 402 183 -39 -104 -20 -193 -59 -158 -300 -303 -44 81 -27 59 -6 -131 19 153 26 -4 49 -9 -75 16 12 -24
1180 -24 -78 -31 61 -176 -65 -38 -220 83 -43 137 15 117 84 -45 236 57 9 18 24 -142 -67 -12 24 -211 -278
$$ packed form
1014B59j01l25J42J15k00P4m9P7j11J47j42L5L20j06k35J45J07j44J50o5L2m00
1036b75J76k19J19J33j29L2m8K36Qj11K39j36K0N2J65j85j44L69k60j01q9J73
1058B5j18J26l7j00J06mm15L50j0J42J71l48N2J46r5Q8j80J88j29k7jr2P1M7L7
1083gk40P2L18p7k32K97J7j37M6r7J76o6J3M9l52L11o9l0r4o9J18J50p8m1J4J22
1109A14L4J21K5k3l13K1J14j86J3J25j51n8R5J04j74J00J51j66n8J96k7j53J63
1132F7l7LJ26j1l97J89K84k99L0K03k58J08j53J16NJ39Q2k15R2J60l44J30L82
1155D02k19k22o5Q4j73J34r9j42lK59J25j08Q6o5j25J50J34j27l0N3n8o6R1ml6
1180b4n4M7R2k37J11K7j82L03j26J80j22J02l3j29K81j79m8ROj66P5N5L6k35o7
$$ plain form
1205 -278 -138 -42 44 22 -74 52 11 91 120 9 -43 -21 -41 184 13 69 -48 -134 -178 -379 83 82 -38 77 -186
1230 -186 10 -56 128 108 3 31 148 15 163 -2 2 21 -116 -1 -97 -111 59 36 -81 78 -10 171 -17
1253 -17 -60 56 242 79 -56 -27 131 49 -41 -118 -202 -202 -217 73 -188 -34 20 152 75 -43 62 163 99 14 85
1278 85 220 -96 -135 111 -108 31 -245 -186 -14 53 91 186 -25 126 -86 -149 -39 -20 158 264 52 -86 21
1301 21 36 -47 -234 -166 31 -156 66 232 -77 -42 73 146 144 145 39 165 -120 -160 47 -319 -153 120 -135 3
1325 3 251 208 -129 -20 90 122 -13 -18 112 151 -11 131 -175 17 -44 -112 84 69 57 -203 -46 -148 19 9
1349 9 48 242 -2 -6 104 -16 -72 177 68 -123 35 -106 -186 7 -130 -127 71 -2 -75 105 -96 27 34 161
1373 161 248 109 -162 -49 48 -237 236 29 94 161 -30 -5 -36 26 -25 58 69 -63 -86 -12 -17 150 -10 61 81
$$ packed form
1205b78J40R6Q6k2r6J26m1Q0K9j11n2K2k0K25j71N6j17q6m4k01M62jj20J15k63
1230a86J96o6J84k0j05K8J17j33J48j65MJ9j37J15r6j4J70k3j17J59q8J81j88
1253a7m3J16J86j63j35K9J58q2r0p7q4%j5K90k61J54N4J32p7j18J05J01o4q5P1
1278H5J35l16l9K46k19J39k76N9J72O7L8R5k11J51k12o3J10J9J78J06k12j38J07
1301B1J5q3j87O8J97j87K22J66l09L5J15P3kJj06J26k85m0K07l66J66K73k55J38
1325CK48m3l37J09J10L2j35nJ30L9j62J42l06J92o1o8J96j5j2k60J57j02J67j0
1349IL9J94k44mJ10j20n6K49j09j91J58j41q0J93j37LJ98p3p3J80k01J23PJ27
1373A61Q7j39k71J13R7k85M73k07O5O7j91K5l1O2n1Q3J1j32k3P4nJ67j60P1K0
$$ plain form
1398 81 -137 -56 -23 -140 209 -69 73 79 -33 101 -52 -198 -27 16 0 -37 175 -64 15 122 112 109 142 37
1422 37 90 25 56 -185 -106 -4 -21 144 -142 92 164 -44 -71 43 -90 54 19 61 194 -54 3 -37 -101 -102 157
1447 157 -80 -93 148 -10 27 -111 -51 284 -60 33 115 -71 119 -118 72 -46 190 220 20 -14 9 -13 -74
1470 -74 -27 -20 69 -10 -234 -65 138 81 -5 -34 -73 -53 112 -270 16 103 -97 84 -176 65 37 12 124 95 -167
1495 -167 99 77 -7 53 -20 202 3 8 -173 -63 132 -212 -11 -196 -4 -64 17 -79 36 85 -160 98 -251
1518 -251 -131 89 22 226 -243 -103 -146 120 -91 -181 17 -117 5 26 -67 215 189 -37 148 -192 -90 -46
1540 -46 -47 8 -176 -97 217 124 215 15 97 11 379 261 -25 -128 -125 15 -47 103 248 68 -16 -96 158 21 -150
1565 -150 136 233 358 25 -352 -146 48 -16 10 32 -99 72 144 157 -16 18 123 60 209 119 123 -120 -219 -76
$$ packed form
1398H1k18Q1L3j17L49k78J42Oj12J34j53j46J71M3j6l7K12k39P9J07j0lL3j05
1422C7N3o5L1k41P9J02j7J65k86K34P2k08k7J14j33J44l5M2J33k48N7m0o4jK59
1447A57k37j3K41j58L7j38O0L35l44R3Q2j86J90k37J90j18K36L0k00l4K3k2o1
1470g4M7PQ9p9k24J69K03n7q6k9l9K0J65l82K86Q7k00J81k60K41k8k5J12k9k62
1495a67K66k2q4O0p3K22j99Nj81J10J95l44K01j85J92o0Q1r6J15M9k45K58l49
1518b51J20K20o7K04m69J40m3K66k11r0J98j34J22K1r3K82k6k26J85l40J02M4
1540d6jN5j84P9L14r3R1k00Q2q6L68j18k86j03LJ40o2J50J45j80q4q0K54j37j71
1565a50K86R7J25l33l77K06J94o4K6K2j31J71P2J3j73L4J05o3J49r0Mk43r9J43
$$ plain form
1589 -76 74 -51 -110 102 54 100 36 46 53 -113 -57 61 -36 -21 48 -20 206 -145 210 27 250 24 30 9 -104
1614 -104 40 180 154 56 231 -70 -56 -94 9 77 -82 -84 -90 43 -116 -152 -99 13 -193 -149 124 -80 5 32 -72
1639 -72 -217 34 -71 -79 -70 -9 3 129 -226 89 116 -205 15 -59 -9 -42 -183 168 39 116 94 -113 -45 -201 83
1664 83 -134 -38 40 205 52 -145 -19 -21 -44 -118 30 7 -7 40 -63 -43 21 48 185 -37 18 56 67 -108 5
1689 5 40 86 -31 161 166 209 261 61 10 10 81 -10 -2 155 57 94 139 -65 44 58 37 156 47 43 55 -128 191 52
1717 52 111 51 94 157 31 -160 -83 -77 105 28 -5 -9 -50 -31 -24 217 81 -28 -40 -352 96 68 34 -166 -105 19 -51
1744 -51 -66 86 117 174 -32 -98 -66 -30 -31 32 -47 -142 -28 -52 -143 -362 60 -134 -1 153 -75 200 292 -18 15
1769 15 49 124 30 -146 -144 -148 4 139 16 -76 -44 -240 -175 41 82 116 54 -129 -73 11 -106 -105 -283 -197 232 93
$$ packed form
1589g6J50j25n9K12m8M6o4J0Pj66N6J18r7J5O9o8K26l51L55j83K23k26Ok1j13
1614a04J44J40k6r8J75l01J4l8J03O8j59koJ33j59l6N3J12k06M4K73k04Q5K7j04
1639g2j45K51j05qRO1J2J26l55L15K7l21K20p4N0l3j41L51j29P7k2k07O8j56K84
1664H3k17R6P8J65j53j97J26kk3p4J48k3j4M7j03K0O4K7J37k22N5L8J1j75J13
1689EL5M6j17J92NM3N2k00n1%P1r1QJ57r8L7M5k04J09J4k1J19j09mJ2j83L19j39
1717E2N9o0M3O3j26j91P7OJ82p7l3mm1J9PK41j36j09j2l12M48k8l4k00O1J24p0
1744e1j5J52L1N7k06o6L2L6jO3p9r5J14k4r1k19M22j94J33J54k28K75R2l10L3
1769A5L4P5r4j76KmJ52J35j23r2L2j96O5K16M1L4o2j83N6Q4j17Jj78Q6M29j39
$$ plain form
1795 93 -238 -194 -23 75 34 160 -34 -17 55 -78 0 -215 30 -21 9 -20 68 -51 128 -55 84 1 23 140
1819 140 -72 39 -37 -247 -60 205 180 -25 -135 -72 47 -51 216 48 34 117 89 -5 -207 60 -83 26 112
1842 112 88 127 103 -11 -58 -149 11 142 -124 59 203 -100 -195 -145 99 209 75 26 146 -48 223 86 14
1865 14 61 26 152 156 -129 -213 -155 1 119 101 -108 -26 -98 -46 -108 -153 79 80 -114 -53 37 267 232 20 103 106 194
1892 194 83 -22 192 231 -113 -99 212 -5 138 -21 5 118 -16 317 62 -68 -145 58 -86 -144 -62 -97
1914 -97 -18 -76 -70 -43 63 97 63 -11 -120 106 164 -30 -98 238 67 -133 147 201 -50 133 93 -15 30 170 163
1939 163 -7 208 26 -73 -85 -73 -85 51 14 -7 -75 -39 51 -181 66 69 -152 44 -81 32 -193 -102 72 -109
1963 -109 -252 77 -8 34 -16 4 88 196 -91 95 -87 142 -133 -175 56 -35 75 43 79 -67 -25 5 -40 -23
$$ packed form
1795I3l31M4J71R8m1J26j94J7P2j33P8k15K45n1L0k9Q8j19J79j83J39q3K2J17
1819A40k12J11p6k10J87K65k5k05j10O3J19r8K67j68j4Q3k8r4k02K67j43J09Q6
1842A12k4L9k4j14m7r1J60J31k66J83J44l03r5N0K44J10j34m9J20j94K71j37p2
1865A4M7l5J26Mk85q4N8J56J18j8k09Q2p2N2o2m5K32Jj94O1R0K30l5k12Q3LQ8
1892A94j11j05K14L9l44J4L11k17J43j59K6J13j34L33k55j30p7K03j44n8Q2l5
1914i7P9n8OK7J06L4l4p4j09K26N8j94o8L36j71k00K80N4k51J83m0j08M5J40p
1939A63j70K15j82r9j2J2j2J36l7k1o8L6R0k32K47Lk21J96j25J13k25R1J74j81
1963a09j43L29q5M2n0K0Q4J08k87J86j82K29k75m2K31r1J10l2L6j46M2L0m5J7
$$ plain form
1987 -23 22 146 182 -83 67 -220 214 42 -121 -144 57 136 -24 72 -25 -147 23 -160 75 -71 -88 42 -104
2010 -104 -78 -102 12 -49 36 152 -122 76 136 49 154 75 -53 -56 129 -6 81 -48 67 -19 99 28 -69 151
2034 151 181 27 -15 -69 -215 -39 -78 -24 110 -19 40 25 -9 -259 -61 -146 -171 48 -245 41 -49 -146 -92 -95 -111
2059 -111 -67 87 146 0 -75 211 -50 -160 110 -163 -52 87 -34 49 40 201 22 51 70 148 -76 -48 -200
2082 -200 105 -49 -153 164 162 167 -118 77 200 13 223 -150 120 -79 -106 104 -234 -74 51 1 -175 -110
2104 -110 62 -73 37 -39 66 7 152 -36 80 -172 -17 18 10 -89 98 28 -32 -40 -151 126 30 -354 20 -214
2128 -214 135 -91 -187 264 -35 57 133 -52 -49 4 106 -71 -5 148 -101 -45 -143 4 -99 11 -153 67 -97
2151 -97 7 64 -14 5 -71 -155 249 99 31 99 -32 -76 -194 -210 -64 45 -43 33 -84 71 -36 -140 122 67
$$ packed form
1987b3M5J24L6k65J50k87M34j72j63k3K01P9j60R6r7j22J70j83K35j46j7J30j46
2010a04K6k4J14o1Q5J16k74J98O0q7J05p9j28lJ85j35Q7j29J15q6J18p1r7K20
2034A51L0j54m2n4j46J76l9N4J34j29N9j5l4k50J98q5k5K19k93K86r0r7N4lj6
2059a11M4J54N9j46p5K86k61j10K70k73J11J39j21Q3rJ61j79K9J9P8k24K8j52
2082b00L05j54j04L17kNk85J95J23j87K10l73K70j99k7K10l38J60J25n0j76O5
2104a10J72j35J10p6J05n9J45j88J16k52J55L5qr9J87p0o0qj11K77r6l84L74k34
2128b14L49k26r6M51k99R2P6j85LN3J02j77O6J53k49N6r8J47j03J10j64K20j64
2151i7J04N7p8J9p6q4M04j50o8O8j31m4j18j6J46J09q8P6j17J55j07j04K62n5
$$ plain form
2175 67 19 84 55 90 134 3 -225 -140 -62 -9 -68 -143 26 119 -82 -73 -109 -21 -1 55 3 67 66 -102 63 61 -23 35 -65
2204 -65 -28 -102 -204 -144 -1 -24 -160 -38 38 -81 -160 -4 -80 -119 -93 116 68 95 -6 52 -8 -166 270 221 -50
2229 -50 -63 13 167 5 13 -198 -66 188 13 37 76 35 28 -114 -59 194 -72 -187 -24 78 -48 -61 -247 -13
2253 -13 101 -103 -43 -165 -65 25 164 -47 209 -122 -214 99 2 -141 -115 115 -168 -9 41 -1 -127 179 -133
2276 -133 223 7 -104 29 74 -35 19 46 -88 -280 -327 -21 148 22 13 -159 -171 -271 -147 17 -103 -50 -14
2299 -14 -128 -52 44 62 176 40 80 -138 104 171 67 37 -206 -51 159 70 -1 56 -93 -93 29 -71 -86 -107 -5
2324 -5 -5 -76 -1 176 -121 173 57 49 33 -2 90 -12 -232 -90 25 -83 21 34 106 -266 93 40 58 59 -72 21
2350 21 -62 -11 -145 -118 132 57 -120 -18 -12 33 93 -153 -46 -190 -158 213 -79 -142 -18 -15 142 47 85 129 45 51
$$ packed form
2175F7m8O5k9L5M4j31k28Q5P8N3n9p5J69R3k01Rl6Q8K0N6n2O4jj68J65kq4N8j00
2204f5L7p4j02O0J43k3j36J22P6j19p9J56p6l9K6K09m8K7j01N8o0j58M36m9k71
2229e0j3P6J54j62Qk11J32K54j75K4L9m1pj42N5K53k66j15J63J02j26j3j86K34
2253a3J14k04O0j22J00R0J39k11K56l31r2L13r7j43K6K30k83J59N0m2j26L06l12
2276a33L56k16j11J33M5j09N4K7j34j92m7L06J69j26rj72j2j00J24J64j20N3L6
2299a4j14P6R6J8J14j36M0k18K42O7j04l0k43J55K10q9p1N7j49%J22j00j5k1J02
2324e%p1P5J77k97K94j16qj6l5R2j02k20J42J15j08J04J3P2l72L59n3J8Jj31R3
2350B1q3N1j34K7K50p5j77J02OM5O0k46J07j44L2L71k92o3J24LJ57r5L8M4q4O
$$ plain form
2376 51 60 -64 -217 18 -40 135 -30 25 -40 127 186 -26 115 -29 16 271 -158 25 160 54 -138 157 12
2399 12 -151 -22 -53 102 206 124 46 -159 2 -177 -6 -38 -140 -51 -321 -191 -153 -32 89 52 47 -136 14
2422 14 124 241 130 -287 -90 34 -124 24 289 -79 64 -155 49 -137 42 204 -54 61 50 78 127
2443 127 8 125 97 -73 96 100 -24 67 12 41 2 -197 50 115 107 -72 92 -114 163 -15 34 220 121 -183
2467 -183 158 1 -89 -145 -60 -61 -32 -232 0 2 330 -84 -110 142 -144 110 17 136 43 78 -7 -97 25 -169 -98
2492 -98 191 173 -16 26 109 -58 -129 115 -384 -48 47 -161 111 -37 23 -165 0 -8 17 12 -123 82 16 90 -223
2517 -223 -99 -16 -104 101 75 89 -112 3 -31 125 -8 -68 45 96 -82 90 10 -65 -26 -98 -4 -122 11 43
2541 43 24 2 -34 -56 -330 -104 -66 -97 157 38 41 -47 -51 -88 0 23 15 203 144 77 -42 211 -29 -14 26 -176 25
$$ packed form
2376E1Rj24j53K35n8J75j65N5o5J67N9k12J41j44M5K55m29J83J35j06j92K95j45
2399A2j63J29l1J55J04q2p8k05J61j79J71l2j02Q9k70J30L8J21J21l7nj83J50
2422A4J10J17j11m17J97J24j58J48K65l68J43k19K04j86J79J62k58J15j1K8M9
2443A27j19J17k8j70J69Mj24R1n5K9l9j99K47O5qj79J64k06K77j78M9J86r9l04
2467a83L41j57r0n6Q5jK9k00K32KL28m14k6K52k86K54r3J19r3L5q5r0J22j94P1
2492i8K89j8j89M2Q3j67p1K44m99L36R5k08K72j48O0j88J65qK5nj35K05o6P4l13
2517b23J24Q3q8K05k6J4k01J15l4J56j33o0J13N1j78J72q0p5L9p2R4j18J33L2
2541D3j9k2l6k2k74K26L8l1K54j19Lq8ml7Q8K3qJ88n9o7j19K53k40J5M0k02K01
$$ plain form
2568 25 5 145 55 209 182 -15 59 -11 141 -19 149 -18 -12 20 -51 -220 117 60 3 47 -122 -139 -236 -74 2
2593 2 134 -79 -47 117 205 -49 92 -103 28 -74 -36 -143 -131 110 -44 143 -24 -150 145 -68 33 -111
2615 -111 65 -152 -25 -34 -69 134 -34 217 -37 200 6 182 124 171 16 97 -100 215 -36 63 -193 60
2637 60 -6 -32 -24 -43 36 -87 75 -168 17 15 -116 -19 188 -171 -64 43 29 9 14 22 -31 -2 21 -93 58 206
2663 206 83 123 -49 -146 -41 -118 51 44 -50 61 101 157 32 -13 84 -304 -213 -45 55 7 -84 161 59 -40 -243
2688 -243 -104 -144 60 0 -91 121 -56 42 -123 -226 -66 -113 88 56 159 4 9 -63 -27 -26 34 1 -13 -39 -104 46
2714 46 -8 -4 -14 -82 -30 -115 9 155 192 -200 128 -101 135 -23 135 -157 -172 54 -93 -116 -71 25 77 153 224
2739 224 -119 92 -123 126 -154 -139 137 -24 -29 186 118 -211 22 -87 81 136 117 -37 -90 26 -146 7
$$ packed form
2568B5k0J40r0J54k7j97P4p0J52j60J68j67OL2p1j69L37n7n7M4j69j7r7J62P6
2593BJ32k13L2J64Q8k54J41j95J31j02L8j07J2K41j54J87j67j26K95k13J01j44
2615a11J76k17J27rl5K03j68K51k54K37j94J76n8M7j55Q1j97L15k51R9k56K53
2637F0o6k6Qj9P9j23J62k43J85kj31R7K07l59J07J07j4k0NQn3K9K3j14J51J48
2663B06j23M0j72r7J05p7J69pr4J11M0N6j25m5R7l88R1J68J00m8r1K45j02r9k03
2688b43J39m0K04o0r1K12j77R8j65j03J60m7K01l2J03j55Np2L6JO0l3j4k6o5J50
2714D6n4Mj0o8N2q5J24J46L7l92L28k29K36j58J58k92j5K26j47k3M5R6N2P6P1
2739B24l43K11k15K49k80J5K76j61nK15o8l29K33j09J68N5j9j54n3J16j72J53
$$ plain form
2761 7 68 -21 -119 -32 78 -66 74 -236 87 -115 192 -82 -36 -4 -3 -8 246 67 97 -129 -90 128 -155 258 -210
2786 -210 48 98 -179 -223 118 -92 -38 105 38 148 155 -169 152 -186 -60 3 -76 169 68 -163 15 -124 -134
2809 -134 -24 -59 26 -127 -134 -99 247 -8 62 -37 107 -118 70 133 -28 -176 29 72 239 -64 -67 200 -196 139
2833 139 41 39 -30 -6 151 89 71 -161 -28 77 99 -68 -80 165 3 -84 128 324 -15 -176 -48 -160 121
2856 121 -46 -17 -95 32 -142 -218 35 -42 -32 -192 21 9 -22 -147 104 89 74 -24 -114 226 -70 116 125 44 134
2881 134 -10 -31 152 79 122 55 70 110 18 -188 18 188 114 9 -32 47 -38 -6 138 6 52 -69 -42 92 19
2906 19 18 -81 -121 73 112 -78 70 -82 102 39 -25 -54 -194 -77 93 -57 -78 -1 7 -68 -76 -210 17 -239 150
2931 150 -97 -81 193 -186 58 -75 213 28 26 -119 -47 -65 19 29 -39 -41 -2 132 68 -10 77 24 -178 155 -105
$$ packed form
2761GO1q9r8Q7J10j44J40l10L23k02L07k74M6L2JnK54j79L0k26L9K18k83M13m68
2786b10K58N0k77m4L41k10N4J43o7J10Pl24L21l38J26O3p9K45j01k31J78j39j0
2809a34J10l5Q5j53pL5L46k55P0r9J44k25J88O3j61j48K05M3J67l03lK67l96L35
2833A39r8ko9K4J57o2j8k32J33J05K2j67j2K45j62q7K12J96l39j61J28j12K81
2856A21j67K9p8J27j74p6K53p7J0j60K13j2l1j25K51j5j5r8r0L40k96J86Rq1R0
2881A34j44k1J83p3M3o7J5M0r2k06K06J70p4j05m1P9q5L2J44j32M6j21K7J34p3
2906A9jr9m0J94L9j90J48j52J84o3o4k9j40J17J70j50k1P7Qp5qj34K27k56L89
2931A50k47J6K74l79K44j33K88j85kj45P2j8Q4J0o8kL9J34o4p8Q7n3k02L33k60
$$ plain form
2956 -105 -95 -127 -205 85 -276 -98 26 142 -46 -44 -132 -128 -112 68 -47 272 -66 -2 42 59 -21 24 105 -188 -100
2981 -100 -9 16 -8 -67 79 -1 74 -184 33 121 102 -82 103 0 17 17 -71 273 -16 100 -47 157 -79 -28
3005 -28 -85 -103 46 -41 40 -56 -9 65 -63 224 136 45 -103 -97 -128 146 -51 -188 70 8 96 -109 -125 161 -26
3030 -26 -39 67 135 81 -83 77 111 171 -143 -63 -19 31 -46 28 -26 -88 119 106 244 33 93 -152 -124 177 -35
3055 -35 185 78 -25 58 5 102 -62 112 151 -87 -115 -85 185 44 57 126 158 -184 -158 12 60 -146 47 -57
3079 -57 -69 161 -55 131 -237 32 116 -47 108 188 -87 72 -104 -126 139 1 -51 -87 169 -235 -88 47
3101 47 -162 -63 -17 75 72 124 130 -81 -60 -12 63 96 32 -122 60 94 -151 54 -191 -53 181 44 36 118 -247 17
3127 17 -45 -120 112 -186 -89 -59 -6 22 141 -86 -180 2 47 63 -194 -90 -161 106 69 -97 -62 128 32 44 76
$$ packed form
2956a05J0l2p8K90l61J78J24J16j88Kq8MJ6J80j15L19l38O4M4J7q0M5Q1k93Q8
2981a00R1K5k4n9J46q0P5k58K17Q8j9j84J85j03J7%q8L44k89J16j47K04k36N1
3005b8n7j8J49q7Q1r6M7P4j28K87q8r1j48Ol1K74j97j37K58o2Q8k05j6K86j87
3030b6j3J06O8n4j64J60L4O0l14Q0M4N0p7P4n4o2K07j3J38k11O0k45K8L01k12
3055c5K20j07j03Q3n3R7j64J74L9k38k8L0K70j41J3O9L2l42K6J70M8k06J93j04
3079e7j2K30k16J86l68K69Q4j63J55Q0k75J59j76k2K65j38n2l6K56m04J47J35
3101D7k09R9M6R2lN2Ok11K1M8P5L3o4j54J82L4k45K05k45J38K34j37qQ2l65K64
3127A7o2p5K32k98R7L0N3K8J19k27r4J82M5J6k57J04p1K67l7j66L5J90r6J2L2
$$ plain form
3152 76 -34 7 55 16 -101 -136 -46 149 192 3 -143 59 -185 113 128 166 -126 -139 -48 -146 43 8 2 -3 -163 106
3178 106 34 2 -38 -92 -31 19 155 -10 -129 -89 23 -10 103 -96 64 53 172 123 -15 29 57 -17 -352 -189
3202 -189 25 -235 -51 60 -183 22 -76 30 188 -142 -85 185 -132 2 -35 -93 281 128 -92 -35 128 -269
3224 -269 -93 11 0 -33 -65 40 6 -92 -18 79 170 46 57 14 83 305 -207 -34 -107 7 157 122 192 -91 -68
3249 -68 -204 -43 -126 161 10 235 250 137 -92 33 -127 19 -52 -64 78 21 16 -142 142 -134 -88 8 286
3272 286 95 -234 -59 -101 -203 30 -73 -288 207 -224 162 135 -75 -145 88 112 185 99 34 159 22 45 -33
3295 -33 2 -155 -213 58 185 -87 90 -90 -169 128 -165 -217 128 -37 49 -18 143 99 -134 -233 -131 61 69 37
3319 37 -48 -100 38 143 -118 -38 39 -24 43 195 110 63 -151 173 -39 -128 -66 222 -72 -126 140 166 69 -282 -225
$$ packed form
3152G6j10M1M8l9j17l5R0J95M3j89j46K02k44K98J5L8k92j3R1r8J89l5onj60K69
3178A06p2l2m0n4O1N0J36j65j19M0J12l3J13j99J60j1J19m9j38M4K8p4l35J63
3202a89K14k60J84J11k43K05r8J06J58l30N7K70l17J34l7n8L74j53k20N7J63l97
3224b69J76J04j1l3l2J05l4r8P4R7R1j24J1m3O9K22n12J73p3J14J50l5P0k83K3
3249f8j36J61q3K87j51K25J5j13k29J25j60J46p1j2J42n7nj58K84k76M6R6K78
3272B86j91l29J75m2j02K33j03k15M95m31L86k7k10p0K33K4P3q6o5J25j37K3p8
3295c3L5j57n8K71J27k72J77j80p9K97k93n2L45j65Q6o7J61m4k33r9J02J92Ql2
3319C7q5n2J38J05k61Q0P7o3O7J52q5m7k14L24k12q9O2K88k94n4K66K6r7l51N7
$$ plain form
3344 -225 70 61 38 73 48 -133 -104 48 -198 -169 171 -28 -112 9 3 -65 -65 170 -62 -181 15 80 -22 -78 -40
3369 -40 103 25 167 -78 105 39 -23 12 45 107 -78 -22 -66 -78 -96 21 120 -89 4 162 8 40 70 -75 329
3394 329 -66 94 35 190 31 167 82 52 74 55 -30 9 -88 -91 -33 -214 62 -237 130 76 214 195 -205 0
3418 0 14 -43 96 -217 13 31 -21 131 -42 -28 -166 72 -68 181 -268 107 15 26 172 99 -148 106 14 -195
3442 -195 -45 340 -158 -1 144 131 93 159 95 -94 -119 -110 -56 -232 182 -139 -58 -216 -55 3 148 36 49 41
3466 41 -76 -9 21 -16 -38 -93 -205 -202 -87 -100 80 99 30 41 42 93 25 -68 133 229 -153 75 94 -56 -14 -128 -20
3493 -20 -69 -12 8 45 -200 66 -18 119 -59 155 -78 -36 -47 56 115 -117 27 29 -166 -17 -133 -112 121 154
3517 154 50 76 -134 -29 41 114 7 94 -279 -94 175 138 -140 128 17 -60 36 -33 -20 108 48 47 39 -141 -73
$$ packed form
3344b25K95rk3L5k5j81K9J52k46K9L40j99q4J21oo8%K35k32j19J96O5j02n6L8
3369d0J43p8J42k45J83o6o2L5L3O2j85N6m4j2j8J17R9k09R3J58j54L2L0j45M04
3394C29l95J60n9J55j59J36q5l0K2j9q5L9r7lN8j81K76k99L67n4J38j9m00K05
3418@J4n7J39l13K30J8n2J52j73J4j38K38j40K49m49L75r2J1J46p3k47K54r2k09
3442a95J50L85m98J57J45j3l8O6o4j89k5RN4j76M14l21Q1j58J61N8J45j12J3q
3466D1j17O7L0l7k2n5j12LJ15j3J80J9o9J1JN1o8r3K01R6l82K28J9j50M2j14J08
3493b0m9N7K0L7k45K66q4J37j78K14k33M2j1J03N9k32J44Kj95J49j16K1K33L3
3517A54j04K6k10J05P0P3j07Q7l73J85K69l7k78K68j11p7R6o9J3J28o0jqj80O8
$$ plain form
3542 -73 -4 -51 168 287 -160 -112 88 -34 45 40 -17 -184 -189 -288 -135 14 69 43 119 -21 81 7 -6 22 140 -96
3568 -96 -49 -88 -130 -146 -90 213 -17 108 -85 0 109 -300 162 26 -94 97 103 -76 23 -62 128 24 -87 155
3592 155 99 72 -82 -82 38 -37 -7 -182 -86 -142 135 -50 -133 206 -21 -158 -102 49 26 -234 26 75 -73 -126
3616 -126 -209 90 87 97 144 129 194 75 163 -70 -36 -12 -96 225 127 156 121 2 -53 -122 220 -81 -43 -187 1 -17
3642 -17 -29 -172 62 153 81 -150 194 54 -77 -172 -131 93 29 50 18 -127 -155 177 -69 -145 53 -3 -20 -53 89
3667 89 -142 62 14 -115 -30 66 31 9 251 -111 97 -85 5 -92 -87 189 -12 -7 16 89 -14 -37 124 141 -30
3692 -30 92 -84 -10 -16 -37 106 -146 -31 90 69 -50 113 -9 -114 116 -208 153 49 -409 -181 -40 -114
3714 -114 -1 -97 -140 178 -15 30 224 -19 -28 21 -88 -139 189 -21 -50 -190 204 161 -100 84 -79 -39 -12 -11
$$ packed form
3542g3O9m7K19J19m47M8K00j22P9nn7j67nr9J53J49N5k6P6j40J02p4j3K8J18k36
3568i6M7l9m2j6N6L03k30J25j93Q5J09m09M62j36j20J91Oj79R9q5J90j04j11K42
3592A55n6k7j54%J20p5L0j75R6n6K77j85q3L39k27j37N6J51k3k60K60M9j48n3
3616a26q3K99lJ0M7j5O5j19Q8k33L4K4q4L21r8K9l5j19n5o9L42l01L8j44J88j8
3642a7j2j43K34R1p2k31L44j40j31r5M1K24o4K1l2j45k8L32k46p6J98n6j7l3J42
3667H9k31K04m8j29Q5R6l5k2K42l62K08j82R0r7NK76k01NK3P3j03k3J61J7j71
3692c0J22j76P4ok1J43k52J15J21k1j19J63j22j05K30l24L61j04m58K28J41p4
3714a14J13r6m3L18j93M5J94k43rM9j09n1L28k10k9j40L94m3k61J84j63M0K7J
$$ plain form
3738 -11 43 -39 137 -172 77 -28 -82 19 -195 22 9 156 -46 -96 -15 -22 128 109 30 42 -44 69 -73 -89 -61
3763 -61 58 -129 35 -95 -128 181 -205 131 178 -18 -64 -50 11 -42 -275 74 -54 93 -90 13 -14 -86 34
3786 34 -55 -18 200 105 83 -58 41 4 -181 67 63 120 115 -18 140 86 -41 -121 61 109 77 229 3 71 144 115
3812 115 -4 19 -171 16 39 34 -96 -56 -61 134 -34 51 78 5 108 -235 39 -27 -64 73 278 102 -146 -11
3836 -11 -103 -4 -74 -70 90 -16 -138 70 -48 -64 167 44 -10 9 -203 -36 -47 46 91 51 36 117 40 90 20 -65
3862 -65 243 -149 81 98 39 9 -13 -116 -93 20 149 165 -122 166 -157 126 75 55 1 70 -84 70 -16 -33
3886 -33 -204 85 96 -111 99 59 134 131 81 51 121 -56 132 -132 -181 97 -51 167 -110 -79 -53 -70 -52 6 280
3911 280 -222 49 -20 20 -52 91 136 -199 3 77 117 97 53 -117 26 -126 -7 -166 -124 47 143 139 -52 114
$$ packed form
3738a1N4q2J76l09K49j05n4J01k14K17j3J47k02n0Q1pJ50j9p9J2q6J13j42j6K8
3763f1J19j87J64j30l3L09l86L36M7j96m6J4O1n3k33L49j28J47j83J03k7p2J20
3786C4q9L7K18r5k2j41R9l7j85K48mN7nj33J58n4j27q0J82M8l2J52k26O8P3k9
3812A15j19K3j90J87K3nj30M0nJ95j68Q5K7p3J03l43K74o6l7J37K05j76k48J35
3836a1r2R9p0MJ60j06j22K08j18j6K31j23n4J9k12J67j1R3M5m0j5Q1p7N0p0q5
3862f5L08l92K30J7n9l0k2j03K3J13J29J6k87K88l23K83n1k0n4O9j54J54q6j7
3886c3j71K89J1k07K10m0P5ln0l0P0j77J88k64m9K78j48K18k77L1K6j7J8N8K74
3911B80n02K71o9M0p2J43M5l35K02P4M0k0m4j70J43j52J19j59M2J71R6mj91J66
$$ plain form
3935 114 -53 -120 53 -215 59 31 -86 -92 -7 198 -78 -14 73 -14 -87 17 -59 21 -228 -6 71 74 -50 -186 39
3960 39 35 -152 -45 -56 231 -61 -37 -89 -126 39 -63 56 19 -56 89 -15 -97 45 -148 22 -60 204 -203 73
3984 73 248 69 -38 93 -14 19 48 -63 108 -160 -37 9 -57 -8 -166 -50 -8 265 180 -123 87 -95 -139
4007 -139 -124 -134 126 130 -45 161 147 -120 18 50 57 -27 -80 50 -38 -320 191 -34 107 26 -52 -29 -46 -79 166
4032 166 -25 -168 39 -10 -132 117 -53 -34 133 -95 23 30 20 -93 -69 -54 -164 -32 94 -15 30 -129 -25
4055 -25 -252 75 89 -141 14 16 -52 139 55 -77 55 112 -211 39 24 3 -331 0 37 9 -49 33 32 95 -203
4080 -203 26 -175 -55 55 19 81 191 85 5 67 -118 -28 81 58 -71 16 -119 97 62 13 -125 189 76
4103 76 -57 -123 22 -1 132 -97 52 293 -50 58 121 -163 69 -158 -64 -31 4 -44 -212 -31 -268 -104 -74
$$ packed form
3935A14j67o7J73k68K74k8j17oQ5K05k76O4Q7q7p3J04p6Q0k49K22P7Lj24j36K25
3960C9mj87J07j1K87k92K4n2l7J65j02J19l7p5J45j04q2J42j93J70q2K64m07K76
3984G3J75j79j07J31j07L3K9j11J71k68J23M6o6M9j58J16M2K73q5l03K10j82m4
4007a39J5j0K60Mj75K06j4k67J38L2Pq4n3J30q8k82N11k25J41q1p8K3j7l3K45
4032A66j91j43K07m9j22K49j70J9J67k28J18Pj0j13K4J5j10J32J26j09M5j59J04
4055b5k27L27J4k30J55Ko8J91q4j32J32N7l23K50j5k1l34L31L7k8n8Q2jO3k98
4080b03K29k01J20J10l6O2J10j06q0O2j85R0J09k3j29Q7j35K16l5m9j38L14j13
4103G6j33o6J45k3J33k29J49K41l43J08O3k84K32k27R4L3L5m8j68J81k37J64L0
$$ plain form
4126 -74 -250 -36 -73 26 -83 35 -85 -13 81 -24 -97 -110 -185 -158 195 133 0 73 271 29 -18 119 130 81 -26
4151 -26 61 -89 116 153 9 -19 -56 -63 267 118 277 37 124 21 196 137 51 108 -68 -99 92 -30 -88 101
4175 101 128 -42 121 100 -7 -110 -110 -31 -105 -158 -122 -65 146 -116 -193 185 -191 53 -155 -342 -12 72 60 -99
4199 -99 -87 -161 51 16 -113 -167 -38 -186 -4 1 -246 34 90 -124 46 108 -5 -42 4 11 -114 148 160 -81 260
4224 260 -3 53 118 -169 28 21 -102 119 -94 -4 319 237 32 50 -43 -74 72 -137 53 113 -49 -66 -187 42
4248 42 -48 80 135 101 45 44 -5 -123 97 -35 27 -215 -52 86 -158 -11 -90 -140 361 23 29 151 -14 -268
4272 -268 -15 -33 -9 -3 -24 34 -95 37 -88 -39 -38 51 99 -116 -256 -71 139 7 9 -33 -20 250 -56 78 50
4297 50 122 -348 95 -6 -68 322 -263 -40 133 34 153 -54 29 -85 28 -135 14 73 -53 23 -57 -57 -73 -80
$$ packed form
4126g4j76K14l7R9j09J18j20P2R4j05p3j3p5K7L53o2j33P3J98k42m7J37J1m9j07
4151b6Q7j50K05L7j44k8l7pL30j49J59k40Q7j03J75n9q6N7j76l1J91j22n8J89
4175A01K7j70J63k1j07j03%P9p4n3L6N7K11k62p7L78l76K44k08j87L30Q4j2j59
4199i9J2p4K12l5j29n4J29j48J82Nk47K80N6k14J70O2j13l7M6Pj25K62J2k41L41
4224B60k63N6O5k87J97pj23K21k13R0L23q2k05J8r3l1J46k09J90O0j62j7j21K29
4248D2r0J28N5l4n6jm9j18K20j32O2k42J63J38k44J47p9n0N01l38OJ22j65k54
4272b68K53j8K4Ok1N8j29J32j25M9JQ9M8k15j40J85K10j32Km2J3K70l06J34k8
4297E0P2m70M43j01o2L90n85K23J73r9J19k07Q3j14J13j63J49N9j26P6q0%j6p
$$ plain form
4321 -80 -139 -57 -147 -11 235 54 -7 90 109 -173 40 -38 -56 19 67 0 -57 85 -59 98 5 -58 -222 97 118
4346 118 51 1 54 180 19 17 -55 -310 -37 -48 -58 55 -103 32 -13 176 82 -36 -24 -220 52 -144 154 92
4370 92 64 -11 -25 246 95 -117 -19 181 129 155 14 -110 -81 -120 77 -128 44 85 -46 -90 -122 -246 18 -29
4394 -29 25 99 7 -40 -11 101 -36 84 -95 34 -3 -149 -19 163 -135 63 -53 36 -202 164 63 -103 42
4417 42 -20 49 199 152 150 79 -101 28 15 15 -17 -145 57 63 -176 32 -72 165 -8 -319 -108 -93 -56 18 180
4442 180 -7 5 -45 46 -139 194 -67 11 38 182 -46 25 -93 18 -201 -64 54 0 262 41 -28 147 117
4465 117 52 123 -121 -28 27 18 -50 96 62 124 97 -267 -71 147 22 -99 26 -52 -128 -243 113 102 47 177 -48
4490 -48 -112 1 30 -192 -41 -99 -33 -30 -87 17 25 7 -20 102 -90 220 116 16 73 17 30 98 25 85 85 -185 94
$$ packed form
4321h0n9Q2r0J36K46j81o1R7J9k82K13p8j8P5M8o7n7J42j44J57r3o3j64L19K1
4346A18o7n0N3J26j61kp2k55K73j1j0J13j58J35m5J89r4j18J2j96K72j96K98o2
4370I2k8p5j4K71j51k12R8K00n2K6j41j24K9l9J97k05J72M1j31m4l2j24K64m7
4394b9N4P4r2m7K9J12j37J20j79J29l7j46J30J82k98J98j16Q9k38L66j01j66J45
4417D2o2O9J50m7kp1j80J29j3%l2j28K02Ok39K08j04K37j73l11K11J5L7P4J62
4442A80j87J2n0R1j85L33k61P8K7J44k28P1j18J11k19J37J18n4K62k21o9J75l0
4465A17o5P1k44R3N5ro8J46l4O2k7l64J96K18j25j21J25p8p6j15L56j1n5J30k25
4490d8o4J13K9k22J51n8O6Ln7J04Qj8k7J22j92L10j04j00N7n6J3O8p3O0%k70K79
$$ plain form
4517 94 41 47 144 42 65 -39 41 189 164 -19 -78 -66 15 151 4 -102 -189 43 -65 37 20 -86 -77 69 -41
4542 -41 86 -112 -278 25 -56 -22 -225 22 178 -146 -5 93 95 117 24 -38 157 -51 98 -87 20 -114 175
4565 175 -146 19 160 -196 10 -192 -217 -162 23 20 120 212 -16 66 -9 107 -103 -63 -187 -57 -34 -192 -80
4588 -80 7 -59 42 17 -52 -36 -127 -33 121 -120 -57 32 -105 -63 180 -95 -32 -164 84 -121 36 62 79 -139 -17
4613 -17 -132 132 -45 -154 73 167 -133 11 82 7 29 37 -11 107 41 -118 -53 -187 27 22 -191 192 -52 -45 135
4638 135 -126 15 16 224 -43 25 3 71 -36 16 136 -66 -61 38 21 -38 -34 -135 123 -127 -22 -209 55 -40 253
4663 253 -72 -219 -83 90 115 69 -36 38 -86 -57 35 -63 37 -119 -49 -57 15 -33 -129 19 -128 -129 145 30 75
4688 75 175 36 104 115 -42 44 -35 136 19 -66 43 48 -4 -23 91 77 -85 77 213 -90 -130 -119 -76 126 88
$$ packed form
4517I4n3OR7j02K3j04Q0J48k5j83n9J2Q1J36j47j06q7K32j08J02j7j06RJ46j10
4542d1J27j98j66L03q1L4k03K47J56l24J41R8KK2r3o2J95k08J49j85J07j34K89
4565A75l21J65J41l56K06k02k5N5J85lJ00R2k28Q2p5J16k10M0j24J30K3j58J12
4588h0Q7o6J01k5o9J6r1R4J54k41O3Q9j37M2K43k75O3j32K48k05J57K6J7k18J22
4613a7j15K64j77j09K27R4l00J44P1p5K2Qm8J18o6j59O5j34K14nk13L83k44PJ80
4638A35k61J41JK08k67O8k2O8j07N2J20k02NR9j7n9Mj01K58k50J05j87K64r5K93
4663B53l25j47J36J73K5m6j05P4j24K9R2r8J00j56P0qP2m8r6J48j47jK74j15M5
4688G5J00j39O8J1j57Q6p9J71j17q5J09Nn2j9J14j4j62J62J36l03m0J1M3K02l8
$$ plain form
4713 88 131 -24 -189 -8 -51 113 85 176 58 6 -109 40 38 -117 137 -36 166 -50 -164 256 77 -137 179
4736 179 -88 -147 476 40 154 53 -28 -18 -22 -108 -248 80 -91 137 -5 -213 -82 -33 -11 -86 113 5 -42
4759 -42 3 -97 -125 22 -212 1 -75 179 16 -206 20 -8 136 12 -63 53 55 64 3 -19 -184 84 -111 -10
4783 -10 55 -91 27 179 84 62 -61 -9 68 48 15 72 -133 47 -108 -88 -213 -188 25 -38 -97 39 -176 -23
4807 -23 72 116 99 35 123 -115 -89 -219 64 -188 96 -35 79 -163 183 -54 -183 -1 -124 34 -37 19 -78
4830 -78 -196 -146 -60 -26 76 -211 17 -8 -16 -122 193 -15 87 33 -124 -40 6 -57 114 137 97 28 -106 43 89
4855 89 9 -152 -11 -94 67 -243 -4 62 -194 -107 51 413 93 81 -244 -167 27 41 94 26 -24 -81 9 84 -128
4880 -128 96 -10 -87 -40 92 25 -75 -26 68 -21 115 -1 11 158 151 48 -12 106 31 196 50 -171 183 -60
$$ packed form
4713H8M3j55j65J81m3J64k8R1j18n2j15J49kj55K54j73K02k16j14M20j79k14L16
4736A79k67n9O23m36J14j01q1J0mq6j40L28j71K28j42k08J31M9K2p5J99j08m7
4759d2M5j00k8J47k34K13p6K54j63k22K26k8J44j24p5J16KRo1k2j65K68j95J01
4783a0O5j46J18J52r5k2j23N2P7k0l3N7k05J80j55K0j25K5K13o3n9J36k15J53
4807b3R5M4j7o4Q8k38K6j30K83k52K84j31J14k42L46k37j29J82j23J58p1N6r7
4830g8j18N0Q6L4J02k87K28k5qj06L15k08J02n4j57Q4M6o3J71K3m0o9j34J49M6
4855H9q0j61J41q3J61l10K39O6k56Q7J58L62l20j2l25P7J94J4N3o8n0n7R0P5k12
4880a28K24j06p7M7J32o7j00M9R4q9J36j16J2J47pj03o0J18p5J65j46k21L54k43
$$ plain form
4904 -60 113 -240 97 -185 108 -50 -96 -34 -90 -122 42 -66 -132 150 -106 50 -126 -47 -133 164 110 11 -18 54
4928 54 51 -176 -53 33 -22 -44 -214 93 -153 108 -43 118 16 -43 146 -161 -86 94 230 155 74 38 -40 -40 235
4953 235 -118 18 -38 -15 -32 62 45 190 -174 106 181 224 197 -185 48 -103 40 -49 -18 49 108 150 -45 -45 -76
4978 -76 -77 -84 35 33 286 -44 -45 -49 59 89 -178 118 -103 -29 32 -37 190 -134 75 -73 171 -187 -216 79 -75
5003 -75 -29 24 33 15 -6 34 -50 -71 9 -284 0 -127 44 12 -79 49 45 -34 7 140 -155 202 206 74 -9 -109 24
5030 24 51 126 98 156 13 -10 -147 242 -122 148 -132 90 -113 -120 70 -7 -95 -133 16 -6 -8 -133 27 50 88
5055 88 -22 58 -81 -30 54 -146 -75 -211 -57 -152 -2 282 -55 -201 135 -152 65 -56 193 58 -205 44
5077 44 -184 147 154 -113 -118 -114 131 -104 -210 102 -11 129 60 177 -98 -108 18 28 -250 54 108 -129 -156 -123
$$ packed form
4904f0J73l53L37k82K93j58m6O2n6l2J64j08o6K82k56J56j76P9q6K97n4r9k9P2
4928E4lk27J23Q6n5k2j70L07k46K61j51J61j02n9J89l07P5J80J36p5q1l6p8%K75
4953B35l53J36n6K3j7R4j7J45l64K80P5M3k7l82K33j51J43q9L1O7N9M2j95%l1
4978g6jpJ19kK53l30jmJ08L0k67K96k21P4O1o9K27l24K09j48K44l58k9K95j54
5003g5M6N3Rj8k1M0q4k1Q0k93K84j27J71l2r1J28mp9M1J33k95L57Mj32q3j00J33
5030B4K7P5k8N8j43k3j37L89l64K70k80K22k03pJ90p7q8l8J49k2kj25J60K3L8
5055H8j10Q0j39N1Q4k00P1j36J54r5J50K84l37j46L36k87K17j21K49j35k63K49
5077D4k28L31Pk67nMK45k35j06L12j13J40o9J17k75j0J26J0k78L04N4k37k7L3
$$ plain form
5101 -123 17 -8 71 -267 -189 -115 68 -185 213 26 97 186 -126 -141 -65 -151 -92 -91 -63 22 161 157 -90 -106 43 -51
5127 -51 -306 11 -96 214 15 127 -132 67 -66 -71 67 -62 136 -63 165 59 -45 -38 -169 -107 -73 92
5149 92 -119 -178 271 16 -141 -50 -84 49 64 -48 93 -227 -183 -88 -73 -82 -20 36 -106 126 -161 -281 -172 -31
5173 -31 -20 -43 89 61 16 200 -116 95 -19 71 87 -17 157 95 -34 90 -81 -163 -33 53 -62 -129 -45 -170
5197 -170 -69 -247 -23 -213 -11 -26 -148 -121 109 276 -83 -15 -29 -192 175 -130 39 -156 63 -74 28
5218 28 -44 -43 63 178 -68 -13 147 196 109 67 25 119 134 -36 -71 -198 41 54 -76 156 21 72 -134 61 -101
5243 -101 155 -128 -71 73 26 -79 -206 70 141 -24 72 -28 -123 -19 76 -14 -104 137 14 -104 -59 75 -67
5266 -67 -120 -55 151 -17 46 -7 52 -8 50 -43 167 134 45 284 25 143 290 67 105 4 -95 -200 -142 -95 101
$$ packed form
5101a23J40k5P9l38P8P4J83k53L98j87P1Q9l12j5P6q6N9JK8Q5J39mk47j6J49r4
5127e1k55L17j07L10j99J12k59J99j33nJ38j29J98j99K28j06j04Pj31O2L4J65
5149I2k11n9M49k55j57R1l4J33J5j12J41l20M4R5J5rO2N6j42K32k87j20J09J41
5173c1J1k3J32k8m5J84l16K11j14R0J6j04J74o2j29J24j71q2J30Q6j15o7Q4j25
5197a70J01j78K24j90K02j5j22K7K30J67l59O8j4j63L67l05J69j95K19j37J02
5218B8p2JJ06J15k46N5J60M9q7m2m2R4J5j70l5j27K39J3j30K32j35N1k06J95j62
5243a01K56k83N7J44m7j05j27K76P1j65R6j00r5J04R5r0r0K41j23j18M5J34j42
5266f7n3O5K06j68O3n3N9o0N8r3K10l3q9K39k59J18J47k23L8j01r9j05N8M7J96
$$ plain form
5291 101 102 -184 -91 152 -35 191 34 -144 -174 167 136 31 -213 162 -82 -4 -162 2 -94 -64 8 73 -88
5314 -88 97 -31 -84 63 81 -21 31 -71 -25 129 29 -93 -27 29 -95 88 23 11 -67 84 -105 185 -89
5337 -89 44 181 -153 92 -44 71 -54 39 -106 -25 -24 147 -43 -197 24 -77 8 51 27 66 -20 53 122 -102
5361 -102 128 -66 -133 -61 35 172 39 -54 -2 -18 69 -175 132 -35 68 29 29 35 38 139 -23 -46 -65 -166 123
5386 123 -184 33 -259 -4 61 -184 -98 -22 -101 10 -65 264 -123 59 -35 26 119 74 -276 -44 255 -7 -101
5409 -101 -125 81 3 47 -35 138 4 -23 40 124 -20 26 124 -87 -8 86 -98 -58 81 41 6 61 220 54 -41
5434 -41 45 56 101 60 -107 13 196 98 136 -41 182 87 -102 -2 -106 -102 -14 -159 70 27 266 -102 48 170
5458 170 -88 -152 -125 6 -66 22 -153 145 -149 -62 -104 -84 100 66 144 -267 11 62 -98 -111 67 45 -43 68
$$ packed form
5291A01Jk86R3K43j87K26j57j78l0L41l1j05k44L75k44P8j58J64r6L0P2O5j61
5314h8J85j28n3J47J8j02N2j02M6J54j00j22O6N6j24J83o5j2p8J51j89K90k74
5337h9J33J37l34K45j36J15j25R3j45Q1JJ71j90j54K21j01Q5M3k4L9q6P3O9k24
5361a02K30j94o7P2R6J37j33r3N2j6Q7k44L07j67J03l9%OLJ01j62k3j9j01K89
5386A23l07K17k92K55O5k45Q6P6p9J11p5L29l87J82r4O1R3m5l50K32K99k62r4
5409a01k4K06p8M4q2J73j34k7O3Q4j44M6R8k11P9R4j84M0J39m0l5N5J59j66r5
5434d1Q6J1M5m1j67J20J83r8L8j77K23r5j89J00j04MQ8j45K29m3K39l68J50J22
5458A70k58o4K7J31p2Q8j75K98k94Q7m2K0J84l4P8m11K78N1j60j3J78k2q8J11
$$ plain form
5482 68 -163 45 -36 -52 133 -4 -45 97 -218 108 -86 23 -1 28 133 38 2 161 -39 24 -15 78 -104 -80
5506 -80 89 -17 -85 156 241 182 43 -24 36 98 -94 -51 -201 -72 -14 -39 21 -106 -14 74 65 37 -107 -105 -35 -37 47
5533 47 -31 -78 -76 38 108 -147 16 -42 249 -18 -87 -53 -14 162 -52 -77 -83 88 148 66 218 79 -39 -67 79
5558 79 68 -149 -24 307 234 86 -54 -167 183 -40 -147 -21 59 101 35 -33 149 96 175 57 55 69 -82 4
5582 4 -20 -8 -37 50 -85 106 184 33 -103 63 -114 -258 157 -124 -117 -144 -82 -116 32 106 11 -174 83 35 -52
5607 -52 -76 -139 -23 -79 -97 -21 -6 -140 -38 -130 48 -161 -81 -64 -144 -87 -51 5 -28 -120 -208 172 106 31 -42 48 51 -203
5635 -203 -53 -41 82 46 113 144 183 -123 -10 27 2 -38 48 108 -132 -90 38 93 103 -255 174 88 -107 -45 -155
5660 -155 -219 -13 76 123 -73 -35 -33 -94 83 92 31 66 45 30 60 -71 -114 26 -132 -54 195 75 -76 103 59 -126
$$ packed form
5482F8k31K08q1j6J85j37m1J42l15L26j94J09k4K9J05r5l6J59k00O3l9R3j82K4
5506h0J69j06o8K41Q5n9j39o7O0O2j92M3j50J29N8k5O0j27R2Q8rk8j44KP0kQ4
5533D7p8m7KJ14P0k55J63n8K91k67o9L4L9J76k14k5oJ71O0q2J52j39j18k8J46
5558G9j1k17J25L31p3j48j40j13L50k23j07J26Q0M2o6o8J82n3P9j18kJ4j51Q6
5582Dk4J2k9Q7j35J91P8j51j36J66j77j44M15k81Pk7O2l4J48P4r5j85K57m8q7
5607e2k4o3J16n6j8P6J5j34J02r2J78k09Q0J7q0N7L6N6l3r2q8L80o6p5p3R0Lk54
5635b03J50J2J23l6O7L1L9l06J13L7k5m0Q6O0k40M2J28N5J0l58M29q6j95O2j10
5660a55o4K06Q9M7j96L8Ko1J77Ro1L5k1j5L0j31m3J40j58P8K49j20j51J79m4j85
$$ plain form
5686 -126 309 -65 25 76 171 -32 38 -138 125 -30 156 180 -61 70 108 58 -71 89 -4 215 -200 77 7
5709 7 53 -34 -11 64 -108 -148 -23 22 206 -23 69 -46 -49 30 -47 -173 -81 116 -8 -84 51 48 1 -33 -60 47 109
5736 109 10 -2 42 -87 6 -82 -109 33 -207 254 88 -30 33 -155 32 -51 1 3 -89 160 65 -124 156 -88
5760 -88 -84 -94 -124 -89 96 29 195 16 237 -79 -119 58 -43 117 42 89 -80 7 -1 -194 2 84 -38 147 133
5785 133 176 -16 -107 57 -211 -220 -169 56 -29 152 -119 -52 128 -270 -60 14 -18 -40 -135 -46 54 -3 -106 153
5809 153 49 67 -27 -4 10 148 80 -95 33 -43 28 -55 -210 -127 32 -87 159 62 82 11 38 -173 -134 37 -147
5834 -147 -124 47 -39 -20 -11 87 -164 -23 -152 156 15 -22 54 5 -190 15 -128 84 7 150 2 -47 -21 -70
5858 -70 -162 14 -18 8 36 35 49 121 90 -62 162 -48 -21 -63 102 -24 -41 128 -159 29 -34 38 -121 159 120
$$ packed form
5686a26M35l74R0N1R5k03P0j76K63j55J86K4k41J31L8n0j29J60r3K19m15K77p0
5709GM6q7K3P5j72m0J25M5J84k29R2j15lP9p7j26R2J97j24p6J35lm7l4k7J07O2
5736A09r9j2M4j29R3q8k7J42k40M61j66j18O3j88J87q3N2Kr2K49r5j89K80k44
5760h8Mj0l0L5J85o7J66j79K21l16m0J77j01J60p5M7j69Q7qj93J96Q2j22J85j4
5785A33M3j92r1J64k68rN1K25q5J81k71O7J80l98K10P4l2k2r5Q9J00n7j03K59
5809A53j04J8r4K3J4J38o8j75J28p6P1q3j55Q3J59j19K46r7K0p1K7k11L9J71j84
5834a47K3J71q6J9RR8k51J41j29L08j41l7P6m9j95K05j43K12p7J43j48m9K6m9
5858g0r2J76l2K6K8jJ4P2l1j52K24k10K7m2J65j26j7J69k87J88o3P2j59K80l9
$$ plain form
5883 120 -20 18 -59 -184 -133 -37 -25 -28 33 -22 57 134 -194 72 129 123 170 37 44 -193 -187 -115 32 -184 -108 -270 -124
5910 -124 -6 -32 164 107 -61 123 -41 -25 77 -32 45 72 83 -187 -108 3 -19 3 55 88 -231 51 -87 32
5934 32 -109 -164 62 48 141 202 2 -27 39 -90 -38 179 -71 -53 -105 7 -68 51 201 152 -199 73 -111 99
5958 99 -222 -106 -255 -9 83 -139 -32 70 -89 -5 -75 28 122 96 45 -198 -5 -18 13 77 2 -164 122 -150
5982 -150 -30 34 -51 -24 156 228 174 15 46 -37 -11 -122 -55 -111 -57 108 12 -73 -1 -250 -176 -11 -310 -192 -31
6007 -31 -14 11 -107 76 -152 33 25 -42 57 29 1 223 -110 -93 -171 22 208 -39 -169 72 -86 -3 -12 28 43
6032 43 51 35 8 22 -127 -88 45 21 -18 3 -56 92 164 -34 -55 49 149 79 172 183 -7 205 47 -7 -55 -96
6058 -96 93 -135 -36 -45 -95 -187 39 47 45 66 -239 -40 27 101 -2 -63 154 112 -186 -143 -10 258 -19 -133 -42 -40
$$ packed form
5883A20j40L8p7j25N1R6J2lO1n5P9P7l28K66N7oM7j33Pk37OP2J47k16P6j62J46
5910a24J18k6J96n7j68J84j64J6J02j09P7K7J1k70P9J11k2K2N2L3l19K82j38J19
5934C2j41n5K26j4R3O1k00k9O6j29N2K17k50J8n2J12p5J19J50m9l51K72j84K10
5958I9l21J16j49K46R2k22J07J02j59Q4p0J03R4k6n1k43J93j3L1O4p5j66K86k72
5982a50J20O4q5K7J80P2n4j59L1q3K6j11O7n6N4J65r6q5P2k49P4J65k99J18J61
6007c1J7K5j18J83k28J85qo7R9k8k8K22l33J7p8J93J86k47j30K41j58Q3rM0J5
6032D3Qj6k7J4j49L9J33k4l9K1n9J48P2j98k1J04J00p0R3J1j90K12j58n4m8m1
6058i6J89k28R9rn0r2K26QkK1l05J99O7P4j03o1K17m2k98M3J33K68k77j14R1K
$$ plain form
6084 -40 -137 -62 155 47 144 -32 -5 -57 -19 -41 34 -48 0 -132 31 -171 11 -67 112 -132 -295 259 144 -170
6108 -170 45 11 -262 7 178 165 64 6 175 -107 -50 80 -97 47 -133 76 -102 247 76 -91 56
6129 56 -24 -151 -51 22 226 -261 222 -46 112 -92 9 186 78 46 -24 -124 -79 103 95 95 -88 -68 -102 41
6153 41 -64 82 -151 14 105 53 95 -11 68 -169 -99 -150 109 -8 17 191 145 -222 6 -136 -3 127 261
6176 261 -24 115 48 218 -82 -58 98 -39 -114 74 -90 -171 62 -52 -295 15 -44 -67 -98 -100 104 -33 -25 95
6200 95 -192 -214 59 -122 -1 97 13 -139 96 115 -270 -158 -37 -158 -31 89 -29 -318 86 64 -11 56 9
6223 9 -11 -22 18 -171 97 42 25 101 79 63 -93 -59 -72 -70 -3 -28 -164 -85 51 -7 71 172 221 -206 97 -184 -90
6250 -90 71 187 245 -47 145 -120 -65 69 -36 -77 131 -94 -74 43 202 -79 22 -102 -61 -261 -11 -42
$$ packed form
6084d0r7P5K17j08R7j76K7n2L8k2P5q2M8j32J63k02J82p8J79k44j63N54j15l14
6108a70K15l4k73K69J71j3j01n8J69k82N7J30j77J44j80K09j78L49j71j67J47
6129E6q0j27J00P3K04m87M83k68J58k04J01J77j08l2p0j00M5J82q%j83K0l4J43
6153D1j05J46k33J65R1n2M2j06P9k37P0n1K59j17K5J74m6l67K28j42J33J30J34
6176B61k85J39o7J70l00K4J56j37p5J88j64q1K33j14k43L10n9k3l1kK04j37QJ20
6200I5k87k2K73j81J21R8q4j52K35J9l85J12J21j21J27J20j18k89M04k2p5O7m7
6223Ik0j1M0j89K68n5j7P6k2j6j56L4j3KO7k5j36P9J36n8P8J01M9m27L03k81R4
6250i0J61J16N8k92J92k65N5J34j05m1K08k25K0J17J59k81J01j24M1k00K50l1
$$ plain form
6272 -42 119 104 8 183 40 -106 163 -112 -206 22 34 26 159 83 -87 17 -73 36 31 -49 117 153 85 -27 74
6297 74 -63 -3 45 -160 -82 218 30 -78 -155 -68 4 -174 -98 25 295 199 -16 118 159 -238 43 35 -39 -71 59
6322 59 -83 -178 9 146 -15 17 -54 16 -100 63 32 153 -29 35 -69 -46 65 240 -177 13 -106 -234 76
6345 76 116 99 -163 69 20 197 85 -85 23 -78 64 -60 -21 -12 20 -8 35 152 -156 68 -190 188 73
6368 73 -56 -131 -30 63 24 -212 -39 -9 -153 -54 22 -165 -18 7 -29 -66 215 -160 -173 104 -26 -62 247 -63
6392 -63 -243 -142 -81 -79 -127 86 -80 5 107 -184 187 -85 -123 16 -20 69 -221 -52 59 180 -57 9 59 104
6416 104 -16 7 -155 20 -47 155 -38 -62 -94 -218 71 -88 -57 43 56 -159 63 -208 120 -46 -162 58
6438 58 151 145 120 73 81 127 -35 -57 -3 143 -55 54 60 97 -60 -1 146 -64 -134 -46 99 -142 -44 73 41 -22 -31
$$ packed form
6272d2J61j5r6J75j43j46K69k75r4K28J2qJ33p6j70J04r0J09nq0J66L6o8j12J01
6297G4j37O0M8k05P8L00j88j08p7Q7P2j78P6J23K70r6k15J34M1l97K81qp4l2J30
6322E9j42r5J87J37j61L2p1P0j16J63l1J21j82O4j04K3J11J75m17J90j19j28L10
6345G6M0j7k62K32m9J77j12j70J08j01J42j24L9RL2k8M3J17l08K24k58L78j15
6368G3j29p5J01R3l9k36J73L0j44R9P6j87J47K5l6l7K81l75j3K77j30l6L09l10
6392f3j80J01O1Km8K13j66Q5J02k91L71k72l8J39l6Q9k90J69J11J21k37O6N0M5
6416A04j20K3j62J75o7K02j93k4l2j24K89j59L1J00J3k15K22k71L28j66j16K20
6438E8R3ok5m7QM6j62k2N4J46j98J09OL7j57N9J47k10p0Q8J45k41R8J17l2o3r
$$ plain form
6465 -31 -96 202 -122 -18 7 -127 -45 161 -139 -48 -46 79 -131 135 -165 -201 24 -179 56 105 -153 106 127
6488 127 68 -44 95 20 -47 54 42 6 40 16 104 -58 287 -150 151 -124 -225 -55 -80 -82 54 -100 75 64
6512 64 96 92 15 93 -36 137 8 -66 -23 -11 69 -41 -21 75 -73 155 159 -208 -9 44 -139 187 202 36 136
6537 136 -1 -123 -6 -52 -32 -9 87 2 -107 -33 34 178 20 55 153 179 -50 90 -236 -87 -36 96 -53 -115
6561 -115 124 -8 -79 -183 91 107 -51 -127 187 -55 -286 38 -25 -155 12 -89 1 1 -12 143 -227 -5 244
6584 244 60 63 49 -177 -21 -25 46 79 209 -126 109 38 -8 -190 -30 65 89 65 159 180 -66 135 -36 -62 118
6609 118 34 -123 166 -33 28 73 195 0 -128 -102 -119 2 -75 -32 33 -69 8 -181 -127 83 -205 110 -90
6632 -90 61 47 68 150 -191 -117 -81 46 1 0 52 -69 -115 117 157 -59 -306 92 -115 16 97 29 63 -45 63
$$ packed form
6465c1o5K98l24J04K5j34Q2K06l00R1KJ25k10K66l00l6K25k03K35M9k58K59K1
6488A27n9j12J39p5o7J01j2l6L4k4Q8j62L45m37L01k75j01J70k5kJ36j54J75j1
6512F4L2mp7P8j29J73j29p4M3J2Q0j10K0R6j48K28Ml67J99N3j83L26J5j66J00
6537A36j37j22J17m6K0K3R6q5j09P4O7J44j58L5R8K6k29J40l26J49N1J32j49o2
6561a15K39j32p1j04K74J6j58p6L14k42k31L24o3j30J67j01R0%j3J55l70K22K49
6584B44j84Lj4k26J56mP1L3J30l35K35p1m6j82J60R5K4k4R4K1k46K01j71k6J80
6609A18q4j57K89j99O1M5J22j95j28K6j7J21p7M3O5j02P7j89N4K10k88L15k00
6632i0J51j4K1Q2l41P4L6J27m5jN2j21m6K32M0k16k47L98k07J31Q1o8L4j08J08
$$ plain form
6657 63 -135 93 -38 -59 0 -72 104 -7 -87 40 50 159 -133 127 135 -43 59 -103 78 -30 -35 22 74 212
6681 212 -184 64 -29 46 112 109 -89 -38 -20 30 -72 235 62 -205 -19 89 -35 202 45 101 67 -161 39
6704 39 69 48 93 195 48 -13 -56 -85 115 20 5 83 38 61 110 -42 -94 -49 -150 73 15 90 96 152 133 -190 -16
6731 -16 -15 -111 -34 93 -5 14 57 -2 61 -148 -135 -96 139 64 -9 -58 -41 -48 -53 -146 81 89 26 -66 -176 -80 75 -121 3
6760 3 50 -206 -212 -43 70 -47 46 -63 -70 185 106 19 40 194 13 36 122 90 42 24 29 133 91 145 93 -64 -2
6787 -2 -102 43 -146 107 90 -94 -85 -161 8 109 -4 64 -66 -49 -59 166 -78 -152 21 57 134 -122 -41 -103 -36
6812 -36 3 -49 91 37 231 -5 -12 -11 84 75 81 3 41 170 -17 -73 -9 14 233 -139 122 -64 -42 43 -163 -79 -154
6839 -154 113 115 -124 -83 86 -42 119 171 110 14 -39 131 157 117 37 165 -1 89 225 57 -116 -86 173 -29
$$ packed form
6657F3j98K28j31k1N9p2J76j11q0J27J0J09k92K60Qj78J02j62J81j08nN7N2J38
6681B12l96K48r3P5O6lj98N1J8N0j02L07j73k67J86J08j24K37j57N6l4k28K00
6704C9L0k1M5J02j47o1m3k9K00r5j5P8m5K3M9j52n2M5j01K23n8P5ON6j9l23J74
6731a6Jr6P7J27r8J9M3n9O3k09J3L9K35p5p3m9J7pnr3K27Qo3r2j10R6J55j96J24
6760CM7k56oJ69J13j17R3j09pK55p9q7K1J54j81K3Q6l2m8j8NJ04m2N4n2j57O2
6787bj00J45j89K53j7j84Rp6J69J01j13O8j30J7j0K25k44p4J73L6P7k56Q1o2O7
6812c6L9n2J40n4J94k36pJR5rOp8L8J29j87n6O4K3K19l72K61j86K2Q5k06Q4p5
6839a54K67Kk39M1J69j28J61N2o1r6n3J70K6m0q0J28j66R0J36j68j73L0K59k02
$$ plain form
6863 -29 56 75 48 -48 -35 -188 115 170 139 70 -152 -1 -32 4 106 100 -43 -52 -136 -59 200 -94 46 11 -76 142
6889 142 -102 218 -213 -11 -16 -47 5 -10 -11 56 -65 -5 31 137 226 112 -68 -31 -48 -189 146 -66 149 105 33
6914 33 -68 -142 -69 -171 36 -73 -63 -137 -30 -97 -83 -48 54 -62 32 30 0 31 -102 98 -21 -153 -8 82 -100
6939 -100 21 -135 24 -35 91 188 -60 13 128 174 17 -11 270 -91 -88 47 57 1 24 192 51 -61 -253
6962 -253 26 128 360 -123 19 -69 -104 117 -142 -24 55 -66 93 -67 118 15 70 -45 -73 66 91 -52
6984 -52 -175 -141 111 -56 -104 99 22 39 120 95 -33 29 89 -48 55 286 27 -31 49 87 -121 86 -221 -121
7008 -121 -189 -70 198 21 -73 45 -17 1 -53 -187 -143 -227 57 121 82 -311 -21 -148 91 -133 215 -181 -58
7031 -58 24 -64 90 161 -155 -186 -90 77 75 -47 -37 -20 145 85 -57 91 153 -71 104 84 15 -71 72 -78 28
$$ packed form
6863b9Q5J9k7r6J3j53L03N5l1o9k22J51l1L6J02oj43rq4P7K59k94J40l5q7K18
6889A42k44L20m31K02nl1N2j5jO7j21O0L6J06Q9j14j80L7j7j41L35k12K15m4p2
6914C3j01p4P3j02K07j09J0p4J07o7J4L5J02j16R4kl0L1j33K00j19j32J45R0j82
6939a00J21j56J59n9J26R7k48P3J15M6j57k8K81l61LJ35J0n6K3J68j41j12j92
6962b53K79J02K32m83J42q8l5K21k59J18P9j21J59j60J85j03N5j15k8J39K5j43
6984e2j23L4K52j67m8K03p7J7Q1k5j28O2O0j37J03K31k59n8Q0L8k08K07l07J00
7008a21o8J19K68j77r4J18o2J8n4j34M4q4K84O4l9l93K90j27K39k24L48l96J23
7031e8Q2q8J54P1l16l1R6J67kj22J0J7J65o0j42J48O2k24J75k0o9q6J43j50J06
$$ plain form
7056 28 -48 45 18 -91 -24 -45 -49 37 49 -199 -214 -167 41 -24 24 -1 -58 -90 25 -1 -38 -86 275 -167 198 170 99
7083 99 216 -30 111 -116 350 151 -96 -5 37 28 62 -8 115 -33 147 115 105 87 29 162 -155 -47 127 -34
7107 -34 85 103 154 -60 -169 -7 152 -74 -96 47 18 -23 -208 -93 21 -63 20 160 -5 16 91 -162 -34
7130 -34 152 0 -15 -87 70 -87 -1 -32 217 194 56 158 31 -39 -52 -46 -107 33 50 43 -38 147 -26 100 169
7155 169 -83 124 -225 -91 -219 133 71 -144 -59 -89 -23 -64 -37 90 -23 159 -121 124 54 201 -163 -41
7177 -41 -18 -169 40 -56 -5 56 78 64 -94 -218 -36 -35 83 -30 101 36 86 50 36 -1 -108 -15 -75 152 69 10
7203 10 -29 -19 -30 -2 41 -77 24 -207 -178 10 56 -168 88 -68 -43 -57 -81 61 -28 3 56 -66 35 9 -19
7228 -19 -130 -149 -56 40 -43 -138 -154 91 104 21 -71 123 -2 132 37 105 -20 -47 149 4 69 67 -77 83 196
$$ packed form
7056B8p6R3k7j09O7k1mQ6J2k48j5M7K08o5M8k5n7l2J15k6l7m8L61m42L65k8p1
7083I9J17k46J41k27M66j99k47R1M2rL4p0J23j48J80l2j0j8n8J33l17J08J74j61
7107c4J19J8N1k14j09J62J59k26k2J43k9m1j85J15J14q4Q3J40j65K1P5k53J28
7130c4J86j52j5p2J57j57Q6l1K49k3j38J02j27p0j3Oo1J40J7pq1J85j73J26O9
7155A69k52K07l49J34j28L52o2k15Q5l0O6m1K7J27j13J82k80K45p0J47l64J22
7177d1K3j51K09r6N1O1K2j4j58j24J82JJ18j13J31o5N0l6j4l7j07R3o0K27q3n9
7203A0l9J0j1K8M3j18J01k31K9J88M6k24K56j56K5j4k4J42q9L1N3j22J01k6k8
7228a9j11j9R3R6q3r5j6K45J3q3r2J94j25J34r5O8j25k7J96j45O5kj44J60J13
$$ plain form
7253 196 203 -17 31 67 93 -43 144 38 -11 4 -105 13 -65 205 -98 -22 -18 -20 -12 -83 -76 -26 -105 128 -32 215 28
7280 28 -38 -36 -104 -30 -63 -97 -108 34 193 -122 -296 277 -60 -113 139 136 13 27 -161 77 218 -12 -28 56 73
7305 73 207 217 -128 98 86 61 98 -44 67 148 163 -140 32 46 -140 98 148 6 -93 96 38 108 125 -49
7329 -49 186 -223 -114 3 39 -70 7 217 -29 -60 4 28 8 -173 -121 -64 -72 5 115 -90 40 -49 17 -117 127
7354 127 39 -166 89 24 -102 198 42 31 -220 -52 -12 40 -193 -57 148 69 108 -29 -114 -164 13 -11 0 216
7378 216 130 40 -50 -15 26 125 158 -158 19 -134 44 107 52 95 -70 -63 9 -79 313 55 -45 -53 3 89 -68 -65 41
7405 41 88 -71 -2 35 -20 -27 -40 22 75 118 -193 -29 114 -122 17 -51 76 36 -188 -39 -93 34 8 -82 -107 71
7431 71 -171 -94 -94 1 117 -177 113 181 -33 -139 46 -187 164 -107 -169 -6 -99 -206 -31 -4 -20 -113 -35 -13
$$ packed form
7253A96Pk20M8L6K6j36J87j06m9J5j09J18p8K70l03P6MkQp1PN0p9K33j60K47j87
7280B8o6Ko8P4l3l4j1J42J59l15j74N73l37n3K52lj23J4j88K38J41k30j6Q4J7
7305G3J34J0l45K26j2k5L7j42J11Q1J5l03J72J4j86K38N0j42r9J89n8P0J7j74
7329d9K35m09J09J17L6j09P7K10k46l1O4K4k0j81N2N7qP7J10k05J30q9O6j34K44
7354A27q8k05K55o5j26L00j56j1k51J68M0N2k33J36K05p9L9j37q5n0J77k4J1K16
7378B16q6r0r0L5M1R9L3l16J77j53J78O3n5M3j65PP2q8L92k58j00qN6Q6j57LJ06
7405D1M7j59O9L7n5pj3O2N3M3l11J64J43k36J39o8J27m0k24J49n4J27k6r0k5J78
7431G1k42P7%R5J16k94K90O8k14j06J85k33L51k71o2J63r3j07J75K7j6r3P8K2
$$ plain form
7455 -13 299 -147 170 50 34 -67 -92 12 200 208 132 -106 -73 34 -41 -84 69 -36 4 -105 55 -22 -55 84
7479 84 -68 -71 -58 -29 -107 -86 71 92 11 -22 -11 -137 -191 -182 188 -43 -71 82 109 121 120 283 114 65 -192 -75 48
7506 48 173 13 150 -107 169 -9 119 22 -31 -84 -31 -211 106 49 -113 -105 64 172 -67 24 79 154 -15 45
7530 45 98 -54 15 96 155 98 -64 12 257 11 -95 -71 17 -39 -11 -178 -187 23 4 -64 -62 173 276 232 -116 107
7556 107 -217 31 -175 -15 332 32 78 -55 -9 -98 16 63 235 42 25 -16 20 -14 -32 -11 3 146 -7 94
7580 94 30 212 142 -62 -63 25 76 124 23 -15 -26 -136 -151 -170 97 -173 -12 100 32 4 68 45 203 -28 -191
7605 -191 59 -55 -39 -18 -17 -37 -203 -103 -144 69 -10 -101 -21 35 118 -5 34 -74 292 48 -138 167 58 -66
7629 -66 -24 86 -139 -72 184 230 -157 -43 -200 11 110 -173 -22 -91 14 51 92 108 -28 -6 -122 -33 24 94
$$ packed form
7455a3L12m46L17j20j6j01k5J04J88Qp6k38L3J07p5m3J53j05M0j09J60p7l3J39
7479H4j52lJ3K9p8K1J57K1q1l3J1j26n4RL70k31k8J53K7J2jJ63j69m9k57J17J23
7506D8J25j60J37k57K76j78J28r7n3n3N3j80L17n7j62QJ69J08k39R1N5P5j69O0
7530D5N3j52O9Q1N9n7j62P6K45k46j06K4Q8n6K8j67rK10j9o8KK35J03m4l48K23
7556A07l24K48k06J60L47l00M6j33M6q9J14M7J72j93j7m1L6l4j8K1J4J43j53J01
7580I4o4J82p0k04jQ8N1M8j01l8j1j10j5j9K67k70J61J12o8k8O4k3J58k31j63
7605a91K50j14J6K1Jk0j66J00m1K13p9r1Q0N6Q3j23L9j08L66k44j86L05j09j24
7629f6M2J10k25O7K56M6l87J14j57K11R9k83J51o9J05L7M1J6j36K2j16Q9N7P0
$$ plain form
7653 94 136 29 41 59 -18 -85 186 211 -67 -80 -56 -45 -87 -152 114 141 109 -277 -87 49 20 -75 0 -133 215 50
7679 50 180 103 108 -32 197 2 -26 -85 36 2 -73 -76 -62 70 196 -47 -99 -138 171 5 -223 -33 -49 65 106
7704 106 18 -8 175 -74 84 -42 139 -24 -3 64 -254 67 115 266 139 -35 5 58 94 -20 58 -119 -48
7727 -48 -41 52 204 -5 80 -153 83 3 -9 -87 -132 -211 -68 -62 -19 48 -43 196 7 114 -109 126 69 39 195 -217
7753 -217 -15 -1 146 -83 93 -74 -28 96 -233 -15 62 -10 78 96 -77 28 117 91 3 72 -54 127 35 -130
7777 -130 -111 22 -65 -64 -19 124 82 43 198 39 -112 127 70 -63 -29 113 105 -69 -20 78 89 72 -164 79 118
7802 118 -113 -113 -103 97 -13 -94 -104 -42 -25 82 6 166 123 80 -22 43 243 -138 43 75 -26 13 127 51 32
7827 32 111 50 127 -30 -169 -133 4 -152 -127 130 209 246 118 -142 64 8 -159 19 67 -255 -76 10 -22 -158
$$ packed form
7653I4M2j07J2J8p7o7K71K5k78j3K4J1m2o5K66K7l2l86J90J36k9r5P5j33L48j65
7679E0J30p7Nj40K29j95k8n9J21l4p5lJ4J32J26k43n2l9L09j66k28J90j6J14M1
7704A06q8k6J83k49J58j26J81j63K1O7l18L21M8J51j27j74M0N3L6j14P8j77P1
7727d8PR3J52k09Q5k33K36q0j2p8m5p9J43OM3O7r1K39j89J07k23K35n7l0J56m12
7753b17K02J4J47k29J76j67M6J24l29K18P7p2Q8J8j73J05Q9k6q8O9j26J81r2j65
7777a30J9J33q7JM5J43m2l9J55j59j51K39n7j33L4J42qj74M9R8J1j7k36K43L9
7802A18k31%J0K00j10q1j0O2J7J07p6J60m3m3j02O5K00l81J81L2j01L9J14p6j9
7827C2P9o1P7j57j39L6J37j56K5K57P9L7j28k60K06n6j67J78M8l22J79Q6l2j36
$$ plain form
7851 -158 -89 90 253 -31 100 -14 -132 147 -1 282 162 145 -65 178 -129 79 -108 7 -62 100 91 -135
7873 -135 0 -194 -43 -84 70 31 -25 21 52 -125 -25 20 -118 17 -182 25 173 16 192 47 212 -78
7895 -78 -45 -58 151 -122 -174 25 32 60 -178 -37 -9 -290 51 80 144 57 66 155 -154 -84 -70 -52 53 -84 -137 7
7921 7 -57 18 104 -13 193 139 92 240 16 7 -32 89 -134 31 -107 146 -27 74 58 -60 76 42 65 -40
7945 -40 53 99 -72 51 -168 34 -179 -16 151 223 84 -105 -16 132 0 29 179 72 -70 39 -68 82
7967 82 -150 -158 -68 -42 87 -4 -219 116 29 -139 -69 -7 106 -53 -60 -142 72 71 -46 59 20 -26 -14 80 -92 -53
7993 -53 -52 101 9 17 -152 157 44 -116 20 -2 213 62 -65 294 76 -167 86 155 37 -23 63 -107 -7
8016 -7 77 -22 -67 88 -143 208 -177 237 -39 -66 -3 -39 -58 -17 8 55 -87 78 127 173 26 -21 -112 -95 87 -32
$$ packed form
7851a58O9J79J63k84J31j14j18K79j48K83j20j7k10K43l07K08j87J15o9J62rk26
7873a35J35j94J51m1J54l9n6M6L1j77J00M5j38J35j99K07J48j57J76j45J65k90
7895g8L3j3K09k73n2J99PK8k38J41K8k81L41K9O4q7RQ9l09P0J4J8J05j37n3J44
7921Go4P5Q6j17K06n4m7J48k24rl9J21k23J65j38K53j73J01j6j18J36l4K3j05
7945d0R3M6j71J23k19K02k13J63J67P2j39j89Q9J48j32K9J50j07j42J09j07J50
7967H2k32qR0K6J29r1k15L35q7j68P0O2J13j59pq2K14jj17J05l9m6J2R4j72L9
7993e3JJ53r2Qj69L09j13j60J36k2K15j51j27L59k18k43K53O9j18o0Q6j70J00
8016gQ4r9m5J55k31L51l85M14k76k7O3l6j9M1K5M7j42J65M9M6j47m7r1J7J82j19
$$ plain form
8042 -32 -40 25 241 -78 -101 63 -26 -85 -81 -23 -62 82 -22 44 23 -162 41 122 26 -26 9 -128 -112 -57 252 6
8068 6 -54 -69 9 122 58 -172 12 78 57 -25 192 -99 -89 47 -83 -249 111 -90 -204 100 -138 -117 -151 25
8092 25 93 144 92 -255 -204 -79 -45 50 169 -21 -24 178 -80 -92 -158 1 -156 -203 -43 13 -45 -19 -146 78 -149
8117 -149 46 129 132 -26 69 -25 -130 60 -22 -118 -134 55 -116 -52 -43 -8 -32 -136 -150 -134 -27 118 11 -148 -80
8142 -80 -12 121 -219 46 53 -9 8 168 -74 136 -82 -59 -149 104 -121 -19 147 -37 -136 154 18 -188 -32
8165 -32 108 -56 50 -111 -34 26 -48 50 -12 -114 124 203 143 7 150 -13 -2 -20 -73 -132 120 182 -215 -128 -118
8190 -118 -68
$$ packed form
8042c2qO5K16l19k3J64q9n9MN8l9J44j04O6k1j85K03Q1r6n2L5j37J6N5L09k46
8068Fo0j5P8J13o4k30J84O6k1q2K17k91J0J36j30j66L60k01j14L04k38K1l4J76
8092B5O8N1n2l47N1J25L4R5J19j90lK02k58j2o6J59j57m7J60N6n8K6j27K24k27
8117a49J95Q3Lj58R5r4j05J90q2r6j6J89j71O4RL5k4j04j4J6J07J45j07j59O8
8142h0O8J33l40K65Po2J7J60k42K10k18K3r0K53k25J02J66j84r9K90j36k06J56
8165c2J40j64J06j61P7O0p4R8o2j02K38P9o0j36J43j63J1j8n3n9K52O2l97Q7J0
8190a18N0
8191f8
$$ Imaginary data points
##PAGE= N=2
##DATA TABLE= (X++(I..I)), XYDATA
$$ plain form
0 0 0 0 0 0 0 0 0 0 0 0 0 -8 8 -8 8 -16 16 -24 24 -32 40 -48 56 -64 74 -88 104 -120 136 -158 179 -206 232
33 232 -264 297 -335 375 -421 470 -525 585 -649 721 -799 883 -975 1078 -1187 1310 -1440
50 -1440 1587 -1749 1927 -2127 2351 -2602 2888 -3216 3599 -4049 4589 -5253 6087 -7175 8661
65 8661 -10813 14239 -20545 36049 -160408 -127267 121678 -84647 -44533 73050 -35311
76 -35311 -81585 142965 141489 10108 38198 49595 -49839 30513 99742 -35962 -107292 -7319
88 -7319 -8503 -43282 9555 -78 -93513 -81288 -11652 21217 34566 14415 -34204 -10920 48212
101 48212 72687 84260 52206 -34858 -30383 45130 18561 -50576 -45824 -66239 -94063 -11274
113 -11274 45327 -26670 -41676 26059 24571 29352 99362 65418 -37737 -11882 47032 1084
$$ packed form
0@%%%%%%%%%%%qJ6j6J6k4L2m0M8n6P2q8J04j20J38j62J92k24K56k94L37l85M38
33B32m96N61o32P10p96Q91r95J110j234J370j520J682j858K053k265K497k750
50a440L027l336L676m054M478m953N490o104O815p648Q638r842J1340j3262J5836
65H661j9474K5052l4784N6594j96457L3141K48945k06325M0114J17583j08361
76c5311m6274K24550j476j31381K8090J1397r9434Q0352O9229j35704p1330R9973
88g319j184l4779N2837r633r3435J2225O9636L2869J3349k0151m8619K3284N9132
101D8212K4475J1573l2054q7064M475P5513k6569o9137M752k0415k7824Q2789
113a1274N6601p1997j5006O7735j488M781P0010l3944j03155K5855N8914m5948
$$ plain form
125 1084 -20179 11691 -34096 -79964 -16944 24975 -14852 -23079 -8227 -28828 -11041 50309
137 50309 41717 -12615 -7176 25669 28811 38836 49182 10786 -28818 -11560 14035 -2030 -26749
150 -26749 -40278 -53435 -43996 -4281 12283 -8267 -12802 10869 28651 41321 53629 37651
162 37651 2424 -4000 14576 15470 -1145 -17634 -32674 -37120 -19387 863 -1589 -16926 -20709
175 -20709 -7089 11280 21786 19760 7166 -3083 7177 29277 30880 11895 -1330 -7451 -11661
188 -11661 -2113 5737 -15420 -37525 -28750 -13334 -8270 3768 9088 -4971 -1466 27095 35299
201 35299 22111 17341 8747 -7197 -201 12991 -4457 -26403 -23899 -19398 -17198 -2151 3466
214 3466 -12443 -14923 3949 14199 14485 16642 9604 -353 7844 20497 15952 3689 -4104 -10419
$$ packed form
125A084k1263L1870m5787m5868O3020M1919l9827q227J4852k0601J7787O1350
137E0309q592n4332N439L2845L142J0025J0346l8396l9604J7258K5595j6065k4719
150b6749j3529j3157R439L9715J6564k0550m535K3671J7782J2670J2308j5978
162C7651l5227o424J8576Q94j6615j6489j5040m446J7733K0250k452j5337l783
175b0709J3620J8369J0506k026j2594j0249J0260K2100J603j8985j3225o121m210
188a1661R548P850k1157k2105Q775J5416N064J2038N320j4059L505K8561Q204
201C5299j3188m770q594j5944O996J3192j7448k1946K504M501K200J5047N617
214C466j5909k480J8872J0250K86K157p038r957Q197J2653m545j2263p793o315
$$ plain form
228 -10419 -10405 -3077 -4438 -15922 -23771 -20354 -9935 1479 5535 2356 2935 8411 16699 24688 22299
243 22299 8147 -533 761 825 -2000 -4852 -14740 -23781 -16235 -4139 -3542 -4827 -2801 -4790 -764
258 -764 13781 17295 7391 4341 7513 6825 9663 13337 3871 -8972 -7778 -3571 -6231 -8417 -10847
273 -10847 -17134 -16399 -4459 3017 3203 3640 5141 8190 15285 19654 14158 5427 651 -1184 -2048 -2748
289 -2748 -7063 -13863 -15891 -11174 -3966 -939 -2785 -3614 -308 3790 7844 10662 7629 1635 1931 7117
305 7117 8489 5356 1154 -3490 -6320 -4593 -3072 -6163 -10351 -11855 -9936 -4360 1663 2757 1835
320 1835 4423 9082 11971 12676 10496 3516 -2044 -2103 -1262 -4281 -8654 -11667 -11409 -7765 -2773 360
336 360 834 -59 1361 4866 8154 6961 3535 1218 1692 2849 3650 2319 -1259 -4180 -4168 -1973 -1698
$$ packed form
228a0419J4P328j361j1484p849L417J0419J1414M056l179N79N476Q288P989k389
243B2299j4152q680J294O4k825k852r888r041P546J2096N97j285K026j989M026
258g64J4545L514r904l050L172o88K838L674r466j2843J194M207k660k186k430
273a0847o287P35J1940P476J86M37J501L049P095M369n496q731m776j835q64p00
289b748m315o800k028M717P208L027j846q29L306M098M054K818l033n994K96N186
305G117J372l133m202m644k830J727J521l091m188j504J919N576O023J094r22
320A835K588M659K889P05k180o980n560n9Q41l019m373l013K58L644M992L133
336C60M74q93J420L505L288j193l426k317M74J157Q01j331l578k921J2K195K75
$$ plain form
353 -1698 -4228 -7099 -8002 -5980 -2491 979 2204 2016 3489 6558 9356 10099 6820 1890 -652 -650 -2268
370 -2268 -5371 -7008 -8650 -9949 -5999 63 905 164 2363 3650 4476 6877 6569 1965 -64 1511
386 1511 526 -180 510 -1998 -5093 -2639 555 -1441 -2759 -2532 -4252 -3926 480 2499 1050 1684 3843
403 3843 4333 5750 7244 4475 800 -47 -917 -3091 -4399 -6129 -8209 -6719 -2903 -745 826 1997
419 1997 2077 3563 6581 6411 4677 3547 1112 -1348 142 428 -2951 -3524 -1983 -3231 -2815 270 -871
436 -871 -4286 -1608 977 -552 738 3360 609 153 5285 5630 2104 3411 2892 -2569 -2187 581
452 581 -3775 -6731 -3602 -3762 -5034 -159 2255 -1013 1226 5817 4036 3181 5647 2173 -1567 1088
468 1088 978 -2753 -2009 -1514 -4300 -3091 161 -1148 -2092 -45 -608 -1206 2038 2372 -199 1884 2825
$$ packed form
353a698k530k871r03K022L489L470J225j88J473L069K798P43l279m930k542Kj618
370b268l103j637j642j299L950O062Q42p41K199J287Q26K401l08m604k029J575
386A511r85p06O90k508l095K454L194j996j318K27j720L26M406K019j449O34K159
403C843M90J417J494k769l675q47q70k174j308j730k080J490L816K158J571J171
419A997Q0J486L018j70j734j130k435k460J490K86l379n73J541j248M16L085j141
436h71l415K678K585j529J290K622k751m56N132L45l526J307n19n461L82K768
452E81m356k956L129j60j272M875K414l268K239M591j781q55K466l474l740K655
468A088j10l731P44M95k786J209L252j309r44K047n63n98L244L34k571K083R41
$$ plain form
485 2825 1036 2789 4526 470 -1217 885 -1097 -3199 -1601 -2783 -6098 -3082 -170 -2369 -223
500 -223 3039 1271 909 5322 4616 744 1920 2328 -1452 -1010 1142 -2400 -4211 -1404 -1197 -2676 -533
517 -533 475 -2172 -1325 1698 740 -117 1371 1419 632 1545 2867 1564 431 582 -64 -962 -1038 -1533 -2495
536 -2495 -3061 -2074 -998 -586 -185 725 1305 1581 2365 2971 1965 548 604 549 -770 -977 -902 -1738 -1959 -1030
556 -1030 -276 -898 -648 158 48 65 1055 1210 130 239 1717 1216 317 1583 758 -1002 -710 776 -873
575 -873 -2304 -920 -1103 -2373 -623 900 -300 -47 1887 1555 594 2260 1753 -415 -204 847 -677
592 -677 -1307 -726 -880 -1848 -491 678 -582 -519 381 121 -165 977 602 -227 287 954 398 523 890
611 890 97 -473 -258 -389 -856 -1109 -1168 -1139 -936 -354 -75 365 656 780 1534 1528 1377 754 460 -97 -498 -299
$$ packed form
485B825j789J753J737m056j687K102j982k102J598j182l315L016K912k199K146
500b23L262j768l62M413p06l872J176M08l780M42K152l542j811K807K07j479K143
517e33J008k647Q47L023r58q57J488M8p87R13J322j303j133J51o46q98p6m95r62
536b495n66R87J076M12M01R10N80K76P84O06j006j417N6n5j319k07P5q36k21R29
556a030P54o22K50Q06j10J7R90J55j080J09J478n01q99J266q25j760K92J486j649
575h73j431J384j83j270J750J523j200K53J934l32r61J666n07k168K11J051j524
592f77o30N81j54r68J357J169j260O3R00k60k86J142l75q29N14O67n56J25L67
611H90p93n70K15j31m67k53n9K9K03N82K79M40K91J24P54oj51o23k94n57m01J99
$$ plain form
633 -299 -576 -1702 -1057 -601 -995 -368 359 89 -169 677 923 -77 413 774 -146 32 1231 587 -419
652 -419 214 270 -772 -447 130 -1403 -1555 -305 -744 -861 516 568 -115 862 1413 887 832 1042 144 -249
672 -249 -188 -585 -1032 -786 -611 -971 -261 -82 -362 43 833 -36 473 929 46 -54 744 104 136 512 322
693 322 -368 -44 325 -617 -609 7 -853 -1322 -269 -198 -354 403 696 217 942 1444 471 192 801 186 -534
714 -534 -146 -379 -1266 -770 -299 -667 -359 215 -174 3 460 307 272 505 243 -114 260 439 -8 68 415
735 415 -115 -149 84 -487 -675 -141 -619 -818 -474 132 -289 114 664 616 382 571 663 160 263 158 -288
756 -288 -657 -285 -781 -650 -89 -159 -188 -76 440 47 183 285 38 -80 55 16 315 298 125 -233 189 238
778 238 -192 10 -156 -407 -493 -298 -129 -469 -139 231 79 469 477 431 266 293 151 -113 13 -297 -374 -254
$$ packed form
633b99k77j126O45M56l94O27P27k70k58Q46K46j000M90L61r20J78J199o44j006
652d19O33N6j042L25N77j533j52J250m39j17J377N2o83R77N51n26n5K10q98l93
672b49O1l97m47K46J75l60P10J79k80M05P90q69N09M56q83j00P98o40L2L76j90
693C22o90L24L69r42QO16q60m69J053P1j56P57K93m79P25N02r73k79O09o15p20
714e34L88k33q87M96M71l68L08N74l89J77M57j53l5K33k62l57L74J79m47P6L47
735D15n30l4K33n71j88N34m78j99L44O06m21M03N50m8k34J89R2n03J03j05m46
756b88l69L72m96J31N61p0k9J12N16l93J36J02k47j18J35l9K99j7j73l58M22M9
778B38m30K02j66k51q6J95J69l40L30L70j52L90Qm6j65K7j42k64J26l10p7J20
$$ plain form
800 -254 -212 -43 11 98 55 64 148 134 63 189 145 -100 -93 138 63 153 166 -61 -81 -68 -104 -177 -136 -280 -250 -285 -342 -50
828 -50 63 146 227 251 7 253 123 41 25 -284 -119 -482 -344 -226 -228 49 144 96 -85 154 307 10 178 144
852 144 72 -39 162 190 -24 -68 -92 -68 -82 215 -198 -54 -208 -90 -117 6 150 -112 405 302 425 287 79
875 79 202 84 -26 -172 -234 -260 -243 -336 -45 -346 -213 -16 202 363 224 239 274 -13 265 256 82 234 93
898 93 31 -29 -194 -317 -297 -282 -247 -320 22 -70 -68 -15 304 31 379 380 284 341 137 -92 -71 -143 -210 -112 -241 -180 -173 26
926 26 -139 96 79 258 32 182 150 -101 143 85 153 209 100 56 60 -140 14 -43 -319 -101 -261 -176 -3 -192
950 -192 -248 28 57 130 157 355 320 114 -57 -67 38 -52 -440 -345 39 -455 -247 -54 -201 -49 131 163 50
973 50 225 62 2 -71 397 -220 115 324 -284 -189 49 -262 -151 -153 -99 -181 -141 15 -93 46 108 149 220 352
$$ packed form
800b54M2J69N4Q7m3RQ4j4p1J26m4k45PK31p5R0J3k27k0J3l6p3M1j44L0l5n7K92
828e0J13Q3Q1K4k44K46j30q2j6l09J65l63J38J18kK77R5m8j81K39J53k97J68l4
852A44p2j11K01K8k14m4k4K4j4K97m13J44j54J18k7J23J44k62N17j03J23j38k08
875G9J23j18j10j46o2k6J7r3K91l01J33J97K18J61j39J5L5k87K78rj74J52j41
898I3o2o0j65j23K0J5L5p3L42r2KN3L19k73L48Jr6N7k04k29K1p2o7R8j29O1PJ99
926B6j65K35j7J79k26J50l2k51K44n8O8N6j09m4Mk00J54n7k76K18j60Q5J73j89
950a92n6K76K9P3K7J98l5k06j71j0J05r0l88R5L84m94K08J93j47J52J80L2j13
973E0J75j63o0p3M68o17L35K09o08R5K38l11J11kN4q2M0J56j08J39O2M1P1J32
$$ plain form
997 352 164 -40 -6 84 -272 -163 -258 -285 -120 16 -97 -36 -20 214 75 182 106 92 154 361 28 -14 86 -43
1021 -43 24 28 -1 -62 -230 89 -70 -62 39 -138 -14 166 -6 -28 73 256 18 148 300 -20 -178 -59 -178
1044 -178 -253 -105 2 -76 -106 29 -205 -32 256 117 230 61 162 -177 154 62 -73 -33 -23 -32 -22 -81 44
1067 44 -42 -37 160 -198 40 -168 -265 68 27 93 -45 72 -9 -156 59 -115 -245 -299 -189 -176 -202 24 176 -199
1091 -199 -24 -72 -4 75 213 -22 80 224 -142 270 173 -115 -221 180 -42 -268 -47 -173 -230 -28 238 -91
1113 -91 -140 100 99 65 196 35 79 108 13 -282 54 -53 -48 -168 168 -66 -318 -158 -87 -142 67 389 -76 127
1137 127 264 51 -62 47 -29 -22 -77 67 -332 -43 -110 -66 -168 -22 -104 -43 133 -93 -43 -3 289 76 206
1160 206 128 129 -1 -168 -69 -208 -130 -117 -345 -112 -57 -197 114 -37 112 -66 90 126 125 162 324 161 35 228
$$ packed form
997C52j88k04L4R0l56J09r5k7J65J36j13O1J6K34j39J07p6j4O2K07l33m2J00j29
1021d3O7Mk9o1j68L19j59QJ01j77J24J80j72k2J01J83k38J30J52l20j58J19j19
1044a78p5J48J07p8l0J35k34J73K88j39J13j69J01l39L31r2j35M0J0rJ0n9J25
1067D4q6NJ97l58K38k08r7L33m1O6j38J17q1j47K15j74j30n4J10J3k6K26J52l75
1091a99J75m8O8P9J38k35J02J44l66M12r7k88j06M01k22k26K21j26n7K02K66l29
1113i1m9K40jl4J31j61M4K9r5k95L36j07Nj20L36k34k52J60P1n5K09L22m65K03
1137A27J37k13j13J09p6Pn5J44l99K89o7M4j02J46q2O1J76k26N0M0K92k13J30
1160B06p8Jj30j67R9j39P8J3k28K33N5j40L11j51J49j78J56L6jL7J62j63j26J93
$$ plain form
1184 228 -87 -24 136 -197 -83 -189 -76 -105 -247 -49 -97 -72 124 240 95 -139 46 -20 -54 -89 -132 35 -199
1207 -199 -63 -36 -112 -224 -57 7 43 56 -125 81 162 72 118 75 57 4 -76 24 220 -117 100 -34 -58 113
1231 113 -139 -103 -118 43 -55 35 152 171 -194 12 133 292 86 12 -88 143 -128 -342 48 115 -130 -250
1253 -250 47 -149 19 255 72 -17 -67 174 -83 55 106 -98 -125 -9 -79 59 -213 -161 55 -188 45 -27
1275 -27 -129 107 120 -88 40 55 -46 60 -11 105 38 156 -47 144 -171 -181 82 109 -113 -72 139 116 42
1298 42 76 41 120 1 -193 78 -42 31 73 -27 -34 -102 -89 -82 35 71 359 35 166 -139 22 165 90 132 28
1323 28 99 42 72 109 -99 -147 119 237 -112 -70 57 -73 287 81 -52 -70 8 -113 -44 -140 -334 -85 37 97
1347 97 51 88 -36 -51 9 -258 -106 90 -56 16 -57 132 -43 -107 18 68 209 53 -43 -208 -103 -110 -98 -141 257
$$ packed form
1184B28l15O3J60l33J14j06J13k9j42J98m8K5J96J16j45k34J85o6l4l5m3J67k34
1207a99J36K7p6j12J67O4L6J3j81K06Q1r0M6m3j8n3q0J00J96l37K17j34k4J71
1231A13k52L6j5J61r8R0J17J9l65K06J21J59k06p4j00K31k71k14L90O7k45j20
1253b50K97j96J68K36j83q9n0K41k57J38N1k04k7J16p0J38k72N2K16k43K33p2
1275b7j02K36J3k08J28J5j01J06p1J16o7J18k03J91l15j0K63K7k22M1K11k3p4
1298D2L4l5P9j19j94K71j20P3M2j00po8J3PJ17L6K88l24J31l05J61J43p5M2j04
1323B8P1n7L0L7k08m8K66J18l49M2J27j30L60k06j33j8P8j21O9r6j94K49J22O0
1347I7m6L7j24j5O0k67J52J96j46P2p3J89j75o4J25N0J41j56r6j65J05pJ2m3L98
$$ plain form
1372 257 -82 66 -66 186 -50 176 42 5 -49 -180 0 -104 -5 -28 -184 -155 -89 -99 -77 -14 -88 46 -36 -172
1396 -172 79 187 229 190 66 50 -79 26 17 -41 -9 -68 58 57 129 -29 89 2 -12 -121 -38 95 58 133 71 -47
1422 -47 -86 92 80 -203 80 52 72 -26 -9 1 -61 128 42 115 -54 -134 116 -76 31 -15 -133 -57 -89 -44 189
1447 189 63 -36 -68 174 -70 -183 -70 -20 93 -113 -44 -12 45 -5 97 22 314 190 -38 -100 14 -75 -163 150
1471 150 67 57 -60 -82 -63 -27 124 82 72 29 290 137 -69 -2 -17 20 -174 27 30 118 -66 169 15 -109 14
1496 14 136 -204 258 59 34 -82 150 -201 0 -30 5 72 88 -4 -116 157 67 -92 -23 118 -59 -29 50 -26
1520 -26 -19 173 181 33 69 -104 21 189 75 -4 -114 44 -186 -53 27 -24 -1 43 143 -35 -17 -11 45 92 96 -145
1546 -145 -81 -140 -91 -73 -76 124 -110 -184 196 37 -189 -78 59 -16 8 -88 -3 79 -47 -2 231 -141 -48 156 -35
$$ packed form
1372B57l39J48j32K52k36K26j34l7n4j31J80j04R9k3j56K9O6j0K2O3p4J34q2j36
1396a72K51J08M2l9j24j6j29J05rn8L2n9J26jP2j58J18q7j4j09Q3J33l7P5o2j18
1422d7l9J78j2k83K83k8K0r8J7J0o2J89q6P3j69q0K50j92J07m6j18P6l2M5K33
1447A89j26r9l2K42k44j13J13N0J13k06O9L2N7n0J02p5K92j24k28o2J14q9q8L13
1471A50q3j0j17k2J9L6J51m2j0m3K61j53k06O7j5L7j94K01LQ8j84K35j54j24J23
1496A4J22l40M62j99k5j16K32l51K01l0L5O7J6r2j12K73r0j59O9J41j77L0P9p6
1520b6PJ92Qj48L6j73J25J68j14p9j10J58k30J33Q0n1K3M4J00j78J8ON6M7Mk41
1546a45O4n9M9J8lK00k34p4L80j59k26J11J37p5K4r6Q5Q2j26M5K33l72R3K04j91
$$ plain form
1571 -35 101 270 32 18 7 -14 -38 251 -104 -108 122 21 -66 -124 11 47 16 -20 -37 -37 -40 -19 88 -109 -144 34
1597 34 83 177 -63 -78 158 59 110 17 6 -40 -5 -31 232 -189 -106 -151 -54 5 -50 -85 -19 56 -202 35 -93 -71 23
1624 23 -169 19 -7 185 -47 -45 -16 -265 -77 -12 -109 -30 -273 114 -47 -42 133 -181 6 17 373 -25 -36 4
1648 4 -43 -217 91 146 103 119 -53 -97 104 19 -60 58 73 93 21 -7 4 65 262 -32 76 74 30 -46 97 274
1674 274 -67 53 126 104 -98 230 28 -72 -31 -86 -20 -35 -26 79 152 92 8 57 59 90 -17 117 43 -40 57 -1
1700 -1 12 -52 39 73 -12 -144 77 221 -106 -42 -58 -63 -139 35 85 -118 2 47 202 -105 -48 -112 63 8 -80 -41
1726 -41 -47 148 306 132 90 105 50 -28 -128 -171 13 -118 138 4 -39 144 77 199 -85 109 64 124 -23 -25 -3
1751 -3 110 38 35 141 48 101 75 19 122 -43 -61 61 79 29 94 -129 -18 -40 14 109 -96 -58 -188 -21 -43 -144
$$ packed form
1571c5J36J69k38j4j1k1k4K89l55mK30j01q7n8J35L6l1l6j7%lK1J07j97l5J78
1597C4M9R4k40j5K36r9N1r3j1m6L5k6K63m21Q3m5R7N9n5l5O6P5k58K37j28K2R4
1624B3j92J88k6J92k32KK9k49J88O5r7P9k43L87j61NJ75l14J87J1L56l98j1M0
1648Dm7j74L08N5m3J6j72m4K01q5p9J18J5K0p2k8J1O1J97k94J08km4p6J43J77
1674B74l41J20P3k2k02L28k02j00M1n5O6j5RJ05P3o0q4M9KL1j07J34p4q3R7n8
1700aJ3o4R1L4q5j32K21J44l27O4j6np6J74N0k03J20M5J55l07N7o4J75n5q8L9
1726d1oJ95J58j74m2J5n5p8j00m3J84j31K56j34m3J83o7J22k84J94m5O0j47kK2
1751cJ13p2lJ06r3N3k6n6J03j65j8J22J8n0O5k23J11k2N4R5k05L8j30J67k2j01
$$ plain form
1777 -144 138 -126 6 -25 -239 -149 -66 152 -227 105 5 -115 30 20 31 -98 83 89 -192 -88 16 -225
1799 -225 -136 -215 68 60 38 -24 -102 65 -2 -39 -49 92 35 155 -153 101 -35 -62 12 -6 26 101 86 106 136 -217
1825 -217 13 119 -118 -20 -3 -96 116 -83 271 -44 2 45 -82 -100 -2 33 -110 -59 -120 10 28 -48 171 41
1849 41 56 -83 -22 -18 -4 124 -115 -213 -62 -208 -26 -141 34 150 -181 69 35 -44 4 -175 -85 -121 -43 127
1873 127 -46 270 -117 -329 -72 -37 85 96 14 -14 67 -23 -18 -53 -19 -112 -101 -214 123 101 -34 -25 -140 -17 76
1898 76 95 -99 -149 68 -165 100 42 9 -205 131 16 -44 100 43 -1 12 41 -50 107 59 7 -66 15 -90 -41
1923 -41 35 172 -23 118 176 -31 -52 104 31 42 23 85 78 96 44 16 100 11 69 -207 -203 217 -28 16 -24 -110 -124
1950 -124 195 10 16 120 86 -159 -57 34 93 -164 141 -37 -60 89 -23 -113 -100 177 69 140 221 3 -30 -102
$$ packed form
1777a44K82k64J32l1k14R0Q3K18l79L32j00j20J45j0J1j29J81Ok81J04J04k41
1799b25Q9p9K83qk2o2p8J67o7l7j0J41n7J20l08K54j36k7P4j8L2P5j5K0L0l53
1825b17K30J06k37R8J7r3K12j99L54l15M6M3j27j8R8L5j43N1o1J30J8p6K19j30
1849D1J5j39O1MJ4J28k39r8J51j46J82j15J75J16l31K50l4p9M8j79R0l6P8J70
1873A27j73L16l87k12K57L5J22J1q2k8Q1r0Nl5L4r3J1j13L37k2j35Rj15J23R3
1898G6J9j94n0K17k33K65n8l3k14L36j15o0J44n7m4J3K9r1J57m8n2p3Q1j05M9
1923d1P6J37j95J41N8k07k1J56p3J1j9O2pJ8n2k8Q4q9N8k76MM20k45M4m0q6j4
1950a24L19j85OJ04l4k45J02R1N9k57L05j78k3J49j12r0J3K77j08P1Q1k18l3p2
$$ plain form
1974 -102 29 -18 15 125 -54 -189 -44 41 -55 37 -75 -61 35 -109 105 -46 -142 76 80 -31 265 -66 240
1997 240 128 -22 -68 -307 -50 -153 151 -2 -84 -71 167 154 102 140 -36 188 -150 -204 -11 -144 85 41 175
2020 175 37 37 -21 67 5 119 57 -21 48 -118 72 -108 -181 58 -47 124 77 156 -33 67 -91 -36 126 42
2044 42 -4 241 70 40 40 -127 137 -135 -77 -78 -1 205 25 -26 106 -142 128 2 -14 -111 -163 -72 -73 98 -3
2069 -3 -148 -255 -4 289 64 -15 40 174 206 -80 -119 -101 -132 139 -157 -51 112 115 114 129 -42 -6 -3 120 212 0
2095 0 212 38 -121 173 17 66 -110 -10 -286 49 57 130 -227 -124 -109 -133 -159 -35 164 149 -153 54 31 64
2119 64 82 103 62 -28 -48 44 -93 -139 78 216 18 -195 -49 53 24 -108 -47 328 -112 96 -2 -56 61 -193
2143 -193 3 -7 32 -164 -119 34 -17 32 71 31 -139 124 -173 -108 53 -104 -99 69 136 -113 75 34 -183 -81
$$ packed form
1974a02J31m7L3J10j79j35J45Q5r6R2j12J4R6j44K14j51r6K18Mj11K96l31L06
1997B40j12j50m6k39K57j03L04j53q2J3K38j3n2L8j76K24l38n4J93j33K29m4J34
2020A75j38%n8Q8o2J14o2p8O9j66J90j80p3K39j05J71m7P9j89J00j58N5J62q4
2044D2m6K45j71l0%j67K64k72N8jP7K06j80n1J32k48K70j26j6r7n2R1jJ71j01
2069cj45j07K51K93k25p9N5J34L2k86l9J8l1K71k96J06J63LjJ5j71L6LJ23R2k12
2095@K12j74j59K94j56M9j76J00k76L35QP3l57J03J5k4k6J24J99j5l02K07k3L3
2119F4J8K1m1r0k0R2j37m6K17J38j98k13J46J02k9j32O1L75m40K08r8n4J17k54
2143a93J96j0L9j96M5J53n1M9L9m0j70K63k97O5J61j57NJ68O7k49J88m1k17J02
$$ plain form
2167 -81 -110 -178 102 -11 -268 73 -111 78 4 34 -134 -86 -18 60 224 59 231 -23 -33 -78 120 11 -123
2190 -123 -101 -33 43 99 48 -216 120 -186 56 -91 143 226 -102 -79 -313 -119 -57 -128 -139 22 100 48 -85 176
2214 176 -141 -185 -24 -112 -151 -16 -128 -32 -58 -56 -59 -118 245 43 22 92 4 -9 3 -16 88 -4 -7 64 -226 -22 -38
2241 -38 38 -41 -21 -98 118 -44 82 -65 62 77 91 -58 37 -16 225 47 -134 -8 -29 -110 50 -2 -67 1 113
2266 113 37 -226 202 100 78 -27 102 -44 28 -175 87 0 -106 -22 74 -89 164 11 87 140 -64 17 -17
2289 -17 -13 10 -84 255 -13 -180 35 -217 27 37 52 74 38 -68 225 -35 -98 -137 -85 16 71 -53 -43 228 -12
2314 -12 28 -106 35 -149 -148 38 65 112 -27 -175 17 191 -88 34 -86 -5 -41 156 -5 126 83 73 48 -131
2338 -131 -66 116 -190 130 -109 -33 -62 -90 214 -124 125 133 36 71 -44 20 -21 140 -105 32 -45 -107 66 74 33
$$ packed form
2167h1k9o8K80j13k57L41j84J89p4L0j68M8O8P8J64j65J72k54j0m5J98j09j34
2190a23K2O8P6N6n1k64L36l06K42j47K34Q3l28K3k34J94O2p1j1J61P8n2j33K61
2214A76l17m4J61q8l9J35j12R6k6Kln9L63k02k1P0q8j3J2j9J04r2lP1k90K04j6
2241c8P6p9K0p7K16j62J26j47J27J5J4j49R5n3K41j78j81J26k1q1J60n2o5O8J12
2266A13p6k63M28j02k2j05J29j46P2k03K62q7j06Q4R6j63K53j53P6N3k04Q1l4
2289a7MK3r4L39k68j67K15k52K44J0J5K2l6j06K93k60o3l9N2J01N5j24J0K71k40
2314a2M0j34J41j84JJ86K7M7j39j48J92J74k79J22j20Q1l6J97j61J31m3j0k5j79
2338a31O5J82l06L20k39P6k9k8L04l38K49Qr7L5j15O4m1J61k45J37p7o2J73Qm1
$$ plain form
2363 33 -63 79 -44 -10 -112 123 5 8 -21 -89 -6 97 -80 74 211 34 -7 -66 20 -59 35 79 -12 -84 137
2388 137 -108 -56 82 -66 -194 -41 -222 30 182 -84 236 45 54 266 -44 -96 -39 100 -171 -310 -83 150
2410 150 73 -62 -171 90 -185 -150 115 93 202 3 41 -188 -66 109 -133 -54 38 28 74 50 102 14 148 -215
2434 -215 -97 -107 -94 -124 -36 31 9 -14 -193 -172 146 13 13 -109 31 47 35 -96 -220 319 110 24 -4 90 -57
2459 -57 -29 -63 23 -13 -16 104 -95 211 -23 -108 39 -168 -200 2 -50 -13 -142 98 -53 -32 15 -143 -72 -308 53
2484 53 206 -115 -5 211 57 226 49 59 -132 -93 73 -115 -32 -61 165 196 12 -247 83 99 -165 -77 -185
2507 -185 -211 -1 2 14 58 185 -108 73 48 45 -87 -34 -10 11 -62 -78 28 15 27 -123 -28 -49 -250 -72 -64 -8 92
2534 92 35 -37 -20 -70 140 -277 89 -23 -18 114 -78 41 58 -109 188 -25 40 -84 -17 -99 -91 26 77 -139 -113
$$ packed form
2363C3r6J42j23L4j02K35j18Lk9o8Q3J03j77J54J37j77m1n9Q6p9R4M4r1p2K21
2388A37k45N2J38j48j28J53j81K52J52k66L20j91RK12l10n2N7J39k71j39K27K33
2410A50p7j35j09K61k75L5K65k2J09j99L8k29J22J75k42P9R2j0M6k4N2q8J34l63
2434b15J18j0J3l0Q8O7k2k3j79K1L18j33%j22J40J6j2j31j24N39k09q6k8R4j47
2459e7K8l4Q6l6lJ20j99L06k34q5J47k07l2K02n2L7j29K40j51K1M7j58P1k36L61
2484E3J53l21J10K16j54J69j77J0j91L9J66j88Q3k9K26L1j84k59L30J6k64Q8j08
2507a85k6K10LJ2M4J27k93J81k5lj32N3K4K1p3j6J06j3J2j50R5k1k01J78QN6J00
2534I2n7p2J7n0K10m17L66j12NJ32j92J19J7j67K97k13O5j24O7q2QJ17N1k16K6
$$ plain form
2559 -113 -41 42 82 72 60 89 13 -252 19 -2 -92 -13 -71 -195 87 -145 -18 -5 48 -17 14 80 26 -36 -24 -53 16
2586 16 -15 -134 -72 94 -157 -60 23 122 -33 -98 -95 -18 -43 -142 -138 64 139 137 137 87 -25 84 -146 30 201 39 -15
2613 -15 -47 -52 -33 -57 -22 41 -5 49 56 18 -71 112 -233 31 221 -112 -160 70 -27 -41 137 -101 -117 -47 195 -20
2639 -20 94 67 151 -29 7 -144 -31 4 -141 158 -115 -6 12 24 -46 -9 152 18 44 191 -14 49 123 274
2663 274 -4 -44 94 179 147 -19 -19 47 159 -42 187 52 145 -59 -64 142 -36 198 46 86 -102 -21 43 -214
2687 -214 31 182 70 -41 170 14 54 -18 254 -102 75 -8 9 60 12 -170 -115 59 -61 -203 144 -78
2709 -78 -93 6 105 -228 251 -73 -102 42 -304 -8 -159 105 -15 -265 205 32 90 -25 -97 -175 45 94 0
2732 0 -103 -88 -75 -11 74 -72 -119 50 0 -106 -203 -230 34 58 -38 59 -207 27 74 -152 -131 131 -83 126 45
$$ packed form
2559a13P2Q3M0j0j2K9p6k65K71k1r0P9n8j24K82k32J27J3N3o5L1O6n4o2J2k9O9
2586A6l1j19O2J66k51R7Q3R9j55o5LP7k5r9MK02P5k%n0j12J09k30J76J71j62n4
2613a5l2nJ9k4L5O3m6N4Pl8q9J83l45K64J90l33m8K30r7j4J78k38j6P0K42k15
2639b0J14k7Q4j80L6j51J13L5j45K99k73J09J8J2p0L7J61j34K6J47k05O3P4J51
2663B74k78m0J38Q5l2j66%O6J12k01K29j35R3k04nK06j78K34j52M0j88Q1O4k57
2687b14K45J51j12j11K11j56M0p2K72l56J77q3J7N1m8j82N5J74j20j42L47k22
2709g8j5R9R9l33M79l24k9J44l46K96j51K64j20k50M70j73N8j15p2p8K20M9r4
2732@j03J5J3O4Q5j46m7J69n0j06r7k7K64K4r6R7k66K34M7k26K1K62k14K09q1
$$ plain form
2757 45 25 -48 25 28 -40 42 -6 88 -42 -176 150 105 -63 188 -103 -70 -86 28 -32 -131 -192 126 109 -71 150 -73
2783 -73 21 -199 32 31 28 -276 -166 -78 -172 -230 119 55 56 91 -27 -48 89 186 57 136 -30 -170 135 139 -2 -51
2809 -51 -248 151 13 -204 -132 -104 -98 -46 104 20 -86 103 -28 11 184 289 149 -32 262 -235 39 125 -195
2832 -195 32 -103 110 -61 -27 -105 32 12 -37 -136 -4 81 -14 52 80 -145 20 56 68 108 -39 109 -178 -77
2856 -77 43 10 32 -10 -104 -174 -166 74 85 -5 80 17 204 32 -72 -22 -222 40 -35 -47 -109 255 104 3 6 159
2882 159 -76 -2 146 31 114 27 209 -120 -125 40 71 -72 -121 32 -184 -8 -46 -157 146 17 -70 208 135
2905 135 40 -24 145 22 -79 -229 -105 211 -131 -14 263 -187 -21 7 67 11 -39 171 -133 -136 -72 -49 95
2928 95 -137 94 -21 157 -60 93 -102 93 -25 -179 49 23 -160 -240 39 37 -118 -85 -97 -88 -56 -8 -8 49 126
$$ packed form
2757D5k0p3P3Lo8Q2m8R4j30j34L26m5j68K51k91L3j6J14o0r9o1L18j7j80K21k23
2783g3R4k20K31jll04J10Q8r4n8L49o4JL5j18k1J37R7j29P9j66j40L05Mj41m9
2809e1j97L99j38k17P2K8ON2J50q4j06J89j31L9J73J05j40j81K94m97K74Q6l20
2832a95K27j35K13j71L4p8J37k0m9r9J32Q5r5O6K8k25J65L6J2M0j47J48k87J01
2856g7J20l3K2m2r4p0QK40J1r0Q5o3J87j72j04N0k00K62p5j2o2L64j51j01LJ53
2882A59k35P4J48j15Q3q7J82l29nJ65L1j43m9J53k16J76l8j11L03j29q7K78p3
2905A35r5o4J69j23j01j50J24L16l42J17K77m50J66K8O0n6n0K10l04lO4K3J44
2928I5k32K31j15J78k17J53j95J95j18j54K28k6j83q0K79kj55L3j2RL2M8%N7P7
$$ plain form
2953 126 71 30 -63 68 161 339 74 19 54 0 -95 121 -99 -62 -147 114 -4 -218 -47 287 177 -154 -171 -244
2977 -244 129 68 -30 98 184 -55 73 -19 127 -78 13 -22 -102 250 70 6 -115 100 -85 55 109 34 -77
3000 -77 91 51 -8 3 -21 161 -18 -43 70 -47 -29 14 24 -109 196 112 70 -30 117 -26 -14 -95 -25 -16 -48 13
3026 13 43 -122 -91 117 -93 27 -8 -12 -11 -42 -208 42 27 -160 -145 -120 220 -145 151 81 36 98 56 59 3 -11 -47
3053 -47 189 -5 -104 -25 107 158 193 55 -271 114 55 207 64 -52 51 -73 47 -27 186 118 7 173 255
3076 255 -235 142 -53 7 76 146 -30 56 16 -98 20 236 94 -137 23 -57 -136 74 -52 247 170 -171 -81
3099 -81 -111 136 -167 -12 -148 -41 90 128 112 84 -214 96 189 -29 -80 13 210 -22 -8 -60 -141 19 307 -67
3123 -67 -100 -138 -68 -45 142 80 193 -95 -19 82 -71 -62 102 37 194 -210 -225 81 42 30 12 -49 2 -57 -21 -12 118
$$ packed form
2953A26n5m1r3J31R3J78k65n5L5n4r5K16k20L7q5K61j18k14J71L34j10l31j7p3
2977b44L73o1r8J28Q6k39J28r2J46k05R1l5q0L52j80o4j21K15j85J40N4p5j11
3000g7J68m0n9J1k4J82j79k5J13j17J8M3J0j33L05q4m2j00J47j43J2q1P0Rl2O1
3026A3L0j65L1K08k10J20l5mJl1j66K50j5j87J5K5L40l65K96p0m5O2m2Ln6j4l6
3053d7K36j94r9P9J32N1L5j38l26L85n9J52j43j16J03j24J20p4K13o8j11J66Q2
3076B55m90L77j95O0O9P0j76Q6m0j14J18K16j42k31J60q0p9K10j26K99p7l41R0
3099h1l0K47l03J55j36J07J31L8j6k8k98L10R3k18n1R3J97k32J4n2q1J60K88l74
3123f7l3l8P0K3J87o2J13k88P6J01j53RJ64o5J57m04j5L06l9j2j8o1N1n9L6RJ30
$$ plain form
3150 118 -29 -138 -18 -41 -34 -168 -65 -99 -55 -48 171 18 -110 -15 -119 112 0 24 17 99 -110 -35 229 -114
3174 -114 -223 -101 -12 -134 28 115 53 -80 -6 -36 95 101 12 -240 83 145 -89 -140 48 -60 -110 41 81 103
3198 103 -53 48 78 4 30 -105 98 -137 -51 -92 -150 99 -29 -133 -183 -67 -102 8 9 13 28 -142 -18 -133
3222 -133 -278 128 -35 122 -139 -11 -12 48 -171 -101 -128 -113 -173 -167 136 -53 -94 74 -206 116 61 -105 -96 20
3246 20 123 -105 84 -17 -133 -29 53 -18 -213 -20 -104 149 -195 16 185 -43 -49 71 -74 -153 107 37 85
3269 85 82 -48 118 -133 173 112 -55 -163 -4 16 81 -36 63 147 -27 212 235 61 7 66 147 -75 -85 36
3293 36 -194 -65 -120 -99 58 -45 76 62 88 29 4 73 -35 -50 -93 -64 145 -65 -109 -176 -14 111 -184 59
3317 59 -95 15 -34 -14 137 48 144 -60 -60 -36 -154 -172 92 -36 -85 33 194 -29 -86 158 40 11 6 -107 -78
$$ packed form
3150A18j47j09J20k3Pj34J03l4M4PK19j53j28R5j04K31j12K4pQ2k09P5K64l43
3174a14j09J22Q9j22J62Q7o2j33P4l0J31Oq9k52L23O2k34n1J88j08n0J51M0K2
3198A03j56J01L0p4K6j35K03k35Q6m1n8K49j28j04n0J16l5J10JMJ5j70J24j15
3222a33j45M06j63J57k61J28jO0k19P0k7J5o0OL03j89m1J68k80L22n5j66RJ16
3246B0J03k28J89j01j16J04Q2p1j95J93q4K53l44K11J69k28oJ20j45p9K60p0M8
3269H5lj30J66k51L06o1j67j08J59K0O5j17R9Q4j74K39K3j74n4N9Q1k22j0J21
3293C6k30J29n5K1J57j03J21j4K6n9k5O9j08j5m3K9K09k10m4o7J62J25k95K43
3317E9j54J10m9K0J51q9R6k04%K4j18j8K64j28m9J18J61k23n7K44j18k9nj13K9
$$ plain form
3342 -78 88 68 -20 77 -45 61 -6 -163 -81 -32 -111 31 3 9 39 38 129 -18 -72 91 -27 96 -133 57 37 170
3368 170 -122 -31 206 -130 101 4 -44 12 231 5 -48 -39 93 -32 10 -87 -80 -83 -93 124 139 70 -208 0 -24 83
3394 83 -19 -46 99 -60 68 -88 -21 -58 -173 122 392 112 91 117 -415 -207 31 -160 13 156 -63 90
3416 90 35 -85 120 79 89 76 -96 69 128 -49 -2 8 1 163 47 -107 11 -15 84 185 68 -70 -8 -158
3440 -158 -59 101 -14 -46 -124 -126 -132 102 -88 -107 17 60 -117 -150 206 -319 -21 94 -31 106 5 -52 71 -44
3464 -44 -43 -138 -79 43 81 14 -103 -60 34 134 -175 125 -24 110 84 80 53 74 -113 -38 24 49 111 -58 -23 -147
3490 -147 -168 -99 129 -27 -61 -33 115 153 -40 -235 -89 137 -21 26 72 100 -39 -42 -308 -58 82 8 -84 129
3514 129 239 -4 216 10 -4 105 -60 76 -66 -47 52 39 16 10 -430 -38 -63 61 41 -41 -123 188 -47 -158
$$ packed form
3342g8J66k0q8R7j22J06o7j57Q2M9p9J42k8OL0jR1j47n4J63j18J23k29J90k0J33
3368A70k92R1K37l36K31r7m8N6K19k26n3RJ32j25M2r7Plj0K17J5o9k78K08k4J07
3394H3j02k7J45j59J28j56O7l7j15K95K70k80k1K6n32K08K38j91J73J43k19J53
3416I0n5j20K05m1J0j3j72J65N9j77M7J0pJ62j16j54J18k6R9J01j17j38O2j50
3440a58R9J60j15l2p8koK34j90j9J24M3j77l3L56n25K98J15j25J37j01n7J23j15
3464d4Jr5N9J22L8o7j17M3R4J00l09L00j49J34k6mk7K1j87P5O2K5O2j69L5j24
3490a47k1O9K28j56l4K8J48L8j93j95J46K26j58M7M6K8j39lk66K50J40p4r2K13
3514A29J10k43K20k06j4J09j65J36j42J9R9j3k3om40L92k5J24k0q2q2L11k35j11
$$ plain form
3538 -158 -47 -248 -82 -30 19 -97 -33 69 -96 -2 158 85 162 -172 77 5 178 119 220 134 416 -88 -32
3561 -32 -62 -15 -115 29 129 35 -70 -40 122 -70 -103 35 145 -4 47 -148 -18 10 187 43 121 101 48 -18
3585 -18 -85 170 71 -249 71 147 82 -116 55 136 -235 -141 41 -6 -57 -16 5 75 -55 -178 -31 -93 55 -112
3609 -112 4 -162 -24 -13 -145 5 -190 143 -7 -147 -127 -16 -4 116 83 -1 108 -81 171 -80 -84 -64 -18
3632 -18 -27 -38 46 -72 -41 92 -120 -34 68 -143 -84 -50 177 -101 -55 34 160 99 50 -92 -5 -66 -60 -7 -40 -51 121
3659 121 77 31 184 -71 12 -3 5 -26 62 -12 65 -33 84 52 128 93 -42 -85 7 -23 -265 -92 178 -127 -119 -174 -47
3686 -47 198 -193 -172 62 -49 29 -261 -116 -4 52 56 -201 -90 -22 -123 147 -25 -166 52 -182 -203 -127 -10
3709 -10 22 -173 27 -101 165 135 -120 167 -101 -191 -119 -190 82 -127 -41 23 55 -164 -62 -115 17 111 4 91
$$ packed form
3538a58J11k01J66N2M9j16O4J02j65R4J60p3P7l34K49p2J73n9J01q6K82n04N6
3561c2l0M7j00J44J00r4j05L0J62j92l3J38J10j49N1j95J30K8J77j44P8k0n3o6
3585a8o7K55r9l20L20P6o5j98J71Q1l71R4J82m7n1M1K1P0j30j23J47o2J48j67
3609a12J16j66J38J1j32J50j95L33j50j40K0J11J2J20l3q4J09j89K52k51mK0M6
3632a8rj1Q4j18L1J33k12Q6J02k11N9L4K27k78M6Q9J26o1m9j42Q7o1ON3l3j1J72
3659A21m4m6J53k55Q3j5Ql1Q8p4P7r8J17l2P6l5j35m3R2l0k42J73K70l05Qn5J27
3686d7K45l91K1K34j11P8k90J45J12N6Mk57J11O8j01K70j72j41K18k34k1P6J17
3709a0L2j95K00j28K66l0k55K87k68r0P2p1K72k09Q6O4L2k19J02n3J32R4j07Q7
$$ plain form
3733 91 -63 -111 102 -5 113 -47 303 105 7 -101 -78 -109 149 40 46 -141 -71 -132 18 21 78 18 207 91
3757 91 -13 86 -18 -280 -174 -76 14 61 -76 -150 -117 334 -20 101 -90 147 97 27 -14 -60 203 7 -12 204
3781 204 -142 125 -294 80 -91 153 -56 -24 -30 -90 172 -135 -76 -39 71 -36 280 269 2 -92 -142 -3 111
3804 111 92 -191 27 -148 -61 -19 -79 -59 29 -12 -113 -141 -56 93 -206 -49 75 27 -123 194 -76 81 85 -87
3828 -87 -112 -31 123 -131 -22 -64 74 9 267 26 -185 27 127 -239 -224 -132 106 -75 -70 -67 22 -137 -17 69
3852 69 -65 19 -136 144 149 -255 175 -49 -95 -21 13 15 -55 -100 64 151 190 63 -108 -69 15 39 -33 -123 51 -3
3878 -3 -95 -41 73 -62 -200 -143 6 -142 -106 50 -9 293 -92 -204 -76 -131 0 -33 75 2 -104 70 169 152
3902 152 -27 -128 -97 -77 -81 -199 -71 81 -160 108 -26 -108 46 -42 49 34 65 21 104 165 93 211 -24 106
$$ packed form
3733I1j54m8K13j07J18j60L50j98r8j08K3l1K58j09Oj87P0o1J50LN7o0J89j16
3757I1j04R9j04k62J06R8R0M7j37p4L3M51l54J21j91K37n0p0m1m6K63j96j9K16
3781B04l46K67m19L74j71K44k09L2oo0K62l07N9L7J10j07L16j1k67r4n0J39J14
3804A11j9k83K18j75Q7M2o0K0Q8m1j01k8Q5J49k99J57J24m8j50L17k70J57Mj72
3828h7k5Q1J54k54J09m2J38o5K58k41k11K12J00l66J5R2K38j81NLQ9j59J20Q6
3852F9j34Q4j55K80Nm04M30k24m6P4L4Kp0m5J64Q7L9j27j71L9Q4K4p2r0J74n4
3878cr2N4J14j35j38N7J49j48L6J56n9L02l85j12J28n5J31l3J08p3j06J74R9j7
3902A52j79j01L1K0mj18J28J52k41K68j34q2J54q8R1j5L1m4Q3O1p2J18k35J30
$$ plain form
3926 106 -85 1 35 -47 340 131 -23 105 -87 137 44 -135 190 20 -14 -131 170 -137 -51 88 -83 -223
3948 -223 -53 -15 129 -87 58 208 146 17 62 -57 98 -13 -66 209 -19 -61 -23 87 223 -193 -308 -27
3970 -27 38 -90 113 23 27 -104 -13 79 -52 -128 42 144 -61 63 -91 107 -33 -74 6 -65 142 72 62 153 113
3995 113 -82 222 238 -74 -133 142 101 60 56 -75 -6 7 45 -35 97 122 -10 -12 -152 -73 215 -158 -35 -174 -44
4020 -44 -41 2 124 -124 248 -25 60 -9 94 42 -123 -88 -23 -102 -82 1 194 179 178 89 -58 -11 -58 -95 4 -67 75
4047 75 64 10 -35 141 -14 20 -79 -9 99 92 -45 -121 190 -100 105 -193 183 44 -133 7 -108 -64 -86 54
4071 54 -118 75 -73 80 -63 -99 -27 -126 -160 72 44 67 -149 -49 10 259 163 -109 40 71 -187 -61 42
4094 42 -209 218 124 112 -36 -132 -144 26 -29 -179 45 229 12 230 205 44 57 -134 -69 18 9 -113 117 187
$$ packed form
3926A06j91Q6L4q2L87k09j54J28j92K24r3j79L25j70l4j17L01l07Q6J39j71j40
3948b23J70L8J44k16J45J50o2j29M5j19J55j11n3K75k28m2L8J10J36m16j15K81
3970b7O5j28K03r0Mj31R1R2j31p6J70J02k05J24j54J98j40m1Q0p1K07p0j0R1m0
3995A13j95L04J6l12n9K75m1m1mj31O9J3L8q0J32K5j32kj40P9K88l73J23j39J30
4020d4LM3J22k48L72k73Q5o9J03n2j65L5O5p9K0Q3J93j5jq9j47M7m7l7R9p1J42
4047G5j1n4m5J76j55L4r9P0J08pj37p6L11k90K05k98L76j39j77J40j15M4k2J40
4071E4j72J93j48J53j43l6P2r9l4K32k8K3k16J00N9K49r6k72J49L1k58J26J03
4094D2k51M27r4j2j48r6j2J70n5j50K24J84k17K18k5j61J3j91O5Q7rj22K30P0
$$ plain form
4118 187 -90 145 127 130 -60 -183 56 3 -54 81 -126 -93 166 111 -15 140 -206 32 -176 -25 48 99 -67
4141 -67 49 88 -121 -183 15 -49 -88 97 67 84 -174 74 -196 -106 -40 -148 220 -42 -53 91 -1 -131 141 -98
4165 -98 -140 -97 -63 65 -23 -66 2 60 -215 -71 -120 118 -211 16 26 -65 85 -95 -91 -49 137 0 82 39 -62
4190 -62 37 -77 20 -25 -43 129 169 -289 95 27 114 133 -202 -152 52 73 251 70 -335 -6 5 314 -88 -44
4214 -44 -45 141 -31 -57 102 175 -26 42 -55 129 138 -222 -85 130 -221 -40 21 29 111 -96 -10 -182 277 231 -27
4239 -27 -49 -15 168 -74 -36 37 139 202 143 189 -2 -71 116 128 -65 -10 -241 152 22 -184 58 1 -155 -129
4263 -129 -140 -48 -107 -53 -15 37 41 58 122 -35 -32 94 37 84 11 92 143 91 91 86 -100 84 -61 12 -30 128 -91 53
4291 53 56 -157 -118 -53 -30 -199 -92 81 -58 -8 -8 -111 -44 152 -270 22 -79 19 -10 99 -73 -103 -13 139 43
$$ packed form
4118A87k77K35j8Lj90j23K39n3n7J35k07L3K59n5j26J55l46K38k08J51P3N1j66
4141f7J16L9k09o2J98o4l9J85l0J7k58K48k70R0O6j08L68k62j1J44r2j30K72k39
4165i8m2M3L4J28q8m3O8N8k75J44m9K38l29K27J0r1J50j80MM2J86j37Q2m3j01
4190f2R9j14R7m5j8J72M0m58L84o8Q7J9l35N0K04K1J78j81m05L29J1L09m02M4
4214d4jJ86j72k6J59P3k01O8r7J84Rl60J37K15l51J81O1QQ2k07Q6j72M59m6k58
4239b7k2L4J83k42L8P3J02O3n9M6j91o9J87J2j93N5k31L93j30k06K42n7j56K6
4263a29j1R2n9N4L8N2MJ7O4j57LJ26n7M7p3Q1N1n2%nj86J84j45P3m2J58k19J44
4291E3Lk13L9O5K3j69J07J73j39N0%j03O7J96m22K92j01R8k9J09j72l0R0J52r6
$$ plain form
4316 43 124 -49 -55 86 -25 -72 279 -25 176 197 -139 45 -173 -43 68 0 -106 1 47 52 -88 84 143 -17
4340 -17 111 -221 32 28 -114 176 -140 -13 185 -8 78 -87 157 -208 25 -139 -12 66 130 -22 -21 -22 -6 -168
4364 -168 -3 -26 -66 151 -255 -175 54 82 -237 -42 -285 183 46 -27 88 58 -77 54 -124 41 -48 47 75
4387 75 14 139 36 -312 -98 20 -15 153 -77 29 35 104 168 70 93 -60 207 71 30 -29 37 117 141 118 175
4412 175 -66 -90 -176 -29 -85 178 48 2 26 -147 102 154 76 191 -101 52 -185 -12 -114 -90 127 14 188
4435 188 -100 -78 -23 222 120 97 95 -171 -207 102 30 19 -165 -67 105 -226 -58 31 -213 112 26 141 -43 -18
4459 -18 41 -51 109 21 -83 10 -35 -92 33 76 191 45 100 -26 33 -173 -46 16 -19 22 45 31 -239 -58 17
4484 17 37 -200 101 134 -10 -49 -79 11 189 68 -157 52 -132 253 19 47 13 -158 -103 120 -66 -224 -52
$$ packed form
4316D3Q1j73oJ41j11m7L51l04K01K1l36J84k18J30J11o8j06J07M6Nj40J72N9j60
4340a7J28l32K53mj42K90l16J27J98j93Q6j65K44l65K33j64J27P8O4j52JjJ6j62
4364a68J65k3m0K17m06Q0K29K8l19J95k43M68j37p3J15l0j35J31j78J65q9R5K8
4387G5o1J25j03l48K14J18l5J68k30J06OO9O4r8K3j53K67j36m1n9O6Q0K4k3N7
4412A75k41k4q6J47n6K63j30m6K4j73K49N2p8J15k92J53k37J73j02K4K17j13J74
4435A88k88K2N5K45j02k3kk66l6L09p2j1j84R8J72l31J68Q9k44L25q6J15j84K5
4459a8N9r2J60q8j04R3m5n7J25M3J15j46N5j26N9k06J27O2l5M1K3j4k70J81P5
4484A7K0k37L01L3j44l9l0R0J78j21k25K09j84L85k34K8l4j71N5K23j86j58J72
$$ plain form
4507 -52 112 -13 -28 116 -52 -269 -134 -186 179 -165 35 -75 -126 18 149 -57 -108 -103 -177 -72 174 85 50
4530 50 115 46 -71 90 -17 191 -105 56 -3 68 -166 -30 252 80 76 -46 -40 -112 200 -16 -105 -30 16 -91
4554 -91 -230 -13 91 102 -36 -34 58 -7 39 -45 -5 -85 49 -177 -3 53 -31 -32 61 57 69 51 -26 -78 132 -135 -188
4581 -188 -86 -44 -22 -145 -162 95 99 -85 75 -3 -87 -63 212 303 80 -64 -93 -21 100 -89 113 182 7 48
4605 48 -239 136 35 -10 -44 51 -225 97 32 -222 154 61 17 -36 180 194 84 90 7 77 -9 -72 144 72 -28
4630 -28 35 -109 163 -146 113 62 13 22 1 -31 46 23 -169 -150 -99 -16 107 0 208 96 -80 193 -85 256
4654 256 -23 -142 72 76 109 -181 -285 227 -83 64 238 20 -50 -93 96 64 -74 -5 154 -75 45 218
$$ packed form
4507e2J64j25j5J44j68k17J35n2L65l44K00j10n1J44J31k06n1Np4J05K46q9l5
4530E0O5o9j17J61j07K08k96J61n9P1k34J36K82j72mj22Op2L12k16q9P5M6j07
4554i1j39K17J04J1j38KR2o5M6q4M0q0J34k26J74N6q4jR3mJ2j8p7n2K10k67n3
4581a88J02M2K2j23j7K57Mj84J60p8q4K4K75R1k23j44k9P2J21j89K02O9j75M1
4605D8k87L75j01m5l4R5k76L22o5k54L76r3m4n3K16J4j10Oq3P0q6o3K16p2j00
4630b8O3j44K72l09K59n1m9Rk1l2P7k3j92J9N1Q3J23j07K08j12j76K73k78L41
4654B56k79j19K14ML3k90j04N12l10J47J74k18p0m3J89l2j38O9J59k29J20J73
$$ [...]
8191C4
##END NTUPLES=NMR FID
##END=
