##TITLE=1H_LR-796-C1-K
 200.13MHz, CDCl3,
 8 sc
 
 17.1.2025
##JCAMPDX= 6.0         $$ Bruker NMR JCAMP-DX V2.0
##DATA TYPE= NMR FID
##DATA CLASS= NTUPLES
##ORIGIN= UXNMR, Bruker Analytische Messtechnik GmbH
##OWNER= pz
$$ XWIN-NMR		Version 3.5
$$ Fri Jan 17 14:02:16 2025 Russian Standard Time (UT+4h)  she@DPX200
##.OBSERVE FREQUENCY= 200.1313
##.OBSERVE NUCLEUS= ^1H
##.DELAY= (6, 6)
##.ACQUISITION MODE= SIMULTANEOUS
##.ACQUISITION SCHEME= undefined
##.AVERAGES= 8
##.DIGITISER RES= 18
##SPECTROMETER/DATA SYSTEM= spect
##.PULSE SEQUENCE= zg30
##.SOLVENT NAME= DMSO
##.SHIFT REFERENCE= (INTERNAL, DMSO, 0, 14.3821)
##AUDIT TRAIL= $$ (NUMBER, WHEN, WHO, WHERE, WHAT)
$$ ##TITLE= Audit trail, XWIN-NMR		Version 3.5
$$ ##JCAMPDX= 5.01
$$ ##ORIGIN= Bruker BioSpin GmbH
$$ ##OWNER= she
$$ F:/spectra/data/she/nmr/H-C/1/audita.txt
$$ ##AUDIT TRAIL=  $$ (NUMBER, WHEN, WHO, WHERE, WHAT)
(   1,<2025-01-17 14:01:22.04 +0400>,<she>,<DPX200>,
      <created by zg, POWCHK disabled, PULCHK disabled
       configuration hash MD5:
       00 E9 B6 7A A2 85 ED C7 34 08 36 98 17 FE 4E 26
       data hash MD5: 16K
       22 2E 56 35 D5 AF DB 9B 31 BE AC 07 98 4D E4 22>)
$$ ##END=
$$ 
$$ hash MD5
$$ D6 E6 2D ED FD 39 38 DD 27 87 9E 71 0A 46 C7 6F
##$RELAX= 
##$RELAX= 
##$RELAX= 
##$RELAX= 
##$RELAX= 
##$RELAX= 
$$ Bruker specific parameters
$$ --------------------------
##$DU= <F:/spectra>
##$EXPNO= 1
##$NAME= <H-C>
##$PROCNO= 1
##$TYPE= <nmr>
##$USER= <she>
##$AMP= (0..31)
100 100 100 100 100 100 100 100 100 100 100 100 100 100 100 100 100 100 
100 100 100 100 100 100 100 100 100 100 100 100 100 100 
##$AQSEQ= 0
##$AQ_mod= 1
##$AUNM= <au_zg>
##$AUTOPOS= <>
##$BF1= 200.13
##$BF2= 200.13
##$BF3= 200.13
##$BF4= 200.13
##$BF5= 200.13
##$BF6= 200.13
##$BF7= 200.13
##$BF8= 200.13
##$BYTORDA= 1
##$CFDGTYP= 0
##$CFRGTYP= 5
##$CHEMSTR= <none>
##$CNST= (0..31)
1 1 145 1 1 1 1 1 1 1 1 1 1 1 1 1 1 1 1 1 1 1 1 1 1 1 1 1 1 1 1 1 
##$CPDPRG= <>
##$CPDPRG1= <>
##$CPDPRG2= <>
##$CPDPRG3= <>
##$CPDPRG4= <mlev>
##$CPDPRG5= <mlev>
##$CPDPRG6= <mlev>
##$CPDPRG7= <mlev>
##$CPDPRG8= <mlev>
##$CPDPRGB= <>
##$CPDPRGT= <>
##$D= (0..31)
0 0.7 0 0 0 0 0 0 0 0 0 0.03 0 0 0 0 0 0 0 0 0 0 0 0 0 0 0 0 0 0 0 0 
##$DATE= 1737108081
##$DBL= (0..7)
120 120 120 120 120 120 120 120 
##$DBP= (0..7)
150 150 150 150 150 150 150 150 
##$DBP07= 0
##$DBPNAM0= <>
##$DBPNAM1= <>
##$DBPNAM2= <>
##$DBPNAM3= <>
##$DBPNAM4= <>
##$DBPNAM5= <>
##$DBPNAM6= <>
##$DBPNAM7= <>
##$DBPOAL= (0..7)
0.5 0.5 0.5 0.5 0.5 0.5 0.5 0.5 
##$DBPOFFS= (0..7)
0 0 0 0 0 0 0 0 
##$DE= 6
##$DECBNUC= <off>
##$DECIM= 32
##$DECNUC= <off>
##$DECSTAT= 4
##$DIGMOD= 1
##$DIGTYP= 9
##$DL= (0..7)
0 120 120 120 120 120 120 120 
##$DP= (0..7)
150 150 150 150 150 150 150 150 
##$DP07= 0
##$DPNAME0= <>
##$DPNAME1= <>
##$DPNAME2= <>
##$DPNAME3= <>
##$DPNAME4= <>
##$DPNAME5= <>
##$DPNAME6= <>
##$DPNAME7= <>
##$DPOAL= (0..7)
0.5 0.5 0.5 0.5 0.5 0.5 0.5 0.5 
##$DPOFFS= (0..7)
0 0 0 0 0 0 0 0 
##$DQDMODE= 0
##$DR= 18
##$DS= 0
##$DSLIST= <SSSSSSSSSSSSSSS>
$$ [...]
##$SUBNAM0= <"">
##$SUBNAM1= <"">
##$SUBNAM2= <"">
##$SUBNAM3= <"">
##$SUBNAM4= <"">
##$SUBNAM5= <"">
##$SUBNAM6= <"">
##$SUBNAM7= <"">
##$SUBNAM8= <"">
##$SUBNAM9= <"">
##$SW= 18.0517328524113
##$SWIBOX= (0..15)
0 0 2 0 0 0 0 0 0 0 0 0 0 0 0 0 
##$SW_h= 3612.71676300578
##$TD= 16384
##$TD0= 1
##$TE= 0
##$TE2= 300
##$TE3= 300
##$TEG= 300
##$TL= (0..7)
0 120 120 120 120 120 120 120 
##$TP= (0..7)
150 150 150 150 150 150 150 150 
##$TP07= 0
##$TPNAME0= <>
##$TPNAME1= <>
##$TPNAME2= <>
##$TPNAME3= <>
##$TPNAME4= <>
##$TPNAME5= <>
##$TPNAME6= <>
##$TPNAME7= <>
##$TPOAL= (0..7)
0.5 0.5 0.5 0.5 0.5 0.5 0.5 0.5 
##$TPOFFS= (0..7)
0 0 0 0 0 0 0 0 
##$TUNHIN= 0
##$TUNHOUT= 0
##$TUNXOUT= 0
##$USERA1= <user>
##$USERA2= <user>
##$USERA3= <user>
##$USERA4= <user>
##$USERA5= <user>
##$V9= 5
##$VALIST= <valist>
##$VCLIST= <CCCCCCCCCCCCCCC>
##$VD= 0
##$VDLIST= <DDDDDDDDDDDDDDD>
##$VPLIST= <PPPPPPPPPPPPPPP>
##$VTLIST= <TTTTTTTTTTTTTTT>
##$WBST= 1024
##$WBSW= 4
##$XGAIN= (0..3)
0 0 0 0 
##$XL= 0
##$YL= 0
##$YMAX_a= 105412
##$YMIN_a= -97882
##$ZGOPTNS= <>
##$ZL1= 120
##$ZL2= 120
##$ZL3= 120
##$ZL4= 120
##$ABSF1= 10
##$ABSF2= 0
##$ABSG= 5
##$ABSL= 3
##$ALPHA= 0
##$AQORDER= 0
##$ASSFAC= 0
##$ASSFACI= 0
##$ASSFACX= 0
##$ASSWID= 0
##$AUNMP= <proc_1d>
##$AZFE= 0.1
##$AZFW= 0.1
##$BCFW= 1
##$BC_mod= 2
##$BYTORDP= 1
##$COROFFS= 0
##$CY= -3
##$DATMOD= 1
##$DC= 2
##$DFILT= <>
##$DTYPP= 0
##$F1P= 0
##$F2P= 0
##$FCOR= 0.5
##$FTSIZE= 0
##$FT_mod= 4
##$GAMMA= 1
##$GB= 0.15
##$INTBC= 1
##$INTSCL= 1
##$ISEN= 128
##$LB= 0.25
##$LEV0= 0
##$LPBIN= 0
##$MAXI= 10000
##$MC2= 0
##$MEAN= 0
##$ME_mod= 0
##$MI= 1.114404
##$NCOEF= 0
##$NC_proc= 0
##$NLEV= 6
##$NOISF1= 3.799351
##$NOISF2= 2.8
##$NSP= 1
##$NTH_PI= 0
##$NZP= 0
##$OFFSET= 14.38212
##$PC= 1
##$PHC0= 250.0257
##$PHC1= 16.3922
##$PH_mod= 1
##$PKNL= yes
##$PPARMOD= 0
##$PSCAL= 0
##$PSIGN= 0
##$REVERSE= no
##$SF= 200.129724274929
##$SI= 16384
##$SIGF1= 3
##$SIGF2= 2
##$SINO= 400
##$SIOLD= 16384
##$SREGLST= <1H.CDCl3>
##$SSB= 0
##$STSI= 0
##$STSR= 0
##$SW_p= 3205.1282051282
##$SYMM= 0
##$S_DEV= 0
##$TDeff= 0
##$TDoff= 0
##$TI= <>
##$TILT= no
##$TM1= 0
##$TM2= 0
##$TOPLEV= 0
##$USERP1= <user>
##$USERP2= <user>
##$USERP3= <user>
##$USERP4= <user>
##$USERP5= <user>
##$WDW= 1
##$XDIM= 8192
##$YMAX_p= 0
##$YMIN_p= 0
$$ End of Bruker specific parameters
$$ ---------------------------------
##NTUPLES= NMR FID
##VAR_NAME=  TIME,          FID/REAL,        FID/IMAG
##SYMBOL=    X,             R,               I
##VAR_TYPE=  INDEPENDENT,   DEPENDENT,       DEPENDENT
##VAR_FORM=  AFFN,          ASDF,            ASDF
##VAR_DIM=   8192,          8192,            8192
##UNITS=     SECONDS,       ARBITRARY UNITS, ARBITRARY UNITS
##FACTOR=    0.0002768,     1,               1
##FIRST=     0,             0,               0
##LAST=      2.2672688,     0,               0
##MIN=       0,             -97882,          0
##MAX=       2.2672688,     105412,          0
$$ Real data points
##PAGE= N=1
##DATA TABLE= (X++(R..R)), XYDATA
$$ [...]
$$ plain form
1840 -23 52 -87 -148 -45 169 183 42 204 135 354 0 92 212 42 -172 -283 -165 -166 -156 -368 -87 94 -101
1863 -101 3 16 -69 -46 33 378 19 27 5 -89 -166 -202 -148 -109 62 -374 39 -125 -145 170 -39 -89 -134 329 177
1888 177 284 5 -65 118 321 231 -71 263 -88 -194 184 85 -104 43 -108 -185 -80 197 158 -43 -33 -106
1910 -106 -50 295 41 84 122 256 143 -41 90 108 -110 -388 -17 -50 26 -36 -130 105 23 -137 57 13 278
1933 278 -59 169 32 282 -61 49 137 77 125 -312 8 -91 -190 11 -244 51 -324 -99 -238 -105 44 41
1955 41 80 200 -61 -55 -38 -155 11 -122 0 -73 -255 -116 -41 80 161 -48 -238 -100 -48 65 17 97 174 77
1979 77 -173 148 15 228 -38 -218 63 -96 166 3 -208 53 -507 -105 -258 29 -124 20 201 227 134
2000 134 70 114 37 266 45 190 -27 36 15 -205 -26 -260 -234 -1 -209 -230 113 62 53 -141 116 -121 280
$$ packed form
1840b3P5j39o1J03K14J4j41J62o9K19l54R2J20j70k14j11J18jJ0k12K81J81j95
1863a01J04J3q5K3P9L45l59Qk2r4p7l6N4L9J71m36M13j64k0L15k09n0m5M63j52
1888A77J07k79p0J83K03r0l02L34l51j06L78r9j89J47j51p7J05K77l9k01J0p3
1910a06N6L45k54M3L8J34j13j84J31J8k18k78L71l3P6o2r4K35q2j60J94m4K65
1933B78l37K28j37K50l43J10Q8o0M8m37L20r9r9K01k55K95l75K25j39J33J49l
1955D1L9J20k61OJ7j17J66j33J22p3j82J39P5J21Q1k09j90J38N2J13m8Q0P7r7
1979G7k50L21j33K13k66j80K81j59K62j63k11K61n60M02j53K87j53J44J81K6r3
2000A34o4M4p7K29k21J45k17O3k1k20J79k34K6K33k08k1L43n1rj94K57k37M01
$$ plain form
2023 280 125 -182 231 164 127 30 2 -11 74 -225 32 150 -250 -105 -133 -60 239 30 254 105 -64 -205 -52
2046 -52 235 -30 175 311 367 -59 30 -90 -68 -294 160 -57 -44 -120 -108 -87 135 -52 33 99 289 -106 70
2069 70 -26 28 91 -4 63 -348 106 -137 202 -207 38 2 -246 -63 -254 -44 129 7 -55 28 119 56 276 83
2093 83 -85 -258 38 -111 -78 -88 -131 91 -70 -29 -65 76 -250 -35 -31 -30 -182 69 72 -306 463 246 -193 -116
2117 -116 157 144 -21 -151 202 -189 -358 -417 -83 -93 408 -110 168 -4 111 54 -42 259 151 -167 439 -54
2139 -54 -5 101 351 65 -208 -13 270 -196 56 71 58 -273 106 124 -162 53 -2 -45 124 217 273 139 235
2162 235 4 -109 79 -14 46 4 71 -258 66 -73 13 14 -103 -96 127 -139 13 193 300 225 123 38 -48 -212
2186 -212 236 9 91 -220 -162 -187 -326 83 -124 -154 -164 184 133 57 206 149 239 43 -16 112 -15 75 132 -207
$$ packed form
2023B80j55l07M13o7l7r7k8j3Q5k99K57J18m00J45k8P3K99k09K24j49j69j41J53
2046e2K87k65K05J36N6m26Q9j20K2k26M54k17J3p6J2K1K22j87Q5O6J90l95J76
2069G0r6N4O3r5O7m11M54k43L39m09K45l6k48J83j91K10J73j22o2Q3R1o3K20j93
2093H3j68j73K96j49L3j0m3K22j61M1l6J41l26K15MJj52K51Ll78P69k17m39P7
2117a16K73j3j65j30L53l91j69n9L34j0N01n18K78j72J15n7r6L01j08l18O06m93
2139e4M9J06K50k86k73J95K83m66K52J5j3l31L79J8k86K15n5m3J69R3N6j34R6
2162B35k31j13J88r3O0m2O7l29L24j39Q6Jj17PK23k66J52J80J07p5j02q5q6j64
2186b12M48k27Q2l11N8k5j39M09k07l0j0L48n1p6J49n7R0j96n9J28j27R0N7l39
$$ plain form
2210 -207 68 -102 -303 -30 -103 -142 117 44 -119 233 68 283 23 -15 -38 -53 -2 24 100 -26 -159 232 -71
2233 -71 -332 97 -91 -112 -95 -270 -260 211 -338 46 154 159 192 -62 -158 316 188 215 155 78 -265 -62 -56 -126 -83
2258 -83 252 -193 135 32 -49 -32 -280 202 -37 -143 1 -123 135 267 265 -9 -50 1 -61 92 142 -47 87
2281 87 75 119 139 -350 128 23 247 80 133 -250 141 -89 176 -67 -133 178 92 -124 259 155 -298 -222 -3
2304 -3 -177 -211 153 -12 2 22 93 120 -2 -42 -88 -24 138 -91 437 -142 28 -65 29 47 79 -271 118 -3 -76
2329 -76 -84 -45 -29 36 1 147 -20 146 267 18 355 -107 -64 72 91 -240 22 -194 1 36 32 -37 -281 -142
2353 -142 -3 -138 68 58 -64 99 255 7 -17 74 184 121 100 -120 -214 -234 -297 239 -344 -170 -34 19 87
2376 87 2 -3 169 118 32 105 -11 111 17 58 122 -67 -276 7 -163 -102 -327 102 85 72 -270 -158 -43 -60 51
$$ packed form
2210b07K75j70k01K73p3l9K59p3j63L52j65K15k60l8k3j5N1K6P6j26j33L91l03
2233g1k61M29j88k1J7j75J0M71n49L84J08NL3k54r6M74j28K7o0p7l43K03Op0M3
2258h3L35m45L28j03q1J7k48M82k39j06J44j24K58J32kk74m1N1o2J53N0j89J34
2281H7j2M4K0m89M78j05K24j67N3l83L91k30K65k43o6L11q6k16L83j04m53P6K19
2304cj74l4L64j65J4K0P1K7j22m0m6O4J62k29N28n79J70r3R4J8L2l50L89j21p3
2329g6qL9J6O5l5J46j67J66J21k49L37m62M3J36J9l31K62k16J95L5mo9k44J39
2353a42J39j35K06j0j22J63J56k48k4R1J10o3k1k20r4k0o3N36n83J74J36N3O8
2376H7q5nJ72n1q6P3j16J22r4M1O4j89k09K83j70O1k25M29j7j3l42J12J15j7J11
$$ plain form
2401 51 74 270 2 322 136 50 -147 -29 -67 247 143 -56 17 31 -239 -81 23 145 -109 -11 71 61 86
2424 86 -247 191 50 -148 203 240 -11 -64 -422 -264 36 -11 -147 99 -143 107 117 -165 -122 -94 82 77 82 289
2448 289 -300 151 3 -57 86 -95 -13 24 39 47 286 55 -30 -88 -59 -10 -175 -78 65 161 -14 334 156 -4
2472 -4 84 -75 -105 -192 107 -212 289 226 -18 -224 150 128 -251 44 157 -256 -8 -123 -225 -42 -113 132 -89
2495 -89 95 191 72 205 212 -114 -62 113 139 -360 23 235 -11 245 209 306 -34 -16 42 169 383 67 -140
2518 -140 -26 191 186 -151 185 64 -63 80 -81 -268 -22 -124 -116 122 97 138 -96 69 125 -28 163 -85
2540 -85 40 164 -61 63 -86 -332 29 -123 18 -172 169 24 16 116 -68 89 176 117 8 155 87 261
2562 261 -168 230 76 -157 -180 191 -194 78 62 144 -41 -144 -223 -215 -45 191 -119 73 -185 195 62 -184
$$ packed form
2401E1K3J96k68L20j86q6j97J18l8L14j04j99P3J4k70J58J04J22k54R8Q2j0K5
2424H6l33M38j41j98L51L7k51n3l58J58L00m7j36K46k42K50J0k82M3K8J76nNK07
2448B89n89M51j48o0J43j81Q2L7J5QK39k31q5n8K9M9j65R7J43R6j75L48j78j60
2472dQ8j59l0q7K99l19N01o3k44k06L74k2l79K95J13m13K48j15j02J83p1K45k21
2495h9J84R6j19J33Pl26N2J75K6m99L83K12k46K56l6R7l40J8N8J27K14l16k07
2518a40J14K17nl37L36j21j27J43j61j87K46j02QK38k5M1k34J65N6j53J91k48
2540h5J25J24k25J24j49k46L61j52J41j90L41j45qJ00j84J57Q7n9j09J47o8J74
2562B61m29L98j54k33k3L71l85K72j6Q2j85j03p9QJ70K36l10J92k58L80j33k46
$$ plain form
2584 -184 314 139 254 -105 253 15 364 -134 -97 -55 -154 19 -14 31 -306 74 45 -118 -17 -141 -2 150
2606 150 256 269 -23 -75 201 0 231 28 36 -166 -154 90 1 95 -88 -83 -161 111 -191 -120 103 -29 123 -27
2630 -27 5 -103 17 245 140 -155 97 -129 30 -32 72 75 368 166 -208 57 -6 12 184 220 75 -19 -130
2653 -130 40 -42 68 -27 -152 -78 -47 -89 -102 93 -232 78 -102 -176 79 -76 111 201 107 107 48 114 -126 -102 -104
2678 -104 94 52 -107 -321 -93 12 60 -216 75 147 150 -219 147 125 146 -5 -77 209 -90 163 -95 27 -249
2701 -249 142 16 -154 -136 -309 -190 -2 -25 -172 -86 -122 65 -8 127 194 229 -7 -42 67 272 81 122 33
2724 33 -26 -123 -74 -121 162 -171 67 -66 -102 90 241 174 135 6 132 -9 39 -171 394 -42 99 -113 -73
2747 -73 -10 126 0 50 -109 -298 -160 -12 67 -267 -83 206 154 98 -56 -231 160 14 98 -28 177 -101
$$ packed form
2584a84M98j75J15l59L58k38L49m98L7M2r9J73l3M5l37L80k9j63J01j24J39J52
2606A50J06J3k92n2K76k01K31k03Qk02J2K44q9R4j83Np8K72l02P1K23j32J52j50
2630b7L2j08J20K28j05k95K52k26J59o2J04LK93k02l74K65o3J8J72L6j45r4j11
2653a30J70q2J10r5j25P4L1m2j3J95l25L10j80p4K55j55J87R0r4%n9O6k40K4k
2678a04J98m2j59k14K28J05M8k76K91P2Ll69L66k2K1j51p2K86k99K53k58J22k76
2701b49L91j26j70J8j73J19J88k3j47Q6l6J87p3J35O7L5k36l5J09K05j91M1q9
2724C3n9r7M9m7K83l33K38j33l6J92J51o7l9j29J26j41M8k10N65m36J41k12M0
2747g3O3J36j26N0j59j89J38J48P9l34J84K89n2n6j54j75L91j46Q4j26K05k78
$$ plain form
2769 -101 241 -37 22 29 47 26 92 -232 216 31 -153 40 -240 254 -133 -69 8 35 -184 261 180 11 -69 -106
2793 -106 -72 147 227 -154 -58 104 -6 -238 -144 -143 -168 -103 -72 211 303 -85 -135 -28 75 21 156 107 -71 -217
2817 -217 -71 -85 -245 183 -7 -10 -164 94 -216 -132 227 -228 -115 166 231 39 349 68 109 -9 -36 -70 75
2840 75 -201 200 -49 -188 -286 156 -143 162 -135 -118 -169 -188 89 77 242 253 -39 378 56 165 37 -297
2862 -297 187 -21 -240 -318 -188 225 9 198 66 34 -180 -284 112 50 -69 -141 173 -87 29 -104 216
2883 216 163 160 -212 -101 -43 0 -132 -74 -170 -6 5 -163 26 31 8 5 236 179 148 89 -79 109 7 -147 -31
2908 -31 -74 51 -133 -146 -92 -219 -239 64 246 -143 -124 195 -88 -31 33 -4 -202 58 -49 341 -73 -285 -244
2931 -244 -252 270 -121 197 16 203 -225 153 -178 158 -27 76 -303 110 146 -41 -186 -78 -69 21 -201 134
$$ packed form
2769a01L42k78N9PJ8k1O6l24M48j85j84J93k80M94l87O4P7K7k19M45q1j69q0l7
2793a06L4K19Q0l81R6J62j10k32R4Jk5O5L1K83R2l88n0J07J03n4J35m9j78j46
2817b17J46j4j60M28j90lj54K58l10Q4L59m55J13K81O5j92L10k81M1j18k7l4J45
2840G5k76M01k49j39r8M42k99L05k97J7n1j9K77j2J65J1k92M17l22J09j28l34
2862b97M84k08k19p8J30M13k16J89j32l2k14j04L96o2j19p2L14k60J16j33L20
2883B16n3ll72J11N8M3j32N8r6J64J1j68J89Nk3lK31n7l1n9j68J88j02j54J16
2908c1m3J25j84j3N4j27k0L03J82l89J9L19k83N7O4l7j98K60j07L90m14k12M1
2931b44qN22l91L18j81J87m28L78l31L36j85J03l79M13L6j87j45J08RR0k22L35
$$ plain form
2953 134 59 -181 83 13 -73 -152 134 -143 2 62 160 -241 323 87 -155 62 -15 32 62 -360 -11 -294 -111
2976 -111 -177 110 10 53 30 34 -19 18 308 109 187 -127 -87 131 -13 110 -142 460 -325 -69 -53 -143 -162 -29
3000 -29 -70 -168 -92 -154 -87 25 -33 359 190 134 194 166 -9 -56 -117 -105 310 -100 106 39 -229 -257 115 109 -23 112
3026 112 23 67 -282 25 69 118 39 -248 65 -190 58 48 47 -135 17 65 -176 -8 10 50 -79 -84 -97 -44 -101
3051 -101 3 118 -86 -226 -112 274 -24 134 136 190 88 -69 310 57 56 270 3 -12 3 34 -143 29 1
3074 1 163 156 174 42 -172 162 97 287 60 -263 -151 -129 -273 27 -109 -281 4 -164 -128 97 237 30 178
3097 178 61 -47 169 64 -61 85 -124 -186 -106 -80 -219 44 -119 -360 284 168 -144 51 77 -93 -33 273
3119 273 214 119 -32 187 93 155 248 296 -98 -17 96 183 -103 -107 -175 -101 168 -83 -343 3 41 17 108 110 -145 -70
$$ packed form
2953A34p5k40K64p0q6p9K86k77J45O0R8m01N64k36k42K17p7M7L0m22L49k83J83
2976a11o6K87j00M3k3Mn3L7K90j99P8l14M0K18j44J23k52O02p85K56J6r0j9J33
3000b9m1r8P6o2O7J12n8L92j69n6O0k8j75m7o1J2M15m10K06o7k68k8L72oj32J35
3026A12q9M4l49L07M4M9p9k87L13k55K48j0jj82J52M8k41J68J8M0j29nj3N3n7
3051a01J04J15k04j40J14L86k98J58KN4j02j57L79k53jK14k67j5J5L1j77J72k8
3074AJ62pJ8j32k14L34o5J90k27l23J12K2j44L00j36j72K85j68L6K25J40k07J48
3097A78j17j08K16j05j25J46k09o2Q0K6j39K63j63k41O44j16l12J95K6j70O0L06
3119B73n9r5j51K19r4O2R3M8l94Q1J13Q7k86mo8P4K69k51k60L46L8k4R1Kk55P5
$$ plain form
3145 -70 59 101 49 -12 276 -8 171 -73 84 3 -265 209 -376 -49 -130 -197 -147 -201 -72 221 21 -145 -88
3168 -88 -11 10 32 132 -60 -188 247 8 -34 -119 108 32 117 79 15 -121 -348 91 42 -43 -109 -78 -161 70 -10
3193 -10 -180 233 -99 -119 132 71 26 170 120 198 -19 -121 -60 30 198 70 23 248 155 -264 0 -59 207 -76
3217 -76 -72 186 -208 81 -97 -245 -206 -119 -141 -100 -196 37 174 -11 -238 23 -50 103 136 -188 -76 -63 -139 -13
3241 -13 -62 274 -153 -130 -124 -193 1 -129 -260 -37 -47 -97 89 -206 94 10 21 -9 -197 -21 29 36 214 40 275
3266 275 39 265 -43 85 -163 -121 216 -17 251 -8 54 19 87 100 -66 -109 -42 23 -14 114 20 -75 105 -127
3290 -127 -67 -197 -167 43 59 227 90 75 -116 5 -37 -128 73 115 -27 -196 -168 -86 227 -3 -172 259 -206
3313 -206 134 96 -35 -149 51 -145 -44 62 23 232 146 -116 -123 178 -68 239 -29 20 -42 309 -99 60
$$ packed form
3145g0J29M2n2o1K88k84J79k44J57q1k68M74n85L27q1o7N0n4J29K93k00j66N7
3168h8P7K1K2J00j92j28M35k39m2q5K27p6Q5l8o4j36k27M39m9q5o6L1q3K31q0
3193a0j70M13l32k0K51o1m5J44n0P8k17j02O1R0J68j28m7K25r3m19K64n9K66k83
3217g6MK58l94K89j78j48L9Q7k2M1r6K33J37j85k27K61p3J53L3l24J12J3p6J26
3241a3m9L36m27K3Oo9J94j30j31K23j0n0J86k95L00q4J1l0j88J76N0PJ78j74K35
3266B75k36K26l08J28k48M2L37k33K68k59O2l5O8J3j66m3O7O5l7J28r4r5J80k32
3290a27O0j30L0K10J6J68j37j5j91J21m2r1K01M2j42j69K8Q2L13k30j69M31m65
3313b06L40l8j31j14K00j96J01J06l9K09q6k62pL01k46L07k68M9o2L51m08J59
$$ plain form
3335 60 -202 -175 -82 -76 18 -19 -236 -46 54 -54 -22 -108 156 -71 -140 -67 -57 -178 -214 97 -83 121 -29 31 -195
3360 -195 70 -109 -246 17 -183 -22 71 25 -77 -60 -28 -56 86 124 4 72 -260 -77 119 44 -80 219 43
3383 43 -5 -31 157 83 -347 -60 -114 -43 -22 -217 198 2 54 -118 60 118 144 23 350 83 52 -115 10 -50
3407 -50 -336 164 -225 277 227 71 169 26 172 97 136 -30 -246 -236 -170 93 234 4 69 112 -127 131 -128
3430 -128 40 -49 354 232 -174 -38 123 -265 -22 -241 -12 269 -82 151 -159 -11 -74 -71 46 -58 -39 166
3452 166 50 -116 -23 -210 121 -167 80 35 -136 -44 -64 223 105 146 -140 -143 -401 -70 -14 -18 249 150 70 -8
3476 -8 -2 9 -63 -106 -24 -7 332 82 -49 67 -5 -44 22 434 -171 -8 -43 -209 -127 -22 111 75 445 -6 -13 -317
3502 -317 -213 161 124 134 -96 -26 -270 212 -218 -214 146 11 74 95 127 100 227 209 129 -183 -162 175 -25 284
$$ packed form
3335F0k62K7R3OR4l7k17J90J00j08L2q6K64k27o9P3J0j21l6L11j80K04j50O0k26
3360a95K65j79j37K63k00J61R3m6j02J7L2k8J42L8j20O8l32J83J96p5j24K99j76
3383D3m8k6J88p4m30K87n4P1K1j95M15j96N2j72J78N8K6j21L27k67l1j67J25o0
3407e0k86N00l89N02n0j56R8j43J46p5L9j66k16J0O6K63J41k30O5M3k39K58k59
3430a28J68q9M03j22m06J36J61l88K43k19K29K81l51K33l10J48o3LJ17j04J9K05
3452A66j16j66R3j87L31k88K47m5j71R2k0K87j18M1k86lk58L31N6mK67r9q0p8
3476hOJ1p2m3Q2J7L39k50j31J16p2l9O6M12o05J63l5j66Q2J05J33l6L70m51pl04
3502c17J04L74l7J0k30P0k44M82m30ML60j35O3K1L2k7J27j8q0l12K1L37k00L09
$$ plain form
3526 284 8 157 233 -5 168 -230 -54 -44 -249 137 -88 21 116 -115 -23 -304 -110 -131 59 -294 -61 50
3548 50 182 69 -62 26 114 -466 -12 113 -122 -111 -409 181 -264 165 137 -26 -16 -31 10 -93 -101 -36 297 299
3572 299 205 17 -294 23 78 156 -15 -121 157 -57 182 25 -9 -120 143 187 -74 105 269 -8 39 125
3594 125 -109 70 72 250 171 110 153 -349 65 188 -127 -88 -67 -145 183 13 -35 69 -191 60 118 -65 38
3617 38 -57 173 -128 -83 -15 -157 65 54 70 15 58 101 -93 92 150 367 98 283 -41 -26 -91 108 5 36
3641 36 95 189 163 -61 207 -33 -139 322 -155 91 31 -71 -390 401 -123 58 485 133 -205 -97 -74 -8
3663 -8 31 -218 16 39 9 38 -111 -195 150 -165 -42 84 210 186 28 -144 159 94 87 -2 88 -200 -69 95
3687 95 34 -51 43 25 114 72 -65 101 -204 153 -96 -153 -44 -106 -413 4 -182 273 217 11 119 349 261 -83
$$ packed form
3526B84k76J49P6k38J73l98J76J0k05L86k25J09R5k31R2k81J94k1J90l53K33J11
3548E0J32j13j31Q8Q8n80M54J25k35J1k98N90m45M29k8j63J0j5M1j03qO5L33K
3572B99r4j88l11L17N5P8j71j06K78k14K39j57l4j11K63M4k61J79J64k77M7Q6
3594A25k34J79KJ78p9o1M3n02M14J23l15L9K1p8L28j70m8J04k60K51N8j83J03
3617C8r5K30l01M5O8j42K22j1J6n5M3M3j94J85N8K17k69J85l24J5o5J99j03L1
3641C6N9R4k6k24K68k40j06M61m77K46o0j02l19P91n24J81M27l52l38J08K3O6
3663hL9k49K34K3l0K9j49q4L45l15J23J26J26k4j58j72L03o5pq9R0k88J31J64
3687I5o1q5R4j8Q9m2j37J66l05L57k49n7J09o2l07M17j86M55n6k06J08K30q8l44
$$ plain form
3711 -83 -132 -152 206 -234 73 -100 -287 -441 118 61 41 47 -8 -240 125 10 -108 -43 37 -64 22 149 224 -60
3735 -60 124 -47 -38 -171 -112 -45 28 44 39 35 43 113 142 116 89 52 -172 -220 197 -66 14 95 108 73 25 7 46 106 -78
3764 -78 -163 -131 199 98 -64 257 198 -121 -188 31 57 270 42 -46 -273 -37 139 -42 -215 156 -11 2 -13
3787 -13 107 65 20 34 -197 -18 -237 61 177 128 249 -82 -210 86 -85 11 -32 -164 -376 -195 22 -141
3809 -141 -33 -16 -106 -58 -98 -166 -84 -210 -36 -49 87 36 49 -161 -14 2 173 -16 -77 -79 -98 77 -157 225 -221
3834 -221 101 -85 -49 -197 81 -190 -63 -255 73 58 12 5 -59 176 -15 13 -199 -76 103 -28 -26 -87 139
3857 139 157 165 -372 301 -98 -125 -193 -247 -44 51 -233 284 -99 -128 -77 60 -24 -26 75 59 -169 117 13 114
3881 114 -125 -298 -149 58 159 -4 -273 -40 60 -21 -158 -26 197 135 -10 -215 16 1 225 8 -33
$$ packed form
3711h3m9k0L58m40L07j73j87j54N59n7k0On5k32L65j15j18O5Q0j01Q6J27P5k84
3735f0J84j71Rj33N9O7P3J6nmQP0K9k6k7l7k24m8M17k63Q0Q1J3l5m8j8L9O0j84
3764g8q5L2L30j01j62L21n9l19o7K19K6K13k28q8k27K36J76j81j73L71j67J3j5
3787a3J20m2m5J4k31J79k19K98J16m9J21l31j28K96j71R6m3j32k12J81K17j63
3809a41J08J7r0M8m0o8Q2j26J74j3J36n1J3k10J47J6J71j89o1kj9J75k34L82m46
3834b21L22j86L6j48K78k71J27j92L28j5m6po4K35j91K8k12J23J79j31Ko1K26
3857A39J8Qn37O73l99k7o8n4K03R5k84N17l83k9N1J37q4kJ01j6k28K86j04J01
3881A14k39j73J49K07J01j63k69K33J00q1j37J32K23o2j45k05K31j5K24k17m1
$$ plain form
3902 -33 -71 -133 -125 23 187 -77 57 -171 -237 81 233 -3 170 239 328 -91 246 -144 29 250 5 206 -3
3925 -3 -207 136 73 -166 -112 -12 104 39 -31 -357 74 46 -28 -105 -248 -226 89 100 -136 -22 -44 -34 87 98 -53
3950 -53 -46 8 113 -27 9 84 -64 -165 -117 -49 25 -116 -31 172 -131 61 9 -23 -146 -136 92 -165 55 60 38
3975 38 -148 23 -202 52 -90 80 -70 -86 96 -47 30 -90 -252 -5 -253 -21 189 -117 142 -34 38
3996 38 -21 113 187 -226 85 -176 38 -111 64 137 84 -81 118 101 -160 23 -108 188 62 74 78 70 -3 211
4020 211 -241 -130 12 -95 208 97 -133 58 101 30 -125 -162 -140 -194 6 -134 -208 9 186 -20 188 19
4042 19 -87 40 103 -133 312 -43 -53 53 185 -39 76 158 158 284 72 30 99 56 21 -8 168 131 -100 36
4066 36 -80 -35 18 214 15 -225 -216 23 -94 8 -22 50 -179 -91 -25 187 143 159 -139 -148 -85 -116 251 48 -122
$$ packed form
3902c3l8o2QJ48J64k64J34k28o6L18J52k36J73O9Q9m19L37l90J73K21k45K01k09
3925ck04L43o3k39N4J00J16o5p0l26M31k8p4p7j43K2L15J1k36J14k2J0J21J1j51
3950e3PN4J05j40L6P5j48j01M8O8P4j41Q5K03l03J92n2l2j23J0K28k57K20Nk2
3975C8j86J71k25K54j42J70j50j6J82j43P7j20j62K47k48K32K10l06K59j76P2
3996C8n9J34P4m13L11k61K14j49J75P3n3j65J99j7k61J83j31K96j26J2Mqp3K14
4020B11m52J11J42j07L03j11k30J91M3p1j55l7K2n4K00j40p4K17J77k06K08j69
4042A9j06J27O3k36M45l55j0J06J32k24J15Q2%J26k12m2O9m3l5k9J76l7k31J36
4066C6j16M5N3J96j99k40RK39j17J02l0P2k29Q8O6K12m4J6k98rO3l1L67k03j70
$$ plain form
4091 -122 -134 68 -29 122 17 151 -265 -122 -206 159 -51 10 -61 13 236 264 134 -79 104 233 -149 165
4113 165 -354 -121 39 -199 -196 -54 -37 -217 134 -190 38 -27 272 245 45 -206 -178 159 105 -71 86 -322
4135 -322 263 94 -103 -344 -324 108 93 105 -82 57 -88 -80 24 54 130 -59 -11 -168 7 48 -285 46 83
4158 83 140 -46 260 -166 -97 -170 -175 -112 -141 74 29 -168 20 3 65 -28 91 -67 -109 -1 -82 95 101 64 -101 -3
4184 -3 -16 213 -114 -24 -156 -174 118 196 99 -178 -84 111 -51 193 104 168 28 -227 -79 209 -134 112 143 -392
4208 -392 128 -137 96 -14 10 164 127 3 -164 58 35 31 177 -123 -98 -133 -62 38 73 72 -52 -66 96 -184
4232 -184 -90 102 213 99 27 205 -30 -102 9 35 -24 -31 286 98 -14 124 66 -109 -369 114 -35 152 -44
4255 -44 128 92 -96 237 72 30 52 -5 247 95 -135 -48 206 -114 -82 -110 -46 -47 11 -99 -10 224 141 -44 -41
$$ packed form
4091a22j2K02r7J51j05J34m16J43q4L65k10O1p1P4K23K8j30k13J83J29l82L14
4113A65n19K33J60k38LJ42J7j80L51l24K28o5K99k7k00k51K8L37n4j76J57m08
4135c22N85j69j97k41K0M32j5J2j87J39j45QJ04L0P6j89M8j57J75M1l33L31L7
4158H3N7j86L06m26O9p3nO3k9K15m5j97J88j7O2r3J19j58m2J08q1J77Ol7j65R8
4184cj3K29l27R0j32j8K92P8r7k77R4J95j62K44q9O4j40k55J48K88l43K46L1n35
4208c92N20k65K33j10K4J54l7j24j67K22k3mJ46l00K5l5P1J00L5jj24j4J62k80
4232a84R4J92J11j14p2J78k35p2J11K6n9pL17j88j12J38n8j75k60M83j49J87j96
4255d4J72l6j88L33j65m2K2n7K52j52k30Q7K54l20L2k8O4jN8j10Q9K34q3j85L
$$ plain form
4280 -41 -82 -46 -189 79 -101 31 227 -20 -97 424 -71 -175 -222 9 -59 -92 -68 -73 -49 69 22 -68 -131 -114 119
4305 119 -6 -48 -288 -60 -8 227 136 -156 93 142 -51 -126 -78 -240 -16 117 -234 -15 106 278 149 -146
4327 -146 3 -40 239 -217 11 153 -73 151 -121 -117 191 -155 -84 -135 17 -152 -25 39 11 -121 112 76 66
4350 66 -148 -34 309 195 -17 -4 248 -58 171 101 -299 133 -72 166 -152 -166 98 34 33 -147 -117 78 104
4373 104 -163 144 25 -106 -247 -27 -61 -82 -227 49 79 27 111 309 -59 -13 69 110 112 -27 -90 171 -6 154
4397 154 -10 -251 -38 61 -198 -48 -214 -303 50 256 -211 90 13 -392 180 204 -108 -118 -132 93 -73 -144
4419 -144 244 -43 128 151 80 108 -196 62 -106 -28 22 36 123 -87 19 -241 18 53 99 201 -136 60 -34
4442 -34 -4 235 97 -361 111 82 216 129 -16 -139 280 -111 88 -32 162 -232 -66 -5 -205 -47 -144 -26
$$ packed form
4280d1m1L6j43K68j80J32J96k47p7N21m95j04m7K31o8l3K4nK4J18m7r0o3J7K33
4305A19j25m2k40K28N2K35r1k92K49M9j93p5M8j62K24J33l51K19J21J72j29k95
4327a46J49m3K79m56K28J42k26K24k72ML08l46P1n1J52j69J27O4k8j32K33l6j0
4350F6k14J14L43j14k12J3K52l06K29p0m00M32k05K38l18j4K64o4jj80L0J95K6
4373A04k67L07j19j31j41K20l4k1j45K76L0n2Q4J98l68M6Q2M1Kj39o3K61j77J60
4397A54j64k41K13R9k59J50j66q9L53K06m67L01p7m05N72K4l12j0j4K25j66p1
4419a44L88k87J71K3p1K8l04K58j68P8N0J4Q7k10J06k60K59L5M6J02l37J96r4
4442c4L0K39j38m58M72k9J34q7j45j23M19l91J99j20J94l94J66O1k00J58r7J18
$$ plain form
4464 -26 65 -270 -36 -309 17 -193 160 -203 4 117 10 75 -39 -87 111 -47 -87 179 171 14 -18 14 -102
4487 -102 51 -71 22 82 -39 -53 -206 -133 -270 281 -74 -253 126 46 -227 72 -6 0 5 34 107 -202 210 38
4511 38 124 -54 175 -40 62 276 5 72 -30 30 134 -85 337 -202 16 233 33 -130 -63 546 239 -84
4533 -84 49 -102 -155 -52 95 -78 -46 102 75 -60 -273 311 -1 -44 -119 22 -2 147 -64 -39 321 -72 81
4556 81 -416 -357 303 54 -38 -14 116 72 49 -92 1 164 165 -93 -91 -144 155 394 -414 22 -48 -166 20 118 167
4581 167 -76 -257 -180 -17 -174 -22 160 144 35 -229 -86 -118 -33 -94 -104 6 306 -42 -249 9 -143 23
4603 23 118 18 -54 216 -25 -109 -244 -128 169 127 221 -185 56 320 -25 -44 199 -172 -81 -126 59 -156 95
4626 95 -142 145 -6 -93 -87 46 143 -129 -90 -214 120 -82 83 -33 2 -140 -157 -109 29 -128 -39 16 -89 -87
$$ packed form
4464b6R1l35K34k73L26k10L53l63K07J13j07O5j14m8J98j58m0K66qj57l2L2j16
4487a02J53j22R3O0j21j4j53P3j37N51l55j79L79q0k73K99p8ONK9P3l09M12j72
4511C8Q6j78K29k15J02K14k71O7j02O0J04k19M22n39K18K17k00j63O7O09l07l23
4533h4J33j51n3J03J47j73L2J48k7j35k13N84l12m3p5J41k4J49k11K5L60l93J53
4556H1m97N9O60k49r2K4J30m4k3j41R3J63Jk58Kn3K99K39q08M36p0j18J86R8M9
4581A67k43j81P7J63j57J52J82j6j09k64J43l2Q5o1j0J10L00l48k07K58j52J66
4603B3R5j00p2K70k41q4j35J16K97m2R4m06K41K64l45j9K43l71R1m5J85k15K51
4626I5k37K87j51q7OJ33R7k72L9j24L34k02J65j16L5j42j7M8J38j57Q9N5j05K
$$ plain form
4650 -87 -88 -76 -102 29 78 263 -30 246 113 -213 56 -27 45 -71 114 86 -56 -72 31 25 132 -95 125 -33
4674 -33 21 -291 22 69 -267 2 199 -279 -263 -122 131 -100 -87 22 26 -14 31 26 113 -26 -66 -106 54 -40 -90
4699 -90 -81 -211 -81 6 208 160 -31 37 -1 -87 131 -34 150 -68 -14 186 103 -27 27 -118 153 -145 -44 -153
4723 -153 -305 234 -91 92 301 -10 -83 -235 147 28 -189 -274 50 -322 102 49 176 100 232 224 -39 -99
4745 -99 165 -66 -105 -33 -278 -60 127 -112 -377 213 112 -234 142 -196 6 -125 109 8 -78 27 38 58
4767 58 3 -132 -316 198 54 33 -181 -24 33 113 -24 -153 -220 276 -183 -60 100 -180 25 77 300 130
4789 130 -51 109 -31 -268 -32 11 60 85 35 -47 -88 -89 125 74 -44 -37 -100 137 248 -122 -109 -58 65 21 -24
4814 -24 100 -82 39 -146 -89 -149 4 -135 -105 44 77 -129 -35 -171 22 4 136 -152 184 148 94 -36 -46
$$ packed form
4650h7jJ2k6J31M9J85k93K76j33l26K69q3P2j16J85k8j42j6J03oJ07k27K20j58
4674c3N4l12L13M7l36K69J97m78J6J41K53k31J3J09Mm0M5nQ7j39m0m0J60r4n0
4699i0Rj30J30Q7K02m8j91O8l8q6K18j65J84k18N4K00q3j30N4j45K71k98J01j09
4723a53j52N39l25J83K09l11p3j52L82j19k17q5L24l72M24n3J27p6J32qk63o0
4745i9K64k31l9P2k45K18J87k39k65N90j01l46L76l38K02j31K34j01q6J05J1K0
4767E8n5j35j84N14j44k1k14J57N7Q0j37j29o7M96m59J23J60k80K05N2K23j70
4789A30j81J60j40k37K36M3M9K5n0q2m1jK14n1j18Po3K37J11l70J3N1J23m4m5
4814b4J24j82J21j85N7o0J53j39L0J49L3k06R4j36J93j8J32k88L36l6n4j30j0
$$ plain form
4837 -46 71 -402 75 27 30 154 -20 37 126 26 -53 -142 -35 -125 238 -77 -287 88 176 -54 -202 121 42 -128
4861 -128 -2 27 61 131 -198 103 101 204 -104 115 41 163 -2 -62 84 137 -117 114 -42 85 75 -55 18
4884 18 140 63 66 59 -140 -271 86 22 150 -45 -26 107 105 124 -27 -135 87 -84 -83 146 275 -180 19 100 306
4909 306 21 -29 45 -109 -126 37 -49 204 -99 217 8 -116 149 -89 -68 -56 -107 -73 1 -17 26 11 -72 -64 202
4934 202 -190 86 99 271 98 95 -234 226 135 164 -173 93 32 -359 10 30 36 263 83 184 -94 -145 135
4957 135 -28 121 2 -2 -143 -14 11 -88 147 -158 222 -115 -64 -184 -123 -111 -191 -491 -199 -137 -233 -130 35
4980 35 -50 -94 -45 171 6 177 134 -54 -325 -56 -54 89 -153 -207 -93 109 47 -39 216 87 -23 -165 140
5003 140 25 -109 80 86 141 170 -63 153 149 54 71 -69 -280 224 -67 -145 -76 46 215 -233 96 255 -269
$$ packed form
4837d6J17m73M77m8LJ24j74N7Q9j00p9q9J07r0L63l15k10L75Q8k30j48L23p9j70
4861a28J26K9L4P0l29L01kJ03l08K19p4J22j65o0J46N3k54K31j56J27j0j30P3
4884A8J22p7Lpj99j31L57o4J28j95J9J33kJ9j51j08K22j71JK29J29m55J99Q1K06
4909C06k85n0P4j54j7J63q6K53l03L16k09j24K65k38K1J2n1L4P4j8M3j5q3QK66
4934B02l92K76J3J72j73ll29M60r1K9l37K66o1l91L69K0OK27j80J01k78n1K80
4957A35j63J49j19mj41J29K5r9K35l05L80l37N1j20O1J2q0l00K92O2r6J03J65
4980C5q5m4M9K16j65J71m3j88k71K69KJ43k42n4J14K02o2q6K55j29j10j42L05
5003A40j15j34J89ON5K9k33K16mr5J7j40k11N04k91p8O9J22J69m48L29J59n24
$$ plain form
5026 -269 142 -161 -36 -215 -247 212 -340 52 -57 295 151 -166 -78 213 276 83 -165 -123 248 -2 -248
5047 -248 225 -37 -160 -15 84 26 -144 69 21 262 -104 154 -227 -10 -155 -11 -105 -100 40 -68 27 -23 287
5070 287 -40 77 -59 205 -146 38 126 -11 -123 -60 134 33 4 -157 71 -237 40 296 -39 -65 -273
5091 -273 -59 186 7 -39 -148 -257 -66 -484 -195 6 -58 22 32 96 109 10 -86 244 -73 245 358 216 -22
5114 -22 301 -2 -201 140 -103 -4 55 178 86 451 44 205 83 -174 153 -71 -229 -111 77 11 -116 75
5136 75 -137 -19 20 -51 168 143 -74 -31 -85 -95 -116 -196 58 315 145 -51 70 134 -70 198 -11 173 -79
5159 -79 7 5 -182 38 -19 6 -10 -263 396 -59 92 185 -55 -72 -138 170 -44 -89 165 17 75 -130 -26 -103
5183 -103 113 -213 40 206 -24 130 -52 64 224 4 -109 -97 -165 -133 189 -100 38 168 45 -45 -187
$$ packed form
5026b69M11l03J25j79l2M59n52L92j09L52j44l17Q8K91O3j93k48M2L71k50k46
5047b48M73k62j23J45R9n8j70K13m8K41l66K58l81K17j45J44r4NJ40j08R5n0L10
5070B87l27J17j36K64l51J84Q8j37j12O3J94j01k9j61K28l08K77K56l35k6k08
5091b73K14K45j79m6j09j09J91m18K89K01o4Q0J0O4J3r9r6L30l17L18J13j42k38
5114b2L23l03j99L41k43R9N9J23r2L65m07J61j22k57L27k24j58J18J88o6j27J91
5136G5k12J18L9p1K19k5k17M3n4j0k1q0K54K57j70j96J21O4k04K68k09J84k52
5159g9Q6kj87K20n7K5j6k53O59m55J51R3k40j7o6L08k14m5K54j48N8k05J04p7
5183a03K16l26K53J66k30J54j82J16J60k20j13J2o8L2L22k89J38J30j23r0j42
$$ plain form
5204 -187 194 -102 86 -21 -121 215 -52 9 -171 70 50 2 -74 108 225 -215 81 -19 -30 34 -194 32
5226 32 129 319 181 83 -246 -60 11 -117 81 199 262 285 134 23 31 282 -31 -262 209 -55 356 65 12
5249 12 57 -19 251 -72 -7 41 -252 262 89 145 89 -2 32 -39 213 23 58 -26 167 34 6 66 -106 -128 303
5274 303 -150 360 318 -80 82 31 -275 97 149 -195 -152 -49 -136 156 91 172 128 -30 -65 -9 72 51 164 -129
5298 -129 229 27 177 41 59 116 -86 -113 193 69 62 -168 -304 -45 -32 85 290 109 -29 1 70 382 241
5321 241 80 32 217 135 34 -47 -125 138 -89 -36 96 47 1 235 32 73 -42 168 74 119 38 -39 -90 32
5345 32 54 -174 -233 94 -20 -34 168 41 199 61 -351 275 -78 -47 452 -85 212 61 -285 -50 24 354
5367 354 156 269 106 -11 -177 292 51 -109 117 168 -134 137 61 55 130 -32 88 -108 -22 22 -100 -14 284
$$ packed form
5204a87L81k96J88j07j00L36k67O1j80K41k0m8p6J82J17m40K96j00j1O4k28K26
5226C2R7J90j38r8l29J86P1j28J98J18O3K3j51j11QK51l13k31M71k64M11k91n3
5249A2M5p6K70l23O5M8k93N14j73N6n6r1L4p1K52j90L5q4J93j33k8O0j72k2M31
5274C03m53N10m2l98J62n1l06L72N2l44M3J03q7K92o5Q1m4j58l5N6Q1k1J13k93
5298a29L58k02J50j36J8N7k02k7L06j24pk30j36K59J3J17K05j81j38L0O9L12j41
5321B41j61m8J85q2j01q1p8K63k27N3J32m9m6K34k03M1j15K10r4M5q1p7n1J22
5345C2K2k28n9L27j14j4K02j27J58j38m12O26l53L1M99n37K97j51l46K35P4L30
5367C54j98J13j63j17j66M69k41j60K26N1l02K71p6oP5j62J20j96Q6M4j22Q6K98
$$ plain form
5390 284 5 24 26 187 222 165 -96 26 21 67 5 -20 -5 -316 81 292 185 179 -199 160 -2 -55 -33 -33 -7 -189
5416 -189 14 169 -256 -157 -6 -22 -15 50 -113 -205 -90 -72 -9 -164 -165 60 -30 -87 95 52 22 -41 199 92 -150
5441 -150 46 -210 -83 103 114 106 -159 35 10 -46 19 84 42 -246 -138 -249 -290 22 127 30 -70 -80 -169 10
5465 10 111 -207 98 4 62 -43 100 53 -13 272 89 -97 -40 -17 143 -78 132 147 -165 69 -134 10 70
5488 70 -141 -26 46 139 -179 36 -190 -134 -82 178 103 32 303 -64 101 -275 -194 40 -53 79 -98 -81 -117 1
5512 1 -50 112 -86 -153 -97 -19 271 -130 26 129 109 -79 307 -144 -80 61 258 135 -119 -41 -38 -207 -156 75
5536 75 -35 7 -7 286 -129 101 142 -74 -130 -52 -91 141 229 -59 165 334 52 365 237 -223 -134 97 209
5559 209 -105 -14 -229 -1 4 -191 -203 78 93 38 37 10 88 -25 174 29 -47 22 -172 267 8 -196 -100 104
$$ packed form
5390B84k79J9KJ61L5n7k61J22nM6o2k5J5l11L97K11j07ol78L59j62n3K2%K6j82
5416a89K03J55m25R9J51j6PO5j63r2J15J8O3j55jK25r0n7J82m3l0o3K40j07k42
5441a50J96k56J27J86J1qk65J94k5n6O5O5m2k88J08j11m1L12J05r7j00j0q9J79
5465A0J01l18L05r4N8j05J43m7o6K85j83j86N7K3J60k21K10J5l12K34k03J44O0
5488G0k11J15P2R3l18K15k26N6N2K60p5p1K71l67J65l76Q1K34r3J32j77J7l6J18
5512An1J62j98o7N6P8K90m01J56J03k0j88L86m51O4J41J97j23k54P8Lj69N1K31
5536G5j10M2j4K93m15K30M1k16n6P8l9K32Q8k88K24J69k82L13j28m60Q9K31J12
5559B09l14R1k15K28Nj95j2K81J5n5jk7P8j13J99j45p6O9j94M39k59k04R6K04
$$ plain form
5583 104 -41 177 -4 -218 22 51 102 -126 -224 119 28 -73 -35 50 -322 -282 319 168 188 -160 -69 -208 -99
5606 -99 77 -287 -40 -102 -357 250 -117 141 82 14 -289 -213 -231 -38 -27 103 -36 307 -40 -168 -112 98 -236
5629 -236 33 -7 35 -31 55 293 -79 112 78 -85 -95 -11 -16 177 -55 332 -64 -65 -334 75 187 -39 146 160
5653 160 115 76 243 -46 -21 -43 15 -61 99 -129 -301 137 33 -182 -35 13 258 52 38 222 -4 28 -140
5676 -140 14 204 -1 -45 118 75 29 47 -96 35 -9 -292 254 281 100 131 -43 -56 -182 189 -66 34 40
5699 40 164 -49 -202 -38 -251 -188 -30 -66 85 -19 0 -45 83 125 57 -128 -88 90 -54 -88 103 -48 16
5722 16 243 79 -120 213 -20 -236 14 90 9 -27 11 186 125 62 144 -10 -173 113 -24 37 -161 102 -182
5745 -182 -181 57 -127 -151 254 7 88 21 -165 239 -115 138 -89 -53 43 -7 -37 -191 266 103 -75 -13 -77 21
$$ packed form
5583A04j45K18j81k14K40K9N1k28r8L43r1j01L8Q5l72M0O01j51K0l48R1j39J09
5606i9J76l64K47o2k55O07l67K58n9o8l03P6j8J93J1J30j39L43l47j28N6K10l34
5629b36K69m0M2o6Q6K38l72J91l4j63j0Q4nJ93k32L87l96jk69M09J12k26J85J4
5653A60m5l9J67k89K5k2N8p6J60k28j72M38j04k15J47M8K45k06j4J84k26L2j68
5676a40J54J90k05m4J63m3m6J8j43J31m4k83N46K7j81L1j74j3j26L71k55J00O
5699D0J24k13j53J64k13O3J58l6J51j04J9m5J28M2o8j85M0J78j44l4J91j51O4
5722A6K27j64j99L33k33k16K50P6q1l6L8J75o1o3Q2j54j63K86j37O1j98K63k84
5745a82JK38j84k4M05k47Q1o7j86M04l54K53k27L6R6n0l0j54M57j63j78O2o4R8
$$ plain form
5769 21 288 0 41 -88 -79 11 -98 55 148 149 118 144 60 -136 -31 28 215 57 131 37 75 5 156 26 154
5794 154 -83 6 -136 25 244 -140 60 158 -63 74 -172 -247 241 -12 24 34 162 -44 130 -21 -105 28
5816 28 -17 259 32 -117 253 -212 35 212 -47 -88 -153 254 14 242 95 274 -8 -60 65 59 -3 222 -144
5839 -144 251 -38 -111 -11 -58 74 38 157 -141 60 11 70 -164 38 -164 83 -110 -164 59 -299 -28 157
5861 157 -69 -67 8 -79 141 -220 -32 84 -71 -106 115 283 118 -36 169 -111 57 -29 24 -93 -77 103 27
5884 27 170 -207 41 38 -40 -36 -173 -201 -102 -114 77 -185 -164 200 -82 58 125 -78 61 135 28 -119 -8 -69
5908 -69 -170 -37 72 -51 -208 -359 -2 -343 30 173 182 14 -101 147 58 74 59 -165 -25 38 72 109 -52
5931 -52 90 34 -137 -66 -299 117 251 200 136 -130 26 176 -159 46 -43 -174 -188 -67 -171 303 88 -53
$$ packed form
5769B1K67k88M1j29RR0j09J53R3Jl1K6q4j96J05N9J87j58P4r4L8p0J51j30J28
5794A54k37Q9j42J61K19l84K00R8k21J37k46p5M88k53L6J0J28k06J74j51q4J33
5816B8m5K76k27j49L70m65K47J77k59m1o5M07k40K28j47J79k82n2J25oo2K25l66
5839a44L95k89p3J00m7J32l6J19k98K01m9N9k34K02k02K47j93n4K23l58K71J85
5861A57k26KP5q7K20l61J88J16j55l5K21J68j65j54K05k80J68q6N3j17J6J80p6
5884B7J43l77K48lp8Mj37k8R9j2J91k62K1L64k82J40O7k03J39P4j07j47J11o1
5908f9j01J33J09j23j57j51L57l41L73J43Rj68j15K48q9J6j5k24J40O3L4L7j61
5931e2J42n6j71P1k33M16J34n1o4k66J56J50l35K05q9j31j4J21j04M74k15j41
$$ plain form
5953 -53 80 -170 105 -29 -69 -199 4 146 -153 330 7 185 -47 -31 28 -10 -38 -4 48 24 -91 18 -3
5976 -3 -5 -30 261 106 121 -79 -327 230 -214 -128 -55 48 -32 53 302 -58 57 197 -67 252 -159 -49 -51 -66
6000 -66 -157 -173 -248 66 -7 30 107 -174 112 -318 63 -250 -227 33 124 148 176 -105 97 146 -307 -65 -14 -31 28
6025 28 -116 100 16 91 122 17 -233 -180 67 -94 62 18 -91 -59 -156 61 247 85 209 125 -25 -347 -190
6048 -190 -74 63 240 132 30 80 -81 -2 59 -102 167 -117 34 -98 -221 -72 -70 -28 228 141 -209 -121 152
6071 152 249 -136 -71 -102 33 -274 131 -72 228 -368 -187 -78 -224 140 1 189 -168 47 -194 -48 -233
6092 -233 -36 45 15 92 -38 32 -34 -22 -126 -312 -265 178 98 -290 -41 54 50 25 -53 138 80 73 -265 -113 -77 16
6118 16 -67 -173 125 74 -52 -174 -191 33 -27 -164 97 -33 67 -50 276 167 -185 -115 150 -23 25 96 -60
$$ packed form
5953e3J33k50K75j34m0j30K03J42k99M83l23J78k32J6N9l8k8L4N2k4j15J09k1
5976ckk5K91j55J5k00k48N57m44Q6P3J03q0Q5K49l60J15J40k64L19m11J10kj5
6000f6r1j6p5L14p3L7P7k81K86m30L81l13K3K60R1K4K8k81K02M9m53K42N1j7N9
6025B8j44K16q4P5L1j05k50N3K47j61J56m4j09L2r7K17J86j62J24q4j50l22J57
6048a90J16J37J77j08j02N0j61P9O1j61K69k84J51j32j23J49KM2K56q7l50Q8K73
6071A52R7l85O5l1J35l07M05k03L00n96J81J09j46L64j39J88l57K15k41J46j85
6092b33J97Q1l0P7j30P0o6J2j04j86M7M43q0l88K49R5mk5p8J91n8pl38J52L6R3
6118A6q3j06K98n1j26j22j7K24o0j37K61j30J00j17L26j09l52P0K65j73M8P1j56
$$ plain form
6141 -60 29 224 -479 -273 -172 138 0 -95 -109 63 -11 72 84 285 219 90 48 50 -14 -44 -119 95 -250 63 41
6166 41 -76 -43 -182 220 -22 90 53 -112 -72 -69 -36 189 -107 -298 -192 -193 -186 -40 41 -35 -138 -44 136 -149 53
6191 53 142 -76 -157 25 160 -179 39 86 -12 116 166 -69 143 -242 -72 76 143 -13 19 164 -150 -56 -17
6214 -17 147 161 -149 -1 205 -17 -64 -179 -80 146 -91 662 -166 -365 97 -95 114 -83 -105 218 -46 109
6236 109 20 -364 0 -191 193 47 449 -318 -74 -103 26 21 -109 -168 -71 -239 284 178 -340 116 211 122 116
6259 116 58 64 -51 36 15 -33 69 -59 -99 -108 -184 38 140 137 56 -90 -73 109 -221 36 88 11 107 18 -12 -148
6285 -148 176 -272 161 -211 -33 445 105 91 -176 117 -49 -19 139 -84 -159 113 28 28 -90 -142 -295 -92
6307 -92 13 24 22 -52 -82 217 61 132 129 -30 17 8 109 -160 129 -138 238 -52 -16 326 275 144 167 26 -100
$$ packed form
6141f0Q9J95p03K06J01L10j38r5j4J72p4Q3J2K01o6j29m2Ko4l0p5K14l45L13k2
6166D1j17L3j39M02k42J12l7j65M0LL3K25k96j91J06jPJ46Q1p6j03R4J80k85K02
6191E3Q9k18q1J82J35l39K18M7r8J28N0k35K12l85J70J48O7j56L2J45l14R4L9
6214a7J64J4l10J48K06k22m7j15R9K26k37P53q28j99M62j92K09j97k2L23k64J55
6236A09q9l84L64j91L84j46M02p67K44k9J29nj30n9R7j68N23j06n18M56R5q9o
6259A16n8Oj15Q7k1m8J02j28m0rp6K22J02lq1j46J7J82l30K57N2p7R6q9l0j36
6285a48L24m48M33l72J78M78l40j4k67K93j66L0J58k23p5K72q5%j18n2j53K03
6307i2J05J1kp4l0K99j56P1lj59M7rJ01k69K89k67L76k90L6L42n1j31K3j41j26
$$ plain form
6332 -100 13 33 -249 117 136 64 253 69 -397 -122 -3 -7 -19 -81 258 268 4 11 -155 -70 113 -80 -25 -347
6356 -347 19 -13 367 -33 -125 -172 71 56 -104 178 57 -33 -230 53 -117 -88 86 -20 -2 37 -32 32 2 105
6380 105 -59 23 109 23 142 142 205 61 -1 -150 14 -323 131 60 212 -100 -183 -27 234 -102 20 349 79
6403 79 69 -50 236 -139 1 53 135 -33 -59 -81 -62 160 103 65 -67 57 -149 -44 120 -73 38 303 -78
6426 -78 154 52 315 -145 71 59 -124 179 -137 -103 -36 -111 209 210 -167 -22 115 22 256 64 171 250 -21
6449 -21 -59 -3 16 168 -127 -163 -35 -236 -68 33 -26 214 168 -173 130 79 -64 -127 -23 -128 163 47 -27
6472 -27 -40 -101 -10 36 -285 99 -13 -57 42 34 211 82 77 347 -105 -40 55 55 -32 -75 -83 -133 100 287 -128 -326 143
6499 143 -292 141 150 95 45 -218 -175 -59 -63 -30 68 104 22 -28 10 76 30 -7 -78 -169 -221 62 21 216 -12 -118 44
$$ packed form
6332a00J13K0k82L66J9p2J89j84m66K75J19mj2o2L39J0k64Pj66Q5J83j93N5l22
6356c47L66l2L80m00r2m7K43j5j60K82j21r0j97K83j70K9J74j06J8L9o9O4l0J03
6380A05j64Q2Q6q6J19%O3j44o2j49J64l37M54p1J52l12q3J56K61l36J22L29k70
6403G9j0j19K86l75J40N2Q2j68k6k2J9K22n7l8j32J24k06J05J64j93J11K65l81
6426g8K32j02K63m60K16j2j83L03l16L4O7p5L20Jl77J45J37r3K34j92J07P9k71
6449b1l8N6J9J52k95l6J28k01J68J01n9K40m6l41L03n1j43o3J04j05K91j16p4
6472b7j3o1R1M6l21L84j12m4R9qJ77j29nK70m52O5R5%q7m3qn0K33J87m15j98M69
6499A43m35M33Rn5n0k63M3J16mL3R8L6q2n0L8O6m6l7p1r1n2K83m1J95k28j06J62
$$ plain form
6526 44 -214 98 -4 250 65 81 31 42 19 -10 336 -85 31 -61 124 -104 23 -134 248 183 79 -16 234
6549 234 46 186 145 -66 36 -296 171 197 -319 143 7 91 52 117 -18 -105 -74 33 -6 -107 188 170 233
6572 233 393 -85 145 177 100 -12 -54 220 366 128 2 -63 79 -52 115 111 194 -37 75 53 29 -193 49
6595 49 -110 -264 215 -6 66 68 175 23 65 -26 -28 -64 -162 -108 493 -137 64 -45 -29 15 -112 -51 -28 -23 -44 -127
6621 -127 -73 -234 -318 -187 -102 37 180 -21 94 -226 -68 -5 -80 -45 -87 -57 16 3 -71 -24 110 165 117 252 90
6646 90 -120 173 -210 118 17 -108 -34 169 66 100 -158 137 23 206 -139 -112 -12 164 265 -48 203
6667 203 -267 73 66 133 -92 105 -240 1 264 113 -99 183 72 -317 -170 -101 28 -30 268 14 -42 163
6689 163 89 39 -98 -243 300 281 22 -88 61 -143 16 -141 -258 256 62 -51 89 13 92 165 123 -12
$$ packed form
6526D4k58L12j02K54j85J6n0J1k3k9L46m21J16r2J85k28J27j57L82o5j04r5K50
6549B34j88J40m1k11J02l32M67K6n16M62j36Q4l9O5j35q7L1J07l9j01K95j8O3
6572B33J60m78K30L2p7j12m2K74J46k38j26o5J42j31J67mQ3k31J12k2k4k22K42
6595D9j59j54M79k21P2KJ07j52M2r1kl6r8N4O01o30K01j09J6M4j27O1K3Nk1q3
6621a27N4j61q4J31Q5J39J43k01J15l20J58O3p5L5m2L0P3j3p4M7J34N5m8J35j62
6646I0k10K93l83L28j01j25P4K03j03L4k58K95j14J83l45K7J00J76J01l13K51
6667B03m70L40pO7k25J97l45K41K63j51k12K82j11l89J47O9J29n8K98k54n6K05
6689A63p4n0j37j45N43j9k59j10J49k04J59j57j17N14j94j13J40p6P9P3m2j35
$$ plain form
6711 -12 -149 53 87 -73 49 151 -2 -209 189 -288 -238 165 -164 59 -27 -86 -90 154 22 -80 -155 40 179
6734 179 -114 -54 327 54 -71 277 87 -87 -91 -46 250 -4 -106 135 263 -36 90 188 30 -141 38 61
6756 61 -86 247 -73 -205 277 -199 -142 149 79 -31 47 -37 273 51 38 -520 -145 -242 304 379 -251 111 277
6779 277 145 151 6 259 -32 -114 29 -112 221 -16 -22 -116 -135 193 111 363 -156 -196 179 -176 57 33 7 58
6803 58 7 -279 86 -160 45 77 -60 60 40 197 114 262 -129 82 84 -121 -159 112 -19 311 113 -116 188
6826 188 -130 230 143 197 -152 227 -216 103 -116 -119 -194 64 -157 -127 -184 -21 112 -14 -85 -38 -74 -11 -143 267
6850 267 2 -145 -255 -160 70 122 14 15 221 -44 -124 -31 -66 -175 46 -75 67 -172 162 122 16 -15 97
6873 97 177 116 12 -24 44 75 138 3 110 154 -50 -119 62 11 -115 -145 147 -114 -166 -65 -55 211 -332 237
$$ packed form
6711a2j37K02L4j60J22J02j53k07L98m77N0M03l29K23q6n9mK44j32j02p5J95J39
6734A79k93O0L81k73j25L48j90j74mM5K96k54j02K41J28k99J26R8j58j71J79K3
6756F1j47L33l20j32M82m76N7K91p0j10P8q4L10k22j3n58L75r7N46P5o30L62J66
6779B77j32Oj45K53k91q2J43j41L33k37or4j9L28q2K52n19m0L75l55K33k4k6N1
6803E8n1k86L65k46K05L2j37J20k0J57q3J48l91K11Kk05l8K71j31L30j98k29L04
6826A88l18L60q7N4l49L79m43L19k19lp5K58k21L0n7J63J33j26p1M7l6O3j32M10
6850B67k65j47j10R5K30N2j08JK06k65q0R3l5j09K21j21J42k39L34m0j06l1J12
6873I7Q0o1j04l6O8L1O3j35J07M4k04o9J81n1j26l0K92k61n2J01J0K66n43N69
$$ plain form
6897 237 -12 278 -68 -241 231 10 203 -100 6 -15 -50 27 -139 20 -217 -64 -48 -45 175 24 -66 70
6919 70 175 284 -230 -19 -128 -185 -29 -73 -178 -56 135 46 20 27 319 -214 -14 260 -67 -73 -46 92 86 -37
6943 -37 -141 -195 -317 -160 -69 46 -192 165 132 168 -98 -126 -145 -152 25 24 148 187 131 -20 186 -67 -137 22 -109
6968 -109 -229 69 -123 -15 -32 65 230 -243 159 25 -252 -87 33 7 -98 262 35 24 -133 61 -204
6989 -204 69 130 198 -213 -132 -96 119 109 -97 -107 -94 -57 61 -47 -48 218 -6 -93 -85 -70 83 159 -97 -112 -2
7014 -2 -231 -121 -59 -188 226 -67 -132 51 121 -224 -83 25 -7 182 -55 -336 290 78 -210 141 -186 55
7036 55 -211 -25 -5 -53 26 -156 320 297 -262 -122 81 25 -112 -34 -83 -224 247 -72 -399 86 -298 -42 -101
7059 -101 8 28 88 20 57 152 31 -3 71 -14 -45 -89 0 198 217 -10 123 164 98 34 -118 -49 -213 -149 -174 26
$$ packed form
6897B37k49K90l46j73M72k21J93l03J06k1l5P7j66J59k37J53J6LK20j51r0J36
6919G0J05J09n14K11j09n7J56m4j05J22J91q9k6PK92n33K00K74l27oK7J38oj23
6943c7j04n4j22J57R1J15k38L57l3L6k66k8j9pJ77jJ24L9n6j51K06k53p0J59j31
6968a09j20K98j92J08j7R7J65m73M02j34k77J65J20k6j05L60k27j1j57J94k65
6989b04K73O1O8m11Q1L6K15j0k06j0J3L7J18j08jK66k24q7QJ5J53P6k56j5J10
7014bk29J10O2j29M14k93o5J83P0l45J41J08l2J89k37k81O26k12k88L51l27K41
7036E5k66J86K0m8P9j82M76k3n59J40K03n6j37P8m9j41M71l19l27M85l84K56n9
7059a01J09K0O0o8L7R5j21l4P4q5l1m4Q9J98J9k27J33M1o6o4j52O9j64O4k5K00
$$ plain form
7085 26 -110 -205 -50 -122 97 134 146 119 34 57 -159 -149 82 12 33 -37 115 -63 -47 29 -11 -111 17 64 104 169
7111 169 -274 -209 314 -37 -36 -74 -62 323 17 -92 138 50 -9 221 45 54 -112 96 -147 46 -63 195 -26
7134 -26 167 -87 102 -215 -33 96 -32 -123 31 -177 -176 160 315 112 70 38 180 270 166 -22 -182 -141 146
7157 146 16 67 -79 81 36 -152 -105 -7 -66 11 -108 -76 67 153 24 192 27 -125 -10 297 -77 -77 -60 -124
7181 -124 82 -21 72 -154 -109 79 -78 99 -48 348 162 17 -112 151 -58 36 205 2 -149 -70 -126 167
7203 167 128 -104 -123 -91 -125 -157 -136 16 -55 -78 -1 -260 75 -228 88 -333 10 -32 26 -44 -62 -26 146 28 160
7228 160 242 209 43 149 -38 -80 100 51 -66 271 -51 150 -81 46 -28 -24 29 32 152 -129 89 -63 40
7251 40 15 -105 -118 50 -4 -35 -122 -65 -7 -207 -187 -108 -329 132 -130 271 166 -84 -47 -73 -244 -190 -132 -133 131
$$ packed form
7085B6j36r5J55p2K19L7J2k7q5K3k16J0K31p0K1p0J52j78J6P6m0j00J28M7M0O5
7111A69m43O5N23l51Jl8J2L85l06j09K30q8n9K30j76Rj66K08k43J93j09K58k21
7134b6J93k54J89l17J82J29j28r1J54k08JL36J55k03m2l2J42R0j04j88j60M1K87
7157A46j30N1j46J60m5j88M7R8n9P7j19L2J43Q6j29J68j65j52J15L07l74%J7o4
7181a24K06j03R3k26M5J88j57J77j47L96j86j45j29K63k09R4J69k03j51P9n6K93
7203A67l9k32j9L2l4l2K1J52p1k3P7k59L35l03L16m21L43m2N8p0j8L6J72j18J32
7228A60Q2l3j66J06j87m2J80m9j17L37l22K01k31J27p4MN3LJ20k81K18j52J03
7251D0k5j20j3J68n4l1q7N7N8k00K0P9k21M61k62M01j05k50L7k6j71N4N8jK64
$$ plain form
7276 131 -68 -79 102 -179 -164 60 54 -139 -71 -104 42 21 -26 -80 -214 117 -70 47 -258 -79 58 -22 -92 -123
7300 -123 -21 -4 -40 -85 214 -167 -12 -77 -48 6 69 76 140 24 175 -60 51 177 84 -56 -120 150 -75 -14
7324 -14 160 73 -68 -2 -54 -137 -410 131 -246 -1 -27 34 116 14 128 -129 27 -304 -61 -307 -222 59 -272
7347 -272 260 305 -211 -76 105 39 -92 57 35 14 -36 253 -17 -74 9 -120 -45 99 -92 10 -301 -21 61
7370 61 18 102 -45 -16 3 242 500 121 64 71 29 -68 14 99 -225 286 -77 139 -185 -152 -40 -29 -238 -148 -171
7395 -171 110 62 -181 24 49 143 168 -42 5 189 -156 -113 -200 -95 -246 35 -227 107 161 -58 87 -245 134
7418 134 -282 152 -246 -158 -66 -163 -172 -40 171 109 79 34 42 -126 172 -38 50 83 59 -115 95 134 25 102 -314
7443 -314 -220 118 102 -23 -46 29 74 -65 192 188 -139 -138 3 95 -120 2 104 45 144 -72 -13 144 -28 -260
$$ packed form
7276A31j99j1J81k81J5K24oj93O8l3J46k1m7n4j34L31j87J17l05J79J37q0p0l1
7300a23J02J7l6m5K99l81J55o5K9N4O3PO4j16J51k35J11J26r3j40o4K70k25O1
7324a4J74q7j41O6n2q3k73N41l77K45k6O1Q2j02J14k57J56l31K43k46Q5K81l31
7347b72N32M5n16J35J81o6j31J49k2k1n0K89k70n7Q3j29P5J44j91J02l11K80Q2
7370F1m3Q4j47K9J9K39K58l79n7Pm2r7Q2Q5l24N11l63K16l24L3J12J1k09R0k3
7395a71K81m8k43K05K5R4K5k10M7J84l45M3q7J05j51K81k62L34N4k19J45l32L79
7418A34m16M34l98Q8R2r7rJ32K11o2l0m5Qj68K98k10Q8L3k4j74K10L9j09P7m16
7443c14R4L38j6j25k3P5M5j39K57ml27JJ41R2k15J22J02n9R9k16N9J57j72k32
$$ plain form
7467 -260 -26 13 -36 188 -128 12 -5 -346 21 234 -8 1 -99 17 202 32 -99 202 -94 340 47 12
7489 12 -129 -77 133 127 -264 142 439 125 115 -152 -119 209 -78 -58 142 1 -87 -285 -84 27 -115 -56 -287
7512 -287 -93 82 -223 101 181 -75 -8 -285 -86 156 -100 99 -63 41 -59 -19 70 12 -28 33 64 -30 103
7535 103 169 190 -23 46 81 139 241 189 -14 -149 101 281 192 -155 38 55 -181 -185 -100 51 241 139 -175 -179
7559 -179 210 -77 -142 71 -46 -100 -85 -9 -107 88 -236 -203 -70 -23 -68 -62 -54 -160 -87 -8 -245 52 -77 139 -354
7584 -354 159 -45 -121 0 -123 -248 -73 11 235 43 177 -44 259 20 -95 15 39 197 146 59 124 58
7606 58 217 -258 53 10 55 11 -151 7 37 -24 15 1 -196 23 135 21 -110 -34 275 86 -11 -128 152
7629 152 32 -31 7 -90 -60 -111 117 140 -117 -39 287 127 -127 12 103 -93 1 208 25 -50 -193 -62 165
$$ packed form
7467b60K34L9m9K24l16J40j7l41L67K13k42Rj00J16J85j70j31L01k96M34k93l5
7489A2j41N2K10ol91M06K97l14j0k67L3L28k87K0K00j41q8j98K01J11j42N9k31
7512b87J94J75l05L24Q0k56O7k77J99K42k56J99j62J04j00M0Q9n8m0O1L1r4J33
7535A03O6K1k13O9L5N8J02n2k03j35K50J80q9l47J93J7k36mQ5J51J90j02l14m
7559a79L89k87o5K13j17n4J5P6r8J95l24L3J33M7m5OQj06P3P9k37K97j29K16m93
7584c54N13k04p6J21j23j25J75Q4K24j92J34k21L03k39j15J10K4J58n1q7O5o6
7606E8J59m75L11m3M5m4j62J58L0o1L9j4j97K19J12j14j31P6L09j89r7j17K80
7629A52j20o3L8r7L0n1K28K3k57P8L26j60k54J39R1j96R4K07j83p5j43J31K27
$$ plain form
7652 165 249 -24 174 86 -4 -68 187 77 62 91 141 -262 75 105 -59 -60 156 -180 -48 90 132 136 -294 -199 123
7677 123 -67 134 -192 9 -228 367 58 42 147 109 375 171 353 -252 -79 308 -22 -90 -55 33 -31 73
7699 73 -109 58 108 -216 49 -96 41 -211 74 -70 -15 42 294 87 -145 -129 117 110 113 125 -201 111 -133
7722 -133 112 -74 -12 147 106 -18 -65 38 298 31 82 64 -40 -131 135 -175 143 203 19 -150 -1 121
7744 121 -76 68 106 223 155 -12 239 -145 104 72 14 156 79 -81 60 271 -160 -92 3 -31 10 143 77
7767 77 -172 285 -286 67 87 -54 -7 -94 82 -122 -2 79 251 -405 107 -20 -127 -58 -196 -235 -53 132
7789 132 -119 181 -170 -41 -26 -155 46 3 125 -78 -105 -206 -65 -26 126 382 -48 217 92 220 559
7810 559 9 -129 156 -34 69 -59 -114 -95 57 51 64 102 -36 46 -158 -87 27 -67 -209 -22 92 34 -174
$$ packed form
7652A65Q4k73J98q8r0o4K55j10j5K9N0m03L37L0j64jK16l36J32J38M2Mm30R5L22
7677A23j90K01l26K01k37N95l09j6J05l8K66k04J82o05J73L87l30o8L5Q8o4J04
7699G3j82J67N0l24K65j45J37k52K85j44N5N7K52k07k32J6K46pLJ2l26L12k44
7722a33K45j86O2J59m1j24m7J03K60k67N1j8j04r1K66l10L18O0j84j69J49J22
7744A21j97J44L8J17o8j67K51l84K49l2n8J42p7j60J41K11m31O8R5l4M1J33o6
7767G7k49M57n71L53K0j41M7q7J76k04J20Q1J72o56N12j27j07O9j38l9J82J85
7789A32k51L00l51J29J5j29K01m3J22k03k7j01J41L9J52K56m30K65j25J28L39
7810E59n50j38K85j90J03j28n5J9J52oJ3L8j38Q2k04P1J14r4j42J87J14n8k08
$$ plain form
7833 -174 -270 -135 -330 83 3 -21 10 65 19 -114 -6 -20 -11 106 -221 85 66 -186 22 39 -250 92 -25 -111
7857 -111 155 -253 -16 -113 19 188 -47 -313 -40 25 92 -152 119 19 83 97 33 -59 -346 15 6 -117 -16
7880 -16 128 177 -54 99 -323 26 -131 -329 -173 12 298 -96 134 -49 -127 120 122 -73 74 -180 -51 -288
7902 -288 207 -158 -97 321 -230 86 -47 -231 31 61 -158 82 -162 -50 -83 80 -31 -116 -39 -64 -30 -235
7924 -235 -14 -58 0 -126 207 -97 187 63 -112 10 204 74 114 -176 -62 9 64 108 40 -192 -167 137 -318
7947 -318 107 -47 28 -78 -209 -60 -210 -39 114 18 104 -71 76 344 -88 -36 -189 -314 76 117 -102 49
7969 49 235 161 -12 -62 -512 272 82 -60 -41 -55 -227 72 221 283 -170 -185 -53 -28 -103 30 -91 48 -71
7992 -71 205 129 10 -38 103 -121 -198 70 108 310 95 134 -110 14 -128 -74 78 -133 9 165 -147 69
$$ packed form
7833a74r6J35j95M13q0k4L1N5m6j33J08j4RJ17l27L06j9k52K08J7k89L42j17q6
7857a11K66m08K37r7J32J69k35k66K73O5O7k44K71j00O4J4o4r2k87L61rj23J01
7880a6J44M9k31J53m22L49j57j98J56J85K86l94K30j83p8K47Kj95J47k54J29k37
7902b88M95l65O1M18n51L16j33j84K62L0k19K40k44J12l3J63j11q5P7k5L4k05
7924b35K21m4N8j26L33l04K84j24j75J22J94j30M0k90J14P1N5M4o8k32K5L04m55
7947c18M25j54P5j06j31J49j50J71J53r6Q6j75J47K68m32N2j53j25L90M1k19J51
7969D9J86p4j73n0m50P84j90j42J9j4j72K99J49O2m53j5J32K5p5J33j21J39j19
7992g1K76p6j19m8J41k24p7K68L8K02k15L9k44J24j42N4J52k11J42J56l12K16
$$ plain form
8014 69 296 -38 32 106 6 60 -327 -15 42 -88 -16 17 77 -73 9 -279 -344 -293 -171 368 -112 86 -194 -67
8038 -67 -30 -154 89 120 -23 -90 97 211 215 -28 136 260 183 139 51 11 -62 1 -159 135 -25 37 -71 19 -135
8063 -135 -199 132 144 167 -26 -179 163 203 -240 94 105 -207 123 128 7 103 -47 37 -186 -45 81 87 -116 -43
8087 -43 328 -4 -272 -84 52 142 -313 -250 -276 -31 -275 -18 156 27 143 64 232 -189 57 -300 -82 -269
8109 -269 -34 137 250 -45 -64 213 186 -295 -134 125 10 -183 285 104 124 100 -205 -96 -239 298 -34
8130 -34 -96 121 117 314 -70 -2 181 -75 -10 -153 -236 -46 -277 -192 213 123 89 195 37 186 94 115 40 -21 -102
8155 -102 -179 120 -75 -240 14 255 -76 -217 -128 5 41 -17 -183 91 -199 -69 239 74 -85 -156 -99 136
8177 136 151 215 94 242 171 -255 177 -1 61 65 -7 36 53 39
$$ packed form
8014F9K27l34P0P4j00N4l87L12N7j30P2L3O0j50Q2k88o5N1J22N39m80J98k80J27
8038f7L7j24K43L1j43o7J87J14Mk43J64J24p7m4q8m0p3O3j60K94j60O2j08R0j54
8063a35o4L31J2K3j93j53L42M0m43L34J1l12L30Nj21R6j50Q4k23J41J26Ok03P3
8087d3L71l32k68J88J36R0m55O3k6K45k44K57J74j29J16p9J68m21K46l57K18j87
8109b69K35J71J13k95j9K77k7m81J61K59j15j93M68j81K0k4l05J09j43N37l32
8130c4o2K17mJ97l84O8J83k56O5j43q3J90k31Q5M05r0l4J06j58J49r2K1p5o1q1
8155a02p7K99j95j65K54K41l31j41Q9J33L6n8j66K74k90J30L08j65j59p1N7K35
8177A36J5O4j21J48p1m26M32j78O2Mp2M3J7j4
8191C9
$$ Imaginary data points
##PAGE= N=2
##DATA TABLE= (X++(I..I)), XYDATA
$$ plain form
0 0 0 0 0 0 0 0 0 0 0 0 0 0 0 -4 8 -8 8 -8 14 -16 16 -24 24 -32 32 -40 48 -56 64 -72 82 -96 106 -122 138
35 138 -154 174 -194 218 -243 271 -301 333 -369 409 -451 499 -549 605 -667 733 -808 892 -985
54 -985 1086 -1204 1336 -1487 1665 -1874 2124 -2432 2822 -3329 4021 -5035 6652 -9670 17269
69 17269 -83259 -97882 19823 -1472 50641 85251 15824 -64912 -37992 -23782 -710 72466
81 72466 105412 40121 -8230 -40476 -82290 -67488 15749 54217 41883 20176 -19943 -69661
93 -69661 -72541 -36709 13941 61485 67958 28639 -9556 -41598 -52744 -4993 58078 63019 42785
106 42785 26233 -28445 -83143 -62139 -15302 6918 36464 50125 -1525 -48919 -39202 -23352
118 -23352 -1898 56830 84907 39228 -5692 -19492 -45719 -51962 -1121 43588 37118 13952
$$ packed form
0@%%%%%%%%%%%%%mJ2j6J6j6K2l0L2m0M8n6O4p2Q8j04J20j36J54j78K02k28K60
35A38k92L28l68M12m61N14n72O34p02P78q60R50j048J154j272J400j541J700j877
54i85K071k290K540k823L152l539L998m556N254o151P350r056J1687j6322K6939
69A7269j00528j4623J17705k1295N2113L4610o9427q0736K6920J4210K3072P3176
81G2466L2946o5291m8351l2246m1814J4802Q3237L8468j2334k1707m0119m9718
93f9661k880L5832N0650M7544O473l9319l8195l2042j1146M7751O3071M941k0234
106D2785j6552n4678n4698K1004M6837K2220K9546J3661n1650m7394R717J5850
118b3352K1454N8728K8077m5679m4920j3800k6227o243N0841M4709o470k3166
$$ plain form
130 13952 -10441 -46472 -58512 -22786 21208 42272 46476 30808 -9294 -42063 -37343 -8567
142 -8567 20343 42670 46075 16337 -27697 -48633 -39812 -16282 13931 37311 30886 -460 -28271
155 -28271 -38144 -29049 840 36905 52571 37642 6159 -23792 -38128 -29600 -2095 24230 29373
168 29373 11333 -14722 -36680 -44378 -24568 12834 36542 38551 26811 -337 -28577 -29970 -5512
181 -5512 15826 29362 33869 11491 -24516 -39273 -32252 -18043 8662 31963 25372 -210 -18441
194 -18441 -28823 -26335 -277 30449 38984 29698 10881 -15158 -30214 -20329 450 17371 24280
207 24280 12811 -13019 -33373 -36222 -23912 1782 26838 32412 20165 1404 -16276 -21821 -5254
220 -5254 16785 27427 26792 12532 -14846 -33412 -29310 -14362 3507 20802 21323 1835 -17369
$$ packed form
130A3952k4393l6031j2040L5726M3994K1064M204j5668m0102l2769M720K8776
142h567K8910K2327L405k9738m4034k0936Q821K3530L0213K3380o425l1346k7811
155b8271r873R095K9889L6065J5666j4929l1483k9951j4336Q528K7505K6325N143
168B9373j8040k6055k1958p698J9810L7402K3708K009j1740k7148k8240j393K4458
181e512K1338J3536M507k2378l6007j4757P021J4209K6705K3301o591k5582j8231
194a8441j0382K488K6058L0726Q535r286j8817k6039j5056R885K0779J6921O909
207B4280j1469k5830k0354k849J2310K5694K5056N574j2247j8761j7680n545J6567
220e254K2039J0642o35j4260k7378j8566M102J4948J7869J7295N21j9488j9204
$$ plain form
233 -17369 -24148 -20877 -4258 21098 33037 25214 9039 -8406 -21078 -16685 2344 17834 21050
246 21050 13017 -6596 -27594 -33231 -22448 -3319 15320 23783 15715 -219 -13489 -16036 -4243
259 -4243 14171 26031 25990 12969 -7928 -24495 -25021 -13303 2300 15141 16699 2675 -14256
272 -14256 -21908 -18623 -5589 13719 25493 20585 6805 -7081 -16853 -14154 1883 16926 20989
285 20989 14904 -59 -18035 -25968 -18484 -3959 9134 16082 10871 -3723 -15399 -16118 -6330 9113
299 9113 22483 24689 14024 -2986 -16353 -19606 -11156 2107 12389 12581 2691 -10498 -19073 -16782
313 -16782 -4554 10862 20169 18562 6828 -7578 -16033 -13875 -2601 10339 16648 13160 1043
326 1043 -12294 -18647 -13493 -1129 10800 15350 10137 -2012 -13702 -16621 -9103 4678 15847
$$ packed form
233a7369o779L271J6619K5356J1939p823j6175j7445j2672M393J9029J5490L216
246B1050q033j9613k0998n637J0783J9129J8639Q463q068j5934j3270k547J1793
259d243J8414J1860m1j3021k0897j6567n26J1718J5603J2841J558j4024j6931
272a4256p652L285J3034J9308J1774m908j3780j3886r772K699J6037J5043M063
285B0989o085j4963j7976p933P484J4525J3093O948n211j4594j1676p19R788J5443
299I113J3370K206j0665j7010j3367l253Q450J3263J0282J92r890j3189q575K291
313a6782J2228J5416R307j607j1734j4406q455K158J1274J2940O309l488j2117
326A043j3337o353N154J2364J1929M550n213j2149j1690k919P518J3781J1169
$$ plain form
339 15847 18787 12116 -330 -12602 -15679 -9039 2406 10370 11500 2923 -9549 -16823 -15190 -5638
353 -5638 8116 18027 18164 8909 -3343 -11138 -10544 -2689 7137 12882 9502 -1473 -12452 -17870 -14355
368 -14355 -3059 9515 14263 10103 1956 -7468 -13109 -7860 4747 13337 14971 11042 388 -11377
382 -11377 -13434 -6562 1149 8467 11509 3259 -9747 -14888 -14234 -8703 3425 14673 14316 6947 -523
397 -523 -6693 -8167 -25 9958 12835 9249 1076 -10182 -17391 -14349 -5112 4202 9441 8248 785
412 785 -7142 -10884 -6510 3308 11446 13980 10184 1506 -8767 -11080 -5735 1560 7851 10294 4616
427 4616 -6668 -12806 -12385 -8816 408 10046 10727 3374 -1867 -5884 -7673 -480 10230 13898 9852
442 9852 4510 -4731 -13663 -11958 -3663 1879 5554 6786 62 -8864 -9910 -4881 678 8862 13816
$$ packed form
339A5847K940o671j2446j2272l077O640J1445P964J130q577j2472p274J633R552
353e638J3754R911J37r255j2252p795N94P855R826N745l380j0975j0979n418L515
368a4355J1296J2574M748m160q147r424n641N249J2607Q590J634l929j0654j1765
382a1377k057O872P711P318L042q250j3006n141O54N531J2128J1248l57p369p470
397e23o170j474Q142R983K877l586q173j1258p209L042R237R314N239j193p463
412G85p927l742M374R818Q138K534l796q678j0273k313N345P295O291K443n678
427D616j1284o138M21L569R224R638O81p353n241m017j789P193J0710L668m046
442I852n342r241q932J705Q295N542L675J232o724q926j046N029N559Q184M954
$$ plain form
457 13816 9342 508 -6159 -8906 -6626 1024 8079 8665 4900 -2014 -9294 -10597 -5628 987 7174
472 7174 8868 3472 -4207 -7540 -7668 -3384 5678 11678 9957 4795 -1606 -8510 -9208 -2327 3576 5197
488 5197 5321 775 -8138 -10644 -5904 -284 6029 11103 9192 1028 -4537 -6744 -6193 -669 6153 7259
504 7259 3270 -2274 -7286 -9118 -5414 1904 7534 8292 4582 -1642 -6837 -7603 -3568 2927 7355 7636
520 7636 2920 -3254 -7178 -6743 -2264 3562 6893 5663 719 -4962 -8650 -6832 -636 5066 7533
535 7533 7524 2910 -3998 -6452 -3516 85 3705 7193 3876 -3902 -7482 -7677 -6822 -541 7297 7643 3364
552 3364 1222 -3035 -6786 -1874 4927 5741 5598 3862 -2753 -8859 -6271 -2600 497 5555 6352 499
568 499 -4183 -5986 -6103 -1837 4942 6855 5204 3483 -2420 -6136 -2479 1641 3668 6644 5754 -2172
$$ packed form
457A3816m474q834o667k747K280P650P055N86l765o914p280j303M969O615O187
472G174J694n396p679l333j28M284R062O000j721n162o401o904o98O881N903J621
488E197J24m546q913k506M740N620O313N074j911q164n565k207N51N524O822J106
504G259l989n544n012j832L704P318N630P58l710o224n195p66M035O495M428K81
520G636m716o174l924M35M479N826L331j230m944n681l688J818O196N702K467
535G533rm614o908k454K936L601L620L488l317p778l580j95Q55O281P838L46m279
552C364k142m257l751M912O801Q14j43j736o615o106K588L671L097N058P97n853
568D99m682j803j17M266O779J913j651j721n903l716L657M120K027K976q90p926
$$ plain form
584 -2172 -6877 -6506 -6845 -3146 4664 5437 782 -186 -2240 -6145 -2169 5496 6506 5236 5536 -426
600 -426 -7272 -5419 -1524 -313 3589 5498 299 -4871 -4923 -5270 -3095 3137 6256 4127 1528 -1591
616 -1591 -4999 -3549 793 4615 6128 5311 442 -4031 -5016 -4449 -1822 3090 4122 1106 -1676 -3904
632 -3904 -6346 -3134 2754 5278 5264 4814 411 -4691 -4181 -751 983 3802 5420 1353 -3573 -4113
648 -4113 -4191 -3157 1584 5153 3377 380 -2156 -4302 -4320 -646 3462 4855 4042 1637 -1953 -4497
664 -4497 -3357 60 2897 3817 2511 -920 -4268 -5393 -3246 403 3220 4467 3436 -495 -3549
679 -3549 -4051 -1415 753 3466 4426 1704 -1708 -3764 -3728 -1951 1955 4659 3866 1133 -1666 -3781
695 -3781 -4389 -1422 2118 3591 2533 704 -1963 -4370 -2821 625 2717 3756 3815 326 -3233 -3817
$$ packed form
584b172m705L71l39L699P810P73m655r68k054l905L976P665J010j270L00n962
600d26o846J853L895J211L902J909n199n170n2l47K175O232L119k129k599l119
616a591l408J450M342L822J513q17m869m473r85N67K627M912J032l016k782k228
632c904k442L212N888K524j4m50m403n102N10L430J734K819J618m067m926n40
648d113p8J034M741L569j776k997k536k146j8L674M108J393q13k405l590k544
664d497J140L417K837R20j306l431l348j125K147L649K817J247j031l931l054
679c549n02K636K168K713R60k722l412k056L6J777L906K704p93k733k799k115
695c781o08K967L540J473j058j829k667k407J549L446K092J039N9l489l559n84
$$ plain form
711 -3817 -2350 -520 2768 4102 2633 -409 -2547 -2984 -2011 987 3314 2805 1384 -1704 -4251 -4063
727 -4063 -2016 881 3491 3979 2078 -691 -1812 -2175 -719 2226 3578 2672 390 -2396 -4502 -3637
743 -3637 -510 1385 2474 3133 536 -2572 -3012 -1650 142 2169 3724 2415 -92 -1943 -2462 -1601
759 -1601 1011 3448 3245 1449 -479 -3342 -4113 -2719 -520 1616 2078 1064 -1506 -2799 -2053 5
775 5 2456 4085 3811 1580 -878 -3047 -2905 -1074 798 1872 1450 -100 -2118 -3470 -2374 -158 1630
792 1630 2966 2011 118 -2018 -2445 -1762 457 2791 3503 2508 84 -1423 -2411 -1925 119 1813 1342
809 1342 117 -1445 -3178 -3096 -1479 746 2543 3164 2210 -358 -1394 -1272 -152 1290 2415 1836 -80
826 -80 -1612 -2935 -2879 -624 1201 2027 1703 276 -1729 -2706 -1815 102 1650 2566 1940 276 -1304 -1600
$$ packed form
711c817J467J830L288J334j469l042k138m37R73K998K327n09j421l088k547J88
727d063K047K897K610M88j901k769j121l63J456K945J352r06k282k786k106Q65
743c637L127J895J089O59k597l108m40J362J792K027J555j309k507j851n19Q61
759a601K612K437k03j796j928k863p71J394K199K136M62j014k570j293P46K058
775EK451J629k74k231k458k169J42J831J872J074m22j550k018j352J096K216J788
792A630J336r55j893k136m27O83K219K334P12r95k424j507r88M86K044J694m71
809A342j225j562j733Q2J617K225J797O21r54k568j036J22J120J442J125n79j916
826h0j532j323N6K255J825Q26l24j427k005r77Q91J917J548R16o26j664j580k96
$$ plain form
844 -1600 -673 826 2342 2295 1504 -778 -2640 -3066 -2159 -161 1431 1620 704 -481 -1850 -1167 -309 1551
862 1551 2456 2414 823 -951 -2061 -2007 -710 1110 1618 1270 272 -1722 -2312 -1566 -397 1279 2203 1410
880 1410 -87 -1679 -1843 -1103 -43 1912 2372 1568 258 -1317 -1934 -1151 214 1188 1659 444 -969
897 -969 -1952 -1752 -1264 598 2034 2256 582 -597 -1717 -1744 -456 746 1567 1846 599 -1207 -1568 -894
915 -894 -57 1063 2155 1370 122 -1179 -1581 -1610 -714 1264 1683 945 -122 -957 -1942 -931 680 1536
933 1536 1524 1105 -68 -1612 -1217 -666 310 1421 1463 353 -920 -1753 -1922 -733 509 1064 682 142
951 142 -560 -2094 -1160 8 1244 1821 2005 911 -640 -753 -709 -447 677 1183 199 -572 -1137 -1901 -1560
970 -1560 166 1005 966 1288 112 -1374 -1072 168 882 1597 2104 1165 -412 -825 -925 -1009 142 1181
$$ packed form
844a600R27J499J516m7p91k282j862m26R07J998J592J89r16j185j369O83Q58J860
862A551R05m2j591j774j110N4J297J820N08l48r98j994n90P46J169J676R24p93
880A410j497j592j64P40J060J955M60q04j310j575o17P83J365R74M71j215j413
897i69r83K00M88J862J436K22j674j179j120k7J288J202Q21K79j247j806l61O74
915h94Q37J120J092p85j248j301m02k9Q96J978M19p38j067q35r85J011J611Q56
933A536j2m19j173j544L95N51R76J111M2j110j273q33j69J189J242N55l82n40
951A42p02j534R34J168J236N77J84j094j551j13M4K62J124N06r84p71n65p64L41
970a560J726Q39l9L22j176j486L02J240P14P15N07r39j577m13j00q4J151J039
$$ plain form
988 1181 172 -463 -782 -2009 -1947 -250 692 1005 1634 1296 -297 -315 98 313 1146 2063 589 -408 -816
1007 -816 -1615 -1937 -292 635 596 191 -43 -1393 -1640 -83 602 1184 1966 1276 -239 -716 -348 -643 836
1026 836 1542 804 177 -704 -1582 -1791 -695 25 327 660 152 -1005 -1034 -18 422 1250 1817 1460 54
1045 54 10 -1061 -1114 -194 642 438 291 -376 -1497 -1376 -622 -38 531 1216 899 -436 -451 -953 -490 355
1065 355 1286 1355 702 -170 -933 -831 -234 237 575 974 -223 -1026 -1224 -919 -426 551 1275 849 203 -258
1085 -258 -896 -782 248 650 535 481 -39 -1044 -1150 -331 -309 997 1296 471 -447 -614 -945 -846 42 516
1105 516 231 376 -389 -873 -903 -173 542 985 1116 666 -90 -728 -657 -448 384 824 524 -149 -347 -1398
1125 -1398 -788 96 195 419 469 -156 -791 -639 73 -60 762 1785 1044 101 165 -463 -508 222 525 -62 -302
$$ packed form
988A181j009o35l19j227O2J697R42L13O29l38j593j8M13K15Q33R17j474r97m08
1007h16p99l22J645R27l9m05k34j350k47J557O85N82P82o90j515m77L68k95J479
1026H36P06p38o27q81q78k09J096P20L02L33n08j157k9J016M40Q28N67l57j406
1045E4m4j071n3R20Q36k04j47o67j121J21P54N84N69O85l17j335j5n02M63Q45
1065C55R31O9o53q72p63J02N97M71L38L99j197q03j98L05M93R77P24m26o46m61
1085b58o38J14J030M02j15n4n20j005j06Q19K2J306K99q25r18j67l31R9Q88M74
1105E16k85J45p65m84l0P30P15M43J31m50p56o38P1K09Q32M40l00o73j98j051
1125a398O10Q84R9K24N0o25o35J52P12j33Q22J023p41r43O4o28m5P30L03n87k40
$$ plain form
1146 -302 -221 -1347 -1326 -310 180 441 1160 397 -255 -55 41 -87 750 1310 774 223 -199 -919 -887 -280 111
1167 111 218 336 47 -1199 -1176 -517 -274 659 1178 683 247 159 -179 -524 725 1119 620 272 -369 -1008
1187 -1008 -1354 -578 -340 -41 274 180 -495 -720 -135 -194 651 1507 932 262 165 -72 -235 -293 543 526 136
1208 136 62 -771 -970 -760 -301 153 540 649 -219 -251 -295 -280 337 1021 1147 661 395 -230 -595 -244 179
1229 179 -231 22 118 -401 -1057 -627 -207 244 524 1070 -64 161 96 -320 -253 428 612 2 73 -271 -938
1250 -938 -563 89 219 439 380 76 -592 -566 -278 -69 364 655 306 138 -347 -545 -318 10 755 396 -81
1271 -81 -220 -436 -456 -448 247 372 660 231 -26 -250 -406 -122 -169 291 704 -83 -690 -478 -541 64 545 814
1293 814 584 306 -224 -329 -184 133 236 408 246 -128 -502 -688 -476 55 213 224 246 -168 -324 -316 -171
$$ packed form
1146c02Q1j126K1J016M90K61P19p63o52K00R6j28Q37N60n36n51m22p20L2O07L91
1167A11J07J18k89j246K3O59K43R33N19m95m36q8l38l45J249L94m99l48o41o39
1187a008l46P76K38K99L15r4o75k25N85n9Q45Q56n75o70r7k37j63n8Q36j7l90
1208A36p4q33j99K10M59M54L87J09q68l2m4J5O17O84J26m86k66o25l65L51M23
1229A79m10K53R6n19o56M30M20M51K80N46j134K25o5m16O7O81J84o10P1l44o67
1250i38L75O52J30K20n9l04o68K6K88K09M33K91l49j68m85j98K27L28P45l59m77
1271h1j39k16k0QO95J25K88m29k57k24j56K84m7M60M13p87o07K12o3O05M81K69
1293H14k30k78n30j05J45L17J03J72j62l74l74j86K12N31J58J1K2m14j56QJ45
$$ plain form
1314 -171 483 740 780 148 187 -448 -359 -379 97 39 41 -277 -874 -895 -909 -214 -24 168 235 105 269 89 53 429
1338 429 593 678 480 93 -205 -574 -702 -276 -334 -297 38 -307 -732 -530 -228 207 537 354 345 408 -83 -21
1360 -21 190 342 310 224 111 -115 -747 -528 -540 -264 68 -148 -47 -319 -273 -52 123 384 477 641 546 -127
1382 -127 -197 -469 -50 -285 303 150 -387 -741 -852 -491 -121 106 310 306 322 -332 -151 216 462 354 579
1403 579 79 -111 -635 -253 -307 -387 -164 212 -215 -125 -153 -406 8 596 158 91 167 10 -116 -37 295 161
1425 161 323 254 -189 -401 -353 -288 83 -12 48 90 -93 -621 -198 -62 149 143 234 286 -252 -95 -144 -34 177 213
1449 213 487 352 -24 3 -489 -165 -125 -2 12 -31 -242 -494 -197 199 57 191 86 223 -178 -201 27 88
1471 88 224 166 429 196 9 -63 -75 -68 142 5 -87 -252 -610 -274 46 26 162 176 -80 31 49 -27 59 276
$$ packed form
1314a71O54K57M0o32L9o35Q9k0M76n8Kl18n97k1j4O95J90J92O7j30J64j80l6L76
1338D29J64Q5j98l87k98l69j28M26n8L7L35l45m25K02L02M35L30j83rO3m91O2
1360b1K11J52l2q6j13k26o32K19j2K76L32k16J01k72M6K21J75K61R3J64r5o73
1382a27p0k72M19k35N88j53n37l54j11L61L70K27K04mJ6o54J81L67K46j08K25
1403E79n00j90n24L82n4q0K23L76m27R0k8k53M14N88m38o7P6j57j26P9L32j34
1425A61J62o9m43k12M8O5L71r5O0M2j83n28M23J36K11oR1N2n38J57m9J10K11L6
1449B13K74j35l76K7m92L24M0J23J4m3k11k52K97L96j42J34j05J37m01k3K28O1
1471H8J36n8K63k33j87p2j2PK10j37r2j65l58L36L20k0J36J4k56J11J8p6Q6K17
$$ plain form
1495 276 403 335 136 34 -139 -462 -162 -283 -64 211 -296 -449 -447 -435 -381 322 390 205 125 -215 250 153 462
1518 462 299 203 270 -97 -282 -462 -360 -503 -390 92 -431 -439 -512 -350 -154 266 541 328 308 661 -26 39
1540 39 302 126 42 413 -134 -125 -321 -483 -502 -194 120 -63 -339 -32 123 -93 449 576 338 352 299 -137
1562 -137 -167 -88 65 -189 111 -134 -555 -279 -233 -333 -185 380 -31 159 386 37 41 -18 155 266 148 -166
1584 -166 -118 -392 -208 29 114 79 -96 -155 -58 -1 -333 -74 180 -18 176 182 -33 -71 98 148 39 263 200 -5
1608 -5 -206 -137 -184 54 220 -103 -68 -183 -107 -27 -53 200 38 312 110 -361 -76 -139 208 212 244 114 136 -49
1632 -49 -156 -28 -60 -84 53 -113 14 -280 -189 -336 -42 160 171 91 156 138 -98 -208 90 409 51 336 82
1655 82 -95 -247 101 -56 -203 142 -138 -328 -358 -128 -220 183 122 25 129 54 -31 -25 165 207 308 356 -102 -304
$$ packed form
1495B76J27o8j99j02j73l23L00j21K19K75n07j53KJ2N4P03O8j85q0l40M65r7L09
1518D62j63r6O7l67j85j80J02j43J13M82n23qp3J62J96M20K75k13k0L53o87O5
1540C9K63j76q4L71n47Rj96j62j9L08L14j83k76L07J55k16N42J27k38J4n3m36
1562a37l0P9J53k54L00k45m21K76M6j00J48N65m11J90K27l49Mn9J73J11j18l14
1584a66M8k74J84K37Q5l5j75n9R7N7l32K59K54j98J94Ok15l8J69N0j09K24o3k05
1608ek01O9m7K38J66l23L5j15P6Q0k6K53j62K74k02m71K85o3L47ML2j30K2j85
1632d9j07J28l2k4J37j66J27k94R1j47K94K02J1q0O5j8k36j10K98L19l58K85k54
1655H2j77j52L48j57j47L45k80j90l0K30r2M03o1r7J04p5q5OJ90M2J01M8m58k02
$$ plain form
1679 -304 -156 -203 -277 -422 -28 -185 -304 11 -285 28 229 299 203 154 180 23 99 369 113 395 -54 52
1701 52 -168 -216 42 -272 -410 97 16 -451 57 -74 -17 -176 110 142 292 531 24 -87 3 66 -40 -78 66
1724 66 -346 -347 -216 -426 -410 -204 -323 -83 -83 64 141 324 241 150 257 28 -12 -301 -83 -83 105 -182 -395 -499
1748 -499 -319 -220 -191 -216 65 204 186 252 -17 -137 165 -56 150 162 181 -234 76 -94 39 210 56 -186
1770 -186 32 0 -117 -290 -325 -156 -228 310 -13 67 0 134 83 101 177 190 -63 199 -262 -338 -268 -8 -42 -167
1794 -167 223 -232 -49 -81 57 156 -29 -8 -42 126 -224 -206 -35 257 164 178 290 -56 132 -146 108 222
1816 222 221 191 -240 -176 -219 -69 -294 15 -37 215 -145 -68 -72 35 87 297 290 77 -133 -204 -251 -19 -17 -206 -106
1841 -106 -43 -301 -219 69 86 -72 -185 118 66 180 -61 -177 129 308 -212 114 169 -84 -85 -276 -462 -187
$$ packed form
1679c04J48m7p4j45L94j57j19L15k96L13K01P0r6m9K6j57P6K70k56K82m49J06
1701E2k20m8K58l14j38N07q1m67N08j31N7j59K86L2J50K39n07j11R0O3j06l8J44
1724F6m12jJ31k10J6K06j19K40%J47P7J83q3r1J07k29m0k89K18%J88k87k13j04
1748d99J80R9K9k5K81J39j8O6k69j20L02k21K06J2J9m15L10j70J33J71j54k42
1770a86K18l2j17j73l5J69p2N38l23Q0o7J34n1J8P6J3k53K62m61p6P0K60l4j25
1794a67L90m55J83l2J38R9j85K1l4J68l50J8J71K92r3J4J12l46J88k78K54J14
1816B22jl0m31O4m3J50k25L09n2K52l60P7mJ07N2K10pk13k10p1m7K32Kj89J00
1841a06O3k58Q2K88J7j58j13L03n2J14k41j16L06J79n20L26N5k53jj91j86K75
$$ plain form
1863 -187 210 -45 -41 72 -290 -167 69 -74 227 236 49 76 236 51 64 -125 -132 -412 -163 -247 -299 -139 -112 -37
1887 -37 116 133 17 -181 67 133 159 -171 124 134 -54 149 -3 62 17 -183 -35 -120 -75 -163 -223 -71 -62 140
1911 140 228 85 -81 19 223 215 -123 211 45 -93 13 -101 -181 33 -187 54 34 -94 -76 -140 -112 -132 346
1934 346 -100 276 -52 -272 16 233 40 233 135 -47 37 39 -244 20 26 -121 -26 6 -123 -128 -127 67 -105 -28
1958 -28 129 61 -94 -54 2 64 351 404 -119 301 73 -67 81 -134 22 -11 -41 -74 -57 -183 -25 78 45 229
1982 229 175 24 -58 104 -84 62 252 34 66 36 -203 44 -59 -319 133 -301 -40 -54 -11 -111 -173 57
2004 57 42 -52 137 162 168 -85 -103 -127 -175 -116 -233 -252 8 -242 -304 105 -143 -169 -242 39 -26 257 22 449 220
2029 220 43 -73 61 98 157 -213 144 65 -207 -125 -19 -172 86 -123 77 -31 -121 -91 108 84 28 315 198
$$ packed form
1863a87L97k55MJ13l62J23K36j43L01Rj87K7J60j85J3j89pk80K49q4n2J60K7P5
1887c7J53J7j16j98K48O6K6l30K95J0j88K03j52O5m5k00J48q5M5q8o0J52RK02
1911A40Q8j43j66J00K04ql38L34j66j38J06j14q0K14k20K41k0j28J8o4K8k0M78
1934C46m46L76l28k20K88K17j93J93r8j82Q4Kk83K64Oj47R5L2j29nJJ94j72P7
1958b8J57o8j55M0N6O2K87N3n23M20k28j40J48k15J56l3l0l3J7j26J58J03l3J84
1982B29n4j51q2J62j88J46J90k18L2l0k39K47j03k60M52m34K61j4M3j00o2K30
2004E7j5r4J89K5Ok53j8k4m8N9j17j9K60k50o2M09k48k6p3K81o5K83k35M27k29
2029B20j77j16J34L7N9l70L57p9k72Q2J06j53K58k09K00j08r0L0J99k4n6K87j17
$$ plain form
2052 198 206 210 7 129 57 -134 -55 -54 303 108 -226 -312 -196 99 32 324 7 -116 -253 109 102 -186 -34 164
2076 164 127 126 224 29 -20 -66 43 -114 -45 -72 -234 -314 -57 0 245 -115 47 212 99 44 119 49 213 146 103
2101 103 120 -19 48 -111 -196 -145 78 73 38 1 171 169 -173 26 111 -71 448 -219 182 250 203 -43 193 -176
2125 -176 -147 -55 127 82 143 227 11 -218 63 -138 -73 -93 -25 -5 83 120 130 101 219 7 176 -160 3 -86 168
2150 168 -172 26 -297 -57 -62 -350 -78 -274 -176 168 -210 -234 -103 93 -71 91 251 107 148 31 188 77
2172 77 -46 -159 158 -5 -3 -91 -37 -326 -315 70 -6 -37 144 201 305 373 36 215 -98 -77 -102 -151 -65 -214 173
2197 173 -240 -103 43 21 -151 -485 99 95 125 65 155 205 93 -50 106 -26 115 -58 -244 173 -111 -19 -250
2220 -250 -262 -180 -71 -150 -186 148 69 -82 37 -113 185 90 6 225 -43 17 -96 60 -179 -224 -318 -62 57
$$ packed form
2052A98QMk03J22p2j91P9JL57j95l34q6J16K95o7K92l17j23j37L62pk88J52J98
2076A64l7jR8j95m9m6J09j57O9k7j62q0K57N7K45l60J62J65j13n5P5p0J64o7m3
2101A03J7j39O7j59q5N1K23nl5l7J70kl42J99Q5j82N19o67M01O8m7k46K36l69
2125a76K9R2J82m5O1Q4k16k29K81k01O5k0O8K0Q8L7J0k9J18k12J69l36J63q9K54
2150A68l40J98l23K40nk88K72j96R8L44l78k4J31J96j64J62J60j44M1j17J57j11
2172G7j23j13L17j63Kq8N4k89J1L85p6l1J81N7J04O8l37J79l13K1k5m9Q6j49L87
2197A73m13J37J46k2j72l34N84mL0o0R0N0j12j43J56j32J41j73j86M17k84R2k31
2220b50j2Q2J09p9l6L34p9j51J19j50K98r5q4K19k68O0j13J56k39m5r4K56J19
$$ plain form
2243 57 -274 -4 -172 205 -157 499 226 81 301 94 173 -122 -249 261 123 132 -77 73 -156 -136 209 -67
2265 -67 -198 -150 -282 -114 111 -26 155 35 118 42 130 -89 253 26 -153 -54 -72 -95 -230 -93 204 109 10
2288 10 -87 329 -13 -338 20 -82 5 -111 -151 21 162 405 24 21 -22 -342 -22 -13 141 -246 -192 -212 -7 -375
2312 -375 125 -6 -89 -67 -52 -73 -220 103 182 185 58 27 106 258 207 -101 -302 27 95 217 -102 2 -153 -151
2336 -151 -102 103 -6 -190 39 351 117 134 1 14 341 61 -22 207 7 -22 36 -18 87 -335 -188 -212 -15
2359 -15 -101 241 -118 -88 -161 -343 -63 5 78 -190 -55 76 -58 73 -121 -8 -3 23 -327 213 38 -183 -131
2382 -131 -58 99 200 -40 294 103 -203 74 344 209 -106 109 -5 -201 -5 350 61 -254 -148 58
2402 58 93 91 -14 22 46 -181 212 20 11 -150 53 -113 156 -224 -352 -250 -239 -123 -121 167 -131 191 122 58
$$ packed form
2243E7l31K70j68L77l62O56k73j45K20k07P9k95j27N10j38Rk09J50k29K0L45k76
2265f7j31M8j32J68K25j37J81j20Q3p6Q8k19L42k27j79R9j8k3j35J37K97r5r9
2288A0r7M16l42l25L58j02Q7j16m0J72J41K43l81lm3l20L20RJ54l87N4k0K05l68
2312c75N00j31q3K2J5k1j47L23P9Lj27l1P9J52n1l08k01L29O8J22l19J04j55K
2336a51M9K05j09j84K29L12k34J7j33J3L27k80q3K29k00k9N8n4J05m22J47k4J97
2359a5q6L42l59L0p3j82K80O8P3k68J35J31j34J31j94J13NK6l50N40j75k21N2
2382a31P3J57J01k40L34j91l06K77K70j35l15K15j14j96J96L55k89l15J06K06
2402E8L5kj05L6K4k27L93j92rj61K03j66K69l80j28J02J1J16KK88k98L22o9o4
$$ plain form
2426 58 111 207 204 52 -130 -190 57 155 -170 255 -44 -42 215 330 -74 2 -3 159 16 -167 -163 -220 79 135 130 29
2452 29 51 -96 -54 28 258 -156 146 179 149 -321 -233 -74 39 -56 189 -180 -367 -53 -149 109 -106 -75 -81 117
2476 117 117 -1 -13 3 70 13 -95 47 -264 -120 73 -191 -383 -56 29 45 206 -99 -28 121 90 225 -32
2499 -32 -124 -160 225 76 -207 445 -118 -310 169 -110 194 -304 -243 -10 96 -68 103 -133 97 -27 -148
2520 -148 166 -93 122 -407 -81 -80 -80 -270 -199 -27 9 -52 56 -254 -14 -125 -161 112 -58 4 12 136 3 -325
2544 -325 5 49 -197 234 60 141 88 -16 -60 79 169 151 39 -101 -36 125 32 10 -36 149 87 82 -41 -35 -27 160
2570 160 248 358 -74 1 194 -106 38 80 -91 -112 -275 -366 -18 133 154 -283 148 13 98 -22 -38 77 126
2593 126 54 -195 147 49 52 42 -60 -14 -95 -67 53 53 88 56 -179 -98 -144 -26 -86 326 -3 158 -72 -34 145
$$ packed form
2426E8N3R6lj52j82o0K47R8l25M25k99KK57J15m04P6nJ62j43j83Mn7K99N6nj01
2452B9K2j47M2Q2K30m14L02L3l0m70Q8J59J13r5K45l69j87L14r6K58k15L1oJ98
2476A17%j18j2J6O7n7j08J42l11J44J93k64j92L27Q5J6J61l05P1J49l1J35k57
2499c2r2l6L85j49k83O52n63j92M79k79L04m98O1K33J06j64J71k36K30j24j21
2520a48L14k59K15n29L26J%j90P1J72L6o1J08l10K40j11l6K73j70O2QJ24j33l28
2544c25L30M4k46M31j74Q1n3j04m4J39R0j8j12j40O5J61r3k2m6J85o2nj23OQJ87
2570A60Q8J10m32P5J93l00J44M2j71k1j63r1L48J51K1m37M31j35Q5j20j6J15M9
2593A26p2k49L42r8Lj0j02M6q1K8J20%L5l2k35Q1m6J18o0M12l29J61k30L8J79
$$ plain form
2618 145 -36 -247 143 -54 0 -90 -37 63 -10 95 -183 64 1 -62 158 149 196 107 -10 -124 37 418 48
2641 48 -89 -19 -7 -132 287 -133 185 64 47 -26 61 5 -123 -1 307 295 182 158 145 34 190 -17 -132
2664 -132 -125 -144 3 -30 -315 -64 64 166 -22 -71 -149 92 -155 -107 -50 -67 129 -106 10 -72 95 27 -164 30
2688 30 229 167 -148 -18 11 187 -115 1 244 109 53 112 101 196 2 164 50 270 163 207 233 38 -56
2711 -56 -174 -281 -335 255 107 16 38 -184 180 39 58 -8 333 64 -141 36 -87 -67 83 -111 -159 141 -39
2734 -39 -72 88 -86 -26 -214 -64 -3 -19 81 65 80 175 107 60 -56 130 143 51 -77 103 -265 -50 -170 -143
2758 -143 -103 -138 -12 15 126 -166 -263 12 24 186 105 -60 58 206 -189 -32 -160 212 118 93 -151 83 -28
2781 -28 -23 -2 33 -378 101 73 236 -196 56 -86 -30 -6 20 51 -15 20 110 60 108 -111 0 -11 -169 -33 -248
$$ packed form
2618A45j81k11L90j97N4r0N3J00p3J05k78K47o3o3K20rM7q9j17j14J61L81l70
2641D8j37P0J2j25M19m20L18j21j7p3Q7n6j28J22L08j2j13k4j3j11J56k07j15
2664a32Pj9J47l3k85K51J28J02j88m9p8K41k47M8N7j7J96k35J16q2J67o8j91J94
2688C0J99o2l15J30K9J76l02J16K43j35n6N9j1R5j94J62j14K20j07M4K6j95r4
2711e6j18j07n4N90j48r1K2k22L64j41J9o6L41k69k05J77j23K0J50j94m8L00j80
2734c9l3J60j74O0j88J50O1j6J00j6J5R5o8m7j16J86J3r2j28J80l68K15j20K7
2758a43M0l5J26K7J11k92r7K75J2J62q1j65J18J48l95J57j28L72r4k5k44K34j11
2781b8NK1L5m11M79k8J63m32K52j42N6K4K6L1o6L5R0n0M8k19J11j1j58J36k15
$$ plain form
2806 -248 -347 -238 200 31 -22 109 -120 -140 -58 50 -136 147 95 65 54 -242 -14 -167 -126 -59 -231 -214 216
2829 216 48 72 253 -108 163 3 285 -96 137 58 1 212 -268 158 -35 -105 -111 23 24 -59 94 -91 -19
2852 -19 99 -142 -136 49 -30 -81 58 46 214 11 86 128 82 179 10 83 44 56 13 40 -178 -108 8 55 63 26 106
2879 106 -148 66 -88 154 -75 -215 155 192 -79 -199 151 -333 -144 -55 -81 122 -175 108 -208 297 58
2900 58 -89 -12 73 173 -67 -199 278 -113 25 -124 -40 71 -110 58 -63 -78 -133 -51 -79 169 125 -42 -62
2923 -62 -391 99 -21 -38 -99 -36 293 -117 -163 -19 -146 147 -153 -58 -55 67 79 -8 116 -129 151 70 144 128
2947 128 -40 39 -33 256 83 311 -182 216 110 28 -118 200 -123 205 113 190 41 -175 -66 20 -22 -162
2969 -162 -80 -65 -165 109 -29 -32 39 235 147 63 169 107 84 71 -212 -47 -51 151 -96 -85 -111 217 -114 9 1
$$ packed form
2806b48r9J09M38j69n3J31k29k0Q2J08j86K83n2l0j1k96K28j53M1O7j72J7M30
2829B16j68K4J81l61K71j60K82l81K33p9n7K11m80M26j93p0oJ34Jq3J53j85P2
2852a9J18k41OJ85p9n1J39j2J68k03P5M2m6R7j69P3l9J2m3K7k18P0J16M7Ql7Q0
2879A06k54K14j54K42k29j40L70L7k71j20L50m84J89Q9k6K03k97K83l16N05k39
2900E8j47P7Q5J00k40j32M77l91J38j49Q4J11j81J68j21j5n5Q2k8K48m4j67k0
2923f2l29M90j20j7o1O3L29m10m6J44j27K93l00R5LJ22J2q7J24k45K80q1P4j6
2947A28j68P9p2K89j73K28m93L98j06q2j46L18l23L28r2P7j49k16J09Q6m2j40
2969a62Q2J5j00K74j38lP1J96q8q4J06o2k3j3k83J65mK02k47J1k6L28l31J23q
$$ plain form
2994 1 120 38 -72 -257 235 114 21 -76 -126 181 132 146 -212 136 129 99 -68 228 -221 -63 37 121 20 112
3018 112 -225 223 -33 51 45 -320 58 118 71 -155 67 198 -96 -102 -3 240 55 -104 316 32 -212 -111 139
3041 139 -71 33 166 -105 86 125 94 99 7 -6 -103 -132 76 -18 -179 -27 152 -19 -124 3 -106 60 -20
3064 -20 83 -61 78 -12 227 0 -131 162 -131 -156 -158 211 -88 -38 372 -118 -87 78 -30 -7 -62 -223 68
3087 68 -271 8 288 175 156 11 -1 -32 -51 45 -35 178 103 117 -64 65 11 -174 265 64 -78 -30 -204 191
3111 191 -254 -75 188 20 28 -254 -90 7 -157 44 -214 -204 82 -96 62 290 103 -139 26 -18 247 124
3133 124 -30 92 91 -60 -115 74 34 -137 -238 20 -196 153 179 112 309 241 20 -201 114 466 18 -13 62
3156 62 -269 -230 97 -146 -108 17 6 121 46 -29 -128 118 -316 228 -64 -91 -28 157 -94 -7 -209 34 -110
$$ packed form
2994AJ19q2j10j85M92j21r3r7n0L07m9J4l58L48pl0j67K96m49J58J00Q4j01R2
3018A12l37M48k56Q4ol65L78O0m7k26K22J31k94oR9K43j85j59M20k84k44J01K50
3041A39k10J04J33k71J91L9l1Nr2j3r7k9K08r4j61J52J79j71j05J27j09J66q0
3064b0J03j44J39r0K39k27j31K93k93k5kL69k99N0M10m90L1J65j08K3n5j61K91
3087F8l39K79K80j13j9j45j2l1j9R6q0K13p5J4j81J29n4j85M39k01j42M8j74L95
3111A91m45J79K63j68Qk82J64R7j64K01k58J0K86j78J58K28j87k42J65m4K65j23
3133A24j54J22jj51n5J89m0j71j01K58k16L49K6o7J97o8k21k21L15L52m48l1P5
3156F2l31L9L27k43L8J25j1J15p5p5r9K46m34N44k92k7O3J85k51Q7k02K43j44
$$ plain form
3179 -110 49 148 2 -162 43 -65 -122 201 -52 22 68 32 -78 208 -125 -82 -55 -5 298 -116 160 -88 -64
3202 -64 -166 25 -49 106 -39 36 57 -270 131 -88 -19 -19 192 103 52 91 97 90 -69 24 -5 -42 146 -146 220 62
3228 62 242 -201 -8 -54 -3 -12 -72 -133 -61 -8 -30 144 119 31 152 175 -78 -9 -47 -275 131 80 -305 -145 114
3253 114 -13 -164 160 -35 150 -27 58 105 -294 25 44 -124 -171 56 8 -1 -124 -43 187 54 -189 75 -6
3276 -6 -92 -92 415 184 35 -88 232 -11 239 174 -41 -209 -124 -37 176 131 -93 187 35 64 -252 189 -90
3299 -90 -69 -51 -61 -16 23 -259 -319 -101 177 -211 -22 -311 357 -337 -177 -161 178 212 39 -373 -48 203 39
3322 39 89 -66 130 278 109 77 156 182 96 257 314 92 267 -191 101 -186 -57 132 -65 305 -58 -102 -319
3345 -319 211 168 215 198 -220 92 244 277 76 -192 42 216 261 -65 -218 148 -218 -56 178 67 92 37
$$ packed form
3179a10J59R9j46j64K05j08n7L23k53P4M6l6j10K86l33M3K7N0L03m14K76k48K4
3202f4j02J91p4J55j45P5K1l27M01k19O9%K11q9n1L9Opj59R3k9l7J88k92L66j58
3228F2J80m43J93m6N1ro0o1P2N3k2J74k5q8J21K3k53O9l8k28M06n1l85J60K59
3253A14j27j51L24j95J85j77Q5M7l99L19J9j68m7K27m8rj23Q1K30j33k43K64q1
3276fq6%N07k31j49j23L20k43K50o5k15j68Q5Q7K13m5k24K80j52K9l16M41k79
3299i0K1J8j0M5L9k82o0K18K78l88J89k89O68o94J60J6L39L4j73m12L25K51j64
3322C9N0j55J96J48j69l2P9K6q6J61N7k22J75m58K92k87J29J89j97L70l63m4k17
3345c19N30m3M7j7m18L12J52L3k01k68K34J74M5l26j53L66l66J62K34j11K5n5
$$ plain form
3367 37 191 71 59 136 131 -110 129 75 96 198 128 281 27 45 -183 50 20 -75 -76 36 76 -116 -177 -20 -3
3392 -3 -81 -106 65 264 205 271 214 170 -19 53 158 82 -141 -182 -87 -185 -127 -72 138 17 137 205 158 -38 -58 224
3418 224 -97 -43 24 126 96 91 -109 -48 -129 -125 -59 -34 -88 -31 35 72 136 51 52 -44 -34 134 189 193 45 -9 117 160 30
3447 30 -185 40 159 99 60 58 -19 -7 -213 -191 24 3 -27 -273 -82 -302 100 -69 58 32 -111 274 -197 263
3471 263 -35 -73 -279 -31 -116 0 -92 -242 38 12 72 239 43 -152 118 37 -258 49 -30 -223 -107 -264
3493 -264 -49 -84 3 -24 -103 147 123 106 -59 146 -23 61 -21 -42 -250 -225 31 74 331 7 -186 56 -82 79
3517 79 89 195 2 -102 -71 -177 -12 -16 -36 -184 107 -194 -35 68 -162 -154 -171 49 -53 285 183 -86 -92 -135
3541 -135 -110 -11 -48 304 123 6 93 -134 413 28 283 77 159 134 -54 253 6 -237 55 205 28 -50
$$ packed form
3367C7J54j20j2P7nk41K39n4K1J02p0J53k54J8k28K33l0r5jJ12M0j92o1J57J7
3392cp8k5J71J99n9O6n7m4j89P2J05p6k23m1R5r8N8N5K10j21J20O8m7j96k0K82
3418B24l21N4O7J02l0nk00O1q1MO6K5n4N7O6L7O4q5Jr6J0J68N5Mj48n4J26M3j30
3447C0k15K25J19o0l9kp7J2k06K2K15k1l0k46J91k20M02j69J27k6j43L85m71M60
3471B63k98l8k06K48q5J16r2j50K80k6O0J67j96j95K70q1k95L07p9j93J16j57
3493b64K15l5Q7k7p9K50k4j7j65K05j69Q4q2k1k08K5K56M3K57l24j93K42j38J61
3517G9J0J06j93j04L1j06J65mk0j48K91l01J59J03k30Qj7K20j02L38j02k69om3
3541a35K5R9l7L52j81j17Q7k27N47l85K55k06Q2k5j88L07k47k43K92J50j77p8
$$ plain form
3563 -50 16 -255 12 62 -12 -147 32 65 -24 292 -19 -140 45 -238 -95 -36 205 -148 100 -52 -22 69 72 -75
3587 -75 79 21 177 98 41 59 109 169 37 72 -203 279 97 -217 -167 -353 -233 78 144 -109 86 107 -9 11
3611 11 -158 -76 -115 72 176 -48 121 120 -32 291 301 233 -3 0 18 166 -180 -144 -150 -83 -232 136 165 -226 1
3636 1 -19 48 202 -367 -49 -35 205 143 61 32 -239 190 117 128 -126 -330 219 -263 128 -130 -6 -219 -332
3659 -332 -66 -136 -221 -20 -139 -54 -40 40 -42 17 -213 -32 -114 -113 428 -141 -11 102 -107 211 -313 -170 67
3682 67 -220 -124 12 -40 65 -62 -247 149 -9 -133 -81 312 -220 -191 189 -133 -11 2 9 -245 31 -4 -350
3705 -350 114 268 -27 -147 -40 135 198 79 27 172 162 144 -222 58 44 -78 371 203 3 160 263 128
3727 128 -29 -208 -130 -94 129 70 201 -121 159 -124 -56 -287 -94 -192 -173 -49 48 -418 97 -90 73 -155
$$ packed form
3563e0O6k71K67N0p4j35J79L3q9L16l11j21J85k83J43N9K41l53K48j52L0R1Lj47
3587g5J54n8J56p9n7J8N0O0j32L5k75M82j82l14N0j86J20L11O6k53J95K1j16K0
3611A1j69Q2l9J87J04k24J69jj52L23J0o8k36LJ8J48l46L6oO7j49L68K9l91K27
3636Ak0O7J54n69L18J4K40o2q2k9k71M29p3J1k54k04N49m82L91k58J24k13j13
3659c32K66p0q5K01j19Q5J4Q0q2N9k30J81q2JN41n69J30J13k09L18n24J43K37
3682F7k87R6J36n2J05j27j85L96j58j24N2L93n32K9L80l22J22J3Pk54K76l5l46
3705c50M64J54k95j20J07J75O3j19n2J45j0j8l66K80j4j22M49j68k00J57J03j35
3727A28j57j79P8L6K23n9J31l22K80k83O8k31J93r8J9J24R7m66N15j87J63k28
$$ plain form
3749 -155 133 -63 59 168 146 89 359 -157 -357 -189 -283 -52 80 238 -228 69 157 84 -115 167 -122 -155
3771 -155 -274 25 72 -118 -46 -265 197 175 -38 -384 -129 -137 35 91 112 -31 127 118 -6 7 -137 -67 44 90
3795 90 120 227 219 -22 40 87 -65 459 -138 -185 255 -250 -213 -90 177 8 -19 139 -298 161 157 224 -55 -160
3819 -160 369 158 -58 -96 184 91 42 -105 37 -334 112 77 -20 189 -39 98 133 70 -76 -293 -101 246
3841 246 -21 -153 -336 -43 31 -56 -70 239 -7 -217 -247 152 279 174 -343 -58 -66 -133 -6 72 -27 82 238
3864 238 254 -241 15 -156 -138 91 -129 46 223 -91 -66 141 -80 -111 -99 36 91 -51 -211 -104 -326 -78
3886 -78 -171 126 -64 -90 59 322 88 159 282 -196 159 -39 -166 -159 167 -161 50 -95 33 -129 -126 -105 142
3909 142 -47 14 -148 -53 -43 5 119 208 318 180 18 147 -36 -245 301 29 35 -77 168 -193 138 104 -59
$$ packed form
3749a55K88j96J22J09k2n7K70n16k00J68r4K31J32J58m66K97Q8p3j99K82k89l3
3771a55j19K99M7j90P2k19M62k2k13l46K55qJ72N6K1j43J58rj24J3j44P0J11M6
3795I0L0J07qk41O2M7j52N24n97m7M40n05L7J23K67j69k7J58m37M59mO7k79j05
3819a60N29k11k16l8K80r3m9j47J42l71M46l5r7K09k28J37L5o3j46k17J92L47
3841B46k67j32j83K93P4q7j4L09k46k10l0L99J27j05n17K85qo7J27P8r9J09J56
3864B38J6m95K56j71J8K29k20J75J77l14K5K07k21l1J2J35N5j42j60J07k22K48
3886g8r3K97j90k6J49K63k34P1J23m78L55j98j27PL26l28K11j45J28j62LK1K47
3909A42j89O1j62R5J0M8J14Q9J10j38j62J29j83k09N46k72Oj12K45l61L31l4j63
$$ plain form
3932 -59 -155 3 -28 -85 155 -140 311 -146 -104 148 172 30 -21 -128 -112 112 -98 95 17 21 -6 11 44 -190 88
3957 88 -34 -120 35 11 43 60 -23 -348 14 481 35 -13 32 -205 114 20 -357 -86 37 -57 93 132 97 128
3981 128 -53 -20 -9 -58 54 124 -88 -188 7 57 -68 0 -138 -247 -5 25 32 -13 -41 123 -287 55 -81 -24
4005 -24 -1 -174 87 201 -184 -127 -87 -17 -68 -161 -108 79 -170 217 19 -254 215 -323 51 316 27 75 -7
4028 -7 72 -47 217 147 232 -68 -36 139 194 238 -159 -52 -19 -247 -6 -45 -131 401 128 80 -109 -67 62 166
4052 166 -114 39 -269 -54 6 8 117 243 -103 -108 -27 207 89 179 136 10 123 -74 106 -44 -4 310 -40
4075 -40 15 126 -149 93 160 -154 14 -298 -111 134 -80 27 -367 26 -278 -103 134 249 77 58 -112
4096 -112 -159 51 -158 131 -151 6 -53 -138 -135 66 75 -56 204 -145 290 -52 122 -57 -57 156 -117 -12 -422
$$ packed form
3932e9r6J58l1n7K40k95M51m57M2K52K4j42n1j07J6K24k10J93p8Mk7J7L3k34K78
3957H8j22q6J55k4L2J7q3l25L62M67m46m8M5k37L19r4l77K71J23r4J50L9l5L1
3981A28j81L3J1m9J12P0k12j00J95N0j25O8j38j09K42L0Pm5k8J64m10L42j36N7
4005b4K3j73K61J14l85N7M0P0n1r3N3J87k49L87j98k73M69n38L74K65k89M8q2
4028gP9j19K64p0Q5l00L2J75N5M4l97J07L3k28K41l9q6N32k73m8j89M2J29J04
4052A66k80J53l08K15O0KJ09J26l46nQ1K34j18R0m3j26J13j97J80j50M0L14l50
4075d0N5J11k75K42O7l14J68l12J87K45k14J07l94L93l04J75K37J15j72j9j70
4096a12m7K10k09K89k82J57n9q5LK01Rj31K60l49M35l42J74j79%K13k73J05m10
$$ plain form
4119 -422 56 57 55 132 -100 17 -38 -81 225 139 -204 28 89 -53 197 45 50 110 15 -258 296 5 -49 246 143
4144 143 84 127 -26 177 -339 -80 15 120 52 -100 125 281 -290 -121 -5 34 -274 -128 413 -32 -220 88
4166 88 36 -210 -130 -55 -80 -156 27 280 137 -68 -90 306 46 -9 -209 -68 -145 -316 194 -1 45 118 302 -4
4190 -4 191 302 2 22 8 161 35 20 55 44 -131 23 -74 0 127 -50 140 -70 172 64 -71 -180 -148
4213 -148 84 -71 76 163 -33 61 299 -169 128 281 -2 -55 93 -57 -41 -375 136 31 -117 197 54
4234 54 -367 -208 -131 -76 201 -143 -262 24 -33 100 -113 105 115 -36 198 372 227 -301 -20 11 -68 38
4256 38 -19 57 125 214 45 116 -42 222 -35 -22 94 71 79 109 69 -20 -124 99 3 0 73 59 -192 -34 22 278
4282 278 -124 -108 277 116 -64 -157 23 -153 70 182 4 115 -50 4 138 249 -126 136 11 -42 19 -123
$$ packed form
4119d22M78JkP7k32J17n5m3L06q6l43K32O1j42K50j52NO0r5k73N54k91n4K95j03
4144A43n9M3j53K03n16K59R5J05o8j52K25J56n71J69J16L9l08J46N41m45j88L08
4166H8n2k46Q0P5k5p6J83K53j43k05k2L96k60n5k00J41p7j71N10j95M6P3J84l06
4190dJ95J11l00K0j4J53j26j5L5j1j75J54r7P4J27j77J90k10K42j08j35j09L2
4213a48K32j55J47Q7j96R4K38m68K97J53k83n3J48j50J6l34N11j05j48L14j43
4234E4m21J59P7N5K77l44j19K86n7J33k13K18J0j51K34J74j45n28K81L1p9J06
4256C8n7P6O8Q9j69P1j58K64k57J3J16k3QL0m0q9j04K23r6lP3j4k51J58N6K56
4282B78m02J6L85j61j80r3J80j76K23J12j78J11j65N4J34J11l75K62j25n3O1j42
$$ plain form
4304 -123 64 176 -148 40 -2 160 186 -199 -74 158 -27 22 -166 90 110 -102 -48 72 172 175 166 28 -167
4327 -167 44 27 20 -8 -211 -145 97 -81 -158 -48 17 13 125 -66 203 231 -128 -13 -143 104 -61 269 56
4350 56 47 271 85 158 -55 45 -24 -69 201 -93 -186 168 -12 352 10 -14 70 52 -165 -133 -112 3 201 -19
4374 -19 -170 -235 -194 271 316 -1 -128 -181 151 121 148 62 -156 111 -93 -66 20 -39 177 -29 205 -123 -158 184
4398 184 185 18 -171 1 62 -150 -20 -287 40 -96 88 -136 -104 195 -22 34 -181 -23 -105 106 -25 318
4420 318 -90 -278 -8 -15 -25 222 -39 54 -57 -175 112 -100 -35 -80 101 -56 127 -85 -42 103 38 -113 -41
4443 -41 -46 -397 -272 -17 -36 18 -191 -1 -1 -225 109 119 183 177 -63 155 138 49 -180 -113 118 -43 -94 285 27
4468 27 18 32 102 -82 -1 -73 -108 -193 24 90 57 -134 -90 -47 100 86 -271 135 171 52 -338 -65 -7 -30 -128 336
$$ packed form
4304a23J87J12l24J88m2J62K6l85J25K32j85M9j88K56K0k12N4J20J00Lrj38j95
4327a67K11j7pk8k03O6K42j78p7J10O5mJ12j91K69K8l59J15j30K47j65L30k13
4350E6rK24j86P3k13J00o9m5K70k94r3L54j80L64l42k4Q4j8k17L2K1J15J98k20
4374a9j51o5M1M65M5l17j27n3L32l0K7q6k18K67k04K7Q6n9K16k06K34l28l5L42
4398A84Jj67j89J72O1k12J30k67L27j36J84k24L2K99k17N6k15J58q2K11j31L43
4420C18m08j88K70pj0K47k61R3j11j18K87k12O5m5J81j57J83k12M3J45o5j51P2
4443d1nl51J25K55j9N4k09J90%k24L34J0O4ok40K18j7q9k29O7K31j61n1L79k58
4468B7rJ4P0j84Q1p2l5q5K17O6l3j91M4M3J47j4l57M06L6j19l90K73N8k3r8M64
$$ plain form
4494 336 -172 22 -150 -309 -109 20 -7 88 212 -42 153 106 -84 -201 93 203 -52 -238 -32 -5 -111
4515 -111 239 -72 76 100 83 -163 110 -218 28 13 -72 -74 294 17 -147 146 -100 84 -19 -39 -86 -288 180
4538 180 -115 15 -144 9 231 -17 271 -2 -203 12 -26 -190 -102 170 -281 211 -135 77 -204 64 -253
4559 -253 202 -79 -157 -205 -13 -8 -277 -192 179 -153 -95 96 -5 60 198 -227 41 187 -88 236 -5 252
4581 252 118 2 52 193 -9 153 6 137 33 147 -128 42 236 4 80 -54 -19 50 -243 19 1 270
4603 270 141 -32 111 -71 -56 -5 -37 147 205 69 -78 53 -174 -33 -400 10 91 309 64 -38 -107 196
4625 196 175 248 -119 55 -32 183 -226 94 19 26 -131 -69 81 129 9 -96 222 -231 97 96 122 -214 -15 -258
4649 -258 -28 -105 113 -64 -9 183 -400 126 -52 216 189 -231 -103 -225 322 48 -24 -84 136 -18 -133 -27
$$ packed form
4494C36n08J94j72j59K00J29k7R5J24k54J95m7j90j17K94J10k55j86K06K7j06
4515a11L50l11J48K4j7k46K73l28K46j5q5kL68k77j64K93k46J84j03k0m7k02M68
4538A80k95J30j59J53K22k48K88k73k01K15l8j64Q8K72m51M92l46K12k81K68l17
4559b53M55k81p8m8J92Nk69Q5L71l32N8J91j01O5J38m25K68J46k75L24k41K57
4581B52j34j16N0J41k02J62j47J31j04J14k75J70J94k32P6j34L5O9k93K62j8K69
4603B70j29j73J43j82J5N1l2J84N8j36j47J31k27J41l67M10Q1K18k45j02o9L03
4625A96k1P3l67J74q7K15m09L20p5Pj57O2J50M8j20j05L18m53L28jK6l36J99k43
4649b58K30p7K18j77N5J92n83N26j78K68k7m20J28j22N47k74p2o0K20j54j15J06
$$ plain form
4671 -27 -54 -181 -38 -86 -18 79 -106 90 -191 -6 -235 -105 -162 52 69 70 -18 -200 -156 50 -25 -205 14 -139
4695 -139 -122 -26 -16 -245 -148 35 -4 -416 76 122 -58 -55 135 -37 -208 9 -134 74 131 118 -109 -51 14 73
4719 73 -45 81 119 -92 -69 72 -47 144 -69 -292 42 202 144 -162 -228 -43 -4 -45 76 -16 -41 -24 -159
4742 -159 84 -123 34 -159 123 -7 25 -124 -102 -126 111 206 158 -56 114 -2 -52 -123 92 254 79 -44
4764 -44 27 97 -36 162 -215 -128 -111 59 -368 -125 160 -314 74 -27 -117 -134 -13 -54 225 184 -138 -284 -45
4787 -45 -95 6 201 184 -27 -195 130 161 51 133 160 -158 267 -307 262 99 -139 -47 -88 -94 25 142 55 108
4811 108 -62 43 56 -79 188 100 216 20 -222 -111 53 33 21 14 -40 -225 -6 178 -129 198 103 179 -8
4834 -8 102 -32 27 -223 -181 10 -90 -60 69 15 -141 82 90 160 -258 -11 53 83 -101 132 -90 115 -165 -48
$$ packed form
4671b7k7j27J43m8O8R7j85J96k81J85k29J30n7K14J7Jq8j82M4K06p5j80K19j53
4695a39J7R6J0k29R7J83l9m12M92M6j80LJ90j72j71K17j43K08N7j3k27N8O5N9
4719G3j18J26L8k11K3J41j19J91k13k23L34J60n8l06o6J85L9m1J21r2k5J7j35
4742a59K43k07J57j93K82j30L2j49K2k4K37R5m8k14J70j16n0p1K15J62j75j23
4764d4P1P0j33J98l77Q7J7J70m27K43K85m74L88j01r0j7J21m1K79m1l22j46K39
4787d5n0J01J95j7k11j68L25L1j10Q2K7l18M25n74N69j63k38R2m1oJ19J17q7N3
4811A08j70J05J3j35K67q8J16j96k42J11J64k0j2pn4j85K19J84l07L27r5P6j87
4834hJ10j34N9k50M2J91j00L0J29n4j56K23QP0m18K47O4L0j84K33k22K05k80J17
$$ plain form
4858 -48 274 182 -101 -161 138 13 -145 104 -151 -92 -21 101 150 42 15 -129 12 133 16 44 54 -93 474
4881 474 151 202 189 -192 -153 1 -34 109 143 -9 32 66 -211 111 76 86 20 140 -159 -332 -236 26 64 -16
4905 -16 -86 84 -76 -94 -227 427 147 -57 144 -198 -36 -249 93 -26 105 87 185 -128 65 101 109 -79 -46
4928 -46 47 -146 -13 47 -14 -17 -131 -213 54 -104 -197 -159 -140 -148 -15 289 -106 57 152 461 -87 -86 15 286 37
4953 37 -309 183 305 -102 205 90 -83 -98 -68 -184 1 49 240 402 -85 63 -46 193 -83 49 -197
4974 -197 -8 -50 57 -135 -171 108 157 457 115 -7 81 -109 -304 -172 104 -136 7 94 -212 -39 69 -377
4996 -377 -328 106 -92 67 180 -68 2 193 96 -190 -16 103 -309 -223 68 -53 107 -36 -141 13 58 -134
5018 -134 -238 43 218 -62 -33 156 -61 -26 91 -46 -48 -75 -262 237 257 55 -135 52 81 -17 -145 -189 6
$$ packed form
4858d8L22r2k83o0K99j25j58K49k55N9P1J22M9j08k7j44J41J21j17K8J0j47N67
4881D74l23N1j3l81L9J54l5J43L4j52M1L4k77L22l5J0o6J20k99j73R6K62L8q0
4905a6p0J70j60j8j33O54k80k04K01l42J62k13L42j19J31j8R8l13J93L6Qj88L3
4928d6R3j93J33O0o1lj14q2K67j58r3L8J9qJ33L04l95J63R5L09n48JJ01K71k49
4953C7l46M92J22m07L07j15j73j5L0j16J85M8J91J62m87J48j09K39k76J32k46
4974a97J89m2J07j92l6K79M9L00l42j22Q8j90j95J32K76k40J43Q7l06J73J08m46
4996c77M9M34j98J59J13k48P0J91r7k86J74J19m12Q6K91j21J60j43j05J54M5j92
5018a34j04K81J75k80K9J89k17L5J17j37kk7j87M99K0k02j90J87K9r8j28m4J95
$$ plain form
5041 6 -66 -168 -193 123 140 221 -49 27 241 181 45 -8 -134 -171 -209 -14 -44 -190 -173 91 333 73 247 111
5065 111 -12 -294 -257 -26 -415 8 -31 -332 -99 115 275 -30 -186 -58 264 -6 14 20 139 168 77 -186
5087 -186 -129 187 -110 15 -68 269 -135 16 -166 -315 99 -59 175 48 93 -208 -284 -215 58 67 -1 56 66
5110 66 24 -1 151 157 17 -187 121 43 91 10 199 -152 -79 30 44 6 212 137 370 48 -82 -69 -77 11 170
5135 170 42 98 112 -71 78 -103 166 230 90 130 -75 171 214 111 168 39 26 153 -407 -102 -139 481 61
5158 61 19 -35 -16 -116 -5 140 189 4 50 98 17 82 115 110 -189 77 -116 18 -120 28 116 165 52 21 43
5183 43 -8 -105 -249 -21 -28 -38 210 27 -29 89 -154 243 157 -202 -20 41 -3 46 -93 12 -89 -81 -104 -71 -28
5208 -28 -256 -239 69 103 -51 47 150 143 73 -149 -4 119 -55 -116 17 101 104 159 52 243 192 63 123 -37 -272
$$ packed form
5041Fp2j02k5L16J7Q1k70P6K14o0j36n3j26l7l8J95l0j46J7K64K42k60J74j36
5065A11j23k82L7K31l89M23l9l01K33K14J60l05j56J28L22k70K0OJ19K9r1k63
5087a86N7L16k97J25q3L37m04J51j82j49M14j58K34j27M5l01p6O9K73Ro8N7J0
5110F6m2k5J52Oj40k04L08p8M8q1J89l51P3J09J4l8K06p5K33l22j30J3qQ8J59
5135A70j28N6J4j83J49j81K69O4j40M0k05K46M3j03N7j29j3J27n60L05l7O20m20
5158F1m2n4J9j00J11J45M9j85M6M8q1O5L3nk99K66j93J34j38J48Q8M9j13l1K2
5183D3n1r7j44K28pj0K48j83n6J18k43L97q6l59J82O1m4M9j39J05j01Qk3L3M3
5208b8k28J7L08L4j54R8J03pp0k22J45J23j74o1J33Q4LN5j07J91n1j29O0j60k35
$$ plain form
5233 -272 -147 -122 -14 16 80 57 -44 -148 77 206 215 -114 64 278 -59 -32 344 -19 147 130 -117 199 2
5256 2 135 -166 -236 29 -14 -284 -19 -99 -81 -2 177 -258 -171 -183 206 75 295 -120 -92 92 -137 183 -100
5279 -100 -38 99 -113 240 152 5 234 -87 -124 -99 193 70 -63 -155 18 230 -173 90 116 210 -139 245
5301 245 48 28 -49 64 -385 42 257 72 25 -86 -292 69 24 50 -5 -50 -3 277 51 -44 311 193 -106
5324 -106 -151 -14 220 -137 15 71 -89 -259 -191 -254 -80 178 354 -271 161 445 -176 140 -25 -64 27 -62
5346 -62 79 34 7 -31 -70 -162 -83 -37 -153 12 76 -186 193 63 2 -159 3 -30 -203 216 -200 -101 110 43
5370 43 -99 14 51 125 -137 -183 -159 287 7 -246 197 64 -180 66 34 232 47 -95 33 -61 82 23 171
5393 171 -20 -196 44 77 100 79 -171 34 138 -143 -35 15 357 163 173 130 -146 12 109 39 -127 -199 57
$$ packed form
5233b72J25K5J08L0O4k3j01j04K25J29Rl29J78K14l37K7L76l63J66j7k47L16j97
5256BJ33l01p0K65m3k70K65q0J8P9J79m35Q7j2L89j31K20m15K8J84k29L20k83
5279a00O2J37k12L53q8j47K29l21l7K5K92j23j33r2J73K12m03K63K6R4l49L84
5301B45j97k0p7J13m49M27K15j85m7j11k06L61m5K6n5m5M7K80k26r5L55j18k99
5324a06m5J37K34l57J52N6j60j70O8o3J74K58J76o25M32K84o21L16j65l9R1q9
5346f2J41m5k7l8l9r2P9M6j16J65O4k62L79j30o1j61J62l3j73M19m16R9K11o7
5370D3j42J13L7P4k62m6K4M46k80k53M43j33k44K46l2J98j85j42J28r4J43n9J48
5393A71j91j76K40L3K3k1k50K05J04k81J08N0L42j94J0m3k76J58R7p0j66p2K56
$$ plain form
5416 57 70 -59 9 246 260 -43 11 -183 -61 365 161 327 -189 -117 67 48 323 -2 -104 -106 -101 52 -347 -126
5440 -126 -26 -37 217 -254 -375 -48 -112 -67 18 15 4 -148 -46 30 102 -101 -130 -74 173 -223 -218 9 -23 44 -189
5465 -189 -44 -30 84 98 -108 -82 88 -147 -126 -106 -129 -164 182 -140 -40 -83 175 -8 97 318 -415 -64 -163
5488 -163 137 11 -380 70 -183 -139 -86 -285 -246 60 -127 62 -90 137 129 -2 49 -10 159 -112 -62 -186 36
5511 36 176 -34 -62 -112 10 -309 -365 -154 -239 251 341 55 8 24 149 -167 -15 74 -93 82 -157 55 0
5534 0 20 -197 203 95 -243 63 32 89 309 -26 -125 91 -190 130 262 -210 -110 -78 41 176 138 175 -67
5557 -67 5 20 -159 -72 -119 24 -130 -43 -185 54 198 56 -73 44 -60 -257 -67 30 8 23 14 -18 132 -78
5581 -78 0 -13 111 279 74 -58 98 -41 264 -127 -164 -258 21 -68 -259 -118 38 -196 18 -106 -35 124
$$ packed form
5416E7J3j29O8K37J4l03N4j94J22M26k04J66n16P2J84j9K75l25j02kNJ53l99K21
5440a26J00j1K54m71j21L27o4M5Q5lj1j52J02P6P2k03k9N6K47l96NK27l2O7k33
5465a89J45J4J14J4k06K6J70k35K1K0k3l5L46l22J00m3K58j83J05K21p33L51r9
5488a63L00j26l91M50k53M4N3j99L9L06j87J89j52K27qj31N1n9J69k71N0j24K22
5511C6J40k10k8n0J22l19n6K11q5M90R0k86m7J6J25l16J52Q9j67J75k39K12n5
5534@K0k17M00j08l38L06l1N7K20l35r9K16k81L20J32m72J00L2J19J35l8L7k42
5557f7P2J5j79Q7m7J43j54Q7j42K39J44j42j29J17j04j97J90R7k2J5rl2J50k10
5581g8P8j3J24J68k05j32J56j39L05l91l7r4K79q9j91J41J56k34K14j24P1J59
$$ plain form
5603 124 -196 -81 -221 267 6 -129 -186 274 158 -70 -8 5 271 -12 39 246 -103 135 20 102 130 101
5625 101 -37 104 -54 -274 -14 -140 105 68 69 94 16 184 -28 57 44 68 148 -31 -27 -176 96 -174 -76 -180
5649 -180 -47 19 -38 347 -119 40 126 -2 -122 -217 29 26 54 -212 128 162 -118 19 47 13 -59 132 12 17
5673 17 -100 -169 -194 196 196 7 -101 55 -128 -157 134 9 -40 195 -43 249 -51 -207 -196 152 179 113 -186
5696 -186 -27 47 -84 -151 -154 103 -45 217 124 72 62 60 50 -289 -104 -96 59 -97 -43 -108 -64 -18 -93 56 -111 41
5722 41 217 -161 -113 -74 224 -221 -56 97 19 218 78 -53 -88 -80 -196 -261 47 -30 137 232 -57 100 -253
5745 -253 -72 -162 -54 28 -172 -7 144 287 61 64 161 40 -29 97 277 77 -303 -447 -94 12 -21 298
5767 298 -196 13 89 103 -188 -247 -310 -121 -130 40 122 -206 203 -30 -24 -83 -160 95 -24 -287 200 191 237 -39 -256
$$ packed form
5603A24l20J15j40M88k61j35n7M60j16k28O2J3K66k83N1K07l49K38j15Q2K8k9
5625A01j38J41j58k20K60j26K45l7JK5p8J68k12Q5j3K4Q0j79Mj49K72k70R8j04
5649a80J33O6n7L85m66J59Q6j28j20r5K46lK8k66L40L4k80J37K8l4p2J91j20N
5673A7j17o9k5L90%j89j08J56j83k9K91j25m9K35k38K92l00j56J1L48K7o6k99
5696a86J59P4j31o7lK57j48K62r3n2j0kj0l39J85QJ55j56N4o5M4M6p5J49j67J52
5722D1J76l78M8L9K98m45J65J53p8J99j40j31l5Qj16o5L08p7J67R5k89J57l53
5745b53J81r0J08Q2k00J65J51J43k26LR7j21o9J26J80k00l80j44L53J06l3L19
5767B98m94K09P6J4k91n9o3J89rJ70Q2l28M09k33On9p7K55j19k63M87rM6k76k17
$$ plain form
5792 -256 54 -359 161 -60 -51 184 90 62 -242 187 -105 -39 -18 117 -41 117 140 86 -92 -96 275 -102 -72 -392
5816 -392 202 196 64 -30 40 84 74 82 30 55 -52 39 121 -87 -13 -78 -130 -75 -294 -289 44 58 -31 -114 155 216 152 -127
5844 -127 -272 -72 -9 -168 -114 -86 -127 51 -52 -147 -123 254 21 60 197 177 -26 133 -171 208 -117 120 -251
5867 -251 310 43 7 -124 75 -18 182 45 -50 -37 79 31 -23 165 -156 -16 -71 223 288 43 -285 134 30
5890 30 28 48 305 -149 -94 -53 -121 38 111 -217 76 -70 -138 -166 62 -21 -115 -172 -136 159 -47 -53 -338 -88 191
5915 191 68 70 -25 -7 78 -74 -77 -239 27 -85 -254 -69 -50 241 -124 26 89 -238 -52 -124 -180 -174 -59 -326
5939 -326 -22 94 -239 49 94 -205 -16 137 154 167 19 178 134 -43 -96 2 70 117 52 130 -116 -136 141 -166
5963 -166 39 -151 42 -9 -51 152 214 -22 -239 35 -178 -206 -27 -25 -163 148 172 25 -439 -226 12 -210
$$ packed form
5792b56L10m13N20k21RK35r4k8l04M29k92O6K1J35j58J58K3n4j78mL71l77L0l20
5816c92N94oj32r4P0M4j0Qn2K5j07R1Q2k08P4o5n2N5k19NL33J4q9q3K69O1o4k79
5844a27j45K00O3j59N4K8m1J78j03r5K4L77k33L9J37k0k03J59l04L79l25K37l71
5867b51N61k67l6j31J99r3K00j37r5J3J16m8n4J88l21J40n5K94O5k45l28M19j04
5890C0kK0K57m54N5M1o8J59P3l28K93j46o8k8K28q3r4n7L6K95k06ok85K50K79
5915A91j23Kr5J8Q5j52lj62K66j12j69J85J9K91l65J50O3l27J86p2n6OJ15k67
5939c26L04J16l33K88M5k99J89J53J7J3j48J59m4j77n3R8O8M7o5P8k46k0K77l07
5963a66K05j90J93n1m2K03O2k36k17K74k13k8J79Kj38L11K4j47m64K13K38k22
$$ plain form
5985 -210 46 -78 148 235 -98 22 25 243 -188 372 -156 -312 -11 -156 85 200 77 -48 -22 -248 28
6006 28 62 -25 -53 123 147 -2 103 15 -160 -29 -35 -61 147 -48 342 -217 48 21 152 -8 -30 -149 -26 189
6030 189 276 4 132 180 -251 -241 214 -67 -315 153 -20 -114 245 -163 234 -49 -116 354 -14 -7 -30 -265 10
6053 10 23 -328 173 170 -130 -109 54 -111 65 -235 151 99 -62 -18 -90 -158 175 141 -18 -82 -47 34 -154 -349
6077 -349 -13 142 -42 290 -72 171 -58 -81 -58 -62 54 105 124 59 -239 111 76 84 41 76 -57 -18 -31 314 246
6102 246 -207 -196 -68 -145 -56 -30 -138 -44 78 60 20 -25 210 146 -62 105 -69 -201 -6 32 -328 -15 -26 106
$$ packed form
5985b10K56j24K26Q7l33J20LK18m31N60n28j56L01j45K41J15j23j25K6k26K76
6006B8L4q7k8J76K4j49J05q8j75J31ok6K08j95L90n59K65k7J31j60k2j19J23K15
6030A89Q7k72J28M8m31J0M55k81k48M68j73r4L59m08L97k83o7M70l68Pk3k35K75
6053A0J3l51N01ll00K1J63j65J76l00L86n2j61M4p2o8L33l4j59o4L5Q1j88j95
6077c49L36J55j84L32l62K43k29k3K3mJ16N1J9o5k98L50l5Qm3L5j33L9j3L45o8
6102B46m53J1J28p7Q9K6j08R4J22j8m0m5K35o4k08J67j74j32J95L8l60L13j1J32
$$ [...]
8191b92
##END NTUPLES=NMR FID
##END=
