##TITLE=1H_LR-796-AK1-OH
 200.13MHz, D2O,
 8 sc
 
 29.1.2025
##JCAMPDX= 6.0         $$ Bruker NMR JCAMP-DX V2.0
##DATA TYPE= NMR FID
##DATA CLASS= NTUPLES
##ORIGIN= UXNMR, Bruker Analytische Messtechnik GmbH
##OWNER= pz
$$ XWIN-NMR		Version 3.5
$$ Wed Jan 29 16:24:37 2025 Russian Standard Time (UT+4h)  she@DPX200
##.OBSERVE FREQUENCY= 200.1313
##.OBSERVE NUCLEUS= ^1H
##.DELAY= (6, 6)
##.ACQUISITION MODE= SIMULTANEOUS
##.ACQUISITION SCHEME= undefined
##.AVERAGES= 8
##.DIGITISER RES= 18
##SPECTROMETER/DATA SYSTEM= spect
##.PULSE SEQUENCE= zg30
##.SOLVENT NAME= D2O
##.SHIFT REFERENCE= (INTERNAL, D2O, 0, 14.3821)
##AUDIT TRAIL= $$ (NUMBER, WHEN, WHO, WHERE, WHAT)
$$ ##TITLE= Audit trail, XWIN-NMR		Version 3.5
$$ ##JCAMPDX= 5.01
$$ ##ORIGIN= Bruker BioSpin GmbH
$$ ##OWNER= she
$$ F:/spectra/data/she/nmr/H-C/1/audita.txt
$$ ##AUDIT TRAIL=  $$ (NUMBER, WHEN, WHO, WHERE, WHAT)
(   1,<2025-01-29 16:23:27.17 +0400>,<she>,<DPX200>,
      <created by zg, POWCHK disabled, PULCHK disabled
       configuration hash MD5:
       00 E9 B6 7A A2 85 ED C7 34 08 36 98 17 FE 4E 26
       data hash MD5: 16K
       82 83 16 72 39 99 42 61 E3 7B 3C BB 92 FE E4 11>)
$$ ##END=
$$ 
$$ hash MD5
$$ E5 54 2F 1B E3 B3 21 FA 98 EE 35 39 96 01 03 3E
##$RELAX= 
##$RELAX= 
##$RELAX= 
##$RELAX= 
##$RELAX= 
##$RELAX= 
$$ Bruker specific parameters
$$ --------------------------
##$DU= <F:/spectra>
##$EXPNO= 1
##$NAME= <H-C>
##$PROCNO= 1
##$TYPE= <nmr>
##$USER= <she>
##$AMP= (0..31)
100 100 100 100 100 100 100 100 100 100 100 100 100 100 100 100 100 100 
100 100 100 100 100 100 100 100 100 100 100 100 100 100 
##$AQSEQ= 0
##$AQ_mod= 1
##$AUNM= <au_zg>
##$AUTOPOS= <>
##$BF1= 200.13
##$BF2= 200.13
##$BF3= 200.13
##$BF4= 200.13
##$BF5= 200.13
##$BF6= 200.13
##$BF7= 200.13
##$BF8= 200.13
##$BYTORDA= 1
##$CFDGTYP= 0
##$CFRGTYP= 5
##$CHEMSTR= <none>
##$CNST= (0..31)
1 1 145 1 1 1 1 1 1 1 1 1 1 1 1 1 1 1 1 1 1 1 1 1 1 1 1 1 1 1 1 1 
##$CPDPRG= <>
##$CPDPRG1= <>
##$CPDPRG2= <>
##$CPDPRG3= <>
##$CPDPRG4= <mlev>
##$CPDPRG5= <mlev>
##$CPDPRG6= <mlev>
##$CPDPRG7= <mlev>
##$CPDPRG8= <mlev>
##$CPDPRGB= <>
##$CPDPRGT= <>
##$D= (0..31)
0 0.7 0 0 0 0 0 0 0 0 0 0.03 0 0 0 0 0 0 0 0 0 0 0 0 0 0 0 0 0 0 0 0 
##$DATE= 1738153406
##$DBL= (0..7)
120 120 120 120 120 120 120 120 
##$DBP= (0..7)
150 150 150 150 150 150 150 150 
##$DBP07= 0
##$DBPNAM0= <>
##$DBPNAM1= <>
##$DBPNAM2= <>
##$DBPNAM3= <>
##$DBPNAM4= <>
##$DBPNAM5= <>
##$DBPNAM6= <>
##$DBPNAM7= <>
##$DBPOAL= (0..7)
0.5 0.5 0.5 0.5 0.5 0.5 0.5 0.5 
##$DBPOFFS= (0..7)
0 0 0 0 0 0 0 0 
##$DE= 6
##$DECBNUC= <off>
##$DECIM= 32
##$DECNUC= <off>
##$DECSTAT= 4
##$DIGMOD= 1
##$DIGTYP= 9
##$DL= (0..7)
0 120 120 120 120 120 120 120 
##$DP= (0..7)
150 150 150 150 150 150 150 150 
##$DP07= 0
##$DPNAME0= <>
##$DPNAME1= <>
##$DPNAME2= <>
##$DPNAME3= <>
##$DPNAME4= <>
##$DPNAME5= <>
##$DPNAME6= <>
##$DPNAME7= <>
##$DPOAL= (0..7)
0.5 0.5 0.5 0.5 0.5 0.5 0.5 0.5 
##$DPOFFS= (0..7)
0 0 0 0 0 0 0 0 
##$DQDMODE= 0
##$DR= 18
##$DS= 0
##$DSLIST= <SSSSSSSSSSSSSSS>
$$ [...]
##$SUBNAM0= <"">
##$SUBNAM1= <"">
##$SUBNAM2= <"">
##$SUBNAM3= <"">
##$SUBNAM4= <"">
##$SUBNAM5= <"">
##$SUBNAM6= <"">
##$SUBNAM7= <"">
##$SUBNAM8= <"">
##$SUBNAM9= <"">
##$SW= 18.0517328524113
##$SWIBOX= (0..15)
0 0 2 0 0 0 0 0 0 0 0 0 0 0 0 0 
##$SW_h= 3612.71676300578
##$TD= 16384
##$TD0= 1
##$TE= 0
##$TE2= 300
##$TE3= 300
##$TEG= 300
##$TL= (0..7)
0 120 120 120 120 120 120 120 
##$TP= (0..7)
150 150 150 150 150 150 150 150 
##$TP07= 0
##$TPNAME0= <>
##$TPNAME1= <>
##$TPNAME2= <>
##$TPNAME3= <>
##$TPNAME4= <>
##$TPNAME5= <>
##$TPNAME6= <>
##$TPNAME7= <>
##$TPOAL= (0..7)
0.5 0.5 0.5 0.5 0.5 0.5 0.5 0.5 
##$TPOFFS= (0..7)
0 0 0 0 0 0 0 0 
##$TUNHIN= 0
##$TUNHOUT= 0
##$TUNXOUT= 0
##$USERA1= <user>
##$USERA2= <user>
##$USERA3= <user>
##$USERA4= <user>
##$USERA5= <user>
##$V9= 5
##$VALIST= <valist>
##$VCLIST= <CCCCCCCCCCCCCCC>
##$VD= 0
##$VDLIST= <DDDDDDDDDDDDDDD>
##$VPLIST= <PPPPPPPPPPPPPPP>
##$VTLIST= <TTTTTTTTTTTTTTT>
##$WBST= 1024
##$WBSW= 4
##$XGAIN= (0..3)
0 0 0 0 
##$XL= 0
##$YL= 0
##$YMAX_a= 168564
##$YMIN_a= -175852
##$ZGOPTNS= <>
##$ZL1= 120
##$ZL2= 120
##$ZL3= 120
##$ZL4= 120
##$ABSF1= 10
##$ABSF2= 0
##$ABSG= 5
##$ABSL= 3
##$ALPHA= 0
##$AQORDER= 0
##$ASSFAC= 0
##$ASSFACI= 0
##$ASSFACX= 0
##$ASSWID= 0
##$AUNMP= <proc_1d>
##$AZFE= 0.1
##$AZFW= 0.1
##$BCFW= 1
##$BC_mod= 2
##$BYTORDP= 1
##$COROFFS= 0
##$CY= -3
##$DATMOD= 1
##$DC= 2
##$DFILT= <>
##$DTYPP= 0
##$F1P= 0
##$F2P= 0
##$FCOR= 0.5
##$FTSIZE= 0
##$FT_mod= 4
##$GAMMA= 1
##$GB= 0.15
##$INTBC= 1
##$INTSCL= 1
##$ISEN= 128
##$LB= 0.25
##$LEV0= 0
##$LPBIN= 0
##$MAXI= 10000
##$MC2= 0
##$MEAN= 0
##$ME_mod= 0
##$MI= 1.114404
##$NCOEF= 0
##$NC_proc= 0
##$NLEV= 6
##$NOISF1= 3.799351
##$NOISF2= 2.8
##$NSP= 1
##$NTH_PI= 0
##$NZP= 0
##$OFFSET= 14.38212
##$PC= 1
##$PHC0= 252.6632
##$PHC1= 2.792229
##$PH_mod= 1
##$PKNL= yes
##$PPARMOD= 0
##$PSCAL= 0
##$PSIGN= 0
##$REVERSE= no
##$SF= 200.129724274929
##$SI= 16384
##$SIGF1= 3
##$SIGF2= 2
##$SINO= 400
##$SIOLD= 16384
##$SREGLST= <1H.CDCl3>
##$SSB= 0
##$STSI= 0
##$STSR= 0
##$SW_p= 3205.1282051282
##$SYMM= 0
##$S_DEV= 0
##$TDeff= 0
##$TDoff= 0
##$TI= <>
##$TILT= no
##$TM1= 0
##$TM2= 0
##$TOPLEV= 0
##$USERP1= <user>
##$USERP2= <user>
##$USERP3= <user>
##$USERP4= <user>
##$USERP5= <user>
##$WDW= 1
##$XDIM= 8192
##$YMAX_p= 0
##$YMIN_p= 0
$$ End of Bruker specific parameters
$$ ---------------------------------
##NTUPLES= NMR FID
##VAR_NAME=  TIME,          FID/REAL,        FID/IMAG
##SYMBOL=    X,             R,               I
##VAR_TYPE=  INDEPENDENT,   DEPENDENT,       DEPENDENT
##VAR_FORM=  AFFN,          ASDF,            ASDF
##VAR_DIM=   8192,          8192,            8192
##UNITS=     SECONDS,       ARBITRARY UNITS, ARBITRARY UNITS
##FACTOR=    0.0002768,     1,               1
##FIRST=     0,             0,               0
##LAST=      2.2672688,     0,               0
##MIN=       0,             -175852,         0
##MAX=       2.2672688,     168564,          0
$$ Real data points
##PAGE= N=1
##DATA TABLE= (X++(R..R)), XYDATA
$$ [...]
$$ plain form
2019 -1159 337 1637 2329 2178 1294 -68 -1439 -2497 -2220 -1237 114 1443 2404 2270 1382 88 -1233
2036 -1233 -1898 -2282 -1524 -232 1184 2326 2440 1738 240 -1582 -2101 -2312 -1829 -364 1122 1983 2088
2053 2088 1750 140 -1006 -2056 -2188 -1619 -578 1073 2044 2039 1802 421 -614 -1850 -2300 -1982 -689
2070 -689 950 1643 2270 1550 562 -854 -1851 -2654 -2218 -694 750 1674 2251 1841 868 -341 -1728 -2275
2088 -2275 -2114 -1080 392 1434 2197 1978 1067 -174 -1558 -2097 -2081 -1099 141 1609 1970 2028 1424 153
2106 153 -1427 -1964 -2030 -1142 44 1079 2169 1737 1413 177 -1130 -1856 -2098 -1322 -78 1293 2217 2253
2124 2253 1395 332 -1086 -2076 -1709 -1490 -449 974 1659 2081 1353 465 -753 -1825 -2263 -1588 -746 534
2142 534 1565 2224 1692 447 -511 -1498 -1825 -1762 -857 565 1391 2169 1725 774 -468 -1421 -2204 -1592 -708
$$ packed form
2019a159J496J300O92j51q84j362j371j058K77R83J351J329R61j34q88j294j321
2036a233o65l84P58J292J416J142J14p02j498j822n19k11M83J465J486Q61J05
2053B088l38j610j146j050j32N69J041J651R71nk37j381j035j236m50L18J293
2070f89J639O93O27p20r88j416r97q03M36J524J444R24N77m10r73j209j387n47
2088b275J61J034J472J042P63k19r11j241j384n39J6R82J240J468L61N8o04j271
2106A53j580n37o6Q88J186J035J090m32l24j236j307p26k42P76J244J371R24L6
2124B253q58j063j418r90L67K19J041J423O85M22p28q88j218j072m38O75Q42J280
2142E34J031O59n32j245r58r87l27O3R05J422Q26P78m44r51j242r53p83O12Q84
$$ plain form
2161 -708 323 1380 1892 1737 1044 -416 -1730 -1936 -1856 -983 389 1255 2069 1777 1219 61 -1529 -1767
2179 -1767 -1603 -976 176 1220 1662 2020 1268 -101 -1231 -2101 -1603 -1118 -144 1152 1866 2043 1349 -38
2197 -38 -835 -1867 -1940 -1006 -178 880 1379 1671 1227 515 -1043 -1568 -1921 -1371 -396 965 1577 1741 1221
2216 1221 614 -474 -1675 -1806 -1320 -526 759 1609 1931 1269 445 -336 -1545 -1875 -1353 -1036 520 1260
2234 1260 1840 1603 748 -495 -1254 -1736 -1519 -873 381 1080 1821 1587 783 -346 -1415 -1738 -1394 -839
2252 -839 -285 1101 1431 1497 697 -89 -1227 -1642 -1603 -816 -193 962 1804 1719 950 -155 -935 -1781 -1685 -1280
2272 -1280 -309 986 1419 1540 1045 196 -602 -1353 -1673 -1231 -360 809 1515 1571 1368 330 -640 -1561 -1457
2291 -1457 -1043 -69 751 1469 1550 1300 115 -825 -1349 -1360 -1278 -376 694 1328 1451 1192 452 -759 -1108 -1649
$$ packed form
2161g08J031J057N12j55o93j460j314k06Q0Q73J372Q66Q14k92n58j158j590k38
2179a767J64O27J152J044M42L58p52j369j130q70M98M85R74J296P14J77o94j387
2197c8p97j032p3R34Q28J058M99K92m44p12j558n25l53N50R75J361O12J64n20
2216A221o07j088j201j31M86P94J285Q50L22o62q24p81j209l30N22L17J556P40
2234A260N80k37q55j243p59m82K17O46J254O99P41k34q04j129j069l23L44N55
2252h39N54J386L30O6q00p86j138m15L9P87O23J155Q42q5p69j105p80q46R6M05
2272a280R71J295M33J21m95q49p98p51l20M42Q71J169P06N6k03j038r70r21J04
2291a457M14R74Q20P18Q1k50j185r40n24j1Q2R02J070O34J23k59p40j211l49n41
$$ plain form
2311 -1649 -1143 -633 524 1203 1606 1168 659 -330 -1255 -1671 -1211 -609 202 1451 1716 1191 737 -314 -816
2330 -816 -1453 -1260 -703 116 1015 1880 1633 670 -89 -997 -1065 -1541 -830 1 932 1432 1728 775 16 -852
2350 -852 -1527 -1200 -1055 -10 765 1345 1519 675 367 -651 -1205 -1340 -833 -128 912 1311 1304 818 451 -586
2370 -586 -1203 -1273 -796 -459 343 1344 1328 1033 572 -546 -1255 -1629 -870 -449 644 1088 1209 1170 440 -265
2390 -265 -995 -1273 -878 -423 394 929 1467 1206 597 -370 -740 -1402 -1052 -472 354 1051 1399 1251 568 -159
2410 -159 -917 -1308 -1158 -839 -2 858 1363 1227 771 -222 -838 -1032 -1356 -711 108 776 1066 1440 743 -22
2430 -22 -941 -1328 -1032 -841 133 910 1200 1238 773 -7 -634 -1149 -967 -1094 -389 393 1221 1187 1134 264 -313
2451 -313 -866 -1193 -834 -251 585 852 1332 957 412 -3 -998 -1402 -1100 -126 326 840 1189 936 532 -277
$$ packed form
2311a649N06N10J157O79M03m38n09r89r25m16M60O02Q11J249K65n25m54j051n02
2330h16o37J93N57Q19Q99Q65k47r63p59r08o8m76P11Q31R31N00K96r53p59q68
2350h52o75L27J45J045P75N80J74q44l08j018n54j35N07P05J040L99pm86l67j037
2370e86o17p0M77L37Q02J001j6k95m61j118p09l74P59M21J093M44J21l9p30p05
2390b65p30k78L95M55Q17N35N38k61o09r67l70o62L50N80Q26O97L48j48o83p27
2410a59p58l91J50L19Q37Q60N05j36m56r93o16j94l24O45Q19O68K90L74o97p65
2430b2r19l87K96J91R74P77K90L8m65p80o27n15J82j27P05P82Q28l4n3q70n77
2451c13n53l27L59N83Q36K67M80l75n45m15r95m04L02R74M52N14L49k53m04q09
$$ plain form
2471 -277 -613 -1092 -828 -368 171 1038 975 1178 463 -237 -891 -1197 -868 -112 214 934 1161 874 290 -160
2491 -160 -901 -984 -921 -525 144 546 1155 783 366 -201 -725 -1121 -1098 -503 -187 563 1182 1019 495 -88 -722
2512 -722 -1017 -1085 -629 -119 603 961 973 579 372 -697 -1089 -1190 -810 -151 452 991 1136 828 143 -513
2532 -513 -974 -983 -627 -360 621 806 1129 618 100 -551 -630 -1054 -736 -284 509 750 988 548 224 -358 -582
2553 -582 -882 -786 -238 437 749 806 781 321 -162 -669 -845 -859 -496 209 591 731 796 462 51 -562 -994 -952
2575 -952 -376 -63 861 855 808 307 -20 -330 -826 -865 -827 -144 867 794 787 407 -61 -514 -756 -797 -545 166 530
2598 530 967 784 515 216 -582 -722 -1167 -464 -113 402 798 877 704 -49 -179 -767 -641 -440 -156 348
2618 348 652 796 715 316 -242 -566 -698 -538 -194 265 717 1042 345 200 -492 -584 -695 -648 -220 244 431
$$ packed form
2471b77l36m79K64M60N39Q67o3K03p15p00o54l06L29P56L26P20K27k87n84m50
2491a60p41q3O3L96O69M02O09l72m17n67n24l96K3N95L16P50O19j63n24n83o34
2512g22k95o8M56N10P22L58J2l94k07j069l92j01L80O59O03N39J45l08o85o56
2532e13m61rL56K67R81J85L23n11n18o51p9m24L18M52P93K41K38m40l24n82k24
2553e82l00R6N48O75L12N7k5m60m83n07j76j4L63P05L82J40O5l34m11o13m32M2
2575i52N76L13R24om7n01l27l10m96l9L8O83J011p3pl80m68m53k42m1K52P11L64
2598E30M37j83k69k99p98j40m45P03L51N15L96P9j73p53j30n88J26K01K84N04
2618C48L04J44q1l99n58l24j32J60L44M59M52L25o97j45o92r2j11M7M28M64J87
$$ plain form
2639 431 576 846 386 -255 -691 -717 -594 -463 157 320 640 607 312 -307 -419 -735 -715 -333 -215 447 609
2660 609 592 342 -201 -550 -566 -777 -434 49 576 569 782 412 -62 -296 -640 -369 -406 111 407 632 772 337
2682 337 -136 -417 -646 -895 -495 -87 327 569 632 552 25 -231 -566 -571 -483 -267 364 598 625 480 313 -324
2704 -324 -722 -708 -143 -387 175 509 695 439 419 -122 -439 -535 -564 -309 131 531 309 768 334 -205 -293 -714
2726 -714 -459 -469 49 742 460 776 137 -55 -223 -566 -881 -242 273 422 690 721 447 43 -643 -539 -666
2747 -666 -523 167 305 344 699 387 -50 -291 -435 -458 -514 -204 237 276 606 420 171 -404 -420 -228 -327 -27
2769 -27 218 435 449 350 4 -352 -317 -510 -454 -305 190 434 639 288 -28 -390 -555 -807 -592 -138 190 364
2791 364 548 559 382 -102 -501 -592 -419 -275 185 144 510 411 284 -29 -408 -170 -522 -332 239 276 370 656
$$ packed form
2639D31J45K70m60o41m36k6J23J31O20J63L20l3k95o19j12l16K0L82J18O62J62
2660F09j7k50n43l49j6k11L43M83N27pK13l70m74k34l44K71l7N17K96K25J40m35
2682C37m73k81k29k49M00M08M14K42O3q0n27k56l35nQ8K16O31K34K7j45j67o37
2704c24l98J4N65k44N62L34J86k56k0n41l17r6k9K55M40M00k22M59m34n39q8m21
2726g14K55j0N18O93k82L16o39j92j68l43l15O39N15J49K68L1k74m04o86J04j27
2747f66J43O90J38L9L55l12m37k41j44k3n6L10M41L9L30j86k49n75j6J92r9L00
2769b7K45K17J4r9l46l56L5j93N6J49M95K44K05l51l16l62j65k52K15M54L28J74
2791C64J84J1j77m84l99r1J73J44M60m1L66r9j27l13l79K38l52J90N71L7R4K86
$$ plain form
2813 656 129 454 -303 -398 -517 -160 265 41 282 412 -49 191 -427 -588 -433 -418 -88 69 497 536 187
2834 187 310 -554 -594 -145 -161 98 600 413 544 152 -13 -71 -215 -430 -654 147 237 517 549 379 1 -156
2856 -156 -392 -432 -389 -128 -23 425 417 10 -17 12 -381 -373 -434 -250 159 301 265 334 343 -8 -371 -380 -333 -152 250
2881 250 357 514 348 7 355 -324 -495 -223 -285 250 182 128 116 -69 -6 -336 -252 -638 -104 193 -34 411
2903 411 211 302 -159 -136 -303 -540 -148 -21 528 239 425 280 -34 -68 -215 -574 -303 -147 71 175 50
2924 50 305 25 -116 -521 -325 -234 -99 346 208 473 252 -277 42 -258 -188 -202 -274 233 312 432 281 25
2946 25 188 -178 -190 -410 -194 170 395 655 514 48 -188 -213 -411 -5 -244 118 403 265 451 269 -453
2967 -453 -239 -295 -305 -109 -40 403 298 -18 388 6 -161 110 -281 -207 -55 359 415 409 141 123 -190 -354 -47
$$ packed form
2813F56n27L25p57r5j19L57M25k24K41J30m61K40o18j61J55J5L30J57M28L9l49
2834A87J23q64m0M49j6K59N02j87J31l92j65n8j44k15k24Q01R0K80L2j70l78j57
2856a56k36m0M3K61J05M48qm07k7K9l93Qo1J84M09J42l6O9Rl51l63rM7J81M02
2881B50J07J57j66l41L48o79j71K72o2N35o8n4j2j85O3l30Q4l86N34K97k27M45
2903D11k00R1m61K3j67k37L92J27N49k89J86j45l14l4j47l59K71J56K18J04j25
2924E0K55k80j41m05J96R1J35M45j38K65k21n29L19l00P0j4p2N07P9J20j51k56
2946B5J63l66j2k20K16L64K25K60j41m66k36k5j98M06k39L62K85j38J86j82p22
2967d53K14n6j0J96O9M43j05l16M06l82j67K71l91P4J52M14N6ok68j8l13j64L07
$$ plain form
2990 -47 -193 66 -113 298 487 201 -48 -142 -478 -419 -285 140 109 204 362 103 -43 -196 -45 -233 -178 219
3012 219 65 220 320 158 -71 -2 -3 -381 -26 -300 -107 124 362 337 342 -262 -386 -270 -334 -171 -5 335
3034 335 102 300 89 -95 143 -323 -112 -159 -28 125 258 202 167 146 -136 -199 -327 -116 -133 130 208 -2
3056 -2 352 -74 183 -247 -598 -239 -2 -11 453 266 199 -203 -187 -55 -436 -49 -161 -170 398 218 293 -31 -14
3079 -14 53 -286 -485 -109 97 342 229 -37 222 155 -167 -335 29 -144 138 183 146 -49 55 -134 -260 -278
3101 -278 -281 -194 -142 174 68 195 131 207 -145 7 -316 -182 -136 -81 197 255 154 119 -207 -83 -414 -113 200
3124 200 208 -151 140 397 -15 -119 -184 32 -96 120 2 43 178 94 181 -73 158 -372 -275 -21 -4 108 234
3147 234 122 139 -139 -91 170 -125 -146 -239 18 174 118 -75 -313 -57 -324 -150 -109 -39 119 206 371 93 129
$$ packed form
2990d7j46K59j79M11J89k86k49r4l36N9J34M25l1R5J58k59j46j53J51j88N5L97
3012B19j54J55J00j62k29O9jl78L55k74J93K31K38k5No04j24J16o4J63J66L40
3034C35k33J98k11j84K38m66K11m7J31J53J33n6l5k1k82o3j28K11j7K63P8k10
3056bL54m26K57m30l51L59K37rM64j87o7m02J6J32l81L87j12rN68j80P5l24J7
3079a4O7l39j99L76K06K45j13k66K59o7l22j68L64j73K82M5l7j95J04j89j26j8
3101b78lQ7N2L16j06J27o4P6l52J52l23J34M6N5K78N8j01l5l26J24l31L01L13
3124B00Ql59K91K57m12j04o5K16j28K16j18M1J35q4Q7k54K31n30R7K54J7J12J26
3147B34j12J7k78M8K61k95k1r3K57J56n6j93k38K56k67J74M1P0J58Q7J65k78L6
$$ plain form
3170 129 -333 -240 -268 -16 -188 -5 340 182 531 -45 -56 2 -29 -169 -39 74 360 232 38 -115 -172 349
3192 349 -164 -122 -75 147 67 174 376 -31 -208 -10 -370 -88 -98 -34 87 289 275 99 -113 -110 -125 -150 -91 -194
3216 -194 100 376 255 193 -40 -194 97 -76 -340 30 117 183 124 187 6 50 -78 -118 -400 -288 272 305 -58
3239 -58 148 -33 -154 -47 -243 35 118 70 494 12 -157 -50 127 -257 41 -345 -254 217 245 228 152 51
3261 51 -95 -36 -219 -304 -51 54 3 87 191 -41 114 143 -44 -124 -37 -211 -76 160 135 241 206 -121 -271
3284 -271 132 46 -90 -59 560 179 68 210 -180 34 -17 -222 13 253 318 138 69 -292 76 -493 -118 126
3306 126 -192 21 -51 19 -11 142 -59 -337 -95 -95 142 -88 288 467 299 235 85 -172 -205 6 94 -8 -169
3329 -169 123 -111 -159 -133 -169 -146 -19 -223 -137 72 87 -128 119 51 -184 -64 255 -204 70 -63 -60 87 451
$$ packed form
3170A29m62R3k8K52j72J83L45j58L49n76j1N8l1j40J30J13K86j28j94j53n7N21
3192C49n13M2M7K22q0J07K02m07j77J98l60K82j0O4J21K02j4j76k12Lj5k5N9j03
3216a94K94K76j21o2k33j54K91j73k64L70Q7O6n9O3j81M4j28m0k82J12N60L3l63
3239e8K06j81j21J07j96K78Q3m8M24m82j69J07J77l84K98l86R1M71K8j7p6j01
3261E1j46N9j83q5K53J05n1Q4J04k32J55K9j87q0Q7j74J35K36k5J06l5l27j50
3284b71M03q6j36L1O19l81j11J42l90K14n1k05K35K40O5j80o9l61L68n69L75K44
3306A26l18K13p2P0l0J53k01k78K42%K37k30L76J79j68o4j50k57l3K11Q8j02j61
3329a69K92k34m8K6l6K3J27k04Q6K09J5k15K47o8k35J20L19m59K74j33LJ47L64
$$ plain form
3352 451 -1 -298 42 -173 -315 -468 195 289 227 76 212 -243 -15 52 59 -7 -187 6 535 140 210 41
3374 41 -373 51 76 72 33 318 -27 76 106 -221 82 39 -316 18 80 135 15 119 25 395 -123 -115 -45 -344
3398 -344 50 166 277 54 312 -60 407 88 -256 -155 -64 93 249 -35 -17 -161 -136 -393 -190 -259 21
3419 21 75 140 -197 176 100 -44 133 -184 162 -272 -67 -40 325 189 33 -63 -3 -89 -128 -120 -231 -204 97 38
3443 38 317 173 -80 -95 -51 -251 -120 58 209 -27 26 -3 93 -113 -279 -125 -21 139 -176 522 450 -66
3465 -66 -115 -166 -247 -199 275 -1 -12 -5 -23 45 -31 -44 -187 -273 88 117 -89 -75 235 200 148 -314 -304 35 106 94 265
3492 265 63 342 140 102 -27 -259 -225 -165 101 -54 150 21 154 -28 -27 7 -240 -67 58 -62 208 242
3514 242 44 -139 -47 -230 -170 -222 8 86 71 391 263 174 12 -124 -327 -392 -96 -1 -18 97 373 -227 134
$$ packed form
3352D51m52k97L40k15j42j53O63R4o2j51J36m55K28O7Po6j80J93N29l95P0j69
3374D1m14M24K5ml9K85l45J03L0l27L03m3l55L34O2N5j20J04r4L70n18QP0k99
3398c44L94J16J11k23K58l72M67l19l44J01R1J57J56k84J8j44K5k57K03o9K80
3419B1N4O5l37L73p6j44J77l17L46m34K05K7L65j36j56r6O0q6l9Qj11K7L01n9
3443C8K79j44k53j5M4k00J31J78J51k36N3k9R6k06j66J54J04J60l15O98p2n16
3465f6m9n1q1M8M74k76j1Pj8O8p6j3j43q6L61K9k06J4L10l5n2m62J0L39P1j2J71
3492B65k02K79k02l8j29k32L4O0K66j55K04j29J33j82JL4k47J73J25j20K70L4
3514B42j98j83R2j83O0n2K30P8j5L20j28q9j62j36k03o5K96R5j7J15K76o00L61
$$ plain form
3537 134 -242 -274 143 -136 -109 84 362 40 144 222 -220 -76 -151 -334 45 45 222 240 223 123 -133 -221 -224 132
3561 132 -81 200 157 151 43 168 -18 -247 -348 189 85 -292 43 375 85 86 -169 -240 -71 -386 116 79
3583 79 -230 -55 132 -234 -15 -10 -222 -132 -97 20 115 -2 283 199 -226 59 -175 -83 -129 185 130 380 143
3606 143 6 -67 -110 -243 -208 93 -97 195 44 105 143 -145 110 116 -6 -275 -164 155 9 153 -121 -89 171
3629 171 -317 -42 -28 -92 306 56 276 -70 147 -109 -364 -240 -74 222 68 389 -82 23 -158 -66 -349
3650 -349 -58 95 -110 -2 99 243 234 -164 167 151 -312 -204 -189 265 223 316 21 352 -104 -184 -321 -398 -2
3673 -2 -134 282 125 219 207 23 28 -477 -83 71 -137 -6 85 424 182 -89 -236 -164 -215 17 -25 74 225 -50
3697 -50 -50 137 324 -127 -198 -141 -5 181 25 94 87 -7 -126 35 -346 -25 96 157 215 -18 263 94 -223 -351
$$ packed form
3537A34l76l2M17k79K7J93K78l22J04P8m42J44p5j83L79%J77J8j7j00k56q8lL56
3561A32k13K81m3oj08J25j86k29j01N37j04l77L35L32k90Jk55p1J69l15N02l7
3583G9l09J75J87l66K19Nk12R0L5J17R5j17K85q4m25K85k34R2m6L14n5K50k37
3606A43j37p3m3j33L5L01j90K92j51O1L8k88K55Oj22k69J11L19j46J44k74L2K60
3629A71m88K75J4o4L98k50K20l46K17k56k55J24J66K96j54L21m71J05j81R2k83
3650c49K91J53k05J08J01J44rl98L31j6m63J08J5M54m2R3k95L31m56q0j37p7L96
3673bj32M16j57R4j2j84Nn05L94J54k08J31R1L39k42k71j47P2n1K32m2R9J51k75
3697e0%J87J87m51p1N7J36J86j56O9pr4j19J61l81L21J21O1N8k33K81j69l17j28
$$ plain form
3721 -351 -194 -114 33 60 373 370 414 257 -131 -280 -397 -10 -14 195 110 156 163 -36 -49 -322 -62 -154 -68 126 26
3746 26 303 86 269 65 -244 -112 161 -92 -33 191 150 57 -72 -56 -466 -170 -248 -222 118 217 243 248 242 -363
3770 -363 22 -160 -195 -198 13 199 141 -7 -62 -202 21 -158 -303 -187 54 187 179 368 225 -60 122 -203
3792 -203 -493 -113 10 -30 208 513 15 -79 47 -104 82 -184 -19 77 69 229 264 165 -120 -172 -446 -70 -27
3815 -27 99 111 -84 153 -60 27 -22 -39 -222 -154 -41 516 380 -65 171 42 -149 -234 -171 -94 13 -45 40 436
3839 436 -162 -30 121 -130 -139 -155 -34 216 247 321 6 184 -136 -405 58 -213 70 390 -91 5 101 -93
3861 -93 -146 -295 -123 -84 297 74 236 263 230 171 -194 -389 -154 -50 130 -130 286 377 245 -27 -99 -47 -188
3884 -188 -230 -238 7 329 610 160 173 51 250 -219 -268 -269 -34 26 167 239 -61 -89 126 -251 -147 -198 -150 183
$$ packed form
3721c51J57Q0J47K7L13lM4j57l88j49j17L87mK09q5M6Pj99j3k73K60r2Q6J94j00
3746B6K77k17J83k04l09J32K73k53N9K24m1r3j29J6m10K96p8K6L40R9K6Noo05
3770c63L85j82l5lK11J86n8j48n5j40K23j79j45J16K41J33qJ89j43k85J82l25
3792b03k90L80J23m0K38L05m98r4J26j51J86k66J65R6qJ60L5r9k85n2k74L76M3
3815b7J26J2j95K37k13Q7m9j7j83O8J13N57j36m45K36j29j91q5O3P7J07n8Q5L96
3839D36n98J32J51k51rj6J21K50L1P4l15J78l20k69M63k71K83L20m81R6R6j94
3861i3n3j49J72L9L81k23J62K7l3n9l65j95K35J04J80k60M16R1j32k72p2N2j41
3884a88m2qK45L22K81m50J3j22J99m69m9jK35O0J41P2l00k8K15l77J04n1M8L33
$$ plain form
3908 183 323 213 25 97 50 -305 -284 18 -133 120 147 111 90 158 -82 -90 -70 -284 -83 271 469 148 2
3931 2 74 -123 -203 -158 -218 -38 223 0 347 127 -56 -448 -390 -163 -1 166 -75 281 240 24 -136 58 -271
3954 -271 -116 41 175 -15 391 213 109 5 -222 -205 -163 11 -226 -108 -248 47 295 -96 -29 212 -112
3975 -112 -250 -232 -250 133 240 329 24 -275 -85 35 -143 -131 -233 58 310 91 85 199 -19 -198 -297 164
3997 164 -15 -110 -32 267 -31 -43 109 -181 -1 111 -116 -1 300 385 151 -61 46 -197 -164 -219 99 -341
4019 -341 266 267 19 117 201 -229 -375 23 -81 128 307 145 77 99 -80 -21 -257 145 -159 139 122 187 305
4042 305 113 11 -50 -70 -134 -74 -59 291 -17 293 61 82 81 -173 -132 -265 48 -74 39 415 135 -59 -204
4065 -204 -271 47 -223 42 362 -8 42 28 -187 -51 -29 -121 -116 85 161 181 -16 1 -11 -322 -88 -105 -210 -326
$$ packed form
3908A83J40j10j88P2m7l55K1L02j51K53K7l6k1O8k40qK0k14K01L54J98l21j46
3931BP2j97q0M5o0J80K61k23L47k20j83l92N8K27J62J67k41L56m1k16j60J94l29
3954b71J55J57J34j90M06j78j04j04k27J7M2J74k37J18j40K95K48l91O7K41l24
3975a12j38J8j8L83J07Q9l05k99J90J20j78J2j02K91K52k19oJ14k18j79r9M61
3997A64j79r5P8K99k98j2J52k90J80J12k27J15L01Q5k34k12J07k43L3n5L18m40
4019c41O07Jk48R8Q4m30j46L98j04K09J79j62o8K2j79N9k36M02l04K98j7O5J18
4042C05j92j02o1k0o4O0J5L50l08L10k32K1jk54M1j33L13j22J13L76k80j94j45
4065b04o7L18k70K65L20l70N0j4k15J36K2r2NK01P6K0j97J7j2l11K34j7j05j16
$$ plain form
4089 -326 -47 50 274 56 -54 89 20 -295 -159 -224 235 -117 322 -4 -314 -96 -246 215 -160 -254 97
4110 97 -25 37 180 138 -229 -177 -14 -275 61 103 53 262 -1 393 -47 155 -262 -120 -63 47 312 452
4132 452 161 118 -164 -160 -399 -224 -200 -312 -20 -16 310 89 -21 -151 -119 -330 -334 22 -31 139 281 242 65 -121
4156 -121 -267 -167 -10 -40 200 256 69 -77 171 120 -176 -108 -127 -108 66 345 444 242 161 -182 -148 -186 -131 -196
4180 -196 14 -32 90 278 223 127 -74 -132 -82 -161 186 209 -54 -228 121 0 -214 -32 73 -50 79 94 87
4203 87 70 -146 32 1 -93 -60 -158 -260 -96 -127 260 230 -22 -205 -274 -286 -169 -152 31 151 157 -3 -127 -41 -363
4228 -363 -134 -98 -181 216 -49 83 267 87 -44 -287 19 75 17 83 128 -36 154 55 -154 48 14 -284 118
4251 118 -76 -5 65 0 -52 -339 -293 -394 -7 -311 -39 118 -132 57 195 -157 83 -167 -315 144 -135 259
$$ packed form
4089c26K79R7K24k18j10J43o9l15J36o5M59l52M39l26l10K18j50M61l75r4L51
4110I7j22O2J43m2l67N2J63k61L36M2n0K09k63L94m40K02m17J42N7J10K65J40
4132D52k91m3k82Mk39J75K4j12K92ML26k21j10j30L2k11mL56n3J70J42l9j77j86
4156a21j46J00J57l0K40N6j87j46K48n1k96O8j9J9J74K79R9k02q1l43L4l8N5o5
4180a96K10m6J22J88n5r6k01n8N0p9L47K3k63j74L49j21k14J82J05j23J29J5p
4203H7j7k16J78l1r4L3r8j02J64l1L87l0k52j83o9j2J17J7J83J20Oj60j24Q6l22
4228c63K29L6q3L97k65J32J84j80j31k43L06N6n8O6M5j64J90r9k09K02l4k98M02
4251A18j94P1P0o5n2k87M6j01L87l04K72J57k50J89J38l52K40k50j48M59k79L94
$$ plain form
4273 259 100 225 37 208 -179 35 121 -121 -27 121 -29 244 -37 55 -65 -221 -83 -224 52 3 206
4294 206 179 506 -1 -190 32 -130 -39 42 -23 231 72 69 224 -50 14 -184 331 24 32 -205 322 207 -4
4317 -4 98 -180 -432 -187 -217 308 143 288 130 -83 250 -310 -211 -73 -187 -107 188 389 -127 259 -138 -104
4339 -104 24 -213 86 2 214 178 137 162 -191 -282 -132 166 70 174 72 -129 82 73 69 -107 0 -218 148
4362 148 80 105 -10 117 63 4 14 -375 -109 -309 -114 -173 21 -27 -100 -25 101 -45 131 -338 -147 4 -120
4385 -120 156 -3 -221 -155 79 -143 -6 47 79 106 -90 388 165 99 5 -291 -182 77 8 -201 1 114
4407 114 277 -180 -39 9 -3 -85 -196 -337 -155 59 148 -301 -24 -132 -84 -293 -174 -28 195 270 67 47
4429 47 -472 -53 -140 -148 -150 7 113 65 5 -98 -19 -295 -239 31 -136 129 172 -167 230 -212 224 -72 -90 -459
$$ packed form
4273B59j59J25j88J71l87K14Q6k42R4J48j50K73k81R2j20j56J38j41K76m9K03
4294B06k7L27n07j89K22j62R1Q1o5K54j59lJ55k74O4j98N15l07Qk37N27j15k11
4317dJ02k78k52K45l0N25j65J45j58k13L33n60R9J38j14Q0K95K01n16L86l97L4
4339a04J28k37K99q4K12l6m1K5l53r1J50K98r6J04j02k01K11rmj76J07k18L66
4362A48o8K5j15J27n4n9J0l89K66k00J95n9J94m8p3P5J26j46J76m69J91J51j24
4385a20K76j59k18O6K34k22J37N3L2K7j96M78k23o6r4k96J09K59o9k09K02J13
4407A14J63m57J41M8j2q2j11j41J82K14Q9m49K77j08M8k09J19J46K23P5k03k0
4429D7n19M19q7qkJ57J06m8o0j03P9k76N6K70j67K65M3l39L97m42M36k96j8l69
$$ plain form
4453 -459 19 -31 66 99 338 37 -43 -21 -202 -190 162 -112 178 227 173 152 108 -3 -330 -69 204 93 -53
4476 -53 70 305 231 -113 109 -442 -175 82 -4 181 42 122 48 146 -275 -47 97 -164 44 -106 90 81 258
4499 258 -65 -345 -187 -78 -128 -235 327 161 98 25 -83 -159 -29 -202 -123 -62 212 -161 106 283 87 188
4521 188 -170 -129 -98 -18 178 110 226 -35 148 -68 -198 -326 -182 -334 55 143 -177 44 -15 110 73 -24 -166
4544 -166 -216 -210 188 14 -66 5 120 -210 -178 -228 -38 -327 64 65 -59 32 124 -201 -229 -230 -163 -126 -142 225 408 237
4570 237 184 -120 -5 -37 -145 -154 37 169 -34 -26 50 -161 18 -120 -372 -134 109 53 294 247 129 176 -144
4593 -144 -6 108 -124 53 167 452 -78 76 -235 87 -171 -217 26 -66 147 166 104 221 -96 -113 -119 80
4615 80 -109 21 68 42 66 320 -21 -176 37 -352 -2 144 92 6 -91 -3 97 -85 239 -15 -173 345 -34
$$ packed form
4453d59M78n0R7L3K39l01q0K2j81J2L52k74K90M9n4k1m4j11l27K61K73j11j46
4476e3J23K35p4l44K22n51K67K57q6J85j39Q0p4R8m21K28J44k61K08j50J96rJ77
4499B58l23k80J58J09n0j07N62j66o3p3j08p6J30j73P9O1K74l73K67J77j96J01
4521A88l58M1L1Q0J96o8J16k61J83k16j30j28J44j52L89Q8l20K21n9J25l7r7j42
4544a66n0OL98j74q0P1J15l30L2n0J90k89L91Jj24R1R2l25k8jO7L7j6L67J83j71
4570B37n3l04J15l2j08rJ91J32k03QP6k11J79j38k52K38K43n6K41m7j18M7l20
4593a44J38J14k32J77J14K85n30J54l11L22k58m6K43r2K13J9o2J17l17j7oJ99
4615H0j89J30M7k6K4K54l41j55K13l89L50J46n2q6r7Q8J00j82L24k54j58N18l79
$$ plain form
4638 -34 105 40 35 -75 147 -313 -195 -254 131 21 18 -32 168 326 -104 -107 29 -114 -46 138 267 152 2 -96
4662 -96 36 -174 -178 24 9 -55 97 280 174 176 19 129 -320 -150 -164 141 -94 -32 55 96 147 -138 -50 -93 133
4687 133 -157 263 95 71 148 143 111 -56 -192 -260 -205 70 -48 166 -74 -59 -470 3 -120 33 -223 -2 211
4710 211 -29 117 -85 115 214 -141 268 -88 -201 67 123 8 -148 -68 184 -149 -185 46 175 147 100 141
4732 141 127 -69 198 -182 -109 144 175 151 -29 -6 121 -236 31 -103 -350 -350 -94 31 -98 -226 106 48 -271
4755 -271 -293 -160 -76 -87 390 -2 152 194 -156 73 32 -35 -73 297 -84 85 -73 106 -35 -15 -11 -107 -130 9
4779 9 -44 -13 222 136 15 296 21 -214 -12 176 47 150 166 77 80 -16 -281 -268 -15 -91 -210 259 73 213
4803 213 405 -292 -72 -54 30 -93 186 50 -31 352 303 -263 -293 187 -45 50 86 -78 101 -25 -43 -180 44
$$ packed form
4638c4J39o5nj10K22m60J18n9L85j10ln0K00J58m30lJ36j43O8J84J29j15j50r8
4662i6J32k10mK02j5o4J52J83j06Kj57J10m49J70j4L05k35O2Q7M1N1k85Q8m3K26
4687A33k90M20j68k4P7nl2j67j36o8N5K75j18K14k40J5m11M73j23J53k56K21K13
4710B11k40J46k02K00R9l55M09l56j13K68N6j15j56Q0K52l33l6K31J29k8m7M1
4732A41j4j96K67l80P3K53L1k4j80K3J27l57K67j34k47%K56J25j29j28L32n8l19
4755b71k2J33Q4j1M77l92J54M2l50K29m1o7l8L70l81J69j58J79j41K0Mr6k3J39
4779In3L1K35q6j21K81k75k35K02J88j29J03J6q9Lr6k65J3K53p6j19M69j86J40
4803B13J92o97K20J8Q4j23K79j36q1L83m9n66l0M80k32R5L6j64J79j26j8j37K24
$$ plain form
4826 44 -35 -16 -101 -90 -103 198 -85 -79 -83 -166 -32 30 -75 26 -72 211 -14 256 -78 -254 -110 -485 -92 -61 -5
4851 -5 189 216 2 119 115 245 -116 -204 -78 -93 -31 226 218 74 153 -147 121 -297 56 34 -148 214 234 -35
4875 -35 -75 -39 -57 90 287 -30 -46 76 98 -158 209 -73 -33 17 233 46 348 -142 122 171 -92 -18 -202
4898 -202 8 -74 27 216 221 121 -293 -44 -24 -148 -3 -112 93 -131 238 199 27 -166 172 -98 -67 -94
4920 -94 -2 -241 -173 130 283 326 -20 88 -234 -112 -257 140 -40 109 310 281 -327 -143 -287 30 -29 162
4942 162 -89 -29 -78 54 -123 -206 50 -292 124 -23 139 84 22 -6 -149 110 -37 -251 -107 -191 218 260 175
4965 175 -260 -65 -157 -110 55 8 132 137 30 222 36 153 -31 -74 -257 40 -22 175 92 -112 -57 -99 -78 -109
4989 -109 -112 82 3 -91 321 -57 79 41 -172 -223 -182 154 128 30 224 -13 -143 238 -10 -410 -45 -141 -105 250
$$ packed form
4826D4p9J9q5J1j3L01k83Omq3J34O2j05J01r8K83k25K70l34j76J44l75L93L1N6
4851eJ94K7k14J17mJ30l61q8J26j5O2K57qj44P9l00K68m18L53k2j82L62K0k69
4875c5m0L6j8J47J97l17j6J22K2k56L67k82M0N0K16j87L02m90K64M9k63P4j84
4898b02K10q2J01J89Nj00m14K49K0j24J45j09K05k24L69l9j72j93L38k70L1k7
4920i4R2k39O8L03J53M3l46J08l22J22j45L97j80J49K01k9o08J84j44L17n9J91
4942A62k51O0m9J32j77q3K56l42M16j47J62n5o2k8j43K59j47k14J44q4M09M2q5
4965A75m35J95r2M7J65m7J24Nj07J92j86J17j84m3j83K97o2J97q3k04N5m2K1l1
4989a09lJ94p9r4M12l78J36l8k13n1M1L36k6r8J94k37j30L81k48m00L65r6L6L55
$$ plain form
5013 250 129 236 169 -170 -246 -356 -243 -149 -87 -48 246 256 -101 61 102 5 -168 -34 101 33 260 -221 -234
5036 -234 -62 -68 -273 9 -17 -128 67 66 176 177 -155 -48 31 -172 -117 131 -100 75 171 -145 -92 84 -165 218
5060 218 19 -77 30 192 408 -93 -118 337 152 101 80 -78 107 154 226 22 73 -153 62 -2 31 239 80
5083 80 -128 140 44 173 254 53 116 -139 -389 61 -45 292 -38 185 65 -82 -135 -52 -95 53 -49 350
5105 350 -20 163 32 69 -80 -99 -421 -89 -81 139 273 -12 276 -82 -221 -335 -148 -140 -20 42 4 122 122
5128 122 30 -163 -155 -183 -152 390 -90 379 -29 69 287 -6 -56 -199 -171 -64 14 46 108 131 -14 -156 268 -34
5152 -34 -116 109 -23 -72 205 -102 -7 -147 -51 -176 -129 85 -186 148 0 68 -65 18 101 1 -88 -83 -346 -80
5176 -80 277 -107 -136 -115 91 -97 -187 54 203 12 124 -42 -10 -32 -208 -301 -245 -99 -96 255 304 419 -157 -165
$$ packed form
5013B50j21J07o7l39p6j10J13R4O2L9K94J0l57J62M1r7j73J34J35o8K27m81j3
5036b34J72ok05K82k6j11J95jJ10Jl32J07P9k03N5K48k31J75R6l16N3J76k49L83
5060B18j99r6J07J62K16n01k5M55j85n1k1j58J85M7P2k04N1k26K15o4L3K08j59
5083H0k08K68r6J29Q1k01O3k55k50M50j06L37l30K23j20j47n3Q3m3J48j02L99
5105C50l70J83j31L7j49j9l22L32QK20J34k85K88l58j39j14J87QJ20O2l8J18%
5128A22r2j93Qk8L1N42m80M69m08R8K18k93n0j43K8J07P8L2O2K3j45j42M24l02
5152c4q2K25j32m9K77l07R5j40R6j25M7K14k71L34j48O8j33Q3Q3j00q9Nk63K66
5176h0L57l84k9K1K06j88r0K41J49j91J12j66L2k2j76r3N6J46LL51M9J15n76q
$$ plain form
5200 -165 -64 -441 -227 12 96 93 82 254 -25 16 24 -43 -94 -27 34 157 -19 220 -81 32 195 54 -186 5
5224 5 -112 -171 -99 72 76 152 166 180 -250 -333 -69 15 182 73 -84 147 299 -63 -333 -202 110 23 137 263
5248 263 200 85 -34 -116 -269 -257 25 -97 58 83 279 214 -81 -106 -176 97 166 -79 377 357 62 6 3 -85
5272 -85 71 200 73 144 47 87 -15 44 74 -262 -182 -40 -213 51 -5 -119 465 -153 92 -68 -238 -367 -220
5295 -220 152 31 239 -9 264 36 -218 -167 46 -288 -92 46 94 222 340 336 83 69 -18 237 19 125
5317 125 49 322 -75 94 -157 -65 -50 -16 -38 -150 -107 254 199 4 -241 -24 50 12 -144 52 -305 16 59
5340 59 -160 -13 -39 -12 -209 -12 123 142 42 104 338 140 -30 -34 136 -31 277 271 37 30 219 163 -45 -152
5364 -152 -94 54 202 -7 19 39 -115 -142 71 61 -102 -181 14 104 198 203 154 -194 -225 -103 15 -177 10 2 -48
$$ packed form
5200a65J01l77K14K39Q4lj1J72k79M1Qo7n1O7O1J23j76K39l01J13J63j41k40J91
5224Ej17n9P2J71MP6J4J4m30q3K64Q4J67j09j57K31J52l62k70J31L12q7J14J26
5248B63o3j15j19q2j53J2K82j22J55K5J96o5k95k5p0K73O9k45M56k0k95n6lq8
5272h5J56J29j27P1r7M0j02N9L0l36Q0J42j73K64n6j14N84o18K45j60j70j29J47
5295b20L72j21K08k48K73k28k54N1K13l34J96J38M8J28J18mk53j4q7K55k18J06
5317A25p6K73l97J69k51R2J5L4k2j12M3L61n5j95k45K17P4l8j56J96l57L21M3
5340E9k19J47k6K7j97J97J35J9j00O2K34j98j70mJ70j67L08ok34pJ89n6k08j07
5364a52N8J48J48k09K6K0j54k7K13j0j63p9J95R0R4Nm9l48l1J22J18j92J87qn0
$$ plain form
5389 -48 117 -4 59 -5 -73 -179 -5 -32 5 360 404 204 47 -311 -144 68 218 -101 200 152 -122 69 73
5412 73 176 59 -214 -6 -169 12 134 248 -184 53 -374 -14 -104 -91 54 -110 169 140 113 67 26 -253
5434 -253 -64 -202 28 79 61 170 284 155 -9 60 -71 -197 13 -147 16 339 191 -246 62 -44 -218
5455 -218 196 31 -37 75 99 445 55 1 -151 -92 -247 -85 108 -207 277 44 72 -112 -35 49 -205 -140 39
5478 39 162 -3 225 -108 -38 31 146 -421 322 -53 263 -15 73 97 120 9 -129 -27 -203 -189 98 -8
5500 -8 -103 -29 -41 -136 60 -29 92 2 142 134 -154 -87 -102 132 -122 44 180 -27 -175 94 66 63 -35 -131 -310 7
5526 7 -112 98 -116 196 -147 65 298 23 -257 -48 38 164 131 223 108 -36 -27 -119 95 -371 15 -147 -39
5549 -39 -14 131 -3 13 -92 -80 38 83 -248 -105 28 -104 187 86 58 16 -133 -153 56 -23 256 49 18
$$ packed form
5389d8J65j21O3o4o8j06J74k7L7L55M4k00j57l58J67K12J50l19L01m8k74J91M
5412G3J03j17k73K08j63J81J22J14m32K37m27L60r0J3J45j64K79k9k7m6m1k79
5434b53J89j38K30N1j8J09J14j29j64O9j31j26K10j60J63L23j48m37L08j06j74
5455b18M14j65o8J12K4L46l90n4j52N9j55J62J93l15M84k33K8j84P7Q4k54O5J79
5478C9J23j65K28l33P0O9J15n67P43l75L16k78Q8K4K3j11j38J02j76J4K87j06
5500hr5P4j2r5J96q9J21r0J40qk88O7j5K34k54J66J36k07j48K69k8lr8r6j79L17
5526Gj19K10k14L12l43K12K33k75k80K09Q6J26l3R2j15j44Rr2K14m66L86j62J08
5549c9K5J45j34J6j05J2J18M5l31J43J33j32K91j01k8m2j49k0K09p9K79k07l1
$$ plain form
5572 18 -57 -204 22 -16 -1 82 21 -83 -117 170 -225 -100 -52 -52 -277 144 -54 -142 -55 80 109 -2 89 -144 -315
5597 -315 332 -109 30 -150 227 119 242 -102 -287 67 67 72 -190 30 -290 -54 -144 -48 -215 164 -26 102
5619 102 217 -44 130 -50 -211 -91 176 119 44 -223 8 305 165 51 2 -133 -146 48 -264 -148 -216 -210
5641 -210 40 -76 106 58 -49 52 -131 -144 203 108 -107 -86 127 -190 11 -266 75 -104 78 -61 272
5662 272 204 -11 -239 -7 -182 91 -72 -56 -9 130 248 234 -21 -59 10 -69 -70 -14 203 -54 132 302 -53
5685 -53 102 -202 44 28 -84 -99 -36 149 228 136 -329 -53 59 -16 -48 150 -107 -26 131 86 -3 29 18 25 -224
5710 -224 270 70 -3 60 90 -101 11 105 -260 133 11 -59 -15 15 141 -29 -15 15 -136 190 93 245 -198
5733 -198 128 -24 -65 -84 1 -37 -28 85 -256 -232 -145 267 160 -207 -66 -335 -124 315 -33 -57 223 132 129 43
$$ packed form
5572A8p5j47K26l8J5Q3o1j04l4K87l95J25M8%k25M21j98q8Q7J35K9j11R1k33j71
5597c15O47m41J39j80L77j08J23l44j85L54%Nk62K20l20K36r0R6j67L79j90J28
5619A02J15k61J74j80j61J20K67n7p5k67K31K97j40j14m9j35j3J94l12J16o8O
5641b10K50j16J82m8j07J01j83j3L47r5k15K1K13l17K01k77L41j79J82j39L33
5662B72o8k15k28K32j75K73j63J6M7J39J18j4k55l8O9p9jN6K17k57J86J70l55
5685e3J55l04K46j6j12j5O3J85P9r2m65K76J12p5l2J98k57Q1J57m5q9L2j1Pk49
5710b24M94k00p3O3L0j91J12R4l65L93j22p0M4L0J26j70J4L0j51L26r7J52m43
5733a98L26j52m1j9Q5l8RJ13l41K4Q7M12j07l67J41k69K11M39l48k4K80r1lq6
$$ plain form
5757 43 -17 -38 32 42 82 400 19 98 7 302 -105 -90 132 8 -214 -31 96 25 136 191 -140 37 -94 24
5781 24 -97 134 27 81 -6 193 -10 45 124 -13 -302 218 140 39 239 -196 47 167 134 -336 123 -27
5803 -27 57 267 236 50 6 28 -111 110 -92 1 160 165 -7 -20 -3 -7 136 62 -270 98 323 88 89 285 264
5828 264 -174 119 -14 -11 196 -9 88 195 -7 -67 -65 -164 -189 267 82 -21 184 112 -37 64 -170 -21 40
5851 40 72 13 29 -33 103 -126 -76 -11 -93 90 166 -144 -132 67 102 -70 186 147 104 301 -53 67 -78 52
5875 52 88 436 87 -110 -63 -153 -68 -95 207 3 -248 115 115 16 -102 -190 -51 25 234 330 212 80 5 57 -320
5900 -320 382 -37 50 -103 27 31 185 -161 -130 -48 -69 -194 10 117 205 211 57 118 178 6 24 5 174 -25
5924 -25 321 186 82 201 -8 -53 200 -45 -114 38 104 119 285 44 -169 131 69 -155 276 83 -113 85
$$ packed form
5757D3o0k1P0J0M0L18l81P9r1K95m07J5K22j24k22J83J27p1J11N5l31J77j31J18
5781B4j21K31j07N4q7J99k03N5P9j37k89N20p8j01K00m35K43J20l3m70M59j50
5803b7Q4K10l1j86m4K2j39K21k02R3J59Nj72j3J7mJ43p4l32L68K25k35JJ96k1
5828B64m38K93j33LK07k05R7J07k02o0Kr9k5M56j85j03K05p2j49J01k34J49O1
5851D0L2n9J6o2J36k29N0O5q2J83P6l10J2J99L5j72K56l9m3J97l54J20j45J30
5875E2L6L48l49j97M7r0Q5k7L02k04k51L63%r9j18q8J39P6K09R6j18j32p5N2l77
5900c20P02m19Q7j53J30MJ54l46L1Q2k1j25K04J07Q8Oj54O1O0j72J8j9J69j99
5924b5L46j35j04J19k09m5K53k45o9J52O6J5J66k41k13L00o2k24M31j93j96J98
$$ plain form
5946 85 62 91 -106 138 95 -81 138 128 48 -68 190 156 -61 3 -31 -67 -189 -30 -210 11 -242 12 73 20
5970 20 -145 -111 -19 14 -145 316 -57 126 59 -70 154 -151 43 -42 3 101 179 12 -25 -6 23 55 -41 69 -248
5995 -248 -105 -137 -14 30 216 -135 -110 -170 150 -84 69 28 275 122 -120 -36 113 -11 42 184 -22 -27 90
6018 90 -128 16 -53 -103 89 119 237 -267 46 124 -170 -59 72 74 -53 -85 132 -54 94 244 284 7 91
6041 91 -146 -62 -136 27 -283 -47 -264 -170 -207 -111 7 -203 277 -97 97 65 127 127 112 -12 -363 -69 -173 113
6065 113 153 39 137 -155 96 107 -40 -264 -195 -194 68 -217 53 -47 -173 -152 180 45 -313 68 107 217 -186
6088 -186 440 -65 25 69 -57 53 -85 -92 -38 16 109 93 57 -72 -259 -160 110 -156 104 -13 -11 97 -181 -64
6112 -64 -101 26 148 -129 -53 35 87 -46 143 44 101 -277 -187 -88 82 86 28 94 -281 23 -247 63 61 179 50
$$ packed form
5946H5k3K9j97K44m3j76K19j0q0j16K58l4k17O4l4l6j22J59j80K21k53K54O1n3
5970B0j65L4R2L3j59M61l73J83o7j29K24l05J94q5M5R8P8j67l7J9K9L2r6J10l17
5995b48J43l2J23M4J86l51K5o0L20k34J53m1K47j53k42Q4J49j24N3J42k06nJ17
6018I0k18J44o9n0J92L0J18n04L13P8k94J11J31Kj27l2K17j86J48J50M0k77Q4
6041I1k37Q4p4J63l10K36k17R4l7R6J18k10M80l74J94l2O2%j5j24l51K94j04K86
6065A13M0j14R8k92K51J1j47k24O9JK62k85K70j00j26K1L32j35l58L81L9J10m03
6088a86O26n05R0M4j26J10j38pN4N4R3j6l6j29j87R9K70k66K60j17KJ08k78J17
6112f4l7J27J22k77P6Q8N2j33J89r9N7l78R0R9J70Mn8O6l75L04k70L10kJ18j29
$$ plain form
6137 50 222 78 -234 154 53 193 -30 86 170 157 -165 83 268 113 288 24 16 245 88 -47 -216 82
6159 82 102 29 195 114 -90 69 127 -87 -24 96 -82 -143 -219 14 127 -191 -69 -140 96 339 79 138 -132
6182 -132 -156 182 -160 78 -249 290 -167 -214 88 -121 251 82 -261 169 -14 -129 288 -69 120 -151 -5
6203 -5 91 84 -171 -171 22 248 224 181 -139 -27 -248 -29 9 -105 -27 125 218 81 89 -123 -173 -24 -98 -118 1 -18
6229 -18 -11 184 136 150 -128 -45 -165 -22 -34 74 -88 76 106 -311 -201 -150 -245 -121 -40 -197 259 -8 110 170
6253 170 327 -23 -87 10 -26 -3 243 -226 -158 91 -75 -165 -132 63 252 184 -31 -166 182 188 -172 126 40 -262
6277 -262 -148 226 -73 3 -62 -43 -201 44 -167 -19 142 -125 -33 178 -118 -57 241 -55 -109 -125 -99 76 41
6300 41 209 -7 162 103 -278 107 78 -12 25 201 122 176 236 221 -20 213 46 -152 -129 -74 -154 -202 -44 18 114
$$ packed form
6137E0J72j44l12L88j01J40k23J16Q4j3l22K48J85j55J75k64qK29j57j35j69K98
6159H2K0p3J66q1k04J59N8k14O3J20j78o1p6K33J13l18J22p1K36K43k60N9k70
6182a32k4L38l42K38l27N39m57m7L02k09L72j69l43M30j83j15M17l57J89k71J46
6203eR6pk55%J93K26k4m3l20J12k21K19L8j14P8J52R3j37Qk12n0J49p4k0J19j9
6229a8PJ95m8J4k78Q3j20J43j2J08j62J64L0m17J10N1r5J24Q1j57M56k67J18O0
6253A70J57l50o4R7l6K3K46m69O8K49j66r0L3J95J89o8k15j35L48Ol60K98q6l02
6277b62J14L74k99P6o5J9j58K45k11J48J61k67R2K11k96O1K98k96n4j6K6J75l5
6300D1J68k16J69n9l81L85k9r0L7J76p9N4O0j5k41K33j67j98K3N5q0m8J58O2R6
$$ plain form
6325 114 -370 -35 -330 151 74 133 264 -117 -48 37 -78 28 -111 -95 150 167 95 -146 13 76 -152 -21 -4
6348 -4 40 229 -86 -131 49 225 -104 10 -14 -38 87 -55 233 265 337 86 57 63 28 -63 129 16 -334 -105
6372 -105 -112 -47 -85 -2 -143 -42 -183 -77 -42 75 15 -11 -85 23 -45 -150 272 51 223 52 114 44 39 84 -55
6397 -55 30 -100 158 203 180 145 -95 79 -134 227 60 -143 34 -104 -20 -154 -110 -75 97 26 3 9 85 -66
6421 -66 88 174 -34 85 -135 -22 -32 -323 145 205 -177 -51 116 72 207 1 -62 185 138 22 59 281 -134
6444 -134 -97 -169 -239 -9 400 -130 6 156 -206 187 -30 4 -235 13 27 27 37 38 -11 77 87 63 169 -183 31
6469 31 -42 -305 -92 139 -183 98 245 -302 -7 -120 -53 -19 -111 222 -153 47 131 -201 -106 -176 8 329 117
6492 117 66 139 -8 135 43 -30 -23 14 223 15 -150 159 -6 -9 47 38 20 47 71 56 48 -57 220 12 56 -151
$$ packed form
6325A14m84L35k95M81p7N9J31l81O9Q5j15J06j39J6K45J7p2k41J59O3k28J31J7
6348dM4J89l15m5J80J76l29J14k4k4J25j42K88L2P2k51k9Ol5r1J92j13l50K29
6372a05pO5l8Q3j41J01j41J06L5J17o0k6p4J08o8j05M22k21J72j71O2p0nM5j39
6397e5Q5j30K58M5k3l5k40J74k13L61j67k03J77j38Q4j34M4L5J72p1k3OP6j51
6421f6J54Q6k08J19k20J13j0k91M68O0l82J26J67m4J35k06o3K47m7j16L7K22m15
6444a34L7p2p0K30M09n30J36J50l62L93k17L4k39K48J4%J0Jm9Q8J0k4J06l52K14
6469C1p3k63K13K31l22K81J47n47K95j13O7L4r2L33l75K00Q4l32R5p0J84L21k12
6492A17n1P3j47J43r2p3PL7K09k08j65L09j65lN6rj8K7K4j5qj05K77k08M4k07
$$ plain form
6518 -151 -121 89 -216 -341 -79 -182 211 -37 104 -126 -147 -73 -294 117 258 -131 -77 -114 78 -66 -205 -88
6540 -88 -152 -3 13 399 83 -180 140 -34 45 -55 -203 -85 37 177 383 -91 -20 -160 -11 178 -58 21
6562 21 -78 158 189 253 207 159 269 6 36 38 -79 75 0 -145 6 335 44 60 133 -3 -154 34 73 -58
6586 -58 34 -102 -118 -101 309 210 -316 -195 -89 115 52 186 97 182 39 148 122 4 -25 187 82 -156 169
6609 169 54 62 -144 -31 -161 -133 184 83 -1 85 -99 -113 -37 -287 -123 -250 109 -225 -6 113 176 -36 -125
6632 -125 216 -170 138 -37 63 -36 -105 87 186 82 -152 -175 114 -171 -204 -298 151 -263 -40 28 -256 111
6654 111 -8 -204 255 70 -97 126 69 -128 -86 38 119 76 119 -263 45 153 348 112 127 -42 185 269
6676 269 19 4 32 77 23 -12 -10 154 159 -39 -176 79 177 -142 115 187 -84 -138 123 48 10 37 -152 155 2
$$ packed form
6518a51L0K10l05j25K62j03L93k48J41k30k1P4k21M11J41l89N4l7J92j44j39J17
6540h8o4J49J6L86l16k63L20j74P9j00j48J18J22J40K06m74P1j40J49J89k36P9
6562B1r9K36L1O4m6m8J10k63L0Kj17J54p5j45J51L29k91J6P3j36j51J88L9j31
6586e8R2j36j6J7M10r9n26J21J06K04o3J34q9Q5j43J09k6j18k9K12j05k38L25
6609A69j15Qk06J13j30K8L17j01q4Q6j84j4P6k50J64j27L59l34K19J19O3k12q9
6632a25L41l86L08j75J00r9o9J92R9j04k34k3K89k85l3r4M49m14K23O8k84L67
6654A11j19j96M59j85j67K23n7j97M2J24Q1m3M3l82L08J08J95k36J5j69K27Q4
6676B69k50j5K8M5n4l5KJ64Nj98j37K55R8l19K57P2k71n4K61p5l8K7j89L07j53
$$ plain form
6701 2 26 34 46 139 -176 -114 -199 -137 -66 113 -77 -165 138 -12 38 129 135 -66 -292 48 -65 -60 -200 226 125 -184
6727 -184 108 238 -94 -174 171 166 -3 49 197 -1 179 -174 119 117 -236 -44 159 -24 14 85 38 90 -5 -207
6751 -207 -238 -99 -74 -32 -74 185 -8 -267 -183 189 40 -27 -51 -37 50 82 -143 -131 -42 128 -19 -181 2 -114
6775 -114 -67 464 24 -29 -191 -31 32 -51 -47 42 -60 86 -138 46 -40 -33 -75 51 -171 -253 176 127 26 39 -91
6800 -91 363 -146 -93 17 164 -124 113 -218 -173 -56 -73 17 -176 -35 -117 109 -25 202 -261 21 9 -274
6822 -274 -12 171 213 108 2 -30 109 56 18 164 -75 -36 94 1 152 8 -44 259 172 -185 -327 -120 146
6845 146 -70 10 181 85 122 131 -136 93 -195 89 -86 208 -282 100 -239 -350 -24 232 -57 96 -184 220
6867 220 -80 -178 8 -112 5 44 -139 53 119 -52 -103 41 114 -67 -16 -13 41 -107 192 -90 -208 200 -256
$$ packed form
6701BK4QJ2R3l15O2q5O2P1J79j90q8L03j50N0R1Ok01k26L40j13Nj40M26j01l09
6727a84K92J30l32q0L45nj69N2J48j98J80l53K93kl53J92K03j83L8P1m7N2r5k02
6751b07l1J39K5M2m2K59j93k59Q4L72j49o7k4J4Q7L2k25J2Q9J70j47j62J83j16
6775a14M7N31m40n3j62J60O3q3MQ9j02J46k24J84q6Pm2J26k22q2M29m9j01J3j30
6800i1M54n09N3J10J47k88K37l31M5J17j7R0j93J41q2K26j34K27m63K82j2k83
6822b74K62J83M2j05j06l2J39n3l8J46k39L9J30r3J51j44n2L03q7l57j42K07K66
6845A46k16Q0J71r6L7Rk67K29k88K84j75K94m90L82l39j11L26K56k89J53k80M04
6867B20l00r8J86j20J17L9j83J92O6j71n1J44P3j81N1LN4j48K99k82j18M08m56
$$ plain form
6890 -256 -39 -210 4 -41 -15 178 58 268 11 106 374 299 46 -184 27 25 -194 -90 273 -93 -65 90
6912 90 50 -271 133 82 268 -129 -21 159 -156 71 70 215 -229 5 37 -25 -194 98 -93 100 136 -100 17
6935 17 -49 -130 53 28 -142 218 106 -2 -130 -110 190 -172 -32 302 -104 -20 -233 -48 61 146 -198 -211 -99
6958 -99 -17 -105 101 -109 -13 -53 145 62 68 -134 -167 231 8 127 86 -33 62 27 -32 -63 -90 -353 -19 120 76
6983 76 -164 166 -53 197 -280 -2 36 -154 15 76 7 -84 29 -77 -222 -79 -74 124 24 227 277 192 -38
7006 -38 58 -93 234 44 194 54 -19 -271 79 424 -103 55 199 -123 114 -4 -12 -92 60 -213 -195 235
7028 235 -50 -33 -117 -104 -224 70 -128 141 141 66 90 267 100 104 298 -92 -45 300 -64 -76 194 -118 27 320
7052 320 -28 73 -243 206 -105 -2 66 -32 -131 21 -92 -77 -13 256 -100 97 -216 143 -120 -33 5 123
$$ packed form
6890b56K17j71K14m5K6J93j20K10k57R5K68p5k53k30K11kk19J04L63l66K8J55
6912I0m0l21M04n1J86l97J08J80l15K27jJ45m44K34L2o2j69K92j91J93L6k36J17
6935A7o6q1J83k5j70L60j12j08j28K0L00l62J40L34m06Q4k13J85J09Q5l44j3J12
6958i9Q2q8K06k10R6m0J98q3Ok02l3L98k23J19m1j19R5l5n9l1k7k63L34J39m4
6983G6k40L30k19K50m77K78L8j90J69O1o9r1J13j06j45J43NJ98j00K03N0q5k30
7006c8R6j51L27j90J50j40p3k52L50L45n27J58J44l22K37j18qq0J52k73J8M30
7028B35k85J7q4J3j20K94j98K69%p5K4J77j67MJ94l90M7L45l64j2K70l12J45K93
7052C20l48J01l16M49l11J03O8r8r9J52j13J5O4K69l56J97l13L59k63Q7L8J18
$$ plain form
7074 123 28 101 46 -8 231 -279 83 133 -51 -259 145 -3 78 176 -44 26 -43 46 -6 135 -69 -96 -22 360
7098 360 234 100 -43 42 198 -65 -93 -58 -33 81 -4 124 2 -172 1 -22 -174 -23 -128 65 196 283
7120 283 -214 255 24 -26 378 -52 -353 -27 127 34 66 15 40 -300 113 -56 76 195 -289 133 -23 91
7142 91 83 -81 -166 -71 92 78 121 -81 -9 110 -150 206 43 116 265 99 217 151 147 -49 -98 -95 -14 69 178 -122
7168 -122 173 114 35 -147 -113 137 -85 93 82 25 -187 -35 -180 -25 42 -36 -29 -91 -217 237 172 238 -174 -166 -97
7193 -97 44 167 -242 -125 -42 -1 -191 150 96 45 304 62 11 -2 116 117 110 5 -40 177 -5 -192 -103 -4 -54
7218 -54 9 53 1 -14 105 441 119 -40 309 -18 -4 95 101 109 -19 24 -150 131 -245 160 -37 -29 177 -69 23
7243 23 -29 -65 -146 12 79 224 45 31 94 -173 -8 -70 -5 -103 -105 -22 -254 139 -56 -108 26 87 -6 19 40 -78
$$ packed form
7074A23r5P3n5n4K39n10L62N0j84k08M04j48Q1R8k20P0o9Q9n2J41k04k7P4L82
7098C60j26j34j43Q5J56k63k8L5K5J14q5J28j22j74J73k3j52J51j05J93J31Q7
7120B83m97M69k31n0M04m30l01L26J54r3L2n1K5l40M13j69J32J19m84M22j56J14
7142I1qj64q5R5J63j4M3k02P2J19k60L56j63P3J49j66J18o6mj96m9LQ1Q3J09l00
7168a22K95n9p9j82L4K50k22J78j1n7k12J52j45J55O7p8Po2j26M54o5O6m12QO9
7193i7J41J23m09J17Q3M1j90L41n4n1K59k42n1j3J18Jpj05m5K17j82j87Q9R9n0
7218e4O3M4n2j5J19L36l22j59L49l27J4R9OQj28M3j74K81l76M05j97QK06k46R2
7243B3n2l6q1J58O7J45j79j4O3k67J65o2O5r8kQ3k32L93j95n2J34O1r3K5K1j18
$$ plain form
7269 -78 -20 -150 134 123 -132 -21 -119 9 164 63 -83 135 -82 20 70 -9 200 -4 216 88 -64 -122
7291 -122 108 19 -37 166 231 110 -99 84 -67 -25 -41 -63 29 -27 -66 42 25 123 -138 152 154 317 -284 -63
7315 -63 270 -207 77 -94 7 -23 91 50 -211 25 -58 -14 4 -213 116 49 -88 220 13 307 -144 -189 27
7338 27 -36 -46 102 -121 225 32 -301 64 13 -95 120 51 -82 -12 57 211 -81 10 -69 16 168 -12 51 -4
7362 -4 127 195 -140 45 -15 -40 -227 29 -95 -30 -54 90 -27 -83 28 -117 183 154 443 -130 7 24 196
7385 196 5 35 148 146 192 -99 11 30 -118 -388 48 -165 36 -8 88 -78 -105 204 87 162 -143 -136 62 -168
7409 -168 -124 27 479 16 -100 200 -270 237 -38 -133 73 160 23 -112 -255 -316 -140 38 240 -176 83
7430 83 -103 -67 -39 -39 -8 107 -481 -18 139 153 -70 125 23 -59 183 -84 -90 146 150 -82 -30 -229 -241 78 308
$$ packed form
7269g8N8j30K84j1k55J11r8J28J55j01j46K18k17J02N0p9K09k04K20j28j52n8
7291a22K30q9n6K03O5j21k09J83j51M2j6k2R2n6l9J08j7R8k61K90KJ63o01K21
7315f3L33m77K84j71J01l0J14m1k61K36q3M4J8k17L29o7j37L08k07K94m51m5K16
7338B7o3j0J48k23L46j93l33L65n1j08K15o9j33P0O9J54k92R1p9Q5J52j80O3n5
7362dJ31O8l35J85o0k5j87K56j24O5k4J44j17n6J11j45L00k9K89n73J37J7J72
7385A96j91L0J13kM6k91J10J9j48k70M36k13K01m4R6j66k7L09j17P5l05PJ98k30
7409a68M4J51M52m63j16L00m70N07k75r5K06Q7j37j35j43o1J76J78K02m16K59
7430H3j86L6K8%L1J15n88M63J57J4k23J95j02q2K42k67oK36Mk32N2j99j2L19K30
$$ plain form
7455 308 -257 -155 251 7 198 13 -117 38 -157 -10 -45 -120 -231 -112 -238 7 -73 69 99 -175 83
7476 83 -194 -98 -182 60 249 -66 58 123 -30 -4 0 -332 89 79 4 -226 41 -124 -12 176 -46 125 -51
7499 -51 29 -184 -211 -8 94 -306 257 157 -31 -152 -157 -18 -165 -75 40 87 219 -91 -136 91 44 72 -10 67
7523 67 171 -211 -15 277 -114 -192 91 -112 -64 -158 -239 49 -159 -58 240 -6 -141 19 -43 -268 -38 -61
7545 -61 -35 -319 -81 210 100 -230 126 -74 -47 73 -38 113 -48 -137 -260 -4 -281 -11 12 -103 -151 311
7567 311 128 -311 -181 115 68 -4 -266 249 -72 -25 6 -31 198 63 -63 -156 195 6 -124 -21 -126 93
7589 93 -115 18 -76 -76 62 -18 -132 -146 64 75 34 -124 142 287 -390 -37 18 17 108 -127 -118 -9 -203 -169 59
7614 59 -131 -157 47 -213 -45 -1 -37 74 -155 240 -280 -34 -31 -170 -169 -62 -18 -21 -110 -25 21 6 23 -12 -157 91
$$ packed form
7455C08n65J02M06k44J91j85j30J55j95J47l5p5j11J19j26K45q0J42L0k74K58
7476H3k77R6q4K42J89l15J24O5j53K6Ml32M21j0p5k30K67j65J12J88k22J71j76
7499e1Q0k13k7K03J02m00N63j00j88j21nJ39j47R0J15M7J32l10m5K27m7K8q2P7
7523F7J04l82J96K92l91p8K83k03M8r4q1K88k08J01K98k46j35J60o2k25K30k3
7545f1K6k84K38K91j10l30L56k00K7J20j11J51j61q9j23K56k77K70K3j15m8M62
7567C11j83m39J30K96m7p2k62N15l21M7L1l7K29j35j26r3L51j89j30J03j05K19
7589I3k08J33r4%J38q0j14j4K10J1m1j58K66J45o77L53N5jR1k35RJ09j94L4K28
7614E9j90k6K04k60J68M4l6J11k29L95n20K46Lj39JJ07M4lq9Q5M6j5J7l5j45K48
$$ plain form
7640 91 12 58 82 -127 115 17 -43 5 -20 -124 -31 274 39 29 -84 137 -11 30 -37 25 -156 -60 -134 -237 -115
7665 -115 36 124 200 30 -45 -111 162 -140 27 245 175 -4 -194 221 -132 53 3 -72 -49 -307 -44 -90 32
7688 32 -83 -14 0 43 234 -3 -110 -174 55 -28 26 11 -118 25 42 51 -72 -66 38 188 -200 -67 -170 -26
7712 -26 290 35 -163 84 -132 -99 303 -140 85 -37 112 -18 -112 -210 -59 142 187 -23 223 335 141 -116
7734 -116 -42 -148 44 -22 175 30 -46 -88 -48 63 -174 -21 -66 99 -176 -107 -204 144 88 -119 204 67 -67
7757 -67 -272 -21 29 154 42 59 227 -150 -133 347 -144 113 -22 63 -88 -53 100 26 12 78 -256 -102 182
7780 182 -23 271 -191 -115 4 168 -91 -60 -32 110 -135 -84 70 86 232 -153 -50 -55 -170 178 -51 -221
7802 -221 117 -132 -7 -62 -59 99 -88 -35 120 223 153 -140 -91 154 167 194 -151 -43 134 112 -12 -90 -62 67
$$ packed form
7640I1p9M6K4k09K42r8o0M8k5j04R3L05k35j0j13K21j48M1o7O2j81R6p4j03J22
7665a15J51Q8P6j70p5o6K73l02J67K18p0j79j90M15l53J85n0p5K3k58K63m6J22
7688C2j15O9J4M3J91k37j07o4K29q3N4j5j29J43J7Rj23OJ04J50l88J33j03J44
7712b6L16k55j98K47k16L3M02m43K25j22J49j30r4r8J51K01M5k10K46J12j94k57
7734a16P4j06J92o6J97j45p6m2M0J11k37J53m5J65k75O9r7L48n6k07L23j37j34
7757f7k05K51N0J25j12J7J68l77J7M80m91K57j35Q5j51L5J53p4j4O6l34J54K84
7780A82k05K94m62P6J19J64k59L1K8J42k45N1J54J6J46l85J03nj15L48k29j70
7802b21L38k49J25n5LJ58j87N3J55J03p0k93M9K45J3K7l45J08J77k2j24p8K8J29
$$ plain form
7826 67 -132 -131 -177 -67 35 5 165 -168 -26 -323 146 -63 89 -241 -193 80 4 80 -56 -111 266 15 44
7849 44 249 -259 99 278 -166 -21 242 -132 157 167 -211 139 169 18 -194 237 4 -172 -160 -236 25 136
7871 136 55 166 -192 -41 -42 109 -109 -200 -132 31 -1 110 71 113 -81 301 84 0 -15 -39 21 168 301 -56
7895 -56 -262 252 -82 41 42 -36 -95 -220 -204 -27 -68 -21 -178 -35 96 -129 60 238 -27 8 127 -119 -33
7918 -33 30 -5 241 261 -195 164 -205 -80 155 51 -191 251 -62 -5 -155 404 24 -29 63 -2 118 101 -30
7941 -30 75 106 163 18 -238 -26 201 88 192 -98 20 67 40 -13 -91 -39 -93 132 -107 -280 5 -342 150
7964 150 -131 116 -51 -193 202 -80 291 -108 -46 -32 -177 102 371 36 -280 -208 59 126 140 120 112 45 -2
7987 -2 20 -122 121 -156 -94 -185 211 157 -70 122 -344 133 -164 85 -156 -69 -58 -155 -121 137 73 41 87 -4 21
$$ packed form
7826F7j99Jm6J10J02l0J60l33J42k97M69k09J52l30M8K73p6P6j36n5L77k51K9
7849D4K05n08L58J79m44J45K63l74K89J0l78L50L0j51k12M31k33j76J2p6K61J11
7871A36q1J11l58J51jJ51k18r1O8J63l2J11l9M2j94L82k17q4j5k4O0J47J33l57
7895e6k06N14l34J23Jp8n9j25J6J77m1M7j57J43J31k25J89J78k65L5J19k46Q6
7918c3O3l5K46K0m56L59l69J25K35j04k42M42l13N7j50N59l80n3R2o5J20j7j31
7941c0J05L1N7j45k56K12K27j13J04k90J18M7k7n3p8N2n4K25k39j73K85l47M92
7964A50k81K47j67j42L95k82L71l99O2J4j45K79K69l35l16P2K67O7J4k0qo7m7
7987bK2j42K43k77O2r1L96n4k27J92m66M77k97K49k41Q7J1r7L4K58o4l2M6r1K5
$$ plain form
8012 21 -314 244 -88 84 -111 225 -48 -241 -50 -116 172 -103 247 305 -45 -95 -30 39 -26 -312 12 -38 -133
8035 -133 -102 190 122 68 44 -42 -188 91 142 -103 -19 -359 -229 43 148 -178 -58 234 -143 -149 36 -71 49
8058 49 -22 148 79 -37 -17 243 272 -273 201 73 -121 -190 -100 -104 178 -39 -259 81 125 107 -54 19 3 76 -138
8083 -138 -58 -271 143 25 -339 -54 -37 -45 -121 -249 296 -116 -212 51 -141 -263 134 255 32 97 53 -44 -127
8106 -127 -190 34 290 -41 147 -40 285 34 13 -22 125 -13 -167 -187 -378 -9 138 -110 -31 193 -124 70
8128 70 -57 48 -56 -45 96 15 -95 -277 -5 163 95 264 -21 -122 -35 149 178 133 8 342 -42 70
8150 70 -112 10 106 -358 -7 89 16 102 1 38 73 80 158 77 -288 48 -120 -3 -2 -285 -6 -20 36 74 239
8175 239 -351 -17 156 137 -95 0 -107 11 -70 -88 46 -120 57 61 -73 -100
$$ packed form
8012B1l35N58l32J72j95L36k73j93J91o6K88k75L50N8l50n0O5O9o5k86L24n0r5
8035a33L1K92o8n4k4q6j46K79N1k45Q4l40J30K72J05l26J20K92l77oJ85j07J20
8058D9p1J70o9j16K0K60K9n45M74j28j94o9R0mK82k17k20L40M4j8j61P3j6P3k14
8083a38Q0k13M14j18l64K85J7qp6j28N45m12r6K63j92j22L97J21k23O5m4r7q3
8106a27o3K24K56l31J88j87L25k51k1l5J47j38j54k0j91L69J47k48P9K24l17J94
8128G0j27J05j04J1J41q1j10j82K72J68o8J69k85j01Q7J84K9m5j25L34l84J12
8150G0j82J22R6m64L51R6p3Q6j01L7L5PP8q1l65L36j68J17Jk83K79j4N6L8J65
8175B39n90L34J73j9k32R5j07J18q1j8J34j66J77Mj34k7
8191a00
$$ Imaginary data points
##PAGE= N=2
##DATA TABLE= (X++(I..I)), XYDATA
$$ plain form
0 0 0 0 0 0 0 0 0 0 0 0 0 0 7 -8 8 -8 8 -16 16 -16 24 -25 32 -40 48 -50 63 -72 80 -95 104 -120 137 -154 176
35 176 -198 223 -249 280 -312 344 -384 425 -472 523 -576 637 -701 774 -854 940 -1035 1141
53 1141 -1257 1392 -1538 1709 -1902 2127 -2394 2714 -3105 3597 -4241 5118 -6393 8421 -12178
68 -12178 21514 -100230 -95280 54218 19523 106565 168564 90147 -9983 -31362 -115337 -152783
80 -152783 -82442 -9736 32797 119691 144948 87416 27931 -34201 -124513 -143663 -86482 -23925
92 -23925 33634 101160 130162 103473 36304 -38387 -98693 -128557 -106494 -29794 37554 79198
104 79198 126695 126213 32843 -48738 -74472 -113163 -121231 -40566 34474 69601 120167 123284 37455
117 37455 -29052 -62471 -119464 -122790 -40950 19572 56456 119803 125135 43667 -19194 -54868
$$ packed form
0@%%%%%%%%%%%%Pj5J6j6J6k4L2l2M0m9N7p2Q8r8J13j35J52j75J99k24K57k91L30
35A76l74M21m72N29n92O56p28Q09q97R95j099J213j338J475j628J794j975K176
53A141k398K649k930L247l611M029m521N108n819O702p838R359j1511J4814k0599
68a2178L3692j21744M950J49498l4695Q7042O1999p8417j00130k1379q3975l7446
80a52783P0341P2706M2533Q6894K5257n7532n9485o2132r0312j9150N7181O2557
92b3925N7559O7526K9002k6689o7169p4691o0306k9864K2063P6700O7348M1644
104G9198M7497m82r3370q1581k5734l8691q068Q0665P5040L5127N0566L117q5829
117C7455o6507l3419n6993l326Q1840O0522L6884O3347N332q1468o2861l5674
$$ plain form
129 -54868 -110352 -119436 -51611 11651 55131 107837 117083 55994 -8352 -51114 -99988 -118164
141 -118164 -66448 3858 52428 97198 114873 66413 -2299 -46617 -89109 -113284 -71385 -2680
153 -2680 42505 86266 113740 74797 6730 -39161 -84393 -112706 -75656 -8603 38326 79682
165 79682 105971 76069 15763 -33440 -75942 -102872 -83099 -24549 33344 75914 98831 84102
177 84102 29720 -32056 -72725 -93096 -83919 -30875 30537 65474 87878 88908 37467 -28357
189 -28357 -63293 -88337 -92430 -39427 25419 57568 85978 93411 39711 -21956 -51358 -82299
201 -82299 -91986 -41968 16221 48229 82704 92141 44143 -11293 -47117 -82888 -90484 -46331 5805
214 5805 44600 80622 87456 49571 170 -42607 -77567 -83480 -52417 -5398 41470 75237 81375
$$ packed form
129e4868n5484r084O7825O3262M3480N2706R246o1089o4346m2762m8874j8176
141a18164N1716P0306M8570M4770J7675m8460o8712m4318m2492k4175M1899O8705
153b680M5185M3761K7474l8943o8067m5891m5232k8313L7050O7053M6929M1356
165G9682K6289k9902o0306m9203m2502k6930J9773N8550N7893M2570K2917j4729
177H4102n4382o1776m0669k0371R177N3044O1412L4937K2404J030n1441o5824
189b8357l4936k5044m093N3003O4846L2149K8410P433n3700o1667k9402l0941
201h2299r687N0018N8189L2008L4475R437m7998n5436l5824l5771p596M4153N2136
214E805L8795L6022O834l7885m9401m2777l4960n913L1063M7019M6868L3767O138
$$ plain form
227 81375 55857 9611 -39848 -73071 -80586 -59783 -11596 38875 68079 77579 62788 15571
239 15571 -35934 -64577 -76262 -64461 -18135 32224 61253 76714 67153 20029 -30312 -59146
251 -59146 -75041 -66275 -22622 25616 55704 73686 66352 25331 -20200 -52637 -73706 -67446 -27904
264 -27904 17903 51673 72503 67279 29950 -14948 -49565 -70129 -66373 -33055 9910 46659
276 46659 68719 66067 35527 -7097 -44466 -67448 -66333 -37783 5255 43559 65030 64419 39462
289 39462 -936 -40293 -64284 -64784 -41186 -2250 36809 61610 64901 43962 4099 -35832 -60025
302 -60025 -62902 -44355 -7238 32758 58800 62805 44761 9504 -28944 -56327 -63337 -46979 -12307
315 -12307 26714 54358 62417 47841 14673 -23832 -52408 -61360 -47760 -16468 21039 50402
$$ packed form
227H1375k5518m6246m9459l3223p515K0803M8187N0471K9204R500j4791m7217
239A5571n1505k8643j1685J1801M6326N0359K9029J5461r561m7124n0341k8834
251e9146j5895Q766M3653M8238L0088J7982p334m1021m5531l2437k1069O260L9542
264b7904M5807L3770K0830n224l7329m4898l4617k0564L756L3318M2965L6749
276D6659K2060k652l0540m2624l7369k2982J115K8550M3038L8304K1471o11k4957
289C9462m0398l9357k3991n00K3598L8936L9059K4801L291k0939l9863l9931k4193
302f0025k877J8547L7117L9996K6042M005j8044l5257l8448k7383p010J6358L4672
315a2307L9021K7644Q059j4576l3168l8505k8576q952J3600L1292L7507K9363
$$ plain form
327 50402 60791 48638 18118 -18648 -47634 -60029 -50317 -21064 16139 46694 58846 49900
339 49900 22726 -12515 -43806 -58411 -49834 -23302 10478 40876 56905 51457 26040 -8865
351 -8865 -40408 -56040 -50789 -27733 5198 37960 56052 51020 28212 -3127 -34242 -53686 -51418
364 -51418 -30041 1174 32969 52552 51264 30924 766 -30813 -51510 -51270 -32462 -2959 28295
377 28295 49832 51593 33787 4931 -25367 -47539 -51353 -35172 -6991 23471 46578 51314 35350
390 35350 8713 -21046 -45339 -51555 -36160 -9871 18566 42968 50194 37108 12097 -16852
402 -16852 -42187 -49800 -37623 -14324 14473 40164 49955 38937 15609 -13374 -38322 -48083 -39713
415 -39713 -17635 11620 36624 46734 39973 18876 -9933 -34168 -46480 -41334 -19542 8800
$$ packed form
327E0402J0389j2153l0520l6766k8986j2395R712K9253L7203L0555J2152q946
339D9900k7174l5241l1291j4605Q577K6532L3780L0398J6029n448k5417l4905
351h865l1543j5632N251K3056L2931L2762J8092n032k2808l1339l1115j9444K268
364e1418K1377L1215L1795J9583j288k0340l0158l1579k0697K40J8808K9503L1254
377B8295K1537J761j7806k8856l0298k2172l814J6181K8181L0462K3107M736j5964
390C5350k6637k9759k4293o216J5395K6289K8437K4402P226j3086k5011k8949
402a6852k5335p613J2177K3299K8797K5691R791j1018k3328k8983k4948r761Q370
415c9713K2078K9255K5004J0110o761k1097k8809k4235j2312N146K1792K8342
$$ plain form
427 8800 32139 45400 42407 20973 -6997 -29929 -44709 -42472 -21592 4883 27973 44459 42952
440 42952 21882 -2716 -25741 -43639 -42457 -22757 982 24458 42849 41843 23843 1266
452 1266 -23483 -42503 -41697 -25407 -3013 22436 40582 41431 27473 4481 -21431 -38595 -39977
465 -39977 -29117 -6292 20089 37095 40547 29766 6220 -19054 -34746 -40708 -31904 -7056 17839
478 17839 32956 40547 32614 8658 -14629 -31892 -40831 -32444 -9063 12404 30368 41061 32578
491 32578 10291 -10716 -29349 -40407 -32662 -12821 9092 29626 39134 31963 14701 -6808 -29045
504 -29045 -38563 -31892 -16053 5839 27422 36649 32683 18228 -5604 -26951 -35370 -33177 -20110
517 -20110 4973 25289 33757 33851 20838 -4063 -23392 -32649 -34690 -21529 2850 21943 32600
$$ packed form
427H800K3339J3261k993k1434k7970k2932j4780K237K0880K6475K3090J6486j507
440D2952k1070k4598k3025j7898J182J9700K3739K3476J8391j006j8000k2577
452A266k4749j9020Q06J6290K2394K5449J8146Q49j3958k2992k5912j7164j382
465c9977J0860K2825K6381J7006L452j0781k3546k5274j5692n962Q804K4848K4895
478A7839J5117P591p933k3956k3287j7263q939Q387K3381K1467J7964J0693q483
491C2578k2287k1007j8633j1058P745J9841K1913K0534R508p171j7262k1509k2237
504b9045r518O671J5839K1892K1583R227l966j4455k3832k1347q419K193J3067
517b0110K5083K0316Q468R4j3013k4901j9329r257k041J3161K4379J9093J0657
$$ plain form
530 32600 35342 21528 -1140 -19205 -32658 -35630 -21616 -106 17488 31448 35371 21998 1953
543 1953 -16727 -31341 -34395 -22780 -3839 15829 31153 33746 23558 5820 -14983 -30319 -32532
556 -32532 -24867 -7374 14566 29349 31831 25480 8745 -13703 -27501 -31406 -26433 -9532 12400
569 12400 26023 31099 27594 9710 -11773 -25064 -30368 -27825 -11324 9988 24481 30845 27396
582 27396 12187 -7751 -22768 -30869 -27830 -13160 6952 22736 29779 27390 14562 -5564 -23015
595 -23015 -29235 -26806 -15819 3908 22073 28715 26830 16758 -2581 -20888 -28015 -26938 -17885
608 -17885 1947 19619 26903 27398 19059 -599 -18695 -26551 -27247 -19006 -557 16526 26258 28066
622 28066 18924 996 -15569 -25509 -27548 -19123 -3267 14179 26129 27968 18927 4573 -12780
$$ packed form
530C2600K742j3814k2668j8065j3453k972J4014K1510J7594J3960L923j3373k0045
543A953j8680j4614l054J1615J8941J9668J5324K593j0188j7738k0803j5336k213
556c2532P665J7493K1940J4783K482o351j6735k2448j3798l905M973J6901K1932
569A2400J3623N076l505j7884k1483j3291n304K543J6501K1312J4493O364l449
582B7396j5209j9938j5017q101L039J4670K0112J5784P043k389j2828k0126j7451
595b3015o220K429J0987J9727J8165O642j885j0072j9339j8307p127J077R053
608a7885J9832J7672P284M95q339j9658j8096p856o96Q241J8449J7083R732J808
622B8066r142j7928j6565r940k039Q425J5856J7446J1950J839r041j4354j7353
$$ plain form
635 -12780 -25736 -27217 -19558 -6503 11952 25281 26149 19619 7421 -10925 -24979 -25686 -20214 -8441
649 -8441 10908 24163 25244 21152 9742 -10007 -22848 -24822 -22124 -10730 8911 21773 24601
662 24601 22275 11034 -7605 -20599 -24436 -23133 -11119 6743 19182 24274 23173 11691 -5403
675 -5403 -18181 -25062 -23101 -11811 3554 17326 24840 23120 12598 -2269 -16581 -24381 -22628
688 -22628 -13187 618 15916 24654 21901 13510 728 -14924 -24456 -22023 -14101 -1596 14532
701 14532 23453 22214 15101 2369 -13693 -23168 -21951 -15808 -3318 12421 21806 22136 16308 4087
715 4087 -11839 -21342 -22071 -17008 -4649 11190 20553 21871 17521 5472 -10172 -20337 -22012 -17412
729 -17412 -6259 8525 19311 22100 17732 6931 -7541 -18517 -22080 -18346 -7568 6644 17899
$$ packed form
635a2780j2956j481P659J3055J8455J3329Q68o530j2198j8346j4054p07N472J1773
649h441J9349J3255J081m092j1410j9749j2841j974K698J1394J9641J2862K828
662B4601k326j1241j8639j2994l837J303J2014J7862J2439N092j101j1482j7094
675e403j2778o881J961J1290J5365J3772P514j720j0522j4867j4312p800J753
688b2628R441J3805J5298Q738k753q391j2782j5652r532K433P922J2505J6128
701A4532Q921j239p113j2732j6062r475J217O143J2490J5739R385L30n828j2221
715D087j5926r503p29N063J2359J5839R363J318m350j2049j5644j0165j675M600
729a7412J1153J4784J0786K789m368j0801j4472j0976l563L734J0778J4212J1255
$$ plain form
742 17899 22204 18480 8036 -5046 -16825 -22004 -18995 -8700 4838 16221 21526 18831 9497
755 9497 -3319 -16086 -21855 -18747 -9757 2412 15076 21538 18952 10123 -1550 -14268 -21103 -18923
769 -18923 -11167 612 13371 20433 19196 11461 379 -12878 -20175 -19152 -12146 -1299 11951
782 11951 19461 19234 12637 1828 -11095 -18694 -19123 -13636 -2384 10521 18808 19704 14028 2878
796 2878 -9485 -17838 -19220 -14299 -3353 9042 17267 19290 14789 4323 -7699 -16513 -19312 -15203
810 -15203 -4804 7061 16236 19532 15407 5113 -6384 -15374 -19377 -15336 -5923 5385 14975 19200
824 19200 15581 6563 -4466 -14154 -18835 -15962 -7259 3682 13623 18488 16052 8150 -3044 -13127
838 -13127 -18236 -16321 -8434 2422 12427 17844 16892 9175 -1638 -11663 -17280 -17072 -9775 966
$$ packed form
742A7899M305l724j0444j3082j1779n179L009J0295J3538J1383N305k695r334
755I497j2816j2767n769L108Q990J2169J2664O462k586q829j1673j2718o835K180
769a8923P756J1779J2759P062j237p735j1082j3257p297J023P006J0847J3250
782A1951P510k27o597j0809j2923p599m29N487J1252J2905Q287Q96n676j1150
796B878j2363q353j382M921J0946J2395Q225K023m501j0466j2022q814k799M109
810a5203J0399J1865R175L296m125j0294j1497q990m003M041R413J1308R590M225
824A9200l619r018j1029r688m681K873Q703J0941R941M865k436p902j1194j0083
838a3127n109J915P887J0856J0005N417r52p717j0813j0025n617K08P297J0741
$$ plain form
852 966 11386 16902 16769 10338 -396 -10693 -16831 -16786 -10517 -303 9941 16300 17196 11098 1015
867 1015 -9165 -15998 -17113 -11342 -1841 8443 15427 17040 11825 2346 -7790 -14905 -16509 -12308
881 -12308 -3081 7173 14627 16558 12874 3712 -6585 -14167 -16345 -13080 -4569 5897 13488 16030
895 16030 13470 4838 -5540 -13063 -15766 -13814 -5554 4787 12437 16055 13940 5915 -3950 -11660
909 -11660 -15828 -14299 -6448 3367 11495 15658 14212 7032 -2692 -10835 -15393 -14469 -7378 1623 10254
924 10254 15141 14489 8083 -1145 -9613 -14820 -14440 -8356 642 9588 14632 14072 9057 299 -8573 -14285
940 -14285 -14339 -9384 -878 8366 13713 14211 10172 1642 -7940 -13158 -14260 -10230 -2185 7243 12763 14069
956 14069 10511 2618 -6551 -12484 -13950 -10999 -3020 6377 11856 13739 11241 3461 -5214 -11594 -13629
$$ packed form
852I66J0420N516j33o431j0734j0297o138M5O269J0214J0244O359Q96o098j0083
867A015j0180o833j115N771R501J0284O984J613n215r479j0136p115j604M201
881a2308R227J0254P454J931l684r162j0297p582k178L265Q511J0466P591K542
895A6030k560q632j0378p523k703J952Q260J0341P650L618k115q025r865p710
909a1660m168J529P851R815Q128M163j446p180r724q143m558R24P091R001Q631
924A0254M887o52o406r228q468n207L80O084Q998Q946N044n60n015q758q872n712
940a4285n4M955Q506R244N347M98m039q530r582n218j102M030Q045R428N520J306
956A4069l558p893r169n933j466K951P979R397N479J883k498p780q675o380k035
$$ plain form
971 -13629 -11466 -4282 4768 11027 13920 11811 4325 -4389 -10817 -13300 -11770 -5320 3613 10347 13474
986 13474 11982 5546 -3171 -10259 -13335 -12018 -6046 2778 9693 12968 12229 6440 -1745 -9007 -13016
1001 -13016 -11997 -6450 1080 8669 12971 12203 6862 -699 -8149 -12516 -12072 -7540 -165 7871 12283
1016 12283 12135 8053 988 -7575 -12116 -11819 -8305 -1316 7227 11283 11815 8894 1878 -6435 -10900
1031 -10900 -11769 -9471 -2353 6127 10621 11777 9497 2274 -5408 -10316 -11731 -9530 -2693 4951 9364
1046 9364 11962 10095 3461 -4100 -9431 -11992 -10012 -3416 3851 9318 12092 9587 3742 -2831 -8808
1061 -8808 -11708 -9720 -4719 2209 8592 11628 9722 5077 -1529 -8282 -11603 -9747 -5660 905 8195
1076 8195 11133 10154 6212 -764 -7649 -10891 -9836 -6392 705 7286 10290 10294 6671 136 -7041 -10438
$$ packed form
971a3629K163P184R050O259K893k109p486q714o428k483J530O450Q933O734L127
986A3474j492o436q717p088l076J317N972Q824O915L275p39n789q185p262m009
1001a3016J019N547P530P589M302p68n341p561p450m367M44M532P375Q036M412
1016A2283j48m082p065q563m541K97L514O989Q543M056N32k921p016q313m465
1031a0900q69K298P118Q480M494J156k280p223p682m908j415K201O837P644M413
1046I364K598j867o634p561n331k561J980O596P267N467K774k505n845o573n977
1061h808k900J988N001O928O383L036j906m645o606o753l321J856M087O565P290
1076H195K938r79l942o976o885l242J055L444P097O581L004Ml623o535p177l397
$$ plain form
1092 -10438 -10394 -7006 -243 6526 10118 10332 7083 368 -5609 -9581 -10446 -7303 -1426 5129 9346 10871
1108 10871 7728 1669 -4565 -9210 -10616 -7554 -2030 4232 8922 10478 7686 2285 -3799 -8636 -10373
1123 -10373 -7991 -2997 3179 8437 10350 7648 3324 -2693 -8349 -10369 -8441 -3573 2340 7536 10081
1138 10081 8311 3958 -1834 -7335 -10279 -8661 -4420 1613 7210 9617 8526 4642 -1018 -6643 -9469
1153 -9469 -8486 -4973 666 6712 9293 9041 5477 -65 -5727 -9219 -8706 -5603 -195 5666 8904 8926
1169 8926 5990 261 -5243 -8901 -9211 -5861 -904 4742 8367 9253 6481 1178 -4062 -8384 -9432
1184 -9432 -6409 -1533 3901 7635 8870 6643 1642 -3527 -7870 -8726 -6778 -1925 2722 7326 9075
1199 9075 6856 2589 -2932 -7233 -9087 -6960 -2726 2413 6737 9173 7161 3357 -1959 -6519 -8656
$$ packed form
1092a0438M4L388O763O769L592K14l249o715n977l972q65L143N877O555M217J525
1108A0871l143o059o234m645j406L062N524O262M690J556k792n401o084m837j737
1123a0373K382M994O176N258J913k702m324o017n656k020J928M868N913N196K545
1138A0081j770m353n792n501k944J618M241O033N597K407j091l884n660n625k826
1153i469R83L513N639O046K581k52l564n542n662l492N13L103N408N861L238K2
1169H926k936n729n504l658l10L350M957N646L625Q86k772n303n240m322j048
1184i432L023M876N434L734J235k227n001n169m343q56J948M853M647M604J749
1199I075k219m267n521m301j854K127M234N139M324K436k012l804n316m560k137
$$ plain form
1214 -8656 -7516 -3292 1608 6138 8363 7431 3540 -1404 -5481 -8059 -7635 -4207 909 5670 7977
1229 7977 7640 4658 -435 -5274 -7877 -7766 -4609 419 4717 7783 8146 4952 176 -4431 -7841 -7990
1245 -7990 -4922 -186 4176 7700 8041 5087 518 -4047 -7258 -7849 -5559 -1082 3519 7089 7893 5710
1261 5710 1320 -2942 -6729 -7909 -5757 -1905 3178 6524 7781 5889 2248 -2449 -6165 -7538 -5991
1276 -5991 -2333 2203 5905 7797 6071 2694 -2021 -5552 -7495 -6496 -2669 1584 5483 7227 6452
1291 6452 3112 -1338 -5284 -7215 -6447 -3097 569 5089 7434 6560 3691 -821 -4934 -7069 -6643 -3872
1307 -3872 709 4340 6783 6706 3885 -20 -3994 -6680 -6859 -4281 -205 3996 6383 6876 4464 554
1323 554 -3748 -6313 -6536 -4675 -662 3478 6247 6798 4869 1000 -3142 -5823 -6691 -4706 -1419 2765
$$ packed form
1214h656J140M224M900M530K225r32l891m944m077k578M24L428N116M761K307
1229G977l37k982n093m839k603J11L157N028M298L066L63l194m776m607l410j49
1245g990L068M736M362L524L41k954m569m565l211n91K290M477M601L570Q04k183
1261E710m390m262l787j180K152L852N083L346J257j892l641m697l716j373J547
1276e991L658M536L702J892j726l377m715l531j943R99L827M253L899J744p75
1291F452l340m450l946j931P68L350L666M520K345q74k869m512m113k135M26K771
1307c872M581L631K443p7k821l905l974k686j79K578M076M201K387M93k412l910
1323E54m302k565k23J861M013M140K769N51j929l869m142k681q68J985L287M184
$$ plain form
1339 2765 5996 6908 4950 1341 -2365 -5704 -6685 -5042 -1731 2086 5491 6648 5337 2076 -1938
1354 -1938 -5140 -6601 -5345 -2255 1690 5046 6478 5583 2600 -1301 -4876 -6195 -5515 -2912 824
1369 824 4755 6184 5723 2871 -639 -4400 -6350 -5492 -3340 362 4338 6108 5803 3761 -364 -3916
1385 -3916 -5982 -5734 -3609 -32 3760 5683 5847 3828 132 -3411 -5928 -5939 -4088 -358 3130 5683
1401 5683 5957 4171 683 -2723 -5184 -5725 -4301 -1199 2742 4998 6198 4395 1305 -2544 -4956
1416 -4956 -5960 -4362 -1452 2252 4921 5559 4268 1852 -1933 -5026 -5608 -4794 -2005 1738 4537 5737
1432 5737 4976 2090 -1389 -4178 -5730 -5100 -2029 1079 4055 5552 4940 2643 -889 -3808 -5237 -5027
1448 -5027 -2889 726 3891 5621 5181 3123 -238 -3605 -5425 -4843 -2817 226 3422 5090 5045 3141
$$ packed form
1339B765L231R12j958l609l706l339r81J643L311L817L405J157j311l261m014
1354a938l202j461J256L090L945L356J432q95k983l901l575j319O80K603L736
1369H24L931J429m61k852l510l761j950Q58K152L702L976J770l05k042m125l552
1385c916k066K48K125L577L792J923J64k019l696l543k517j1J851L730L488K553
1401E683K74j786l488l406k461n41J424L102L941K256J200j803l090l849k412
1416d956j004J598K910L704K669O38j291k416l785l093n82Q14K789L743K799J200
1432E737p61k886l479k789j552O30L071L108K976J497o12k297l532k919j429K10
1448e027K138L615L165J730m40k058l361l367j820N82K026L043L196J668m5j904
$$ plain form
1464 3141 142 -3267 -5058 -5055 -3249 -312 2726 4850 5031 3412 673 -2639 -4813 -5228 -3381 -719
1480 -719 2394 4986 5074 3623 1014 -2370 -4674 -5464 -3805 -1242 1973 4455 5054 3868 1704 -1625
1496 -1625 -4328 -5096 -4235 -1656 1699 4325 5110 4196 2032 -1380 -3973 -5181 -4168 -2107 1006 3833
1512 3833 4884 4143 2332 -840 -3755 -4734 -4371 -2174 698 3484 4880 4403 2269 -404 -3148 -4769
1528 -4769 -4327 -2448 84 2916 4736 4754 2514 -36 -2710 -4530 -4689 -2988 -282 2651 4622 4523
1544 4523 3218 514 -2559 -4360 -4538 -2866 -681 2432 4299 4609 3180 630 -2066 -4341 -4436 -3306
1560 -3306 -997 2062 4038 4537 3229 1192 -1819 -3602 -4589 -3416 -1066 1501 3983 4495 3770 1388
1576 1388 -1265 -3549 -4662 -3851 -1464 1370 3547 4309 3816 1826 -1073 -3341 -4808 -3843 -1661 846
$$ packed form
1464C141k999l409j791LJ806K937L038K124J81j619k739l312k174m15J847K662
1480g19L113K592Q8j451k609l384k304p90J659K563L215K482N99j186k164l329
1496a625k703p68Q61K579L355K626P85r14k164l412k593j208J013K061L113K827
1512C833J051p41j811l172k915r79L63K197K872K786J396m77k134k673k744j621
1528d769M42J879K532K832J820J8k240k550k674j820j59J701K706K933J971r9
1544D523j305k704l073j801j78J672K185L113J867L10j429k550k696k275r5J130
1560c306K309L059J976M99j308k037l011j783r87J173K350K567K482N12p25k382
1576A388k653k284j113Q11K387K834K177P62m93j990k899k268j467R65K182K507
$$ plain form
1592 846 3210 4393 3809 1882 -383 -2946 -4201 -4079 -2182 158 2832 4298 4099 2243 -160 -2782
1608 -2782 -4174 -3673 -2493 -149 2396 4101 4162 2601 227 -2372 -4239 -3964 -2613 -363 2177 3946
1624 3946 4310 2596 664 -1826 -3836 -3841 -3115 -769 1686 3847 4277 2894 1000 -1707 -3578 -4006 -3071
1641 -3071 -1137 1584 3498 4170 3220 1221 -1170 -3158 -3953 -3381 -1407 1443 3134 4103 3256 1225
1657 1225 -1124 -2806 -3752 -3449 -1635 901 2754 4042 3346 1685 -617 -2551 -3875 -3363 -1432 518
1673 518 2750 3960 3338 1774 -423 -2296 -3845 -3406 -1925 -29 2339 3514 3361 2007 68 -2028
1689 -2028 -3884 -3572 -2530 -241 2141 3658 3386 2529 360 -2209 -3574 -3891 -2573 -412 1602 3053
1705 3053 3587 2693 656 -1684 -3237 -3603 -2786 -660 1605 2823 3618 2611 889 -1396 -2806 -3762
$$ packed form
1592H46K364J183n84j927k265k563j255J22J897K340K674J466j99j856k403k622
1608b782j392N01J180K344K545J705O1j561k374k599j867K75J351K250K540J769
1624C946L64j714j932k490k010nP26K346K455K161M30j383j894k707j871m28R35
1641c071J934K721J914O72r50j999k391j988p95N72J974K850J691R69q47k031
1657A225k349j682r46L03J814K536J853J288o96j661k302j934j324N12J931J950
1673E18K232J210o22j564k197j873j549M39J481J896K368J175j53j354j939k096
1689b028j856L12J042K289K382J517k72q57k169k569j365l17J318K161K014J451
1705C053N34q94k037k340j553l66Q17K126K265J218P95j007j722k285j410r56
$$ plain form
1721 -3762 -2919 -1142 1213 2930 3756 3148 1210 -904 -2828 -3835 -2995 -1162 619 2753 3674 2928
1737 2928 1157 -650 -2565 -3666 -3054 -1607 614 2415 3582 3015 1585 -264 -2207 -3482 -3396 -1507
1753 -1507 186 2191 3542 3365 1969 -73 -2297 -3482 -3191 -2077 204 2143 3218 3313 2194 91
1769 91 -1840 -3215 -3248 -2271 -449 1413 3025 3278 2340 551 -1829 -3119 -3435 -2635 -496 1603 3028
1786 3028 3256 2463 678 -1396 -2752 -3467 -2735 -808 1438 2839 3531 2674 966 -861 -2490 -3446 -2938
1803 -2938 -1206 683 2793 3248 2935 1360 -854 -2601 -2902 -2655 -1341 965 2222 3597 2957 1454
1819 1454 -425 -2194 -3427 -2809 -1582 15 2105 3117 2911 1434 -296 -2027 -2979 -2613 -1658 218
1835 218 2086 3138 2730 1907 -34 -1781 -2888 -2843 -1924 -18 1444 2932 3166 2093 20 -1734 -2796
$$ packed form
1721c762Q43J777K355J717Q26o08j938k114j924j007Q40J833J781K134R21p46
1737B928j771j807j915j101O12J447K221J801J167n67j430j849j943j275Q6J889
1753a507J693K005J351j77j396k042k224j185K91J114K281J939J075R5j119k103
1769I1j931j375l3R77J822J862J612K53r38j789k380j290l16Q00K139K099J425
1786C028K28p93j785k074j356p15P32J927K246J401O92q57j708j827j629r56N08
1803b938J732J889K110M55l13j575k214j747l01K47J314K306J257J375o40j503
1819A454j879j769j233O18J227J597K090J012k06j477j730j731r52L66R55J876
1835B18J868J052m08q23j941j747j107M5R19J906J462J488K34j073k073j754j062
$$ plain form
1852 -2796 -3029 -2124 -230 1464 2794 3035 2195 508 -1283 -2951 -3021 -2278 -610 1330 2529 2928 2365
1869 2365 859 -1003 -2556 -2913 -2217 -674 1136 2395 2923 2469 1011 -1041 -2500 -2904 -2215 -1073
1885 -1073 726 2145 2936 2513 1246 -676 -2063 -2900 -2836 -1159 515 2135 2729 2975 1466 -378 -2316
1902 -2316 -2803 -2798 -1562 334 2044 2795 2554 1320 -136 -1619 -2800 -2870 -1861 -57 1693 2736 2460
1919 2460 1858 87 -1694 -2497 -2714 -2001 -35 1395 2818 2515 2252 512 -1106 -2538 -2738 -2247 -566
1936 -566 1419 2217 2748 2035 360 -1001 -2445 -2662 -1870 -914 1094 2212 2512 2156 532 -661 -2233
1953 -2233 -2864 -2392 -963 901 2225 2852 2017 1006 -864 -1995 -2569 -2378 -872 494 2127 2665 2275
1970 2275 1323 -348 -1810 -2567 -2288 -1174 96 1731 2796 2233 1305 -194 -1610 -2842 -2415 -1290
$$ packed form
1852b796k33R05J894J694J330K41q40j687j791j668p0P43J668J940J199L99n63
1869B365j506j862j553l57O96J543J810J259N28m54j458k052j459m04O89J142
1885a073J799J419P91m23j267j922j387q37O4J677J674J620N94K46j509j844j938
1902b316m87NJ236J896J710P51k41j234j456j483j181p0J009J804J750J043k76
1919B460o02j771j781q03k17P13J966J430J423l03k63j740j618j432k00M91J681
1936e66J985P98N31p13j675j361j444k17P92R56K008J118L00l56j624j193j572
1953b233o31M72J429J864J324O27q35j011j870j131n74J91J506J366J633N38l90
1970B275r52j671j462p57K79J114J270J635J065n63r28j499j416j232M27J125
$$ plain form
1986 -1290 310 1612 2515 2515 1493 -91 -1367 -2389 -2572 -1584 -211 1487 2568 2404 1561 33 -1092
2003 -1092 -2201 -2251 -1478 -291 1199 2441 2587 1712 589 -1010 -2055 -2549 -1990 -448 1254 2207 2096
2020 2096 1914 619 -955 -2211 -2473 -1946 -657 770 2033 2635 1845 803 -677 -2195 -2199 -1976 -729
2037 -729 803 1918 2232 1958 1049 -464 -1534 -2481 -2380 -898 403 1587 2589 2225 989 -227 -1549
2054 -1549 -2466 -1949 -1183 77 1448 2165 2068 1457 -345 -1615 -2386 -2285 -1088 -12 1449 2228 1792 1340
2072 1340 112 -1338 -2080 -2362 -1272 47 1111 2148 2278 1451 360 -1125 -1872 -2316 -1349 -280 967
2089 967 1878 2250 1816 482 -911 -2162 -2322 -1892 -496 700 1776 2283 1396 722 -735 -1888 -2029
2106 -2029 -1761 -633 786 1685 1928 1775 848 -433 -2000 -2185 -1660 -689 708 1545 2183 1870 915 -514
$$ packed form
1986a290J600J302R03%j022j584j276j022j83R88J373J698J081j64q43j528j125
2003a092j109n0P73J187J490J242J46q75j123j599j045m94N59J542J702R53j11
2020B096j82j295j574j256k62N27J289J427J263O02p90j042j480j518mK23J247
2037g29J532J115L14k74r09j513j070r47J01J482J301J184J002l64j236j216j322
2054a549r17N17P66J260J371P17r7o11j802j270p71J01J197J076J461P79m36m52
2072A340j228j450p42k82J090J319J064J037J30q27j091j485p47m44R67J069J247
2089I67R11L72m34j334j393j251j60M30J396J196J076N07q87o74j457j153j41
2106b029K68J128J419Q99K43j53r27j281j567j85N25R71J397Q37O38l13r55j429
$$ plain form
2124 -514 -1631 -2155 -1708 -830 299 1295 2122 1733 1070 -393 -1376 -2123 -2003 -1052 360 1269 2198 1957 1121
2143 1121 -211 -1350 -1675 -2022 -1152 141 1045 1870 1883 1392 198 -1270 -1975 -2208 -1351 -3 1006 1893
2161 1893 1802 1442 336 -1041 -1923 -2014 -1459 -170 740 1703 2111 1569 265 -614 -1713 -1604 -1450 -586 593
2180 593 1493 2094 1596 567 -606 -1429 -1836 -1638 -524 643 1450 1717 1574 491 -443 -1377 -1896 -1531
2198 -1531 -854 349 1298 1825 1287 857 -347 -1322 -2010 -1590 -877 309 1233 1848 1832 599 -229 -1318
2216 -1318 -1609 -2019 -895 74 1210 1805 1618 1090 -57 -955 -1732 -1851 -1002 -69 732 1520 1641 1098 -34
2235 -34 -990 -1701 -1608 -1126 42 876 1575 1878 1526 232 -790 -1681 -1561 -1042 -352 575 1412 1592 1201 465
2255 465 -527 -1686 -1525 -1406 -546 559 1411 1760 1267 275 -644 -1508 -1659 -1378 -689 469 1255 1542 1368
$$ packed form
2124e14j117n24M47Q78J129R96Q27l89o63j463r83p47J20R51J412R09R29k41q36
2143A121j332j139l25l47Q70J293R04Q25J3m91j194j468p05k33Q57J348J009Q87
2161A893r1l60j106j377q82r1N55J289R10R63M08n42j304q79j099J09J54Q64J179
2180E93R00O01m98j029j173q23m07J98J114J167Q07K67j43j083r34r34n19L65
2198a531O77J203R49N27n38m30j204r75o88M20P13J186R24O15j6j233q28j089
2216a318k91m10J124R69J136N95j87n28j147q98p77j19Q49R33Q01P88J21n43j132
2235c4r56p11R3M82J168Q34O99L03l52j294j022q91J20N19O90R27Q37J80l91p36
2255D65r92j159J61J19Q60J105Q52L49m93r92r19q64j51K81O89J158P86K87j74
$$ plain form
2274 1368 677 -364 -1257 -1849 -1551 -641 411 1211 1556 1311 803 -199 -835 -1475 -1656 -729 411 1372
2292 1372 1578 1412 1085 -243 -877 -1830 -1400 -839 86 1076 1381 1654 813 0 -990 -1514 -1408 -900 -293
2311 -293 1051 1457 1676 869 -107 -815 -1483 -1574 -1016 -245 949 1187 1598 1232 178 -577 -1549 -1677 -1085
2330 -1085 -254 885 1281 1687 1044 519 -524 -1299 -1433 -1145 -133 330 1190 1392 1046 388 -691 -1321
2348 -1321 -1466 -1267 -393 428 1102 1454 1395 705 -225 -1249 -1371 -1128 -596 372 1053 1410 1196 611 -363 -1109
2368 -1109 -1283 -1242 -577 332 1043 1312 1224 758 -86 -780 -1387 -1377 -697 -194 874 1285 1349 870 -150 -910
2388 -910 -1299 -1407 -690 -15 634 1243 1320 813 -11 -808 -1231 -1407 -901 -60 805 1055 1068 861 236 -407 -949
2409 -949 -1261 -1028 -254 352 1193 1213 771 299 -391 -988 -1198 -1053 -319 437 1056 1286 1065 221 -631 -913
$$ packed form
2274A368o91j041q93n92K98R10J052Q00L45k45n08j002o36o40j81R27J140R61
2292A372K06j66l27j328o34r53M30N61R25R90L05K73q41q13r90n24J06N08O07
2311b93J344M06K19q07r76p08o68r1N58P71J194K38M11l66j054p55r72j28N92
2330a085Q31J139L96M06o43n25j043p75j34K88J012M63Q60K02l46o58j079o30
2348a321j45J99Q74Q21O74L52n9o90r30j024j22K43N32R68O81L57k14n85r74p46
2368a109j74M1O65R09P11K69q8m66q44o94o07J0O80N03J068M11O4m79j020p60
2388i10l89j08P17O75O49O09P7n07q24p97m23j76N06Q41Q65K50J3k07o25o43n42
2409i49l12K33P74O06Q41K0m42m72o90n97k10J45P34P56O19K30k21q44q52k82
$$ plain form
2429 -913 -1036 -941 -631 369 917 1415 932 174 -393 -1045 -1226 -1048 -432 503 860 1147 1029 443 -198 -854
2449 -854 -1105 -1086 -406 209 638 1195 1262 563 146 -930 -1039 -1500 -518 48 866 1069 1200 745 -274 -721
2469 -721 -1153 -1242 -741 -196 808 961 961 842 135 -670 -928 -1000 -701 261 546 1021 1275 841 77 -449 -1245
2490 -1245 -1187 -699 -152 483 1082 1039 1045 141 -403 -1099 -1067 -771 -303 533 869 985 739 351 -479 -890 -1094
2511 -1094 -1054 -259 281 983 943 1041 234 -189 -583 -988 -716 -422 94 681 995 1065 433 -202 -799 -860 -953 -316
2533 -316 158 418 1073 1108 613 -125 -720 -971 -883 -508 79 685 1240 973 330 248 -605 -1011 -811 -646 182
2554 182 724 967 801 611 126 -589 -751 -1238 -489 -106 400 619 863 354 149 -468 -839 -810 -733 -71 607
2575 607 1064 884 540 323 -136 -696 -1168 -484 -115 500 1094 1121 587 378 -401 -616 -1089 -959 -510 -26
$$ packed form
2429i13j23R5L10J000N48M98m83p58n67o52j81J78O16R35L57K87j18n86o41o56
2449h54k51J9O80O15M29N57O7o99m17j076j09m61R82N66Q18K03J31m55j019m47
2469g21m32q9N01N45J004J53%j19p07q05k58p2K99R62K85M75K54m34p64n26p96
2490a245N8M88N47O35N99m3Or04n44o96L2K96M68Q36L36J16k46l88q30m11k04
2511a094M0P95N40P02m0R8q07m23l94m05K72K94N16N87L14P0o32o35n97o1r3O37
2533c16M74K60O55L5m95p38n95k51Q8L75N87O06N55k67o43q2q53m06K00J65Q28
2554A82N42K43j66j90m85p15j62m87P49L83N06K19K44n09k05o17l71K9P7O62O78
2575F07M57j80l44k17m59n60m72O84L69O15N94K7n34k09p79k15m73J30M49M84
$$ plain form
2595 -26 647 953 678 268 -190 -804 -882 -656 -381 241 638 1012 692 52 -320 -424 -681 -683 -443 52 607
2616 607 1039 852 390 -251 -406 -691 -1091 -208 -327 600 834 764 470 84 -387 -587 -421 -401 -98 766 566
2637 566 1015 300 129 -670 -672 -878 -131 -232 323 761 500 576 17 -360 -751 -766 -820 -225 112 665 643 461
2659 461 424 -108 -484 -471 -718 -90 127 803 794 579 243 -272 -495 -1008 -752 -293 -39 543 867 879 312 -141
2681 -141 -464 -644 -455 -351 28 520 604 731 348 -122 -589 -481 -645 -60 -39 502 651 554 386 101 -403
2702 -403 -808 -802 -180 -147 507 559 700 364 218 -366 -763 -616 -238 -141 684 484 417 407 136 -408 -451 -536 -569
2725 -569 -479 378 643 802 352 227 -205 -740 -659 -423 -99 580 353 496 457 110 -288 -502 -617 -542 -111
2746 -111 109 695 564 517 195 74 -441 -416 -365 -503 145 273 485 744 282 -294 -284 -656 -438 -26 85
$$ packed form
2595b6O73L06k75m10m58o14p8K26K75O22L97L74l20o40l72j04k57kK40M95N55
2616F07M32j87m62o41j55k85m00Q83j19R27K34p0k94l86m71k00J66K0L03Q64k00
2637E66M49p15j71p99kk06P47j01N55M38k61P6n59l77l91j5n4N95L37N53k2j82
2659D61l7n32l76J3k47O28K17O76rk15l36n15k23n13K56M59K54N82L24J2n67m53
2681a41l23j80J89J04L79M92Q4J27l83m70m67J08j64N85K1N41J49r7j68k85n04
2702d03m05OO22L3O54N2J41l36j46n84l97J47L78R7Q25k00o7j0k71n44m3q5l3
2725e69R0Q57K65J59m50j25m32n35Q1K36L24O79k27J43l9l47l98k14j15P5M31
2746a11K20N86j31m7l22j21n15K5N1j38O48J28K12K59m62n76J0l72K18M12J11
$$ plain form
2767 85 289 514 227 80 80 -113 -540 -541 -336 -41 507 615 236 199 142 -223 -673 -476 -344 -49 233 443
2789 443 560 483 41 -362 -464 -562 -432 -140 286 581 655 368 -102 -297 -386 -679 -510 -137 577 427 353 268
2811 268 79 -313 -475 -589 -531 41 201 593 453 313 251 -433 -174 -580 -630 -29 7 162 393 272 265 -300
2833 -300 -351 -456 -468 -314 359 385 480 329 368 -191 -290 -379 -617 -354 -112 17 607 492 155 -91 -205 -331
2855 -331 -489 -372 -88 98 698 451 300 -23 -241 -790 -796 -189 -64 244 459 125 187 -44 -203 -453 -359
2876 -359 -181 -162 225 342 241 370 166 -415 -424 -307 -382 -151 338 526 657 88 -50 -394 -275 -337 -375 -65
2898 -65 108 229 570 244 51 -54 -202 -314 -229 -147 47 148 496 92 -6 -437 -363 -419 -558 -78 32 138
2920 138 535 387 164 7 -249 -391 -507 -138 -105 220 358 348 426 3 -128 -177 -322 -137 63 163 418
$$ packed form
2767H5K04K25k87j47%j93m27jK05K95N48J08l79l7n7l65m50J97J32K95K82K10
2789D43J17p7m42m03j02r8J30K92M26K95P4k87m70j95q9k93J69L73P14j50p4q5
2811B68j89l92j62j14N8N72J60L92j40j40o2o84K59m06n0O01L6J55K31j21pn65
2833c00n1j05j2J54O73K6R5j51L9n59r9q9k38K63K42J29N90j15l37k46j14j26
2855c31j58J17K84J86O00k47j51l23k18n49oO07J25L08K15l34O2k31j59k50R4
2876c59J78J9L87J17j01J29k04n81rJ17p5K31M89J88J31n69j38l44J19o2l8L10
2898f5J73J21L41l26j93j05j48j12Q5Q2J94J01L48m04r8m31P4n6j39M80J10J06
2920A38L97j48k23j57k56j42j16L69L3L25J38j0P8m23j31m9j45J85K00J00K55
$$ plain form
2941 418 831 516 -198 -60 -366 -392 128 38 142 323 228 75 86 63 -195 -280 -414 -68 243 679 201 161
2963 161 257 -2 -255 -343 -213 81 -41 145 256 150 116 -62 -296 -414 -168 36 32 255 315 206 -78 9
2985 9 -114 -413 -229 -190 121 200 250 535 46 129 -436 -384 -194 -80 232 139 57 228 123 16 51 -291 -136
3008 -136 -103 -56 22 1 350 188 37 -119 -404 -291 23 8 94 223 161 263 -11 -285 -276 -274 -337 158 -46 361
3032 361 255 325 312 -228 -201 -203 -200 -198 103 233 142 237 362 -47 -304 -264 -77 -151 -37 165 83 310 -76 -14 -376
3057 -376 66 -324 14 50 317 30 218 234 -55 -88 -450 118 -13 323 109 190 28 11 201 23 -167 -279
3079 -279 -46 -33 84 223 49 70 -164 -252 -297 -367 -208 -174 236 278 -190 -66 45 -51 -71 -146 76 143 -182 103
3103 103 243 250 -78 -222 -327 -273 -133 32 -31 262 352 308 141 125 -123 -174 -99 43 -166 330 142 219 65
$$ packed form
2941D18M13l15p14J38l06k6N20r0J04J81r5j53J1k3k58q5j34L46L11M36m78m0
2963A61R6k59k53q8J30K94j22J86J11j06l4j78k34j18K46K04mK23O0j09k84Q7
2985Ij23k99J84L9L11P9N0K85m89Q3n65N2J90J14L12r3q2J71j05j07L5l42J55
3008a36L3M7P8k1L49j62j51j56k85J13L14j5Q6J29o2J02k74k74RKo3M95k04M07
3032C61j06P0j3n40K7kLKL01J30r1R5J25m09k57M0J87p4J14K02q2K27l86O2l62
3057c76M42l90L38L6K67k87J88J6k89l3l62N68j31L36k14Q1j62j7J90j78j90j12
3079b79K33J3J17J39j74K1k34q8m5p0J59L4M10M2m68J24J11r6k0p5K22O7l25K85
3103A03J40Pl28j44j05N4J40J65o3K93R0m4j67j6k48n1P5J42k09M96j88P7j54
$$ plain form
3126 65 -54 -1 -207 -83 -88 -49 186 434 -89 237 44 100 -202 -201 -295 -44 430 214 254 6 -66 -98 -185 -149 -141
3151 -141 -249 165 198 28 209 -40 183 -200 -347 -411 -75 -29 27 354 92 60 97 -207 -122 4 44 134 148
3174 148 234 64 22 -53 -283 49 -122 -155 72 306 156 421 180 230 -205 -164 -66 80 26 -127 31 203 246
3197 246 -73 -52 12 -280 57 52 -159 630 233 97 52 -186 7 -300 86 -370 273 33 189 79 -40 -5
3219 -5 47 -130 45 -89 83 32 -133 238 -104 -168 185 31 -6 -194 15 -113 159 417 19 166 -276 -149
3241 -149 -208 -120 15 209 225 78 -229 -72 -141 -143 -99 -50 -204 -98 183 130 130 -158 -248 -157 -293 -49 70 140 366
3266 366 153 125 145 -21 82 20 13 -45 37 136 16 177 -71 -86 -83 -288 -316 -148 60 -5 -24 125 296 50 -182
3291 -182 -16 -124 181 44 -28 -75 94 105 -44 -256 -375 -167 -195 226 194 433 188 43 -268 -22 -204 -177
$$ packed form
3126F5j19N3k06J24nL9K35K48n23L26j93N6l02Jr4K51M74k16M0k48p2l2q7L6Q
3151a41j08M14L3j70J81k49K23l83j47o4L36M6N6L27k62l2L7l04Q5J26M0R0J4
3174A48Q6j70m2p5k30L32j71l3K27K34j50K65k41N0m35M1R8J46n4j53J58J72M3
3197B46l19K1O4k92L37nk11P89l97j36m5k38J93l07L86m56O43k40J56j10j19L5
3219eN2j77J75j34J72n1j65L71l42o4L53j54l7j88K09j28K72K58l98J47m42J27
3241a49n9Q8J35J94J6j47l07J57o9kM4M9j54J06K81n3%k88r0R1j36K44J19P0K26
3266C66k13k8K0j66J03o2pn8Q2R9j20J61k48j5Lk05k8J68K08o5j9J49J71k46k32
3291a82J66j08L05j37p2m7J69J1j49k12j19K08k8M21l2K39k45j45l11K46j82K7
$$ plain form
3313 -177 -190 59 10 347 402 -112 -146 205 -120 -50 -24 29 251 108 239 50 64 76 -201 -300 -254 -150 233 34
3337 34 244 171 -79 -182 -54 -133 -304 6 -195 430 191 352 -40 -145 123 -26 -135 39 -10 147 62 40
3359 40 213 -21 60 -189 31 -232 241 -115 68 141 159 -132 103 -215 -133 324 183 35 100 80 -90 139
3381 139 168 -388 -40 -101 -102 186 7 109 327 129 -31 -54 -236 -126 -309 -77 57 74 3 19 -47 -102 -60 -150
3405 -150 -191 -44 -134 62 103 -97 -68 -130 -6 58 -30 -115 312 160 116 91 -59 28 20 -128 -34 0 100 89 115 328
3431 328 37 -91 20 -468 -250 -103 185 120 -77 -125 -86 -233 181 -294 -336 -110 -142 35 55 157 27 -81
3453 -81 -373 -147 16 -172 -254 117 334 -190 83 79 159 -87 -210 10 -175 125 42 155 65 340 40 -60
3475 -60 -93 -166 -29 128 49 -2 -35 -36 -105 -555 -285 51 11 108 224 302 -57 115 -78 -158 -159 -212 87 -38 -62 138
$$ packed form
3313a77j3K49m9L37N5n14l4L51l25P0K6N3K22j43J31j89J4J2k77r9M6J04L83j99
3337C4K10p3k50j03J28p9j71L10k01O25k39J61l92j05K68j49j09J74m9J57q5k2
3359D0J73k34Q1k49K20k63M73l56J83P3J8k91K35l18Q2M57j41j48O5k0j70K29
3381A39K9n56L48o1jK88j79J02K18j98j60k3j82J10j83K32J34J7p1J6o6n5M2r0
3405a50m1J47r0J96M1k00K9o2J24O4q8q5M27j52m4k5j50Q7qj48R4L4J00j1K6K13
3431C28k91j28J11m88K18J47K88o5j97m8L9j47M14m75m2K26l2J77K0J02j30j08
3453h1k92K26J63j88q2L71K17n24K73mQ0k46j23K20j85L00q3J13r0K75l00j00
3475f0l3p3J37J57p9n1l3jo9m50K70L36m0R7J16P8l59J72j93q0jn3K99j25k4K00
$$ plain form
3501 138 113 62 -58 151 -66 -439 102 388 280 303 133 71 285 -209 -64 5 -270 63 149 225 176 -36 -146
3524 -146 -209 -301 -368 38 -93 129 243 107 93 0 -34 -288 162 -265 -53 212 70 2 -260 239 -144 -6
3546 -6 -116 -130 -151 -12 -51 93 244 144 -93 -528 -223 107 -86 -36 170 -27 -23 160 18 -174 -307 -40 1
3569 1 95 172 128 298 24 -86 -113 -208 -15 93 94 -25 -186 224 -28 -135 -264 52 -244 101 -152 225 289
3592 289 128 101 -3 -200 -290 -300 -53 -191 -13 5 309 220 -42 -118 -111 -318 -186 -166 181 232 351 -187 336
3615 336 177 -245 91 -256 -41 122 41 171 -158 -33 153 4 -223 -147 -90 170 -123 -6 141 115 -292
3636 -292 -71 -271 89 268 123 89 204 268 -350 89 75 79 -233 133 -19 222 96 -43 137 225 -80 -474
3658 -474 -279 -173 -90 100 262 197 273 23 -133 -21 -146 -119 53 134 33 175 -21 258 -138 -202 -408 -420
$$ packed form
3501A38k5n1j20K09k17l73N41K86j08K3j70o2K14m94J45O9k75L33Q6P6m9k12j10
3524a46o3r2o7M06j31K22J14j36j4r3l4k54M50m27K12K65j42o8k62M99l83J38
3546fj10j4k1J39l9J44J51j00k37m35L05L30j93N0K06j97MJ83j42j92j33K67M1
3569AR4P7m4J70k74j10k7r5J93J08Jj19j61M10k52j07j29L16k96L45k53L77O4
3592B89j61k7j04j97r0j0K47j38J78J8L04q9k62p6Pk07J32K0L47N1J19n38N23
3615C36j59m22L36l47K15J63q1J30l29J25J86j49k27P6N7K60k93J17J47k6m07
3636b92K21k00L60J79j45l4J15O4o18M39j4Ml12L66j52K41j26j39J80Q8l05l94
3658d74J95J06Q3J90J62o5P6k50j56J12j25K7J72Q1j01J42j96K79l96o4k06j2
$$ plain form
3680 -420 49 -290 114 118 152 -13 -213 -117 -144 -309 122 125 -6 182 73 -106 -216 -92 -263 -123 -215 87 121
3703 121 316 -89 178 16 -270 -145 -98 7 104 261 133 163 -106 147 -302 -173 -206 -143 134 130 321 261 242
3726 242 -19 -54 -50 -252 -72 -81 69 214 43 234 14 -107 -197 -35 -191 68 261 -125 162 159 26 -25 -244
3749 -244 -45 -148 -59 371 169 210 267 43 -142 91 -274 8 264 9 110 65 378 -1 -58 -222 -159 -16
3771 -16 39 80 113 180 68 404 -42 -52 -129 -92 -128 138 76 268 220 165 -269 20 -137 -441 29 289 -5 156
3795 156 328 101 358 -205 -248 -435 -93 207 148 354 169 26 -175 29 -290 328 -18 167 373 173 274
3816 274 13 162 -206 -63 -63 111 -105 -54 268 105 -123 -90 -226 1 -369 -80 -257 78 291 464 39
3837 39 180 -195 -254 -132 -20 11 -222 296 212 -17 507 -200 -184 11 -291 -57 219 111 356 347 73 -89
$$ packed form
3680d20M69l39M04ML4j65k00R6k7j65M31Lj31J88j09j79j10J24j71J40r2L02L4
3703A21J95m05K67j62k86J25M7J05R7J57j28L0k69K53m49J29l3O3K77mJ91o0j9
3726B42k61l5Mk02J80rJ50J45j71J91k20j21r0J62j56K59J93l86K87lj33n1k19
3749b44J99j03Q9M30k02M1N7k24j85K33l65K82K56k55J01m5L13l79n7j64O3J43
3771a6N5M1L3O7j12L36m46j0p7L7l6K66o2J92m8n5m34K89j57l04M70K60k94J61
3795A56J72k27K57n63m3j87L42L00n9K06j85j43k01K04l19O18l46J85K06k00J01
3816B74k61J49l68J43%J74k16N1L22j63k28L3j36K27l70K89j77L35K13J73m25
3837C9J41l75n9J22J12L1k33N18q4k29N24p07J6J95l02K34K76j08K45rk74j62
$$ plain form
3859 -89 -32 -320 -371 77 67 231 -70 148 50 -55 55 -52 -286 -24 193 125 -148 114 -116 -56 196 -147
3881 -147 81 -195 -108 124 235 34 -16 159 -312 61 -100 -273 -94 -58 80 191 94 -64 -132 -385 140 -356
3903 -356 -182 90 238 247 149 88 28 -315 -471 13 -51 85 240 178 318 14 181 -32 -265 -48 -117 216 187
3926 187 -62 244 322 -39 268 -127 -8 90 80 82 20 99 122 236 -22 -297 -140 -20 -163 329 -18 144 92
3949 92 -65 16 -58 -140 -26 -104 42 279 179 479 -196 -220 -96 -302 -165 -373 160 189 19 82 -40 40 -36
3972 -36 -284 -267 -72 -39 7 -42 303 117 -69 -304 -304 -224 -171 240 -42 111 452 110 -197 -317 -204 -360 -239
3995 -239 74 -11 361 328 -48 39 -206 -411 -73 93 181 152 96 100 -189 14 -58 -106 -181 60 -77 -36 104 386
4019 386 22 105 -86 -301 -206 -393 -78 -50 70 175 128 -120 -325 -41 47 0 55 -34 160 71 63 251 -90 20
$$ packed form
3859h9N7k88n1M48j0J64l01K18r8j05J10j07k34K62K17o8k73K62k30O0K52l43
3881a47K28k76Q7K32J11k01n0J75m71L73j61j73J79L6J38J11r7j58o8k53N25m96
3903c56J74K72J48Rr8o1o0l43j56M84o4J36J55o2J40l04J67k13k33K17o9L33k9
3926A87k49L06P8l61L07l95J19R8j0Ko2P9K3J14k58k75J57J20j43M92l47J62n2
3949I2j57Q1p4q2J14p8J46K37j00L00o75k4J24k06J37k08N33K9j70O3j22Q0p6
3972c6k48J7J95L3M6m9L45j86j86k35%Q0N3M11k82J53L41l42l07j20J13j56J21
3995b39L13q5L72l3l76Q7k45k05L38J66Q8k9n6Mk89K03p2m8p5K41j37M1J40K82
4019C86l64Q3j91k15R5j87L15K8J20J05m7k48k05K84Q8m7N5q9J94q9qJ88l41J10
$$ plain form
4043 20 153 -417 70 164 332 344 327 103 -34 -53 -36 -47 90 113 68 267 155 53 -122 -17 -232 -192 -134 46
4067 46 -131 325 255 74 233 -170 -5 -250 -135 224 -122 -7 81 12 -149 -162 -236 -256 -104 11 80 273 471
4090 471 239 64 -109 -191 -187 57 318 -62 221 461 -4 208 -331 -232 -180 109 -45 -39 208 50 266 40
4112 40 -44 58 -54 -294 88 198 97 52 261 101 -197 -178 34 -36 -316 135 -64 248 93 79 58 -32 -142
4135 -142 -177 -11 -95 89 -151 328 318 -87 -112 -104 -301 -35 180 157 336 148 -37 -37 -195 -55 -146 -360 167
4158 167 -153 193 252 -70 -170 -74 -88 193 -456 21 77 -179 231 -11 267 -223 -200 -85 80 29 60 213
4180 213 -78 50 -196 125 -228 -213 -84 -250 -8 -161 8 -130 48 -330 -161 -117 -355 95 187 132 186 222
4202 222 -137 -53 86 -48 -91 -93 -37 256 -42 242 -160 -164 -85 101 20 -144 307 264 88 -27 194 -124 57
$$ packed form
4043B0J33n70M87R4J68J2j7k24j37j9J7j1J37K3m5J99j12j02j75J05k15M0N8J80
4067D6j77M56p0j81J59m03J65k45J15L59l46J15Q8o9j61j3p4k0J52J15O9J93J98
4090D71k32j75j73q2MK44K61l80K83K40m65K12n39R9N2K89j54OK47j58K16k26
4112D0q4J02j12k40L82J10j01m5K09j60k98J9K12p0k80M51j99L12j55j4k1r0j10
4135a42l5J66q4J84k40M79j0m05k5Qj97K66K15k3J79j88j85%j58J40r1k14N27
4158A67l20L46N9l22j00R6j4K81o49M77N6k56M10k42K78m90K3J15J65n1L1J53
4180B13k91J28k46L21l53J5J29j66K42j53J69j38J78l78J69M4k38M50R2n5N4L6
4202B22l59Q4J39j34m3kN6K93k98K84m02mP9J86q1j64M51m3j76j15K21l18J81
$$ plain form
4225 57 14 -216 -293 3 181 200 -7 163 102 -64 -233 -213 -222 -142 328 191 15 203 -33 -283 -142 -87 111
4248 111 -4 233 78 361 235 -179 236 58 -12 -121 4 167 229 7 -2 191 154 191 -318 -108 183 95
4270 95 83 87 91 159 42 -256 -215 -245 175 61 25 179 -9 -141 -190 21 179 -181 157 77 16 259 111 255
4294 255 -109 -108 -211 -407 54 -228 -162 78 -6 157 55 -101 -142 2 145 -115 -64 255 71 -133 -184 -154 -233
4317 -233 -72 -300 106 142 161 228 -324 103 -105 -304 -337 -206 28 28 21 319 -153 -112 -139 -74 -65 -113 134 94 138
4342 138 318 -185 21 -371 19 36 -218 -205 165 73 358 92 13 -28 -179 -350 -91 51 281 123 -132 -189
4364 -189 185 -295 -119 -180 21 -255 -40 154 74 91 88 211 -144 -333 42 178 47 -26 -22 250 75 242 -452
4387 -452 -190 1 -437 9 91 177 -100 -85 191 -165 -148 -147 -1 -315 270 -70 316 143 -232 -241 -264 -186 -2
$$ packed form
4225E7m3k30p7K96J78J9k07J70o1j66j69K0rQ0M70j37j76J88k36k50J41N5J98
4248A11j15K37j55K83j26m14M15j78p0j09J25J63O2k22rJ93l7L7n09K10K91q8
4270I5j2MMO8j17k98M1l0M20j14l6J54j88j32m9K11J58l60L38q0o1K43j48J44
4294B55l64Jj03j96M61k82O6K40q4J63j02j56m1J44J43k60N1L19j84k04n1L0p9
4317b33J61k28M06L6J9O7n52M27k08j99l3J31K34%pK98m72M1k7O5Rm8K47m0M4
4342A38J80n03K06l92L90J7k54J3L70r2K85k66p9m1j51j71K59J42K30j58k55n7
4364a89L74m80J76o1K01k76K15J94q0J7lJ23l55j89L75J36j31p3MK72j75J67o94
4387d52K62J91m38M46Q2Q6k77J5K76l56J7JJ46l14N85l40L86j73l75rk3P8J84
$$ plain form
4410 -2 172 143 194 175 160 -183 -204 -287 97 -113 72 -10 42 -44 -54 36 286 -80 -13 -118 54 264 30 298 269
4435 269 113 4 -143 -309 -284 -24 60 179 137 248 127 -194 -31 -104 -126 -118 21 97 177 -147 -30 -134 170
4458 170 -58 -3 114 -128 -140 265 9 -153 253 100 71 -143 206 -175 91 203 -47 236 6 -121 -96
4479 -96 -176 -75 72 78 76 245 80 -140 -170 -115 -285 276 24 -106 85 -14 166 44 -115 -182 -113 -37 -72 170
4503 170 341 -23 67 207 120 -185 -514 -137 51 97 41 253 21 -105 33 -55 145 85 -268 16 -87 279
4525 279 212 81 207 -82 -121 -60 -27 -130 129 126 -21 -120 81 101 150 -186 -98 20 70 -83 146 159 -68 -68 -187
4550 -187 -91 -90 236 195 -70 -190 287 478 151 -126 -275 -369 -25 -159 55 134 71 31 258 29 -167 -78 -106
4573 -106 93 80 -35 367 32 92 -183 -270 -95 -101 -125 157 59 173 75 -106 -79 -169 83 -20 281 -66 42
$$ packed form
4410bJ74k9N1j9j5l43k1q3L84k10J85q2N2q6j0R0K50l66O7j05J72K10k34K68k9
4435B69j56j09j47j66K5K60Q4J19m2J11j21l21J63p3k2QJ39P6Q0l24J17j04L04
4458A70k28N5J17k42j2M05k56j62M06j53k9k14L49l81K66J12k50K83k30j27K5
4479i6q0J01J47OkJ69j65k20l0N5j70N61k52j30J91r9J80j22j59o7O9P6l5K42
4503A70J71l64R0J40q7l05l29L77J88M6n6K12k32j26J38q8K00o0l53K84j03L66
4525B79o7j31J26k89l9O1L3j03K59lj47r9K01K0M9l36Q8J18N0j53K29J3k27%j19
4550a87R6JL26m1k65j20M77J91l27k77j49r4L44j34K14P9o3m0K27k29j96Q9k8
4573a06J99j3j15M02l35O0k75q7J75ok4K82r8J14r8j81K7r0K52j03L01l47J08
$$ plain form
4596 42 -122 -55 93 -152 -28 163 -35 -107 13 -59 -78 136 100 87 -314 -244 -105 -125 -115 130 151 191 197 -235 -86
4621 -86 -176 -322 -137 -103 119 109 54 297 -196 -277 9 -138 -65 125 45 138 -87 275 31 116 -152 -2 -127
4644 -127 149 121 161 57 207 -106 88 -99 -62 -114 86 140 -70 -33 60 -29 22 99 9 -138 -52 5 57 75 -138
4669 -138 142 17 62 -216 160 -210 -234 362 60 -224 -159 27 -49 -35 -162 -139 215 193 27 230 138 84 -116
4692 -116 -130 139 18 -154 146 -66 309 -17 95 -264 -305 -17 -111 126 208 1 199 151 -117 -267 -13 -396
4714 -396 29 101 120 197 -87 97 100 -110 26 -21 -44 -29 2 86 292 298 -154 -151 -323 -53 -2 -209 -82 183 -56
4739 -56 -14 85 178 -153 11 -50 103 -31 -26 61 563 -411 -118 -304 20 -32 -215 171 -35 -30 59 -85 17 102
4763 102 -66 -40 -10 252 -183 237 349 69 -46 16 -402 -154 34 19 57 113 -1 51 -125 108 -175 -168 -39
$$ packed form
4596D2j64O7J48k45J24J91j98p2J20p2j9K14l6j3m01P0J39k0J0K45K1M0Om32J49
4621h6r0j46J85L4K22j0n5K43m93q1K86j47P3J90q0R3k25L62k44Q5k68J50j25
4644a27K76k8M0j04J50l13J94j87L7n2K00N4k10L7R3q9N1P7r0j47Q6N7N2J8k13
4669a38K80j25M5k78L76l70k4N96l02k84O5J86p6J4j27K3L54k2j66K03r2n4k00
4692a16j4K69j21j72L00k12L75l26J12l59m1K88r4K37Q2k07J98m8k68j50K54l83
4714c96M25P2J9P7k84J84Lk10J36m7k3J5L1Q4K06Om52Lj72K70N1k07J27K65k39
4739e6M2R9R3l31J64o1J53j34NQ7N02r74K93j86L24n2j83L86k06NQ9j44J02Q5
4763A02j68K6L0K62m35M20J12k80j15O2m18K48J88j5L8N6j14N2j76K33k83PJ29
$$ plain form
4786 -39 420 22 306 78 83 70 -33 94 -18 -217 172 -129 -57 -49 112 215 29 -223 -54 -66 -50 55 -4
4809 -4 134 -85 170 -145 -79 177 143 90 107 34 15 232 101 145 -69 -99 -279 -154 61 159 130 354 -21 56
4833 56 -42 -246 104 251 298 -54 235 -9 221 -102 -144 -207 -435 -124 57 281 97 173 171 -31 -168 -105 16
4856 16 -165 108 84 340 134 92 -198 -188 104 -159 50 -41 42 21 -37 31 -65 -107 -56 -362 125 -141 -138 164 257
4881 257 -14 -22 105 -42 -170 53 90 -22 -23 184 247 -258 118 22 109 -174 -100 166 -74 69 47 195 21
4904 21 -108 -33 -303 138 -117 344 -83 -1 -7 -249 142 -156 -27 51 -26 -32 -12 338 214 -25 -53 81 -83 88
4928 88 37 180 -14 -56 216 85 -3 73 -99 49 -58 159 106 -95 294 -256 62 -47 -145 29 213 96
4950 96 204 307 74 51 -218 -176 65 -8 -53 125 28 393 -126 196 -133 -124 -185 -39 4 81 164 166 0 15 -52
$$ packed form
4786c9M59l98K84k28Nj3j03J27j12j99L89l01P2QJ61J03j86k52J69j2J6J05n9
4809dJ38k19K55l15O6K56l4n3J7p3j9K17j31M4k14l0j80J25K15R8k9K24l75P7
4833E6r8k04L50J47M7l52K89k44K30l23m2o3k28L11J81K24j84P6kk02j37O3J21
4856A6j81K73k4K56k06m2k90J0K92k63K09r1Q3k1n8O8r6m2N1l06M87k66LL02R3
4881B57k71qJ27j47j28K23L7j12jK07O3n05L76r6Q7k83P4K66k40J43k2J48j74
4904B1j29P5k70M41k55M61m27Q2ok42L91k98J29P8p7oK0L50j24k39k8J34j64J71
4928H8n1J43j94m2K72j31q8P6j72J48j07K17n3k01L89n50L18j09r8J74J84j17
4950I6J08J03k33k3k69M2K41p3m5J78r7L65n19L22l29Ro1J46M3P7Q3Kj66J5o7
$$ plain form
4975 -52 -160 61 -102 -100 -10 216 162 299 98 -278 -147 -56 -228 144 -20 -100 67 -150 -11 -230 -2 -188
4997 -188 66 -296 282 98 336 51 -63 -26 -9 -140 -207 -137 173 305 -274 38 -54 24 -60 -158 74 -57 87
5020 87 -360 116 221 44 23 -222 25 -216 307 -177 157 27 149 97 116 24 -63 -151 157 235 295 -67 259
5043 259 293 -233 24 -103 -390 -59 38 7 -71 -140 32 26 57 -85 13 12 -7 249 152 310 324 -260 137 -236 -227
5068 -227 55 -220 127 -146 293 -32 252 128 -389 -175 -55 -51 -76 0 168 99 -39 177 190 -311 36 26
5090 26 202 20 182 37 73 -406 -37 -107 -142 -67 35 306 -97 -6 120 156 -75 -62 -95 -11 -54 -187 -7 45
5114 45 21 -281 -409 -320 -161 -75 -182 61 54 120 7 37 58 144 -59 166 -408 68 116 108 5 -147 -37 216
5138 216 117 -46 -40 -62 225 -4 256 -117 184 -162 -16 -167 182 27 101 -98 -55 14 214 33 -123 -283
$$ packed form
4975e2j08K21j63KR0K26n4J37k01l76J31R1j72L72j64q0J67k17J39k19K28j86
4997a88K54l62N78j84K38k85j14L7J7j31o7P0L10J32n79L12r2P8q4r8K32j31J44
5020H7m47M76J05j77k1k45K47k41N23m84L34j30J22n2J9r2q7q8L08P8O0l62L26
5043B59L4n26K57j27k87L31R7l1p8o9J72oL1j42R8jj9K56r7J58J4n84L97l73R
5068b27K82k75L47k73M39l25K84j24n17K14J20Mk5P6J68o9j38K16J3n01L47j0
5090B6J76j82J62j45L6m79L69p0l5P5J02K71m03R1J26L6k31J3l3Q4m3j33J80N2
5114D5k4l02j28Q9J59Q6j07K43pO6j13L0K1Q6k03K25n74M76M8qj03j52J10K53
5138B16r9j63Ok2K87k29K60l73L01l46J46j51L49j55P4j99M3O9K00j81j56j60
$$ plain form
5160 -283 59 -86 -153 250 222 80 -148 -189 -522 -39 -85 -9 8 173 -18 -104 -136 -151 24 67 -97 -168 -1 222
5184 222 232 144 -125 74 -54 -77 -167 135 -186 160 -174 -161 91 -38 -260 -126 -181 143 249 161 -51 -361
5206 -361 476 -130 260 -228 99 -87 -108 272 -106 268 -210 -127 -116 -189 -34 -79 69 21 148 -133 18 35
5228 35 68 -41 -249 -39 140 -6 257 -23 -39 -194 109 136 48 -210 -340 -19 37 -23 -57 359 -302 -29 18
5251 18 -199 -128 243 215 81 126 121 -84 -227 -13 -87 -60 57 82 117 211 -30 119 -302 -135 -400 -309 48 3
5275 3 19 -16 375 102 31 -81 -170 -130 -306 8 168 37 67 -331 -156 -127 56 120 85 58 -98 21 -61 181
$$ packed form
5160b83L42j45o7M03k8j42k28m1l33M83m6P6J7J65j91q6l2j5J75M3j64p1J67K23
5184B22J0q8k69J99j28k3r0L02l21L46l34J3K52j29k22J34n5L24J06q8k12l10
5206c61Q37o06L90m88L27j86k1L80l78L74m78Q3J1p3J55m5J48m8J27k81J51J7
5228C5L3j09k08K10J79j46K63k80j6j55L03K7q8k58j30L21N6o0l4M16o61K73M7
5251A8k17P1L71k8j34M5nk05j43K14p4K7J17K5L5R4k41J49m21J67k65R1L57m5
5275CJ6l5L91k73p1j12q9M0j76L14J60j31L0l98J75K9J83O4l5k7j56J19q2K42
$$ [...]
8191C6
##END NTUPLES=NMR FID
##END=
