##TITLE=1H_LR-795-MK1
 200.13MHz, CDCl3,
 8 sc
 
 24.1.2025
##JCAMPDX= 6.0         $$ Bruker NMR JCAMP-DX V2.0
##DATA TYPE= NMR FID
##DATA CLASS= NTUPLES
##ORIGIN= UXNMR, Bruker Analytische Messtechnik GmbH
##OWNER= pz
$$ XWIN-NMR		Version 3.5
$$ Fri Jan 24 16:16:02 2025 Russian Standard Time (UT+4h)  she@DPX200
##.OBSERVE FREQUENCY= 200.1313
##.OBSERVE NUCLEUS= ^1H
##.DELAY= (6, 6)
##.ACQUISITION MODE= SIMULTANEOUS
##.ACQUISITION SCHEME= undefined
##.AVERAGES= 8
##.DIGITISER RES= 18
##SPECTROMETER/DATA SYSTEM= spect
##.PULSE SEQUENCE= zg30
##.SOLVENT NAME= CDCl3
##.SHIFT REFERENCE= (INTERNAL, CDCl3, 0, 14.3821)
##AUDIT TRAIL= $$ (NUMBER, WHEN, WHO, WHERE, WHAT)
$$ ##TITLE= Audit trail, XWIN-NMR		Version 3.5
$$ ##JCAMPDX= 5.01
$$ ##ORIGIN= Bruker BioSpin GmbH
$$ ##OWNER= she
$$ F:/spectra/data/she/nmr/H-C/1/audita.txt
$$ ##AUDIT TRAIL=  $$ (NUMBER, WHEN, WHO, WHERE, WHAT)
(   1,<2025-01-24 16:15:12.39 +0400>,<she>,<DPX200>,
      <created by zg, POWCHK disabled, PULCHK disabled
       configuration hash MD5:
       00 E9 B6 7A A2 85 ED C7 34 08 36 98 17 FE 4E 26
       data hash MD5: 16K
       55 20 D3 5F 3B 3A CB 76 46 68 7F 51 BA 2A B5 AF>)
$$ ##END=
$$ 
$$ hash MD5
$$ CD 61 4D 86 64 CB AA 9E EB 80 6B 43 00 DF C4 97
##$RELAX= 
##$RELAX= 
##$RELAX= 
##$RELAX= 
##$RELAX= 
##$RELAX= 
$$ Bruker specific parameters
$$ --------------------------
##$DU= <F:/spectra>
##$EXPNO= 1
##$NAME= <H-C>
##$PROCNO= 1
##$TYPE= <nmr>
##$USER= <she>
##$AMP= (0..31)
100 100 100 100 100 100 100 100 100 100 100 100 100 100 100 100 100 100 
100 100 100 100 100 100 100 100 100 100 100 100 100 100 
##$AQSEQ= 0
##$AQ_mod= 1
##$AUNM= <au_zg>
##$AUTOPOS= <>
##$BF1= 200.13
##$BF2= 200.13
##$BF3= 200.13
##$BF4= 200.13
##$BF5= 200.13
##$BF6= 200.13
##$BF7= 200.13
##$BF8= 200.13
##$BYTORDA= 1
##$CFDGTYP= 0
##$CFRGTYP= 5
##$CHEMSTR= <none>
##$CNST= (0..31)
1 1 145 1 1 1 1 1 1 1 1 1 1 1 1 1 1 1 1 1 1 1 1 1 1 1 1 1 1 1 1 1 
##$CPDPRG= <>
##$CPDPRG1= <>
##$CPDPRG2= <>
##$CPDPRG3= <>
##$CPDPRG4= <mlev>
##$CPDPRG5= <mlev>
##$CPDPRG6= <mlev>
##$CPDPRG7= <mlev>
##$CPDPRG8= <mlev>
##$CPDPRGB= <>
##$CPDPRGT= <>
##$D= (0..31)
0 0.7 0 0 0 0 0 0 0 0 0 0.03 0 0 0 0 0 0 0 0 0 0 0 0 0 0 0 0 0 0 0 0 
##$DATE= 1737720911
##$DBL= (0..7)
120 120 120 120 120 120 120 120 
##$DBP= (0..7)
150 150 150 150 150 150 150 150 
##$DBP07= 0
##$DBPNAM0= <>
##$DBPNAM1= <>
##$DBPNAM2= <>
##$DBPNAM3= <>
##$DBPNAM4= <>
##$DBPNAM5= <>
##$DBPNAM6= <>
##$DBPNAM7= <>
##$DBPOAL= (0..7)
0.5 0.5 0.5 0.5 0.5 0.5 0.5 0.5 
##$DBPOFFS= (0..7)
0 0 0 0 0 0 0 0 
##$DE= 6
##$DECBNUC= <off>
##$DECIM= 32
##$DECNUC= <off>
##$DECSTAT= 4
##$DIGMOD= 1
##$DIGTYP= 9
##$DL= (0..7)
0 120 120 120 120 120 120 120 
##$DP= (0..7)
150 150 150 150 150 150 150 150 
##$DP07= 0
##$DPNAME0= <>
##$DPNAME1= <>
##$DPNAME2= <>
##$DPNAME3= <>
##$DPNAME4= <>
##$DPNAME5= <>
##$DPNAME6= <>
##$DPNAME7= <>
##$DPOAL= (0..7)
0.5 0.5 0.5 0.5 0.5 0.5 0.5 0.5 
##$DPOFFS= (0..7)
0 0 0 0 0 0 0 0 
##$DQDMODE= 0
##$DR= 18
##$DS= 0
##$DSLIST= <SSSSSSSSSSSSSSS>
$$ [...]
##$SUBNAM0= <"">
##$SUBNAM1= <"">
##$SUBNAM2= <"">
##$SUBNAM3= <"">
##$SUBNAM4= <"">
##$SUBNAM5= <"">
##$SUBNAM6= <"">
##$SUBNAM7= <"">
##$SUBNAM8= <"">
##$SUBNAM9= <"">
##$SW= 18.0517328524113
##$SWIBOX= (0..15)
0 0 2 0 0 0 0 0 0 0 0 0 0 0 0 0 
##$SW_h= 3612.71676300578
##$TD= 16384
##$TD0= 1
##$TE= 0
##$TE2= 300
##$TE3= 300
##$TEG= 300
##$TL= (0..7)
0 120 120 120 120 120 120 120 
##$TP= (0..7)
150 150 150 150 150 150 150 150 
##$TP07= 0
##$TPNAME0= <>
##$TPNAME1= <>
##$TPNAME2= <>
##$TPNAME3= <>
##$TPNAME4= <>
##$TPNAME5= <>
##$TPNAME6= <>
##$TPNAME7= <>
##$TPOAL= (0..7)
0.5 0.5 0.5 0.5 0.5 0.5 0.5 0.5 
##$TPOFFS= (0..7)
0 0 0 0 0 0 0 0 
##$TUNHIN= 0
##$TUNHOUT= 0
##$TUNXOUT= 0
##$USERA1= <user>
##$USERA2= <user>
##$USERA3= <user>
##$USERA4= <user>
##$USERA5= <user>
##$V9= 5
##$VALIST= <valist>
##$VCLIST= <CCCCCCCCCCCCCCC>
##$VD= 0
##$VDLIST= <DDDDDDDDDDDDDDD>
##$VPLIST= <PPPPPPPPPPPPPPP>
##$VTLIST= <TTTTTTTTTTTTTTT>
##$WBST= 1024
##$WBSW= 4
##$XGAIN= (0..3)
0 0 0 0 
##$XL= 0
##$YL= 0
##$YMAX_a= 117202
##$YMIN_a= -121327
##$ZGOPTNS= <>
##$ZL1= 120
##$ZL2= 120
##$ZL3= 120
##$ZL4= 120
##$ABSF1= 10
##$ABSF2= 0
##$ABSG= 5
##$ABSL= 3
##$ALPHA= 0
##$AQORDER= 0
##$ASSFAC= 0
##$ASSFACI= 0
##$ASSFACX= 0
##$ASSWID= 0
##$AUNMP= <proc_1d>
##$AZFE= 0.1
##$AZFW= 0.1
##$BCFW= 1
##$BC_mod= 2
##$BYTORDP= 1
##$COROFFS= 0
##$CY= -3
##$DATMOD= 1
##$DC= 2
##$DFILT= <>
##$DTYPP= 0
##$F1P= 0
##$F2P= 0
##$FCOR= 0.5
##$FTSIZE= 0
##$FT_mod= 4
##$GAMMA= 1
##$GB= 0.15
##$INTBC= 1
##$INTSCL= 1
##$ISEN= 128
##$LB= 0.25
##$LEV0= 0
##$LPBIN= 0
##$MAXI= 10000
##$MC2= 0
##$MEAN= 0
##$ME_mod= 0
##$MI= 1.114404
##$NCOEF= 0
##$NC_proc= 0
##$NLEV= 6
##$NOISF1= 3.799351
##$NOISF2= 2.8
##$NSP= 1
##$NTH_PI= 0
##$NZP= 0
##$OFFSET= 14.38212
##$PC= 1
##$PHC0= 251.8613
##$PHC1= 14.1922
##$PH_mod= 1
##$PKNL= yes
##$PPARMOD= 0
##$PSCAL= 0
##$PSIGN= 0
##$REVERSE= no
##$SF= 200.129724274929
##$SI= 16384
##$SIGF1= 3
##$SIGF2= 2
##$SINO= 400
##$SIOLD= 16384
##$SREGLST= <1H.CDCl3>
##$SSB= 0
##$STSI= 0
##$STSR= 0
##$SW_p= 3205.1282051282
##$SYMM= 0
##$S_DEV= 0
##$TDeff= 0
##$TDoff= 0
##$TI= <>
##$TILT= no
##$TM1= 0
##$TM2= 0
##$TOPLEV= 0
##$USERP1= <user>
##$USERP2= <user>
##$USERP3= <user>
##$USERP4= <user>
##$USERP5= <user>
##$WDW= 1
##$XDIM= 8192
##$YMAX_p= 0
##$YMIN_p= 0
$$ End of Bruker specific parameters
$$ ---------------------------------
##NTUPLES= NMR FID
##VAR_NAME=  TIME,          FID/REAL,        FID/IMAG
##SYMBOL=    X,             R,               I
##VAR_TYPE=  INDEPENDENT,   DEPENDENT,       DEPENDENT
##VAR_FORM=  AFFN,          ASDF,            ASDF
##VAR_DIM=   8192,          8192,            8192
##UNITS=     SECONDS,       ARBITRARY UNITS, ARBITRARY UNITS
##FACTOR=    0.0002768,     1,               1
##FIRST=     0,             0,               0
##LAST=      2.2672688,     0,               0
##MIN=       0,             -121327,         0
##MAX=       2.2672688,     117202,          0
$$ Real data points
##PAGE= N=1
##DATA TABLE= (X++(R..R)), XYDATA
$$ [...]
1860c4k90K26J57j56J42q6k8K9k07M47r0j08K09l30J94j99j0%J68qL1k11M35k63
$$ -34 -324 -98 59 -97 45 -41 -69 -40 -247 200 110 2 211 -119 75 -124 -134 -134 34 26 57 -154 281 18
1884A8j56J93R4J06o9m5n9j12j25J02j01R0j3Q6j52J52n5K22j58k27M99l17l3
$$ 18 -138 55 149 255 186 141 82 -30 -155 -53 -154 -64 -77 9 -143 9 -46 176 18 -209 290 -27 -60
1907f0j46K05L6J8j42J44k55K51r9p6K1J85q2m8k85L47j52k24K64K72m11K17L16
$$ -60 -206 -1 35 53 -89 55 -200 51 -48 -124 -103 82 0 -48 -333 14 -138 -362 -98 174 -237 -20 296
1930B96l36o6M2M91l41J09k03Q3L19k14j49L32j58m13K70p6M31k25j29k15J73
$$ 296 -40 -106 -64 427 86 195 -8 75 394 180 31 363 205 -208 62 -14 417 192 63 -152 21
1951B1L5K88l27O1k5Kj12K17j99r1K37l03L78k21R8k87J2K58J8j78J38J12r8L10
$$ 21 56 344 17 78 53 55 -57 160 -39 -130 107 -196 182 -39 59 -228 -216 42 60 -118 20 132 34 344
1975C44k60p5o9J54M3l7n2k66J44m8K60Q2l36lK79l8j59nL08j64l81K60J41L1
$$ 344 84 9 -60 94 137 100 48 -218 -74 -122 138 220 -116 -119 160 122 -37 -42 266 102 -279 -19 122 153
1999A53k58K04J21p1k62J50j41K77j19j94K5P9m9K67k13n5J10J30k10m7Q1j16
$$ 153 -105 99 220 149 -113 37 -104 173 54 -140 -115 -36 -85 182 -31 -86 24 154 -56 -103 -22 -138
2021a38K02Kk73L33j93k51L32j20j07J37J65O0k45O5M48m37M74k01n76M83K0k98
$$ -138 64 66 -207 126 -67 -318 14 -106 -213 -76 89 149 -96 -31 417 -20 454 253 -323 160 180 -118
2043a18K49n21M99n6J6j86J27kj83L48k72l7J04P0m5J59k31N6N3k40K91r0k42
$$ -118 131 -390 109 53 69 -117 10 8 -175 173 -99 -136 -32 38 -7 152 -79 -23 30 -210 81 -9 -251
2066b51K31M58m63n1j3J89m22L51m09M45j17N5k56J81r7R4L29j33k8o1J43j89
$$ -251 -20 438 -25 -76 -89 100 -322 29 -380 65 -52 3 -253 -72 -169 -75 254 121 93 32 175 -14
2088a4l50K56q6K42j80J80j24L40j64l21L06j11J3P3p0j97L54m05L92m25m4M93
$$ -14 -364 -108 -194 48 -132 48 -76 264 100 -221 85 -26 -13 60 -10 -207 147 -258 134 -291 -335 158
2110A58K4k42J23k32K67M2k48J99m38K79J30n06L66j8K3k00J24M27j40k36L00
$$ 158 182 -60 63 -169 98 140 -108 91 -347 -68 62 -444 -78 -96 -73 -273 -149 278 138 -98 202
2131B02k62k49L76j29J38j15K2R5o0J2K11j01j10J35l28J14J06j00K26j10J68
$$ 202 -60 -309 67 -62 76 -39 -17 78 18 30 241 140 30 165 -163 -49 57 -43 183 73 241
2152B41l81O5OK8j72K27j49kJ84j36j1P0K57j30j02L6k53J59j1k11K03K41j53
$$ 241 -140 -75 -69 -41 -213 14 -135 -137 47 -89 -100 -30 227 97 -5 31 -222 -63 -74 -285 -82 159 6
2175Fj9K01l63N4J70J3K6o3k18P0j9L91o3l88O4L63l58p3J73J41l0K33k96n8K65
$$ 6 -13 188 -175 -121 49 62 88 25 -193 -123 -142 249 186 -202 -138 225 -133 -206 -33 108 78 311 15 -43 222
2200B22j2l21o9L28l35L50l41L42k67R7R1o2k29J45K0P4j36p8K62k3j11J16j7
$$ 222 210 -111 -180 148 -187 163 -178 164 -103 -6 85 23 -206 -61 -41 33 -103 -181 81 58 -53 63 46
2223D6J17p9l2J2j1j25J60o6m7r7N0L9N2j41Q1O5j35r3J99l6m5J97k19o6k8K01
$$ 46 163 84 52 64 53 -72 88 22 -25 -122 -72 -33 19 -122 -41 24 -111 -204 -5 -41 -86 111 -108 -174 -202 -1
2249aJ25R1p7K4q0j83J44J52n82N05J45J5j47j46n5p4j5K79k3j38MQ7k00M9Q5
$$ -1 124 215 138 162 82 -101 43 195 -387 118 263 278 131 -15 -70 -144 -159 120 97 -41 -37 50 -150 -101 -16
2274a6lp6j48J72J1K75l38Q0K06P2l15lj12K49Q3P0n2j65l4L0l23K30r8N6L00
$$ -16 -19 -95 -243 -71 -60 215 -123 -43 163 235 -80 -83 -195 54 137 207 155 -10 -44 -14 -337 -107 -205 -149 151
2299A51P9J8k31Q3o2J18l3J16k76J39K07l15J06L7k81p5N54l60p6J6J44j13R3
$$ 151 230 248 17 100 38 156 123 239 -37 102 309 -6 100 137 -144 -219 335 -25 -101 -85 59 -54 39
2322C9j26P1n2j15K48J78l75Q2o1K54k98K26R4j32p9K42R4l53KK05k95J60k36
$$ 39 -87 -16 -68 -183 65 243 -132 -50 -111 143 -155 71 165 33 -46 196 290 -63 -61 144 -151 9 -227
2345b27J77RJ4J49j06K33l51J67r4P4l30M13k41K56j94j88J32J43O0O6l44J72
$$ -227 -50 -41 -27 122 16 249 -102 65 -29 45 -285 128 -113 143 -51 -239 -107 36 96 162 -182 -10
2367a0P1N9k9k92J5J40k04J78n6j78N42k67N3J73p3j2l7j04N3p5n2J36k37K67
$$ -10 61 120 91 -201 -186 -46 -250 -72 -128 -306 236 -31 22 195 122 110 73 -31 22 -53 -105 31 -206 61
2391F1m5J16j76J52%l46M10j51J64l98K30PpNJ63m59L32j04J79L0j18p8p6j16
$$ 61 16 132 -44 108 108 -238 172 21 185 -213 17 24 17 22 185 -274 58 -46 133 163 45 -33 -109 -225
2415b25M18k3j31J78j10J16j60n9j02J21K7pJ72k65p2M14j83l0k27L31l62J47
$$ -225 193 170 39 217 107 223 63 4 -98 23 50 43 215 -50 -122 292 109 79 -148 183 -179 -32
2437c2j55L42l85P8M86k33k97l2K38O1Q7j76R3r8RK93l09M9q7m5l07J63J01K15
$$ -32 -187 155 -230 -152 334 101 -196 -228 10 71 158 -18 75 -23 -14 279 -30 19 -68 -113 -420 -257 -156 59
2461E9j97L1J52R2l57mL07j94P2j0r8K08N5j63J13n2k4L3k00L15j69%j20J14J22
$$ 59 -138 -107 45 137 -220 -224 83 -111 -39 -49 -147 61 116 -47 66 14 -10 23 -177 138 -31 -31 -151 -37 85
2486H5j60M0j43M87l68P5o1j89K24R2k37P4K74k35J54q1k05K85j86J4J09p6Q8
$$ 85 -75 -35 -178 309 -59 16 -45 -234 -10 82 -155 -81 193 -42 112 31 -174 111 -75 -61 48 -28 60
2509F0J29j67p5k3L63k94k79M27l8j89K39Lk12pj13lK76K0k54K43j15l2M52j85
$$ 60 189 22 -53 -76 287 -7 -286 141 103 -86 153 156 -56 -63 -176 -179 97 117 -137 106 -9 -41 411 226
2533B26k60J05k2l53N19j41J9J12l09J64k01l6J34J04q5J50o6O0j88j81N67k05
$$ 226 -34 71 49 -304 215 74 93 205 -104 60 -141 -177 -43 61 -24 126 60 120 -68 -249 318 113
2555A13q3q6J76l24L35k95N2J21j45K20n5j70J1J40N4q8L59k15l10K66O4j87q2
$$ 113 30 -56 120 -204 131 -164 -112 9 -136 84 29 -141 -130 10 64 -24 335 120 -190 76 140 -47 -129
2578a29L17j03J24j38k94j5J90j44M04k05k2o4J06r9L03k49K02j85j9O4J24k22
$$ -129 188 85 209 71 -223 -238 -48 -192 212 7 -15 -79 27 -72 231 -18 184 -1 -20 44 168 -54
2600e4J49p9K74k68K20j15l2J2k71M16k14M2J67m72J94J8j30P3J39p5k42RJ18
$$ -54 95 16 290 22 242 127 95 107 -164 252 38 80 247 -225 -31 -13 -143 -70 69 -6 -248 -239 -121
2623a21K42l57K72q4pO8j86K19k36K90L9K6j07j6J4o1J40M7o0M4k13K1j29QK73
$$ -121 121 -236 36 -48 -55 13 -173 46 -190 100 139 165 58 42 56 -5 135 182 122 166 -47 -26 -155 -147 126
2648A26K10k81k46N5R1J83k89K68p6M9lk9j67J84p4lJ7k22L80j91Rr1J42J80k28
$$ 126 336 55 -191 -136 -45 138 -151 117 41 90 87 58 -109 75 1 -2 15 -207 173 -18 -9 -100 42 222 -6
2673fJ8rq6M78k43j78J58r2P5JJ47j35o8Q2j85p1N5j25K83Q3j12j04J7K94n27
$$ -6 12 3 -83 395 152 -26 132 40 115 116 263 128 60 142 -43 -114 -59 -184 99 182 70 -34 -17 277 -250
2698b50L69k09j13K34Q7l07kJ51M1k05K56j09J0K31k11l4Q6K14m94L40K65l42
$$ -250 119 -90 -203 31 118 -189 -191 -40 1 -204 52 -57 -47 184 -27 -61 25 239 -255 85 350 8
2720Hj26L16p9l94M73l48J92R3J8j37LJ37j65MO6q4J12j14n8j5M03j66J7j38j59
$$ 8 -118 198 119 -275 198 -150 42 135 153 16 19 156 -9 -5 61 -23 89 -25 -83 -98 305 139 156 18 -141
2745a41Qj37oL04o4O8J1j25L30l01J01q2N8J29k88Q4L05j47K80n25l5pR6LJ43
$$ -141 -133 -270 -276 28 -36 32 43 -82 248 -53 48 -34 24 153 -135 -51 254 107 387 -138 -173 -180 -84 -81 62
2770F2k24M03j49J18j55m04Q5J21K80n02N73j95K56l97j87J72r4J21jP0M4k04
$$ 62 -162 241 92 210 55 -349 -264 -143 137 -365 208 13 269 -128 -315 -143 -237 -116 -117 -47 -3 -207
2792b07M5K6n5R4K4q4J11lm4nK18j1k44O7j27Q0K24k22K26m7Q2j43J52n1K1k56
$$ -207 -162 -136 -191 -97 -73 -157 -46 -49 -93 -98 120 109 -135 -68 -195 -115 109 -113 113 66 148 5 157 106 127 -129
2818a29L17J52n14lK77j61N3j32J68K06l08J7J89k6o4N6j10k14N1J76j37j7mJ03
$$ -129 188 340 -174 -177 100 -61 -8 -140 28 234 -74 -57 132 106 42 98 -12 -226 -175 1 -136 -153 -157 -54
2842e4N8Q1k4j85J28k24M01k35M4j22K30k15L09k38J16N9j2m0Q4N1l33L90o19
$$ -54 4 85 61 -124 4 -220 181 -54 -10 -132 98 -117 192 -46 70 129 117 77 161 212 -121 269 -350
2865c50N25R7k26j24R5n6l08N23k74L6M6k38K33J95k92K3O7j61K32MQ2j86j66
$$ -350 175 272 46 -78 17 -39 -347 176 -98 -62 -16 -254 -21 174 -118 -95 -28 -189 43 47 129 -57 -223
2888b23L18K5m0Mj97K31p4J33j68Q3N8L6k16k04L17j40j52N9l6Q3O9L4J02J70
$$ -223 95 120 80 84 -113 118 44 177 9 92 150 186 -30 -234 83 -57 -209 -150 -186 -103 -34 0 102 272
2912B72k30k61J86J41K2k36n7j05K11k10L25k13J94Pj50K31K0l41J23K82k34J41
$$ 272 42 -219 -33 108 130 -106 -163 -268 -57 -267 58 -155 39 46 -104 127 147 -194 -71 211 -23 118
2934A18l18M02j0k02k90J11K39j66j34L35l0k8k97J63J50k88R0K94p8N2k37K83
$$ 118 -200 202 192 -10 -300 -189 50 -116 -250 85 55 27 -270 -107 43 -245 -155 139 61 113 -124 159
2956A59k13j9L02j45j58J84r8K50l14R7M6k20O5j5J36j27P0n3J72k47K64k88J98
$$ 159 -54 -73 229 84 -74 110 12 262 -52 45 91 -129 -64 -79 57 -70 0 -53 119 -128 136 -152 46
2979D6k20J91J22j45J6J18k14K7M9L24m57%J60J12k66J06j02J99k66P2P6j39J70
$$ 46 -174 17 139 -6 10 128 -86 -59 -10 314 -143 -143 17 129 -137 -31 -133 66 -200 -128 -52 -191 -21
3002b1QN3k55L65o0K7K0L44m93k2l14M39J64l10J41k44N3K47j87K4J52l21Q5K14
$$ -21 -13 40 -215 150 90 117 137 481 -12 -34 -348 91 255 -55 86 -158 -105 142 -45 -21 131 -190 -105 109
3026A09l18J5K49j90J24n7j88K68j86J11J39r8qJ50j90N28n70J31m7J03O7j7l
$$ 109 -209 -194 55 -135 -11 -68 -256 12 -174 -63 76 -22 -30 120 -70 458 -112 19 -28 75 142 125 122
3049A22j47L8J58n6m4j39J96O6j25k2k95Q3K24m85K97r7L25k23j40L87J38m19
$$ 122 -25 13 171 115 71 -68 128 194 69 47 -248 -165 59 -426 -129 -226 99 -124 -264 123 261 -158
3071a58K24R4m40L37J19j07l14k6K87j32J14r1L71k27J55k23j26J62j71J0K0K23
$$ -158 66 160 -280 57 176 69 -245 -271 16 -116 -2 -93 278 51 206 -17 -143 19 -152 -142 -122 101
3093A01N0r3j83R8O5p7J33K1J82m10j15M02%j09rj79L47k77J24J45n40L40qk22
$$ 101 151 58 -125 -27 38 -39 94 115 297 -113 -228 174 174 65 56 -123 224 -53 71 216 -324 16 8 -214
3117b14M46k73j7P1k03J75J41j34Q7R6k83J07N0M3j92K15K04m49oK95l19K55j66
$$ -214 232 -41 -58 13 -190 -15 126 -8 79 175 -108 -1 49 92 -100 115 319 -130 -136 159 -160 95 -71
3140g1L39m35k1M80k60j81J36K77k14L9j66n8l7L01j40j61P2J77rj06K07k59J02
$$ -71 268 -167 -188 292 32 -149 -13 264 50 89 -77 -135 -172 129 -11 -172 -100 77 68 -38 169 -90 12
3163A2j20j30nL75OR9l53K48q9l7o5j23J6P0J74J75k16O8N5j91J22j5K5j56j17
$$ 12 -108 -238 -243 132 138 237 -116 132 43 6 -59 -182 -166 -96 78 253 37 105 160 -31 91 76 101 -55 -172
3188a72L04l90L5K05j4J88m12K63L1q8p6N5K51m17J69j52Q1j06J51p3M13j20o7
$$ -172 132 -258 -223 -18 -32 156 -256 7 38 -50 -126 -71 180 -237 -68 -220 -139 -245 -94 -167 246 126 59
3211E9j45M4J24L31l5j48j6l77K76q6n2MP2l5k72L26k13K44n2l74N5P6K70R2k8
$$ 59 -86 -42 82 413 378 230 214 -163 113 27 -25 -21 51 16 -256 70 -143 101 49 -325 -270 -194 76 168 140
3236A40K8m46M6K19j72K48j06J78l3j49j44L29k37O4K76l29j00K86m28K61J92
$$ 140 168 -278 -232 -13 -185 63 -43 135 102 -47 -191 138 -99 -35 241 -88 -188 98 -330 -69 123
3257A23j66j67J16K62j60j32k7j62M49p3l6O8J24j42j28K19Mk15k6n7R5R6j9k45
$$ 123 -43 -210 -94 168 8 -124 -151 -313 136 63 27 95 219 77 -51 168 172 -43 -69 -126 -31 65 46 -199
3281a99j33L10j21J23p5J36j85ro8J19j07K44J39j30k3k90L26Qkj08J39r3Oo6
$$ -199 -332 -22 -143 -20 -95 41 -144 -153 -221 -102 -209 35 174 44 21 -269 57 65 63 -45 94 1 7 -59
3305e9R5j05K89j83P2l23M47l09L47k84j4j44p8J56j40K68k9l3K07j85m9j32P3
$$ -59 36 -69 220 37 109 -214 233 -76 271 -13 -27 -171 -249 -93 -233 35 6 -27 180 -5 -54 -186 -113
3328a13K39m25L54l53M10j02j3J99m9l34N1K34l73L24j1J72k32J04K35l36k20
$$ -113 126 -299 55 -298 112 10 -3 196 147 -187 -136 98 -275 49 38 210 -22 82 317 -19 -239
3349b39L59J4j96o3J89P5j18l2K13j30J37k19J06R8q0M5k80J45k45K01k17M02
$$ -239 120 134 -62 -125 64 139 21 -11 202 72 209 -10 96 194 114 159 -121 24 -221 -20 -237 165
3371A65j04M6k00J91K2J81l41k39L34K70m59K40k87K49j05l1J12j34J73J7o5J0
$$ 165 61 107 -93 98 120 301 -40 -279 55 325 -134 106 -181 68 -37 -68 44 -90 83 100 35 45
3393D5j74J52j19oJ76L1O2M8l48j22K30J8k83M48l33J78K78k17l16J6p0J53k3
$$ 45 -129 23 -96 -102 74 105 167 215 -133 -255 -25 -7 -290 158 -175 3 281 64 -252 -236 -306 -153 -176
3416a76L9K99r6j22O0M5mQ0k31J80p8K07l89J43Q8m2j06J78M7l50L48k03K03m36
$$ -176 -137 162 66 -56 4 49 45 125 -106 74 -4 203 -186 -43 45 3 -103 75 122 -228 120 -83 120 -316
3440c16K99o4Q0J8K44j32j53pq6J60K41l70J76j97J03J2L29j76j62L7k4L31m43
$$ -316 -17 -81 -1 17 261 129 -24 -31 -117 43 284 -86 90 -107 -4 8 337 161 -1 36 12 343 -100
3463a00P7J07k01K57j13j46K47l23J69k8j3J09l21K50M9k7q2J70okj20R0k27K04
$$ -100 -23 84 -117 140 27 -119 128 -195 -26 -54 -67 42 -279 -29 20 -7 -89 81 75 73 -47 43 -184 20
3487B0J43q3l76K10rpM2l53L04Q9k48L18O7n5qJ65L8l01J89j35r1LO7k05K21j5
$$ 20 163 80 -296 -86 -95 -102 -60 -413 -109 -20 -268 50 117 62 54 219 257 -44 145 10 -81 -78 -11 -216 5 -10
3513a0l00K56K17o9j72J89J15j74j58J48j01n7J90j93N0K3k83M70k82K39Q9k15
$$ -10 -310 -54 163 94 -78 111 226 52 -106 42 -59 -116 74 -119 -69 -46 -329 141 -141 98 187 -28
3535b8j44LL5L39l46K92j33L5k0l32N03l10K9P1j42R0K32k85L73p7j31j35K31
$$ -28 -172 -169 -134 205 -141 151 18 53 33 -299 204 -106 -77 -6 -148 -58 174 -111 262 185 54 -81 150
3558A50j83j67K31j0O0k6r4j30L94m2m06J31r5J55O7j05O8l72O06j25p6j62q3
$$ 150 -33 -200 31 21 81 55 -39 -169 225 183 -223 -92 -187 -32 35 -70 -2 -374 232 107 31 -131 -214
3581b14L15o7Q2j39J3q2j84O77l13n7r2J33M3K3j74J22k96R5K12j41J10r2J81
$$ -214 101 34 116 -23 -10 -92 -276 401 88 31 -61 72 115 138 -36 86 -210 -115 97 -44 66 -26 155
3604A55k27J61j01k24K87J47k63k25J51J5J98np7k1N2L13l46J79k55P6m7j40K57
$$ 155 -72 89 -12 -236 51 198 -65 -290 -139 -124 74 69 -8 -29 23 336 -10 169 -86 -10 -57 -197 60
3627F0j38J50l57L11k27K07J92m3j5r3K35m28J91J9j19r4J82Q7l67K28J29m62
$$ 60 -78 72 -285 26 -201 6 198 155 140 47 282 -146 45 64 -55 -149 33 120 -247 -19 110 -352
3649c52M27k03K23J64l19k71M52j96L09j74k77K93J99m64O1LJ96K42m34K3J80
$$ -352 75 -128 95 259 -60 -331 121 -75 234 60 -217 76 275 -189 -128 -125 71 313 -121 -98 82
3670H2j17J44L7o1j41J67PPl6O5j19o1K94k20M7j08M6R1j09k64N9J02J83N2M6
$$ 82 -35 109 146 85 -56 111 118 125 89 154 35 -26 268 48 95 -13 33 124 15 -249 -190 -88 95 147 193
3695A93l53O6L19j75k10K86m03J87L5k7J55J1q7J13K08j54j9l13N06j94l27K99
$$ 193 -160 -94 225 50 -160 126 -277 -90 -55 -82 73 84 -3 110 318 164 145 -168 338 144 -183 116
3717A16K80k85J19k94O7R6J93m21q3L45k79l1L22k60L44j71R9j42j2j33L56J9
$$ 116 396 111 230 -64 3 99 292 -129 -212 133 -146 -177 145 -115 229 58 157 15 3 -130 226 245
3739B45m56L57l20M11k37k14K2K88mk47L32q9k09M3o0o2K59p4N5k20J26K44k97
$$ 245 -211 146 -174 237 0 -214 -192 96 92 -155 177 88 -121 -78 -138 -200 59 -15 40 -180 -54 190 -107
3762a07Q7j27K0L96k03k04J8j05K86m12M35j31Q6R5j31k8J99k03m6J35j14J39
$$ -107 -20 -147 -127 269 66 -138 -120 -225 61 -351 84 -47 39 134 3 -25 174 -29 -75 60 -54 85
3784H5q7j34K04J01l09RK69j58n7j45J74J27k57O1K90q2j5k45j9K15LMk0J85K8
$$ 85 -2 -136 68 169 -140 -131 138 -20 -77 -222 -48 79 -178 -117 173 91 76 -169 -188 27 30 34 14 199 227
3809B27j68j53J12kj04J12J27r8k59M1m4N7J62O2l17J95J36m97K81j9K76J58l25
$$ 227 59 -94 18 16 -88 24 151 53 -206 -165 -209 -152 10 72 -245 -50 86 -411 -130 -149 127 285 -40
3832d0J77k45J97J51l38J16j95J84j58J27M9j74j07L05l43M73j06k19L44k10j38
$$ -40 137 -108 89 240 -98 18 -177 7 -151 -24 25 -149 -256 49 -294 179 73 -146 198 -12 -150
3853a50L71k52j35K1J26j05O8J17J92j84j27k2K25q5k95L99k79L50j59k25J78
$$ -150 221 -31 -166 -145 -19 -124 -56 61 253 69 -58 -80 145 60 -235 164 -115 235 76 -149 29
3874B9j36J84r8J07q0j2j19Q9J10kj49N4r6%K23j6k86O5K08J15m04K22j19m3P4
$$ 29 -107 77 -21 86 6 -6 -125 -36 74 72 -77 -23 -119 -119 104 88 -198 -133 75 190 -214 8 -111 -154 -80
3899h0n5J66j80K73J16k56J9q7n7P0N1k09M10j85K01l25J03J12m8m0j95L47J8
$$ -80 -135 31 -149 124 240 -16 3 -84 -141 -71 -20 -229 181 -4 197 -128 -25 87 39 -1 -196 151 169
3922A69q3n7j20j36K95J7P3k8j20l1j6O1l10L14j41K62P3k83J84m40N00q0j46
$$ 169 86 29 -91 -227 68 85 158 130 10 -21 -37 24 -286 28 -113 149 222 -61 123 -317 183 103 -43
3945d3r0j52M64k04R6K71l65O2k4N4R0j35j02KM70j14k25Q6k63L46k20J02Q1k43
$$ -43 -133 -285 179 -25 71 342 -23 39 15 69 159 24 -78 -76 394 280 55 141 -122 224 4 106 187 -56
3969e6J98k36j06L00j11P0O1j35J81k12n5n1L54r0L5j66k51m0J73Q1J44J6K17
$$ -56 142 -94 -200 100 -11 59 120 -15 166 -46 -101 -152 202 112 147 -19 -270 -310 -137 -56 88 104 321
3992C21k55j86l6J40j68K65q3r0K4J76K40l86K55l45Q4o0j54r0L99J3n9L33j77
$$ 321 66 -120 -156 -16 -184 81 -2 -92 -68 108 348 -38 217 -128 -44 -104 -258 -348 51 64 5 338 161
4015A61l97L05m6r8j10j4J68k66L62o6r4K14J6l30K28pJ11K2J36k95j82J36L4
$$ 161 -236 69 23 -75 -185 -199 -31 -297 65 -1 -95 119 135 -195 33 26 137 159 295 0 -182 -46 -12
4038a2j56K08kk5j9J10j1j63J6O4J98k07N5j60K30k83J77R8M4J74k89J07j67N7
$$ -12 -168 40 38 13 -6 104 93 -70 -54 10 208 1 56 -104 126 -157 20 118 162 336 47 154 -13 44
4062D4J98j83J29j57K5o9L1J18m28L92R1m43K26j69K28p8l6K24l18P3L42l00k8
$$ 44 242 59 188 31 56 -13 18 136 -292 100 191 -252 -26 -195 33 -45 -81 143 -175 -102 240 -60 -88
4085h8J9J1L61m40J37n1K04j94K5K2o7j03L07J02j66j82K34n3j65n8J27j68N48
$$ -88 -69 -58 303 -137 0 -51 153 -41 -16 6 -61 -164 143 245 79 -103 131 78 -87 -145 -18 -186 362
4108C62m69J19J76l55N1J16l6L0J10j22K32l61J07j04M30m24O8n5J41o2j24J34
$$ 362 -107 12 188 -167 -116 0 -36 -6 104 -18 214 -147 -40 -144 286 -138 -70 -125 16 -46 -170 -36
4130c6N3K46o1l5k1r0k19L66p9k96m8J89n0q8M4L75k42Nk3M0J89l21R7k81rK41
$$ -36 17 263 202 167 146 56 -163 203 124 -172 -220 -31 -81 -169 -125 250 8 13 -10 30 219 -102 -5 -286 -295 -54
4156e4K6J5J87k80j77J81K56Pl26J79j63j3K8J51L49n61L40m5l0k37L83j66J62
$$ -54 -28 -13 174 -106 -283 -102 154 161 -165 14 -149 -162 -134 17 366 -195 145 100 70 -167 216 50 212
4179B12l00l6j7O8o9l7K49j11j5J70l45K1J70k4l05K47R9O7n3k51M09j03Q5j60
$$ 212 -88 -124 -141 -73 -142 -179 70 -41 -56 114 -231 -210 -40 -64 -369 -122 -23 44 -9 -260 149 46 131 -29
4203b9K1j24o8L22j10j01j4K90j25M7p4P7Q4k11O9k4k2k1Qn3M3Kk9Jo9NN3Q5l5
$$ -29 -8 -132 -200 122 12 -89 -103 187 62 109 35 112 196 -15 54 30 8 -13 -5 -58 -15 -13 -42 -41 -110 -105 -52 33 -2
4232bj0K05k37j8Q7L75n95k4K93j41J29K5p1K01m6k92J40qP6j38K47m8lk69R6
$$ -2 -12 193 -44 -62 25 400 -195 -219 74 -67 62 87 16 217 171 -121 19 11 87 -51 196 148 145 -124 -28
4257b8J56j2m4k0J15k49L41l78O1j31Q0Q6j15r0J14J67j46R3k66M84l43R5j16
$$ -28 128 116 72 52 167 -82 259 -119 -58 -189 -109 -23 -138 -228 -114 53 -93 0 -266 218 -125 -30 -146
4280a46K56j71K11j29K2p4L0p2j22j39K80M82m07K9J62j63pj07J06j68J01P8K6
$$ -146 110 -61 150 21 43 -31 -1 -73 -195 -334 -54 428 21 50 212 49 42 -65 41 -127 -26 52 78
4303G8k46L51q0k88M4K26j47j03P1L08k82K1Rn6M5J8q7PQ0l23J69J78J33j09N1
$$ 78 -168 183 103 -185 -141 85 -62 -165 -94 214 -68 -47 -38 -94 -49 -31 -118 -111 -31 -354 -185 -7 126 17 68
4328F8J1j91Q9NK66l11j1J09J5j23K0J58m2j57p5K75r0j34L50l27K0L7K36l07
$$ 68 79 -112 -23 -18 248 -63 -74 35 50 -73 -53 105 63 -94 -169 106 16 -118 232 -95 -75 -38 198 -109
4352a09P3K26M1j75R7k56K51L4l22J64j48K85j96r0j04M83l65K56j48qk35J41
$$ -109 -36 190 231 56 153 -103 148 182 -140 24 -124 161 -35 -125 -229 254 -111 145 -3 -11 -246 -105
4374a05l20L33K20j09P0k93M68m08K14j08Mk1K30L9j63o4j73L97l29Q4p4K28q3
$$ -105 -425 -92 128 19 89 -204 264 -144 70 -38 -34 -55 175 214 51 -13 -186 211 -118 -34 -108 120 37
4397C7P9l33K11j8K01K76m39j05P3j69J32K90l75K47L0j85Pj45Q6p1K15J78l69
$$ 37 116 -217 -6 -24 177 453 14 -91 -18 -187 -55 235 -140 107 137 -48 -41 -186 -100 -171 44 222 -147
4420a47M0J37k24J37J18J51l78J35K17o22M57J16k10j20J44O4o6K82l27p0J55
$$ -147 -107 30 -194 -57 61 212 -166 -31 186 -436 21 137 -73 -193 -49 15 -51 231 -96 -166 -11
4441a1j72J03r4M68l58K02k59K00J44q4k00k24K56O9j68M16k95j41N4J21j40m5
$$ -11 -183 -80 -174 294 -64 138 -121 79 223 139 -61 -285 -29 40 -128 288 -7 -148 -94 27 -113 -158
4463a58J00J53j91L9Q0j38o3n7J45L45m18K62j30P1k31J57Q8r7L77j49k87K03
$$ -158 -58 95 -96 -57 23 -115 -178 -235 -90 255 -163 99 -31 40 -191 -34 54 -43 334 185 -102 101
4485A01l2q4K09l09R9R5k1j33j69J79J03R0k87n6K37J77k25Q5o3M2j71K26oj46
$$ 101 69 -15 194 -115 -16 79 58 -75 -244 -65 38 128 -159 -215 22 199 -26 59 -4 38 -133 93 87 -59
4509e9j3L17l65J98J37l27k1J70J21J06j63l17J86K47l93J31Q0m6J36m9q8J32
$$ -59 -72 245 -120 78 215 -112 -133 37 158 264 101 -216 -30 217 -176 -45 35 -11 125 76 -12 120
4531A20r3j68K46R7j73o8K08j20J3k8J74o1k1P4k82K62N3k91J40o0r4j6m9J10
$$ 120 27 -141 105 202 29 -39 169 49 62 34 208 147 126 200 -82 180 233 -58 82 22 -72 -88 -137 -27
4555b7K06q4p0LK29m22K77l07P5J19K96j60j64J05j64J96j23k7L62k13r9l85K36
$$ -27 179 95 25 28 257 -165 112 -195 -120 -1 295 135 -29 76 -88 108 -15 -42 320 107 8 -377 -141
4578a41J19K66r0r9L32k14j59N4k32K62R5k36j06K04j74K79p7Rj23J9J07q3o0
$$ -141 -22 244 154 55 387 173 14 68 -164 98 193 -43 -149 55 -119 160 83 92 -31 -12 95 12 -48
4601d8j46J24k4jJ77nJ06m63p1L30J03j02l33L53K25q7N1l58L52Jl10K07j08l
$$ -48 -194 -70 -94 -95 82 77 183 -280 -351 -21 82 -20 -353 0 225 138 189 -169 183 184 -126 81 -27 -30
4625c0K23l54J5Q7k28K24K11j38m2J84o6o6O7mk5R6k65J85N5M5k84L3l3J78J58
$$ -30 193 -161 -146 -59 -287 -63 148 10 -32 152 86 20 87 83 58 154 -111 74 129 174 -110 -77 -110 68 226
4650B26m8q3K66l60J52m24N13l78M7K20k60J4lQ2J65l3k0j19j86J64MO2K60k11
$$ 226 178 95 361 1 153 -271 242 -136 -89 131 -129 -115 -118 -36 129 96 76 -43 -229 -65 -61 1 261 50
4674E0O0k87L17j94j11N4j8L17R6j59r1l79N06k38Q9p3k9q1j30K15j53K29j41
$$ 50 110 -177 140 -54 -165 -111 -129 188 284 125 34 -345 161 -77 12 -61 -90 -171 -301 -86 -239 -10 -151
4697a51K74N5k04p0J66J8j80J55O6j80M39j29k64k42J88k27J21K63j15K45J8m56
$$ -151 123 178 -26 -96 70 88 -92 63 129 -51 388 259 -5 -247 -59 -286 -165 98 -17 228 246 -210
4719b10L7J90p0j48l3J41K18K3n0j29J23j88N6L2j02K07k83L69l54J19K48n30
$$ -210 -173 17 -53 -201 -234 -93 125 148 98 -31 92 -96 -40 -8 -110 97 -186 183 -171 -52 196 -334
4741c34L99j00l6R0n1j23m2K78o3O9k77K38l3j9J63k65K10j74m6r3J42r4J49J45
$$ -334 65 -35 -71 19 -32 -155 -197 81 18 87 -190 48 15 -4 159 -106 104 -70 -116 -209 -67 -161 -12 133
4765A33rp4o3K49n87K75L28k72M4m23L75m4J53p4J03q6R4j66j86J00O7j89M28
$$ 133 124 50 -13 236 -351 -76 252 -20 24 -399 -24 -68 85 11 114 28 122 -44 -230 -130 -63 -252 176
4788A76O8l95R8K7J51P8l23K60r0j72m2J17k9L07l46p3J52K14m6L1j44k28J79
$$ 176 244 -151 -53 -26 125 203 -120 140 50 -122 -164 -47 -76 231 -115 -188 -36 178 132 163 19 -209 -30
4811c0O9O5r5J86k65M7j08K81j86q9J45k55M17k57J16r0j3K53m8j49p0K62l21
$$ -30 39 104 9 195 -70 -23 -131 150 -36 -125 20 -235 182 -75 41 -49 -62 191 143 -6 -76 186 -135
4834a35jL35l64K19k72L25j54P1J61j32k27M04k66M5L37J0k0o46L60p1J11J76
$$ -135 -136 199 -165 54 -218 107 -47 24 185 53 -174 230 -36 9 346 356 336 -310 50 -21 90 266
4856B66k70rQ1j13JK4m2J30k05J76K6l1l01K35j59M63k69N2j26K52k13N5k99K79
$$ 266 -4 -13 68 -45 -44 -20 -62 68 -137 39 65 34 -267 -32 -191 272 3 55 -71 181 -32 23 -276 3
4880CK25j31k20J51j50qJ52j32J04k12L47j28j94L15r8K9j17Q0Nj85J66p1K56
$$ 3 228 97 -123 28 -122 -130 22 -110 -6 -218 129 1 -193 122 24 53 -64 16 21 -164 2 -69 187
4903A87l24O7K17J15j93j1l87L75j10M3j77M16p4j54J36K18k69J1m52L45M58l79
$$ 187 -137 -70 147 262 69 58 -329 46 -64 -21 -198 218 144 -10 126 344 75 86 -366 -21 437 58
4925E8J03j68j03K9K14n27N54k11L10l91O3K38l28M9K9O4K88l73N3J98k0k06K09
$$ 58 161 -7 -110 -81 133 -394 160 -51 259 -132 -69 169 -159 -110 -81 -17 271 -102 -49 149 129 -77 132
4948A32m40N11j23j96L88k34k94L64M7l67J51l1L94l11j33J0r7j30J98L25k38
$$ 132 -308 203 80 -116 272 38 -256 108 155 -212 -61 -92 302 -9 -142 -132 -229 -359 -161 164 -74
4969g4j32K08L85l79J71j97M4K9n9lRK2J2k59M09l78J03Q7j77J98l35O16l20J68
$$ -74 -206 2 387 8 179 -18 26 55 -4 -7 2 24 36 -223 186 -192 -89 -2 -179 19 -316 300 -20 148
4993A48k2l3r7lJ89k02K74m6k03j9o5L66m15J50j98K19P7k39k05J13K33j2L20
$$ 148 126 93 -4 -7 182 -20 254 208 5 -14 -79 287 -128 22 -176 43 120 -119 -324 -211 22 10 330
5016C30n51K24j47K38j1j39L3k94J19j2O1K57m5j35p2L52j73R0P1k65m7M28l14
$$ 330 -221 3 -144 94 83 -56 -23 -317 -198 -210 -149 108 63 -72 -144 208 35 125 196 -69 -116 312 -2
5039bO0o7J64m5k9m4K35Q1k90k21J33J9j29K33j71K39k18P6k90J98J07K8k58K74
$$ -2 58 -9 155 110 81 37 272 353 63 -158 -25 -6 -135 98 -73 166 -52 24 -266 -68 39 67 -191 83
5063H3o8j44M3j14O7KL44j88P3j80K58l04K97n3l2k96J59r5J96l5K52l43K75m56
$$ 83 15 -129 -86 -200 -133 -131 213 25 98 -82 176 -128 169 116 84 -212 -53 -148 48 13 265 -78 197 -259
5087b59K79J40q4J5O2j8j51J64Q8l9k53k66L50n5jR8l87K62l1J54Q9k9l02L77
$$ -259 20 160 76 91 153 135 -16 148 236 197 -56 -322 28 -27 -28 70 -317 -55 -86 68 157 128 -174 203
5111B03l74M26n16J95L2K9j44M52k22L6l35J52K42l92R2R9Q1k21n3L50j30l49
$$ 203 -171 255 -261 -66 -34 -5 -149 303 81 117 -218 -66 176 -216 -124 -25 56 -165 -218 132 2 -347
5133c47J90p3M33J8Nl41K37J12k71M6n6J74k71N5j10K43J17K6J30l95L77l64J56
$$ -347 -157 -230 203 221 226 -115 122 234 -37 9 -47 127 -144 -89 -199 44 161 187 317 -78 299 -65 91
5156I1L3K25n22K25k03k07K15o6L78k00j71j5J91J70n7m13K66J51K6M3q3j30K53
$$ 91 124 349 -173 52 -151 -358 -143 -209 169 -31 -202 -217 -26 144 87 -326 -60 91 117 160 77 -53 200
5179B00j89J24mj62l8J06jj02J17j77R9R7k88J79J12k22K08QR8l17L84k70J20
$$ 200 11 135 131 -31 -69 37 36 -66 51 -126 -27 70 -218 -39 73 -149 59 67 165 -152 232 -38 82
5202H2k13K70j09LJ45j66j52J64J1j9R1o0O7k56L63m50M27o0j28J96k30o8J51
$$ 82 -131 139 30 33 178 12 -140 24 35 16 107 47 114 -142 221 -229 198 138 10 206 -24 -92 59
5225E9J42k08O9q4K31L1l21J08KM8k11K02j13p1O2J09J05k17j28L7K16N0l14L97
$$ 59 201 -7 62 -22 209 240 -81 27 29 77 -134 68 -45 -116 -54 55 160 -57 -185 -148 68 118 -196 201
5249B01j81rJ99p5j78K14q6L1l9ok74J67R0j61L7J4J65L01n60J01M3K18j87r2
$$ 201 20 11 210 135 -43 171 85 116 77 71 -203 -36 54 -107 -70 -56 109 410 -150 -49 -6 212 25 -67
5273f7j83r6L20K34j95j65N44l29p9j0L28K2j59l20K18j70J37J56j95l0K1J54
$$ -67 -250 -346 -26 208 13 -152 392 63 -16 -26 302 324 165 -155 63 -107 30 186 -9 -39 -18 136
5295A36m09K86J13ok28R8k9N8q2J26r4M1j76K10R9j70p6K03m08L18J74k48j96
$$ 136 -273 13 126 120 -108 -10 -39 19 -63 63 -31 10 -166 44 143 -27 -103 100 -308 10 184 -64 -260
5318b60L14J32J36k47l07N49l97K84k09j55J8K91j91J25j23J23o8n6l0K28l02
$$ -260 54 186 322 75 -232 317 -80 204 -5 -160 -142 149 -42 83 -40 83 15 -41 -71 157 -145
5339a45J88o6o0o0L36m18J60J49n4m27L94J21o7K3j55O2j07O0k61L28R7R1l21
$$ -145 43 -23 -83 -143 193 -225 -65 84 30 -397 -3 118 51 74 -81 -19 -126 -66 -327 1 98 189 -132
5362a32L31k55K7K4K0N8j97o2K28l5r5J0K41j14r8j2L9p2J66k68K41o4J51o8o6
$$ -132 199 -56 -29 -5 15 73 -124 -186 42 7 -88 -78 163 49 -49 -61 -22 -94 72 -196 45 -19 132 64 -2
5387bK02k52j67M25l72M37j49qp6j34N9J22N6j14k50J07K05K42k18J39m36K56
$$ -2 200 -52 -219 206 -166 271 122 114 38 -96 -37 85 141 27 -223 -116 89 331 113 252 -184 72
5409G2n5j41K62l88M26p8j62K13L4Q2k14L1j26J53j01j60K54l29K62j22NJ17O9
$$ 72 17 -124 138 -250 176 98 -64 149 183 265 51 82 -44 109 8 -152 102 -227 35 -87 -82 35 104
5432A04Kk21N6J95k19J42lJ81n4l14L76j87j98p8K43mP6k10J11k65K26M4l7j37
$$ 104 106 -115 -59 136 -83 59 56 237 183 -131 245 58 -140 -218 25 21 97 -113 -2 -267 -41 3 -34 -171
5456a71J67n8jq7k04L95k10J10j42J48K5J25j30J32j8OL2k72J46K22Mm0k68k9
$$ -171 -4 -62 -63 -150 -354 41 -169 -59 -201 -53 -28 97 -33 99 81 87 119 -153 -7 215 219 179 -89 -118
5480a18J78k06k61O64k66J41j83J70k2K5r1J50m99L95k80J02J76J31p7j35q9R7
$$ -118 60 -146 -407 257 -9 132 -51 119 97 122 31 181 -318 77 -203 -101 75 206 129 -6 -95 2
5502Bn9L6J97pL3k82j35K82j40K3NN7Lj48R8J97j95q2J04o9J79k23K0R8j51m5
$$ 2 -57 -21 176 169 202 -80 -215 67 -73 -50 -45 12 15 -133 -35 162 -33 -115 -11 -80 99 -124 -104 -6 -157 -202
5528b02K77j96Q0J22j94m4N4MK73l90J77J70j35K5K70k73j44J69n0J18p8R2k4
$$ -202 75 -121 -41 81 -113 -157 -103 -99 174 -216 -39 131 -4 21 291 18 -126 43 -7 111 33 125 101
5551A01K07n28M91n0l73K6Q9N2j25J44j0K22l11j03J42nJ05pj20l8M0L04j82j52
$$ 101 308 -220 271 221 -152 -126 -37 15 -110 34 24 246 -65 -168 -26 -31 74 67 -53 -91 -51 253 71 -81
5575h1j9k06L83j5m00M00p5l07J56M03q3k06r3M1j13J58P1N9M6j57j9O6j22K34
$$ -81 -100 -306 77 62 -338 62 -13 -320 -164 239 156 -50 -143 -102 -215 -57 14 73 119 -38 -57 9 -113 121
5599A21k9R5l53l8K26O3k71L14k70l0L57k67K2M5r1J09M1L89l44j8j09m1J44k14
$$ 121 92 187 -166 -204 22 85 -186 128 -142 -172 185 -82 -60 -15 -106 3 44 433 89 71 -38 -79 65 -149
5623a49m6L31l05L61K9l89L51n08M28j49K37r9j21R6K44l36K27k03j09J65j03
$$ -149 -195 136 -169 192 221 -168 183 -325 103 -46 191 92 -29 67 311 -25 202 -1 -110 55 -48
5644d8K07p0KK0L0k48K64k34k8K52k94K09K20k32L25l82j10L57j41k5p7K69l45
$$ -48 159 89 91 111 141 -107 157 -77 -105 147 -147 62 282 50 375 -7 -117 240 99 74 -3 266 -79
5667g9J57J04l34J19k51K00O9j29J10o2J61j06l22L22M6j57K63p8Lo7k8n5J61
$$ -79 78 182 -152 -33 -284 -84 -15 -144 -34 -96 65 -41 -363 -41 5 -152 111 33 36 -31 -59 -114 47
5690D7p9j06L42j50j89L01m28M64k39J56k92J20J1j64K53k76K9L12K43l93qJ36
$$ 47 -32 -138 204 54 -135 166 -262 202 -37 119 -173 -53 -42 -206 47 -229 -200 112 355 -38 -46 90
5712I0J6J7j71O9J13n8l38K58J64k60j58J53L26l65q5K2K81o5j43lJ97k22K14
$$ 90 106 123 -48 21 134 76 -262 -4 160 -100 -258 -105 221 -144 -229 -207 74 9 -134 -137 60 -162 52
5735E2J0j25J17l37K91k62J32R5N7k90L55Q4o81N26p4K64k69rj89L30J45l5J12
$$ 52 62 -63 54 -283 8 -254 -122 -27 30 -260 95 179 -502 24 -50 214 -55 -64 -253 77 222 187 299
5758B99m47K47l0j23J44k4j95R7L5j32K14j4q6N6p1J9r2J05j76L46j37N8j43J30
$$ 299 -148 99 69 -54 90 66 -129 -32 3 -129 85 71 -15 41 -30 -11 -103 2 -174 172 35 93 -50 80
5782H0n0L2k13L82k10k7j00K27J6k17J17m9l23K15J97m79L73K15k87O7J80j24
$$ 80 30 62 -151 231 21 -6 -106 121 137 -80 37 -12 -335 -120 77 -402 -29 186 -101 -34 146 22
5804B2l8K0q6K45k70qj2R9n7J52Q9l48L03M0m7j24J88l13J08K19l84J07J10J6
$$ 22 -16 4 -82 163 -107 -115 -127 -28 -85 67 156 -192 111 151 104 -20 168 -145 -37 182 -202 -95 15 31
5828C1O7j04O7k57l9J96j86K97l39M59l58K23jr1n1R7l4J91l03L6j03J47N7k60
$$ 31 98 -6 61 -196 -235 -39 -225 72 -267 192 -166 57 56 -35 -86 11 -23 168 -135 -99 -202 -55 2 -258
5852b58J71m1J37j13l4M87k66Q2P4k71j32q8J37K2J8L22l57K96l75J75k4J82m1
$$ -258 -87 -128 9 -104 -138 349 83 165 239 -32 -164 -252 -115 -93 -75 247 -110 186 -189 -14 -38 144 103
5875A03j78J14r5L6N9p6Oq0M50o16K77Lqj15L59l34o2J91k71J35J38K5k81K60
$$ 103 -75 39 -56 -20 39 -37 -31 -111 339 -277 0 3 -5 -120 239 -95 -157 34 -237 -102 36 61 -220 40
5899D0J13q4j11R9k51l3J47K08K08J09o29J20P4p6M6Lj48J55Q3K39m80L01k90
$$ 40 153 69 -42 57 -194 -227 -80 128 336 445 -184 -64 10 -66 -20 -17 -165 -10 73 312 -168 133 -157
5922a57L9J96j29n5L76l07J41l93K56j29K09j37k6L0J43r3J03q7K18J00m33RJ28
$$ -157 -118 78 -51 -106 270 -37 104 -289 -33 -162 47 -90 -116 -86 57 -36 67 -20 198 298 -135 -126 2
5945BL95n28m6J78J20j85K35k05J21j07J03K5p6r4Rk25K61p7n3L2n5L36k55J51
$$ 2 397 -131 -177 1 121 -64 171 -34 87 -20 83 108 32 -62 -53 -278 -17 -94 -147 -115 -170 166 -89 62
5969F2o3N6j15R9Ok00J00Q0J03o2j94L00m6L8j00o1N6M2k36K04k3Q2M1k25K83
$$ 62 -1 55 -60 39 45 -155 -55 25 128 66 -128 172 126 164 64 3 59 101 -135 69 46 128 169 -56 227
5994B27j05k14Q4M0r5k7L5J61k05J66j75N0M1J61r4R0j38L2k17K67m13J20M66
$$ 227 122 -92 -8 32 -63 -90 -55 106 -99 67 -108 -58 -17 144 50 140 2 34 -183 84 -329 -209 257
6017B57j52j65PJ51j85m8J76M0j56J33j8j58OJ78K03m23M4k08K50n1P7K62j29
$$ 257 105 -60 -53 98 -87 -135 41 81 -75 58 40 -118 -112 66 269 -154 -110 -318 -68 -119 -42 220 91
6040I1N7l18J84J27n63J51P1K30j56N3k2n0L55m31K38o8j25J70m3o7M00l93K2
$$ 91 148 -170 14 141 -422 -271 -200 30 -126 -73 -95 -145 210 -221 17 -51 -176 -6 -49 -116 284 -109 -87
6063h7K5k60M19k86J78J14q2J32q2q4P4j10r2K54m69J52K18J54l56J66J41n8O4
$$ -87 -62 -322 97 -189 -11 103 21 153 71 -13 61 -49 -141 113 -356 -204 14 168 -188 -22 119 61 125
6086A25k00j17%J56J47j44J84r9j90O5O0j2r1o2J60J43j6k2O1k09o8j3J36N7J02
$$ 125 -75 -192 -192 -36 111 -33 151 52 -138 -73 -13 -25 -116 -178 -18 125 109 87 148 -61 -129 -142 -6 51 153
6111A53j94o9j9L11j70N9l3k64L33j02K71n07N7K58j55K12j7J7k1j72k7J81k92
$$ 153 -41 -110 -129 182 12 71 38 -226 107 5 276 -231 -174 84 -71 141 124 141 120 -52 -79 102 -190
6134a90J60k30K48j34L19J02k20L1q1k15L16j41J18K4K27n52N5J99m8k61J74J01
$$ -190 -30 -260 -12 -146 173 275 55 86 5 -210 106 -35 83 107 334 -218 -163 36 -12 -273 -99 2
6156Bq5jJ42L3k33J07jP1m39L40J33m3j4mO5n9Q7l23J03l4Q4M2P2j47K35k80j7
$$ 2 -83 -84 58 91 -142 -35 -36 35 -404 -64 69 26 12 8 73 14 101 -222 -119 -153 -69 -27 45 -102 133 -147 -164
6183a64K30o9K81m9p0j95J49k39J13N6K77l65K38J29l20k88K10JJ0nL26j97k0
$$ -164 66 -3 278 229 159 -36 113 -126 -13 43 320 -45 193 322 2 -286 -76 -75 -65 -70 256 59 39
6206C9J19k91L17k49J28j52J62j03j3R8m9o2j44K48l19M79j39n2j8K8k45K09L46
$$ 39 158 -133 184 -65 63 -89 73 -30 -43 55 6 -56 -200 48 -271 208 69 17 -1 27 -218 -9 337
6229C37n74O3K42j37j0O2J57k1p1K3J86k41JO1l9k27J97M2k87J33J39M3q8K87
$$ 337 -237 -174 68 -69 -79 -17 140 119 48 71 257 16 17 78 39 -188 9 51 -236 -103 36 79 -9 278
6253B78q5k83m2p8K90k52O4K80m79L44K08l47K4j21K14l2j93J19J76k07K8J9k61
$$ 278 193 -90 -132 -210 80 -172 -108 172 -307 37 245 -102 -78 -199 15 -17 -210 -91 85 -122 -94 -75 -336
6276c36K31J12n4l9K45m48M17q0j95kR9K46j62j84L75j63j95q1K85q6J09j8Nk16
$$ -336 -105 7 -47 -86 159 -289 128 48 -147 -149 -50 196 34 -150 225 62 -133 -214 71 -15 94 76 81 -135
6300a35M20m45j52K38r8L0j79M59k33L1j05J71J42j30J84k21l9M02j77j54l3K3
$$ -135 285 -160 -312 -74 -172 -142 -321 138 -95 -64 -169 2 144 14 198 -23 -62 340 163 9 -24 -1
6322aJ13q7j47J51j38k22J80k22K75J08Pj68K73j50J15k8r4J10oj76k4Q0N7m29
$$ -1 112 25 -122 29 -109 -331 -151 -373 -98 10 17 -151 122 -28 87 59 -35 75 69 -107 -131 -51 6 -423
6346d23K98K3J34j38Oqk73K16J35Q7k50O2K78m11K6M24m7q3K99o16K37J23k08
$$ -423 -125 -102 32 -106 -100 -108 -381 -165 -30 57 -193 -131 147 -264 -238 186 139 56 355 -261 -24 99 -109
6369a09L65m39n9J63R1p4J88J30k64j04J32k43M5K19k5J37l21J70J98k53O2P8
$$ -109 256 -183 -242 -79 12 -62 126 256 -8 -112 20 -223 -178 41 16 153 -168 2 200 -53 9 87
6391H7q1K47l75L12j28J5l16K53L5K19m02J54l3j54L27k14K05k21j06L27l9j56
$$ 87 6 253 -122 190 62 77 -239 14 49 268 -134 20 -13 -167 160 -54 151 -70 -176 151 112 -44
6413d4J0j35K96k77K27j6K77n04J10J55l43Q2L88m11K2L83k6k72j83M29k57K49
$$ -44 -34 -169 127 -150 77 61 338 -166 -56 99 -244 -162 226 -185 -163 220 194 -78 -261 168 -89 160
6435A60j22j19K15j15q8K12o9k6j87J75j11J12j47K95l22K0k70L25O5J16l69K02
$$ 160 38 -81 134 19 -69 143 74 48 -139 36 -75 37 -110 185 -137 -117 -387 -62 3 119 -250 -48
6457d8Q5k82M64k84kR6J37K06n87L73o8L5k70L16m5K8q3j53k1J40o1k24L01m4
$$ -48 37 -245 219 -65 -67 29 166 372 -215 158 90 125 -145 171 126 154 71 -82 -103 37 -24 -248 53 9
6481IQ8k84L10K31m18J86j11m2K4J13j83J77P7l46N6M5M9Lk31J95o4l2K66j50
$$ 9 97 -187 123 354 -64 122 11 -31 -7 106 -77 100 177 -169 -113 -68 -19 -16 -247 -52 -116 -148 118 -32
6505c2R0M0j2J55l39k5J90oJ57n99M72j49J20R1k38l3L24l2j47R1l5q9j14P0l0
$$ -32 58 98 86 241 -98 -123 67 61 218 -381 91 -58 62 153 -85 -118 206 174 27 118 83 -6 -120 -50 -80
6530h0J15M8p1P3m1j81K84J63k42n84M55N5l7q1J28j51M02k85m1J33K8j26k29
$$ -80 35 83 12 85 44 -137 147 310 68 -516 -61 -6 -43 -124 4 -147 255 -30 -71 62 90 -36 -265
6553b65n9M03j55J47J13k78j89L6O14k49N6l92j3K86k24J3J7q2N75l54J3j75K71
$$ -265 -324 79 -76 71 184 -94 -283 -247 367 118 174 -218 -231 55 -169 -156 -139 -221 354 0 13 -162 109
6576A09J83p5o0j55j23Q0K93j05k26j4J54K6M1j72L42l31R7l55L53k73N35k44
$$ 109 292 217 157 2 -121 -41 252 147 -79 -93 61 87 128 -44 298 -33 64 -291 62 -211 324 80
6598H0J05k13k11M12l69J40J98j65J47j2q4j07K15k27K22k8m8j18K3J06j59K58
$$ 80 185 -28 -239 173 -196 -56 142 -23 124 112 28 -79 136 -91 131 103 55 -63 -40 66 -93 165
6620A65l27K73j82J15j48R8k57K11k15o5R5p2M55M3p3J16j24L9l66J95m5L49j65
$$ 165 -162 111 -71 44 -104 -6 -263 -52 -267 -332 -237 -309 146 189 116 232 108 147 -219 -24 -69 280 115
6643A15Oj40j0j77L67n0k40L57m16K71K80n42N02l80k05J79J55jo8J03J2L0k54
$$ 115 121 -19 -29 -206 161 111 -129 228 -188 83 363 -179 323 -57 -262 -83 72 71 3 106 118 148 -106
6666a06j0m7K66m51K43O1l73P8K84J25J9k31J07p7MJ77k14J95N2j95J97m47O08
$$ -106 -116 -163 103 -348 -105 -44 -417 -339 -55 70 89 -142 -35 -112 -108 69 -145 50 102 -93 104 -343 265
6689B65r5j35K09k36R1k8r8J55k38j5J61N7P8l01J73J22j02j00j39L46r5j41l5
$$ 265 170 35 244 8 99 71 -27 128 -110 -125 36 93 171 -130 43 165 63 -37 -176 170 75 -66 -101
6712a01M7m2R3Q9l94L71J6R5j80O2M1l19K69k40J79MKq9Q2O7P1k90J28K43k8j07
$$ -101 -54 -96 -3 86 -308 63 79 174 -6 56 97 -222 47 -193 -14 -10 -8 -97 -15 52 123 -167 -39 204 176 69
6738F9J21j30l0N7K83l60m9J30k23J6K23o4j02Q5lLM7k3j17P2K20l20L6K74j66
$$ 69 190 60 30 87 370 10 -39 91 -132 -116 107 43 -59 26 23 26 73 50 -67 5 225 -95 -59 215 49
6763D9j53k8J20J35K46l06J74l17K41k21p6n0J90j68j02Q0K91j80J32j4J8j62
$$ 49 -104 -132 -12 123 369 63 237 -80 161 -60 -136 -186 4 -164 -266 -186 105 -75 57 43 61 -101
6785a01k6J65n3o0j2J37k10L13k58j82L45MP8j52J79j84m4r6L32r1k29P4k54J81
$$ -101 -127 38 -15 -75 -87 50 -160 153 -105 -287 58 62 140 -12 167 -17 -61 -157 175 84 -145 -71 -325 -144
6809a44J2j3N5L65m79K38k70L81k41nm3J04N1r7j05j88M08l17N33m82K61J41K8
$$ -144 -132 -145 -90 275 -204 34 -236 145 -96 -101 -144 -40 11 -86 -191 -379 29 -288 245 -237 24 165 193
6832A93j60J2J84m03J83j2J23k75N0K5N2j41j17L27Rj18j56K2K89J6n7k46L48
$$ 193 33 45 229 -174 9 -3 120 -155 -105 -80 -28 -169 -286 41 50 -68 -224 -202 87 103 46 -200 148
6855A48p1j15K86j45k19j44J66q4Q8m2Q2K69lj88j06K1J05J79k55N4m3O1J7j45
$$ 148 77 -38 248 103 -116 -260 -94 -178 -90 -132 -50 219 216 28 -78 -57 48 227 -28 26 -17 44 61 -84
6879h4j11J98k60K66K44j50j98N9p7K02K13k79J90j48J14k68j01N1L43o4j29j0
$$ -84 -195 3 -257 9 253 103 -95 -36 -113 89 302 23 213 65 179 -89 -190 -139 204 140 11 1
6901Ao2L1j14j5J45j7r7j06L41o5r6N4N3j56R3j25O28m17k32J31k38J94r9O2K05
$$ 1 -61 -30 -144 -159 -14 -31 -128 -234 107 42 -54 0 53 -103 -10 -135 493 76 -156 -25 -263 -69 -168 -106 99
6926I9J64j41r0j17M3K11j86n6J20l8P9lq1K82k96k08P2J11J2j07j43QK61J88
$$ 99 263 122 32 -85 -42 169 -17 -73 47 9 88 85 4 286 -10 -218 -146 -35 -23 -130 -273 -265 -4 184
6950A84k84l8N0J63j32p7K09k6N8m01J00J54n6L47k66J1J85j77K36l21j73M7Q2
$$ 184 -100 -138 -88 75 -57 -134 75 49 107 -294 -194 -40 -96 251 -15 -4 181 4 240 -81 -254 -207 -125
6973a25K1M08n14K59j7L7J6O1J10K7l18q1mJ64j66J62J60l13M0K26l6K4k54l2
$$ -125 -104 304 -210 49 32 69 85 146 256 283 -35 -116 -120 44 -122 40 200 -113 -73 153 117 141 -113 -145
6997a45Q0j56N5J59J34P5l60J19j5M98k56j3j08Jj8J78k77J06k49K81k0k94L20
$$ -145 -65 -221 -166 -7 127 202 -158 -39 -54 444 188 175 67 68 50 228 -49 57 -192 89 69 -225 95
7020I5kj60J31o9n7n4K95m28J71J21j89J79K77k67k07K82j01K46m4j35j92L09
$$ 95 93 -67 64 -5 -62 -116 179 -249 -78 43 -146 33 310 43 -164 118 17 263 219 84 -108 201
7042B01l86L14l38L89l37nq2L02k06J91o0L5J15j75J04l37M53j19j67K82j89J21
$$ 201 -185 129 -209 180 -157 -162 -244 58 -148 43 -17 18 133 -42 62 -275 178 59 -108 174 -15 106
7064A06k80K17q4J57l18K74Q9m48K19L17m25j78J85J48J52k42j57J27K34j73L73
$$ 106 -174 43 -41 116 -202 72 161 -287 -68 249 -176 -354 -169 -21 131 -111 -268 -141 93 -80 293
7085B93k79k81K91k57L20K1k38j37L15Q3Lj25K7j86K5J59J22Ok21J41k31J67M2
$$ 293 14 -267 24 -233 87 108 -130 -267 48 131 134 9 36 -150 -125 34 156 162 -59 82 -149 18 60
7108F0j87Q9J92j96O9J69q1k33J60J18j42o9oJ62m1p9K6n6J64j1J54k00P0m8q8
$$ 60 -127 -38 154 -42 27 196 115 -118 42 160 18 -51 -57 105 64 -15 11 -45 119 108 262 62 132 84 -4
7133dj31K10o4k3J6O6k43LN0qJ46NJ05l3L2L4l25J15M6J44j56j29L97l33n0P6
$$ -4 -135 75 11 -12 4 70 -173 -170 -120 -128 18 23 128 95 127 161 -164 -49 -3 141 -15 -144 253 -80 -130 -54
7159e4j38J77J82p4j50k9J35j03m4J56K0k01R6j43m2L27J5j51j04L21k98J10k41
$$ -54 -192 -15 167 93 -57 -86 49 -54 -98 58 78 -123 -27 -170 -212 115 130 -21 -125 196 -102 8 -233
7182b33J42J10pJ36j67j4k37M56l68L89j96j81J21L1l21L81j03P7N7l63N76k76
$$ -233 -91 19 12 148 -19 -33 -270 186 -182 207 11 -170 -49 -18 -339 42 -61 16 73 -290 286 10
7204A0J98j66K28k01K4l68J79L21j67l41K46l8O0R9k07J60L6N4j64j63K44K00
$$ 10 208 42 270 69 93 -275 -96 225 58 -283 -37 -75 -15 84 -123 37 73 127 -37 -200 44 244
7226B44l33J46k02N9Rkl3J93M7k25K06k13J89o9%m4k4q0J71J85J14o76L49l7j6
$$ 244 -89 57 -145 -86 -77 -79 -112 81 128 -97 109 -104 85 16 16 -28 -52 -132 39 224 338 -338 11 -26 -42
7251d2K25n92M97j41K37p1M4N8k14J83n0l01M06l76K35r3k1j21J8J59j74J63j2
$$ -42 183 -409 88 -53 184 113 157 215 1 184 134 -167 239 -137 98 5 -16 -137 -119 40 -134 29 17
7274A7Q2l74K64mj67K31n7q0k28M43L6j95j83J94j3Q4j01l55N41r0N8j11Q7l68
$$ 17 99 -275 -11 -15 -182 49 -8 -88 -316 127 163 -32 -215 -21 -34 50 -51 -406 135 45 103 -8 79 -289
7298b89M31j58m03O11m45L75j19K32m23K4L5JK29j92K3R3m1j01K37Q1k27K84k20
$$ -289 142 -16 -419 192 -253 122 3 235 -188 -164 -129 -128 101 -91 -68 25 -16 -117 120 201 -26 258 38
7321C8l39K42j06K07R2q0j28J75Jp8l39N15l13L40j64RL87m28j42J18j16J02K76
$$ 38 -301 -59 -165 42 134 54 -74 101 102 24 -315 200 -113 227 63 72 459 31 -111 7 -109 -7 269
7344B69l95J00J33k4j0J31j95J31O5l30R6M9n9K35p6j94K05k31J58l16M09j74
$$ 269 -126 -26 107 83 73 204 9 140 205 -125 -29 20 -39 196 120 -74 131 -100 58 -258 151 -23
7366b3J53k42K1P5K46K2k80j77L96l92M9L63p1l15Q8K33m06j48L48O9Q9K6l48
$$ -23 130 -112 -91 -16 230 252 -28 -205 191 -201 -152 211 140 -175 -87 146 -260 -408 -60 9 98 124 -224
7389b24M82j6q6j41p8J78k90L93m33M47r2q9k86K91k85k3O2R9J89k37j01K82j44
$$ -224 258 242 156 15 -63 115 -175 218 -215 232 140 51 -235 56 -229 -252 -190 -91 98 -139 -240 42 -102
7412a02L33k85J0L44l84J01M4j01R3j67K89j42j73rM71n44pK23J05m8L4J20l65
$$ -102 231 -54 -44 300 -84 17 61 -40 53 -114 175 33 -140 -149 322 -222 -229 -6 99 51 85 205 -160
7435a60Q1J1L2j59L95l97M47j17n14N73j37L81l76L8r6j77K35N9n0J12j66j61
$$ -160 -79 -68 -36 -195 200 -197 250 133 -381 192 55 436 60 98 2 -175 60 119 69 181 15 -146
7457a46J71K8j76q0R6K1J33qL1j43L9J24j17K68k74J1K7O9k1J85l21J20O4J24
$$ -146 25 53 -123 -203 -107 -86 47 39 70 -73 -34 90 -27 241 -33 -22 5 74 53 238 -83 37 101 225
7481B25j89J08j45l19N37j83j89L80M2k55L1pj94m1J54l5k4K8J00K9r5J52J50
$$ 225 36 144 -1 -320 217 34 -155 225 267 12 43 36 -158 -199 -45 -80 -104 -76 24 53 -42 110 260
7504B60m46j9K44J3J5j00K91m39L1J57%K23j65n16O15K13k69O9k13k0K77o4l08
$$ 260 -186 -205 39 52 67 -33 258 -181 -150 7 7 230 65 -451 164 377 108 177 -36 -56 221 157 -151
7527a51J08K21L9l73O9j11J88K11J4m58J76J30k21L2j57K57RJ38l50J07Q0J02
$$ -151 -43 178 217 -156 -87 -198 -10 201 215 -243 -67 63 -158 -126 -283 -26 -17 121 -229 -122 -42 60
7549F0j00j21R2J33l82J92q8K61J49j09M4%j10p5jJ45k62J45k1l5M4P7J16q0k04
$$ 60 -40 -161 -69 64 -318 -126 -214 47 196 87 131 131 21 -54 -55 90 -172 -27 -48 -83 -39 38 154 74 -130
7574a30K61J6j4N5j82M9p9R8P3l77N61m4l39RK78k99j85K76k05m2J3K37P5k74
$$ -130 131 147 133 188 6 55 -24 74 147 -230 331 287 -52 -43 235 -64 -249 27 -178 -220 -207 30 105 -169
7598a69J03J48k44K95k95Q5R1q4k08L64j3k51J01J2L3j73K26o3j1J61j32N5p5
$$ -169 -66 82 -162 133 -162 -77 14 -70 -278 86 73 -178 -77 -65 -32 -205 21 -42 -53 108 -24 31 -44
7621d4J68J58k88n7K68k95j56n5J62j2K47K43r7j06P9l18J63J70k40R1n8Q5k79
$$ -44 124 282 -6 -63 205 -90 -246 -301 -139 -151 96 339 242 136 215 -103 60 230 -10 81 23 108 -171
7644a71K62l5o3K52O7l68J29k16o2Q4mP9j22J65j89K08m2J19m4j28R8j04J09J3
$$ -171 91 56 -7 245 312 -56 73 -143 -205 -121 -125 -46 -168 -3 -192 16 -26 93 49 -79 19 -85 24 37
7668C7K38l75n5J5k5J61j23J99J22m7j26n3k6J34k56L8K74p3q3O8K03q7j60k10
$$ 37 275 -100 -155 -140 -165 -4 -127 72 194 147 21 -32 -58 76 -180 -142 132 59 -24 44 247 160 0 -210
7692b10Q1J39j68j8J63J27Pm2J9j41P6j65n2K34j16M1J17k88K18m5k26J79J82
$$ -210 -129 10 -158 -176 -13 114 121 79 98 -43 33 -132 -184 50 -66 -25 92 -196 22 -23 -249 -70 112
7715A12j23K22k02k24L49l72K58k1R5P6k26J53j15n5l6K55j2k28PJ6k41L18N7
$$ 112 -11 211 9 -215 134 -238 20 -1 94 170 -56 97 -18 -73 -109 146 134 -94 -87 -71 -312 6 63
7738F3j51R8r7K05m8m2q6O5k01J39K13l68J28J4K12k18k3K61k51J16k58K83J13
$$ 63 -88 10 -87 118 70 28 -58 7 -194 -55 158 -210 -82 -68 144 -74 -97 164 -87 29 -229 54 167
7761A67m6m8K0k20Q9O0M6j7k65L59l89K86K0j45P4m80M94k13K18J24Jl3m04N61
$$ 167 121 73 93 -127 -38 22 68 51 -214 145 -244 42 62 -83 -9 -489 5 -208 10 134 135 102 -302 259
7785B59m12J35l8J99n9j76l9K68J38o28M18Q7j31j38J93j69r3L8M46l61j03K30
$$ 259 -153 -18 -56 143 84 -92 -131 137 275 -353 65 152 21 -117 76 -93 -186 -148 298 -63 -166 64
7807F4m0O8n9K84l07m1k0n8J55J86n27M56j53l6L7Nj07p4J92q8P2p7m5J26K84
$$ 64 24 92 33 317 10 -31 -51 -109 46 232 -295 161 8 -28 9 14 -93 -167 25 -63 9 -68 -113 13 297
7832B97m25K47K34m07r2K05J27j09m16K83oO2J77j70M3K80k28l12K37m1J02q3
$$ 297 -128 119 353 -54 -146 59 186 77 -339 -56 -62 0 177 7 50 330 102 -210 27 -14 88 5
7854EP0l22M68l15j6Q3j27L67l78Q6LJ98k44L77k35j19K46j0m9n11M67M2J0j1
$$ 5 75 -247 221 -94 -110 -27 -154 213 -165 -79 -76 122 -122 255 20 -99 147 137 88 -423 44 86 96 85
7878H5m63K24K29k05o9M32j93J57k69K47l11K63K8j58J91j14J4k8j29K23l81L06
$$ 85 -378 -154 75 -130 -199 233 40 197 -72 175 -136 127 155 -3 188 74 88 60 -69 154 -227 79
7900G9MJ42m00L37N2k80J14q6K27k40K62k93p2J52j34K21jlo0P4J08N8j03R5m09
$$ 79 83 225 -175 162 214 -66 48 -38 189 -51 211 -82 -154 -2 -136 85 84 81 21 95 203 261 158 253 -156
7925a56J07K57k29J20L5k07J79L4l73M74k1l05P8j5j6j38K95j92L18n9j28o8j19
$$ -156 -49 208 -21 99 134 -73 106 140 -233 241 220 -85 -7 -22 -38 -176 119 -73 245 186 58 -10 -129
7948a29j38M65l75P8n4n2p6L13k04K14J67k73k13N6Q4K25j56M5j82K07K65j53
$$ -129 -267 198 -177 -99 -153 -205 -281 32 -172 42 209 -64 -277 -221 -137 88 -68 -23 -205 2 267 114
7970A14mM1k21J13p7j03N3O5j83NK36k76K84j56r5J38j84K89j17J18J60k58J25
$$ 114 110 151 -70 43 -34 -137 -84 -19 -202 -197 39 -237 47 -109 -204 -66 -250 39 -78 40 200 -58 67
7993F7j98K3K17j25N5p4J7M9J39J61l96L60j32j64j02J68N6r5K1N2n1L3m6l17
$$ 67 -131 -108 109 -16 39 -35 -18 31 170 331 -65 295 163 -1 -103 65 121 26 47 99 48 81 35 -282
8017b82M01l56O7L50j86J38J55k30k99K50k18J61Q4q3J2J56m4j8m6j47K14J6j50
$$ -282 119 -237 -170 180 -6 132 287 57 -242 8 -210 -49 35 -48 -36 120 76 58 12 -135 79 95 -55
8040e5K09j44J0j3j33L09k30L3l3J49N3n1K4o0k15n3K40J71k05J29k28L33j48
$$ -55 154 10 20 7 -126 183 -47 -14 -47 102 155 104 128 68 -147 -200 40 211 6 135 -93 240 92
8063I2j27K60k74J17k8N4J60J57o26K75m19O25k91N4j8n4J70J1Q4j83L4k7q4q0
$$ 92 -35 225 -49 68 40 94 254 411 -215 60 -359 266 -25 29 11 -43 127 138 222 39 73 46 -38 -118
8087a18J40QM7M9K2p4j32J64k33J77p7P0k87K17K02k73Mn6J5J83j42R0j1K0O8
$$ -118 22 30 77 126 148 74 -58 106 -127 50 -27 43 -244 -27 175 -98 -94 -150 -135 48 -94 -4 -15 5 73
8112G3k23L2N7K68m19K03j61K8J04jp2M2j30J24K22j78n0q8K64k08K62j01l01
$$ 73 -150 -118 -61 207 -212 -9 -170 -142 -38 -39 -111 -69 -199 -75 147 -31 -81 -169 95 -113 149 48 -253
8135b53K32J57Q1l84K05n8J04j04k7J1R7k41K03l3Q1K12j87o4O0J17l47L18k2
$$ -253 -21 136 217 -167 38 -20 84 -20 -47 -36 61 -180 23 -10 71 283 96 32 92 209 -138 180 158
8158A58j09r4Oj13j13J29J00l7j19JK51J1Q4J81m95K54l89QM02n21K87J2M1K76
$$ 158 49 -45 -39 -152 -265 -136 -36 -73 -192 -191 60 71 155 336 -159 95 -294 -286 116 -405 -118 -106 -65 211
8182B11j49q8L1o2K62l22K25K9j94
$$ 211 62 -26 5 -57 205 -117 108 137 -57
8191e7
$$ Imaginary data points
##PAGE= N=2
##DATA TABLE= (X++(I..I)), XYDATA
0@%%%%%%%%%%%%Qj6J6j6J6k4L2l2M0m8N6p2Q6r6J12j34J52j73J97k24K56k90L30
$$ 0 0 0 0 0 0 0 0 0 0 0 0 0 8 -8 8 -8 8 -16 16 -16 24 -24 32 -40 46 -50 62 -72 80 -93 104 -120 136 -154 176
35A76l74M20m70N25n86O53p26Q06q92R87j092J206j331J467j616J781j961K160
$$ 176 -198 222 -248 277 -309 344 -382 424 -468 519 -573 633 -698 769 -847 934 -1027 1133
53A133k384K632k911L228l588M005m495N077n782O661p791R299j1430J4696k0387
$$ 1133 -1251 1381 -1530 1698 -1890 2115 -2380 2697 -3085 3576 -4215 5084 -6346 8350 -12037
68a2037L3129j18520L1975J27472j44957M6400J23561n8665o9130J13552j982
$$ -12037 21092 -97428 -65453 62019 -82938 -36538 87023 28358 -40772 72780 70798
79G0798p9404N0827L9502j09749j7843N6995m2617l3131Q3794Q135o6478J7882
$$ 70798 -8606 42221 81723 -28026 -45869 11126 -31491 -64622 19172 27307 -39171 -21289
91b1289M1950m0563j3194M0594M860j7497J4765J004j9940O154L1044J1050j3587
$$ -21289 20661 -19902 -33096 7498 12358 -5139 9626 10630 -9310 -3156 27888 38938 25351
104B5351j0772P890j0162l8634p454K3975j3995j8788L2607Q259l8762K0349N3101
$$ 25351 14579 22469 12307 -26327 -33781 -9806 -23801 -42589 -9982 -1723 -40485 -20136 32965
117C2965j7137j3924M6814l051n0165J5387J8650m8255n417M6187k1850l7872
$$ 32965 15828 1904 48718 45667 -4498 10889 29539 -18716 -24133 22054 204 -37668
129c7668L0377O040l7250K4461L5428l4338n956M7839j6274m2180L6219L0349
$$ -37668 -7291 -1251 -38501 -14040 21388 -12950 -18906 28933 12659 -29521 6698 37047
141C7047l6374J024L7784k3962l5526K5035P502l5980M834K4952k1973j6956K5560
$$ 37047 673 1697 39481 15519 -20007 5028 12530 -23450 -18616 6336 -15637 -32593 -7033
154g033K649j8448K3124K7853j7623q464K3195l079k4592Q508J2946j9817j0876
$$ -7033 -4384 -22832 292 28145 10522 2058 25253 22174 -2418 6090 19036 -781 -11657
167a1657J3576q800k0251J2643J4133j2754K30K0533l926j3696J6010J1250j4868
$$ -11657 1919 -6881 -27132 -14489 -356 -13110 -12880 7653 3727 -9969 6041 17291 2423
180B423J421J8929r854j7639R817L167j8311k28J2794j0194j0138J1741K729j0708
$$ 2423 3844 22773 12919 -4720 5097 8264 -10047 -10275 2519 -7675 -17813 -6072 -3343 -14051
194a4051P573J4383m862k359J1893m75j1049M190P184r047n775P025k381j1369
$$ -14051 -6478 7905 3043 684 12577 12102 1053 5243 12427 3380 -2395 4630 2249 -9120
208i120J326O179n886l186R022Q65q082L879R126m637j252J1617J741q500M691
$$ -9120 -7794 -1615 -7501 -10687 -1665 -800 -8882 -5003 4123 -514 -1766 9851 11592 3092 7783
223G783O004j0320m926P920n708j2223L969L234j1086O92J2635k309k555J2405
$$ 7783 13787 3467 -1459 6461 753 -11470 -7501 -4267 -15353 -14661 -2026 -4335 -6890 5515
237E515M765p757M815Q114p997n243O757m852j1119L401K841q172j74P274j843
$$ 5515 10280 2523 7338 15452 7455 2212 8969 4117 -7002 -3601 -760 -8932 -9106 -1832 -3675
252c675l734O029K146m091K522M778k896m81M588K25k416K050K377k936k470N14
$$ -3675 -7409 -1380 766 -3325 -803 3975 1079 598 5186 5411 2995 5045 7422 4486 2016 2530
268B530k747m764j512m91k137l51K607K322J587L656M747J525K99K321O49l999
$$ 2530 -217 -4981 -6493 -6984 -9121 -9472 -6865 -4543 -2956 700 5447 6972 7271 9592 10241 6242
284F242k612q31l794l969o05Q5j412N84K415P31P11K667J198k64J261O46r20j88
$$ 6242 3630 2799 -995 -4964 -5569 -5484 -6896 -6312 -3897 -3166 -2455 212 1410 1146 2407 3053 2133 1945
302A945J400m10p07J027j22k254p97r9k224k005K78q04j258O60K134J269K031
$$ 1945 3345 2935 2228 3255 3133 879 82 -17 -2241 -4246 -3968 -4772 -6030 -5370 -3236 -1967 64
319F4K468J828J217J65K7j159j398j414j436k186j929q60PRO51J551J531K73R05
$$ 64 2532 4360 5577 5742 5769 4610 3212 1798 362 -1824 -3753 -4613 -4606 -4597 -3946 -2395 -864 -591 314
338C14R88M34K28N99Q7j52l98p38m99Kj50n95j027q05r44q20n25J193J050L98
$$ 314 1302 1736 1964 2563 2650 2498 2100 1362 863 865 715 120 -907 -1712 -2656 -3476 -4001 -2808 -1758 -1360
358a360Q86J543P59N64J140O51k42q62j150j438j619r00m53r30KJ060l49j60K033
$$ -1360 -474 1069 1828 2392 3532 4183 3941 3079 1929 491 -1128 -2028 -2481 -3411 -3409 -2349 -2698 -2858 -825
377h25J736J19Q28J348p50p87O52p81j483O67N24k677p09J279r88q81K092M31
$$ -825 911 1030 1858 3206 2456 1669 2321 1540 57 724 1248 -1429 -2138 -859 -1847 -2728 -636 -205
395b05j600J475R38j263O84K154o27k53J597p29k294Q41L44j499k31R79k029j370
$$ -205 -1805 -330 608 -655 29 2183 1556 1303 2900 2171 -123 718 1062 -437 -668 311 -1718 -3088
413c088J172m5j020K233J443j089J135J228q61L99J942p40j131N77j268k510J4
$$ -3088 -1916 -1961 -2981 -748 695 -394 741 1969 1108 1507 3449 2709 1578 2155 887 -1623 -1609
430a609K97q61J92J192j290o05K332k49K8K307J128j555J018N73j757n22J677
$$ -1609 -1312 -2173 -1981 -789 -2079 -2684 -352 -601 -573 1734 2862 1307 2325 2898 1141 619 2296
447B296j312j764J234j130k909J193J253k039Q54K767j140j020K917L42j446K917
$$ 2296 984 -780 454 -676 -3585 -2392 -1139 -3178 -2324 443 -697 -1717 1200 1542 96 3013
463C013J262k484l98J592l215j780K343j177k236K141L26l485J572K828j969R23
$$ 3013 4275 1791 1393 2985 -230 -2010 333 -844 -3080 -939 -613 -4098 -2526 302 -1667 -744
479g44L794j758j585L120l14l124J951K479l450n89J774k780k142K958k26k644
$$ -744 3050 1292 -293 2827 2513 -611 1340 3819 369 -220 1554 -1226 -3368 -410 -636 -3280
495c280K589R38l206L48L614j491l62M482n33k736J820M09l158O48K366k883j596
$$ -3280 -691 247 -2959 -2611 1003 -488 -850 3632 3099 363 2183 2592 -566 82 2448 -435 -2031
512b031K153j885k717K373J701j393J239J807j043m50J119q5N97J507j055j117
$$ -2031 122 -1763 -4480 -2107 -406 -1799 -560 1247 204 -246 873 788 1385 2892 1837 720
528G20K16p40j719P04P69o82J3K63j681L09J123k03L93K777o34j610J092R64k128
$$ 720 936 196 -1523 -819 -50 -732 -719 -456 -2137 -1828 -705 -908 -515 2262 1628 18 1110 2074 -54
547e4O78K059j592j788Q49j121j846J262J408j110J71J766o78j474R47J998r37
$$ -54 624 2683 1091 -697 152 -969 -2815 -1553 -145 -1255 -1084 682 4 -1470 -523 1475 538
564E38N59Q94p71j367k11K19l79J16R46l58j372N50N2j191P55J939m5j470J104
$$ 538 1097 1991 1220 -147 -358 -139 -518 -402 544 186 -1186 -636 -584 -1775 -1020 919 874 -596 508
583E08L79j749J174J880j407m42J227j281k238N38J257r69K88J110j167n74J506
$$ 508 887 -862 312 2192 785 343 1570 289 -1949 -1411 -154 -1123 -835 275 -892 -1466 40
600D0m8l75J852L80r33q6L43j905o36K167j36j696M81Q34j677j0J161o68N71J107
$$ 40 -8 -383 1469 1849 916 830 1173 -732 -1368 799 663 -1033 -552 282 -1395 -1405 -244 -912 -341 766
620G66k38j109O89K18K6J013Q4r28L7L60j779j20P07p51l30J601j088j381J434
$$ 766 528 -581 108 326 352 1365 1449 521 558 918 -861 -981 -274 -1025 -1355 246 -842 -2223 -789
639g89J438j175J201J693j593k22J013r14j607J729L34k463O66J152k014j87K098
$$ -789 649 -526 675 2368 775 553 1566 652 -955 774 1108 -1355 -689 463 -1551 -1738 360
656C60n91j246K192N88k069M87J283j177P32J614j472j221J612l12j700J003K19
$$ 360 -231 -1477 715 1303 -766 -279 1004 -173 559 2173 701 -520 1092 780 -920 83 302
673C02j578O7O65j061l88J833r6l1Q59Q93j092N84N05q81n4P02j339p33Q91p58
$$ 302 -1276 -1209 -544 -1605 -1993 -160 -256 -287 572 1465 373 957 1462 581 527 1229 -110 -843 48 -710
693g10o06R46J13m41J66N80n86J65O93j08m14J141Jr24M38N74q56j17N43n90l86
$$ -710 -1316 -370 -257 -698 -532 48 -538 -373 320 212 -202 939 940 16 454 1028 172 55 598 8 -378
714c78K50o13n77M17K73m49P41R02k94l66J042J76l24J15J48q05k21j55l80m80
$$ -378 -128 -741 -1318 -901 -628 -1077 -336 566 272 -94 948 1124 800 915 1063 258 37 -118 -498 -978
734i78L49K03m29K53J35J09K61O5K74j65L44k42J63J95R8j68k21M29p27k60N1
$$ -978 -629 -426 -855 -602 -467 -358 -97 -32 242 77 421 179 342 537 635 467 246 675 -52 -312 -261
755b61l94K41k12K0J62%q0J92M14L26L6N8L60k93k88Q0l33l70M9l6o5l42O37k0
$$ -261 -655 -414 -626 -606 -444 -444 -524 -332 82 408 444 502 862 569 281 361 28 -342 -293 -329 -394 -736 -99 -119
779a19n73P43K91o6j83lJ73o2k20J18j09J35j46J32J12k37k35Q6R2k53k39K89
$$ -119 -692 51 342 276 93 90 263 201 -19 99 -10 125 -21 111 223 -14 -249 -163 -71 -324 -563 -274
801b74p2J61K60K65p0K89j23j39J16k65k71j05l00j93O17k45L9J21L85j45k29
$$ -274 -346 -185 75 340 270 559 436 297 413 148 -123 -228 -528 -721 -104 -349 -310 -189 196 51 -178
822a78K98l6J07j75L39Ql55J70k24m8k14j14L69m35J58j11J70k7q5L30Q3k5J38
$$ -178 120 84 191 16 355 363 8 178 -46 -94 -308 -422 -53 -488 -330 -441 -271 -298 -383 -53 30 5 143
845A43M21m3K6L9l51l27J85k75Q2k52k04K36j33J57L9J59J1K33m5L78o6R4l47
$$ 143 564 521 547 586 235 -92 93 -182 -100 -352 -556 -320 -453 -296 -257 -98 -87 146 101 479 413 507 160
868A60rj43J85j28l13J61j9Qj87k30J15L32j93n1K4L51K6J29M06O8l57J70l01
$$ 160 151 8 193 65 -248 -87 -106 -98 -285 -515 -400 -68 -261 -312 -288 63 89 218 624 692 335 505 204
891B04J41k57r2j92m8j02p5l25L46K91K31j40M17k86O2J66J01m61K97o7j0l37
$$ 204 345 88 -4 -196 -244 -346 -421 -746 -400 -109 122 -18 399 113 175 341 442 -19 278 211 201 -136
913a36P8j25k88K12K74k64j77M77pn46K92R2K05K39j01M60m38J94j67K54l93l21
$$ -136 -58 -183 -471 -259 15 -249 -426 51 44 -502 -210 -118 87 326 225 685 247 441 274 528 135 -186
935a86J95l45l02M26j34k79M63J99k81P1L58P3j11N87k66k02k79L15j85m54M39
$$ -186 9 -336 -638 -212 -346 -625 -162 37 -244 -173 185 258 147 734 468 266 -13 302 117 -337 102
956A02k08j05M86j65k60o8J24J46j82J18q3J49K49k18N21m06K6J02m2l38R6k53
$$ 102 -106 -211 275 110 -150 -218 -94 52 -130 -12 -95 54 303 85 606 200 226 328 286 -52 44 -209
978b09K68k38M12n19k69M98J27r5J28K59m5o46N33r2j57O2J16j91l91M66j72k43
$$ -209 59 -179 233 -286 -555 -57 70 -25 103 362 317 -329 204 112 -45 17 133 -58 -449 17 -155 -398
1000c98K93M67n61O2M72l88k9L68J68p51O76k3n82o2M91k57l25M81K39n58Q9P2
$$ -398 -105 362 -199 -137 335 -53 -82 286 454 -297 379 356 -226 -288 203 -54 -379 102 341 -217 -128 -56
1022e6j47m8M35j36j35M73j65k37j92O81m10l06Q1K71l29j48L00j59K78N3j0l37
$$ -56 -203 -251 184 48 -87 386 221 -16 -208 473 63 -243 -162 109 -220 -368 -68 -227 51 104 94 -243
1044b43K80J16J26k59J47Kj31l00J92l2j2nQ9K3l54j20N10j97J13L04k76JJ10
$$ -243 37 153 279 20 167 169 38 -262 -70 -102 -114 -119 -30 -7 -361 -481 29 -168 -55 249 -27 -26 84
1067H4J48k28j10L33k50n1K17j41k46j19K59k78K08K55k11j43k1O29m00K81J42
$$ 84 232 4 -106 227 -23 -74 143 2 -244 -363 -104 -382 -174 81 -130 -273 -294 335 -65 216 358
1088C58j72k35K52L4l06K43k6l88K37p8o6l09L88p5o0q3M50L9k20N86m34K34J15
$$ 358 186 -49 203 237 -69 174 148 -240 -3 -81 -147 -456 -68 -143 -203 -286 164 203 -17 569 135 369 484
1111D84k6k45r6r2j79j47K66j79l7k13J73L80k64M31j16K93k62j22R8j15K6o6
$$ 484 458 213 117 25 -154 -301 -35 -214 -251 -464 -291 89 -175 256 140 433 171 49 147 32 58 -8
1133hJ56j11qr5l96L05J25j95L02nj17mJ20k6k16L42r5J12q0J94k17J3j28K56
$$ -8 148 37 29 -66 -462 -157 -32 -227 75 70 -47 -51 69 43 -173 169 74 186 106 300 83 96 -32 224
1157B24m15rJ94j88j7l2K73j61Q1kQ8p2RK47j74j2R0k08L4J14Q3n83K13pL65m02
$$ 224 -191 -200 -6 -194 -211 -243 30 -131 -50 -52 36 -36 -27 220 46 34 124 -84 -50 64 147 -436 -223 -230 135 -267
1183b67M25k20Q2j18J87Q5L2J22o2k49n5k1L05k34q0L49o31L19M6R4j04k33J99
$$ -267 158 -62 20 -98 89 174 206 328 266 17 -38 -59 246 12 -68 281 -350 -31 15 109 5 -228 -29
1206b9J03K9J68k68O0K30l74q0j0K78j56j31j21L47J72k55K16k27L12m64M41k15
$$ -29 74 103 271 3 63 293 -81 -161 -171 107 -49 -180 -301 46 218 -37 179 -48 264 -200 241 26
1228B6J7k72M08k85J6J22l54K14o5J62k10k4J66k14K85j52Q0k60L88K9jJ09j07
$$ 26 43 -229 179 -106 -90 32 -322 -108 -173 -11 -221 -245 -79 -293 -8 -160 -80 -340 48 77 76 185 78
1251G8j92J61K07m26J53J95k43J39k35J72q2p3M13k94j70K69j9r1L34j46%l6J25
$$ 78 -114 47 254 -172 -19 176 -67 72 -163 9 -73 -146 267 -27 -197 72 53 -38 296 150 150 114 239
1274B39k30l71J39J79n9j04J87l6q6k8o8L02l62J96N3J88p3j38K35j19l2k12J4
$$ 239 9 -362 -223 -44 -103 -207 -20 -56 -142 -170 -238 64 -298 -102 -49 139 66 -72 163 44 12 -200 -186
1297a86J44m1J7j30K86M7k41L75k73J82j49Q3K6Q5j42j4L9j84l4K8o9N3K30l49
$$ -186 -42 -83 -66 -196 90 137 -104 271 -2 180 31 114 140 225 83 69 108 -76 -110 -82 -151 -98 132 -217
1321b17l8K60j21n4K53l72J43L11J18L1k29kK16l18J42P5m43L21K1oK7j61k08
$$ -217 -255 5 -116 -170 83 -289 -146 165 283 314 85 83 299 -19 123 198 -245 76 97 91 118 -43 -251
1344b51L28j9j98L08k87K50mr1o7K00j0J9m81L13K45n16L63m14L96K6l35K04m2
$$ -251 77 58 -140 168 -119 131 127 36 -31 169 159 178 -303 10 255 -261 102 -312 84 110 -225 -21 -63
1367f3j98L54k09L7K21k56K22J4k31K37l5j42o4J17k41K19J23p5P6j68J12j04
$$ -63 -261 93 -116 -79 142 -114 108 122 -109 128 93 -49 -113 4 -237 -18 105 30 106 -62 50 -54
1389e4K30j75j7R1o1L72l86M8j67J07Om67K87N8l7K62K5j01j59R7j31P5K72j56
$$ -54 176 1 -16 75 14 386 0 48 -119 -12 -6 -473 -186 -128 -165 97 122 21 -138 -41 -172 -97 175 19
1413A9J62M5m4j22q5P0k21J61J35j02k2K11m6k93K50K77l09q2q9L46j15q2k35
$$ 19 181 226 182 60 -25 45 -176 -15 120 18 -4 207 161 -132 118 395 86 4 -85 261 146 64 -171
1436a71J45o6M2K35l62K83N0m5k30JJ59O9m95M35j87m7K03j88J00J77N2q4p4j84
$$ -171 -26 -92 -50 185 -177 106 156 111 -119 -118 41 110 -385 50 -137 -184 19 -169 -69 108 160 76 2 -182
1460a82J84j19L77j16k89K30K7n0J67k35k61L13L62n39J89M3l67J68J75j3k37
$$ -182 2 -117 260 144 -145 85 112 62 229 -6 -267 46 408 -131 58 101 -266 -98 77 64 -173
1481a73rP7K57r8N6k35N1J51Mj21jP4J52j74j46J51j75K05K7j53k32L24k97L39
$$ -173 -182 -105 152 54 110 -125 -74 77 81 -40 -41 33 185 11 -135 16 -159 46 73 -80 -312 12 -285 54
1505E4k3J92k74L3q2J32J55j40KO6k26n2J66Jq8J18q6L15l88J34MM6J59n2j92
$$ 54 31 223 -51 -18 -100 32 187 47 49 115 -111 -163 3 4 -84 34 -52 263 -125 9 13 59 218 166 -26
1530b6qj02N5L2M15m08J74j64m5J05J25k16J81k75L01k54m9K47j23k0R5o1k1k2
$$ -26 -34 -136 -81 -49 366 -42 132 -32 -77 28 153 -63 118 -157 144 -110 -159 88 -35 -55 40 -21 -42 -64
1554f4J80N0l55J32j2L44m25J55l2k8L9J62k82J18J3J00K82l16kJ65l34K13J2
$$ -64 116 166 -189 -57 -69 275 -150 5 -27 -55 -16 146 -136 -18 -5 95 377 61 59 224 -110 103 115
1577A15n0j51Q1j52J56J17k25P4rj7J92p8j28L38j50j11P1j93J37r1R2J7j7k02
$$ 115 65 -86 -5 -157 -1 116 -109 -35 -44 -61 131 53 -75 263 113 2 73 -120 17 -74 18 35 18 -184
1601a84J43M5j18J02J62l54K93l2L6oj99J03O1k52J96O6l16o2P51l16j5K64l75
$$ -184 -41 4 -114 -12 150 -204 89 57 93 87 -112 -9 52 -200 -4 62 -254 -316 435 119 104 368 -7
1624gR7N1l54N02l55kR9k63K96P5k56J72j05M3N6j25J50Q7l04J6k6K79l42K78
$$ -7 90 141 -213 289 -66 -68 31 -232 64 139 -117 55 -50 -7 49 -76 74 161 -143 -127 -153 126 -216 62
1648F2K83l69L6J50l96J75J27Rj0j58j0J02L16l35L42m78Q0N4J31O6j99j79K86
$$ 62 345 -24 12 162 -234 -59 68 77 67 -91 -101 1 317 -18 324 -154 -74 -20 111 177 -22 -201 85
1671H5k04J52n8K64l65J62J34n2n0k7o5m9q4K20k16N42m86N6k17L19k48J18k30
$$ 85 -119 33 -25 239 -126 36 170 118 68 41 -24 -73 -157 63 -153 389 -97 -41 -258 61 -187 -69 -299
1694b99K20R5o2K59k04kJ19j72q3J07Q9r2J27j51j36J53o5K16j25RK45n2k99J64
$$ -299 -79 16 -46 213 9 7 126 -46 -129 -22 67 -25 102 -49 -185 -32 -97 119 -6 3 248 196 -103 61
1718F1n05M43q3J88P0l49L0K3K72m4J36j73l89L67J9j3J3j6j5j53R1j63L65k19
$$ 61 -444 -1 -84 104 174 -175 -145 -122 150 106 242 69 -320 47 66 53 66 50 35 -118 -27 -190 175 -44
1742d4p5K78j43l1J20j49JJ16RP9O5l41N3q1J40K45k32J37j28J2k2lm0j3K76m82
$$ -44 -119 159 16 -15 105 -44 -43 73 82 161 226 -115 -62 -143 -3 242 10 147 19 31 9 6 -34 -47 229 -253
1768b53l4K82j75L60k00k15K20rQ3j1nJ11m78L72k20J72k05L29k71O35n79L22
$$ -253 -287 -5 -180 180 -20 -235 -15 -24 59 48 43 154 -324 48 -172 0 -205 124 -147 488 -91 231
1790B31k75L6p6M6k4J43j25K19k60Q4J17j11j06J54l9R9j22J63l04Q2J38j59p2
$$ 231 -44 -8 -84 -38 -62 81 -44 175 -85 -1 116 5 -101 53 14 113 -9 154 -150 -68 70 -89 -161
1813a61K47k40O0K59j42J66J8l0j25l38P1J39j51M57j67m66K92K43J00l09n8J05
$$ -161 86 -154 -94 165 23 189 207 177 52 -286 -215 -76 -227 230 63 -403 -111 132 232 -77 -135 -30
1835c0k2J18Q3l02N07k65r4R4k70J12j36J7J92k93N48m06K04l12L27k14P1N9j40
$$ -30 -52 66 149 -153 354 89 -5 89 -181 -69 -205 -188 4 -289 259 -147 57 -255 72 -142 -71 -12 -152
1858a52K30K6Q5k57K32k92J04p9j22L02rK24l64j63R2J93K32l51J97J08m84J46
$$ -152 78 104 189 -68 164 -128 -24 -103 -225 77 68 292 -72 -235 -143 50 282 -69 128 236 -248 -102
1880a02J56k21K56o3j01L0KO1J32j25j46N36m05p7r2J84q0K5nJ35J42k90j71L09
$$ -102 54 -167 89 26 -75 -45 -43 18 150 25 -121 415 10 -67 -159 25 -55 -30 -35 100 242 -48 -219 90
1904I0k18J64j11J28Km2o2K12k9j72J08l40K76K24j08k10M65k29k21L8l6L93l41
$$ 90 -128 36 -75 53 55 13 -49 163 134 -38 70 -270 6 230 122 -88 377 148 -73 -35 -71 322 -19
1927a9K22l12M01j48m01L20J01j80K64o8l68Q4M6M6K08m9L7k42P0n4O6j48j45
$$ -19 203 -109 292 144 -257 63 164 -16 248 180 -188 -104 -58 -12 196 147 184 -58 12 -42 24 -124 -269
1950b69L47j12Q1j80J80r4JJ7j02K48j91K56j34j58K15j05j81J55p6K34m06M28
$$ -269 78 -34 47 -133 47 -47 -46 -29 -131 117 -74 182 48 -110 105 0 -181 -26 -102 132 -274 154
1972A54j86o4p5K91m55M03j10J44R0j98O5jm11L85j79L05j48p8J61j50J40k39
$$ 154 -32 -96 -171 120 -335 68 -42 102 192 -6 59 58 -353 32 -147 158 10 -68 93 -57 83 -156
1994a56m3N9M7o8L51m48K17j7l5r2K12p7J37L6K5j08j77J62j71K31K1J80K9m92
$$ -156 -199 -140 -93 -161 190 -258 -41 -58 -93 -185 27 -50 87 123 148 40 -137 25 -146 85 106 286 315 -177
2018a77K78K9l70J96J54k91K46lj18j4J11k9j44J5J26j34M00l52j15J13j79O0
$$ -177 101 130 -240 -44 110 -181 65 62 -56 -70 41 12 -132 -117 9 -125 275 -77 -192 -79 -258 -198
2040a98j47L46L36k49k93K91m7L22m37P5K4Qk23J80l28J76J40n14M69L0J95k06
$$ -198 -345 1 337 88 -205 86 39 361 -76 -1 23 31 -192 -12 -340 -164 -24 -538 -69 -39 156 -50
2062e0o1J35m2J0J5J16r7K20j27j23J79l52J47O3j27K41k37j51M67j42k41K48
$$ -50 -111 24 -18 -8 7 123 26 246 119 -4 175 -177 -30 33 -94 147 -90 -241 226 84 -157 91
2084I1K44m71K72ln2K2k54N0LMo7J08J83j87J15J11k25J03j31J28k90J88j81K80
$$ 91 335 -136 136 133 81 103 -151 -101 -98 -94 -161 -53 130 -57 58 169 -56 47 -84 44 -246 -58 -239 41
2108D1J70N1k46L3M2j51J94P1j99J70l47R8q5J83J71j59j28K70kj88k6K7R5p4
$$ 41 211 262 16 49 91 -60 134 205 6 176 -171 -73 -158 25 196 37 -91 179 177 -11 -37 -10 85 11
2132A1R9k34J42P9N7j13kM3J1j60j6MJ32J03l31K26Jj96J7K65j18k0j28J17j85
$$ 11 110 -124 18 97 154 41 39 82 93 -67 -83 -79 53 156 -175 51 52 -144 -127 138 20 0 -128 -11 -196
2157a96J92o5QL5j68n7K74q3R8k88J23jK22k20J60L61o72K46j1N3J54k90j81L67
$$ -196 -4 -69 -61 -26 -194 -251 23 -60 38 -250 -127 -128 94 -126 34 395 -277 -31 -42 11 165 -125 -306 61
2181F1oK2k44J04K44j11P2k10J06p3J00l76J65K84j16q1p0N7k9jj0J73J25K5k27
$$ 61 55 77 -167 -63 181 70 142 -68 38 -35 65 -311 -146 138 22 -59 -129 -72 -101 -102 -112 61 186 211 -16
2206a6KJ01q6l2r5J18o0j02N8OJ24L8O8j6o7q0q3j6K51J5k30km5L55NP2n78K12
$$ -16 -14 87 1 -31 -126 -8 -68 -170 -112 -106 18 56 124 108 41 -39 -122 -138 113 128 -102 -104 -149 206 211 283 -295 -83
2234h3J37rq9K94l02j04J68J29Qj23J03j9k08l7l0k00N35j10J19j25k68J47qJ48
$$ -83 54 45 -44 250 -52 -156 12 141 149 26 129 110 -98 -135 -165 -365 170 60 179 54 -214 -67 -75 73
2258G3j5r5R9j13J37k41K00j92K46o1K96l39L5K1j46j21M2K48J93k20N1m4K9L7
$$ 73 58 -37 62 -51 86 -155 45 -147 99 38 334 -5 30 51 -95 -216 -174 74 267 47 98 54 83 120
2282A20k41J49j29k7j38K02N5j13K26k89M7K34j15R2j37J01r3J18m30L76L64r3
$$ 120 -121 28 -101 -128 -266 -64 -9 -122 104 -185 -138 96 -19 73 -64 37 -56 62 -368 8 372 279
2304B79l09J56k05K2J10j1p5J24l61M27l73K4K61J57n20K03K06j48q4L28k28k3
$$ 279 -30 126 -79 -57 53 42 -33 91 -270 157 -216 -192 69 226 -294 -91 115 -33 -117 211 -17 -40
2326d0J01L2j69K07N2k99L03k55j74J60j56J1Q5J2l6M52j98M8m32Q5j39L55R6
$$ -40 61 93 -76 131 183 -116 187 -68 -242 -82 -238 -227 -142 -130 -166 286 88 136 -296 -211 -350 5 101
2349A01k1j14J51k67Q8J91k42J8R0K33m01RM11k60J95K9O6l24K24j33q3o9J28
$$ 101 80 -34 117 -150 -62 129 -113 -95 -5 228 -173 -164 247 -13 182 211 277 -47 177 44 -39 -108 20
2372B0L2R8k29J07lJ0j27p1L55k72K53n7k55m1J22L67k49k66J78J98j26J35k82
$$ 20 52 150 -79 28 25 35 -92 -163 192 -80 173 116 -139 -180 -58 309 60 -206 -28 170 44 179 -103
2395a03J14m6j5o2j75L06k26L05j58O1R4l32K26j67J31O5j11J99l90M11p0L7k24
$$ -103 11 -35 -50 -112 -287 19 -207 98 -60 1 95 -237 -11 -178 -47 18 -93 106 -284 127 57 94 -130
2418a30O9M2j31j06K27J28k2k3j15M6m2L20l91J47l34O49l06j14J89k02j23L00
$$ -130 -61 -19 -150 -256 -29 99 77 54 -61 -15 -57 263 -128 19 -315 334 28 -86 103 -99 -222 78
2440G8k34J48Q8j50J0j9J77Nk10K37L9j32Q6k48J48k12J53%r7p0L09r5j29K51
$$ 78 -156 -8 80 -70 -60 -79 98 103 -107 130 169 37 123 -125 23 -189 -36 -36 -133 -203 106 11 -118 133
2464A33k6J14m10L10K39n64L75J50m18J94o8R3n21L51K7L7J60k60J92p1l1k1j63
$$ 133 107 221 -189 121 360 -204 171 321 -97 97 29 122 -399 -48 -21 16 176 -84 108 37 6 -15 -178
2487a78K42k5J85l00o2J66o5Rj43J13P4p0Q4j01M6J14j09K41l16p3K43K8k07P7
$$ -178 64 39 224 -76 -138 28 -37 -28 -171 -58 16 -54 30 -71 -25 89 -20 221 -95 -168 75 103 -104 -27
2511b7J3R0J39o6J03m48R7O7K16j90o0j91L2L22k09J34J12j15J14j24R2j36n2
$$ -27 -14 76 215 149 252 -196 -99 -32 184 -6 -66 -257 -225 97 -112 22 134 19 133 9 101 -35 -87
2534h7j7r8K67J62m58L46p6P8Lk05O9M4P5l6M3k11J9o4K04j83P1L11l11J06j73
$$ -87 -104 -202 65 227 -231 115 39 117 120 -85 -16 28 103 67 110 -101 -82 -146 58 -125 -54 257 -54 52 -121
2559a21l01M42p8J18m4j02M1j22p2M03P3k05k24P0L8O6j39J50R8l60P9K10j87
$$ -121 -422 20 -58 60 16 -86 -45 -167 -239 164 237 32 -192 -122 -84 -18 -157 -7 91 -269 -190 20 -167
2582a67J42K77l77L09l09Q6J6q7q3O0J2j23J89J75J01r1k45o1J4J62J74k60K62
$$ -167 -25 252 -125 184 -125 -39 -23 -110 -193 -133 -121 -244 -55 120 221 130 -115 -176 -162 0 174 -86 176
2605A76k09q8M14j56j03Nn7p2J86k29K22j37J60J65k95K18j55M9l08J91q0j4K71
$$ 176 -33 -121 293 137 34 39 -18 -90 96 -133 89 -48 112 277 -18 200 45 94 -214 -23 -103 -117 154
2628A54j65QJ87o4n2j93L91k03k8l3k13K48j00K16l6j85J52o8p1L6Q8k93K98l3
$$ 154 -11 -3 184 120 68 -125 266 63 35 2 -211 37 -63 153 117 -68 84 16 -55 -19 69 -224 74 41
2652D1L6Pk2p4j22O1j55L64k6l73J58P0j6j1j59L32N8P7k86j2K25l34K85M7k44
$$ 41 77 84 62 -12 -134 -73 -228 136 110 -263 -105 -35 -51 -62 -221 111 169 246 -40 -52 173 -161 124 171 -73
2677g3K0K03p8j82k3Q4n1K81l21R4k25N42n6j37J38l52J49Pl56K34J00Qk18N7
$$ -73 -53 150 72 -110 -133 -49 -100 181 -140 -46 -271 271 215 78 216 -136 13 20 -336 -102 -2 6 -212 -155
2701a55k49N31j47K82l32J43J14Nj35k7Q4k01K23L62n08J82lr8O7k02m6K08k25
$$ -155 -404 127 -20 262 -70 73 187 192 57 30 114 -87 136 498 -10 172 169 71 138 -64 -110 98 -127
2724a27k22L07K97l25J54q2N7K8j09J63j46j03pL9J86m2K3J27k21J60r4j7k9J68
$$ -127 -349 -42 255 -70 84 2 59 87 -22 141 -5 -108 -115 -76 110 68 91 218 -3 157 63 46 17 185
2748A85l28J72K7J1n7k11K61P5k03M6p8J87o0J36k87P6J11j93J00J56k23N6K13
$$ 185 -143 29 56 67 10 -201 60 135 -68 -22 -100 87 27 163 -124 -48 63 -130 -30 126 -97 -41 172
2771A72j33q3r8K53j74n9P0O9j7n9J55QJ5l94K59K81j30k10J6O7k72J79K72k26
$$ 172 39 -44 -142 111 -63 -122 -52 17 0 -59 96 104 119 -275 -16 265 135 -75 -59 8 -264 -85 187 -39
2795c9O2%j02J57R5k66L59m51K72q2J84k33P6j77K4K3K1J78l08K51l7N3k84M94
$$ -39 23 23 -79 78 173 -93 266 -185 87 5 189 -44 32 -145 -121 -98 -77 101 -207 44 7 60 -224 270
2819B70l34p9Q2K31j47l3qr8m5j04J26J66J27l71l4L82Rm73L31k5J02O9r9k5j84
$$ 270 -64 -143 -61 170 23 -10 -18 -116 -161 -265 -139 27 154 -217 -251 131 140 -333 -2 -27 75 144 45 20 -164
2844a64J44l90O00j42j85K22k27K42j78j20J10K13j47K3R1o6k43K75j44j42J94
$$ -164 -20 -410 190 48 -137 85 -142 100 -78 -198 -88 125 -22 1 92 26 -217 58 -86 -228 -34
2865c4J52l25K65j55P3j80K60k2j70K23j95RJ44J14j77M4nk2j09K47n7j06j81
$$ -34 118 -207 58 -97 -24 -204 56 34 -136 87 -108 -99 45 159 -18 26 21 -1 -110 137 80 -26 -207
2888b07N04l40j46L38l15M61m03J56K1p2K43k66L36j07k15j14o9K16K9j39O9k05
$$ -207 297 -43 -189 149 -166 295 -108 48 69 -3 240 -26 310 203 -12 -126 -195 21 50 -89 -20 -225
2910b25K62J55m7j33M8J53r0M6k02o7r8J44%j4L02j51J90n98J15K88k44J96R2
$$ -225 37 192 145 12 60 213 123 169 -33 -100 -198 -54 -54 -68 234 83 273 -325 -210 78 -166 30 122
2933A22l57K1M5K96j01J6Q3k71K41k49J35j7j53J34p8J98mk60L67q9m5j02R4J01
$$ 122 -235 -214 -169 127 26 42 125 -146 95 -154 -19 -36 -189 -55 -133 65 61 -199 168 79 34 -68 26 127
2957A27k72O0K98j98J7R5k79M3M1Q6j94p9L4J49M6J02p6J25l07J26P8K16r2k91
$$ 127 -145 -85 213 15 32 127 -152 -109 -68 18 -176 -255 -221 -72 -26 76 0 125 -182 -56 22 238 146 -145
2981a45K17K83l43L1L09n45K26R3k43R4O3K6oM4j05K63k14l38M61k63K72k07J70
$$ -145 72 355 12 43 352 -193 33 126 -117 -23 40 66 60 104 -1 262 48 -290 171 -92 180 -27 143
3004A43O5j91K71j20J16l78K29o3m9j40J7k9J81q7j65k5K41k8k8R0n9m9J61j05
$$ 143 208 17 288 168 284 -94 135 72 23 -117 -100 -129 52 -35 -200 -225 16 -12 -40 50 -9 -58 103 -2
3028bN4J53j22j68p7L06j2j96R6rm8K11k11j27K53j54J51q8J66j37L14m00j5N2
$$ -2 52 205 83 -85 -162 144 132 -64 32 23 -25 186 -25 -152 101 -53 98 10 176 39 353 -47 -62 -10
3052a0q4L04n90L50J7J68j20j50J65l65M6J85m7O6K26k38KJ98m5k70J51m2Lp7
$$ -10 -94 210 -380 -30 -13 155 35 -115 50 -315 -269 -84 -131 -65 161 -77 -75 123 78 -192 -41 -83 -80 -157
3076a57J11r0J22N2p7K79l35J53l8J46j49j15j84J8K98J73k61PK52l56L9M64l82
$$ -157 -46 -136 -14 38 -39 240 -95 58 20 166 17 -98 -282 -264 34 207 -54 -47 205 -151 -112 352 -30
3099c0j58J56J31P5l28J62M5J5j76J50K2j37N9p4oj15M79k96K94j47j01k4r8J89
$$ -30 -188 -32 99 174 -154 8 53 68 -108 42 64 -73 -14 -88 -94 -209 270 -26 268 121 20 -4 -102 87
3123H7K87k91k36J43N4l29M84Nj16Q2j36P9j09j0j17j7K70r9p8J70l07J80j7N6
$$ 87 374 83 -153 -10 44 -285 199 204 88 170 34 113 4 -6 -123 -140 130 31 -47 123 -184 -4 -21 35
3147C5J4J06j08n3J55k80J5Lp3P8Qj53J95K0J05k10J41J46j20N3j82K77m09J25
$$ 35 49 155 47 -6 149 -131 -116 -113 -186 -108 -100 -253 -58 -38 67 -143 -2 144 24 77 -105 172 -237 -112
3171a12L5O6j24P0O5j4K16n27N93m70J59J10j89M00j60l5m7o1J12j00K99j64q0
$$ -112 -77 -11 -135 -65 0 -14 202 -325 268 -202 -43 67 -122 278 118 83 36 -25 87 -13 286 122 42
3194D2j64j3L05j3j07J44j89n3k51L80L8j79R2j24q0Q1J68J94j28k22K53m5l09
$$ 42 -122 -135 170 157 50 194 5 -48 -299 81 119 -60 32 -92 -172 -91 77 271 143 -79 174 129 -180
3217a80K32M9k10j82N15L6l30k8l5J43r0j9m2Q8j00L50k08j43j00L72l7j80K39
$$ -180 52 101 -109 -291 224 260 -70 -98 -133 10 -80 -99 -141 -53 -153 197 -11 -154 -254 118 81 -99 140
3240A40k5k43L21k52R1J42l8l26K79J28k0j74R8j11J34r3k47J81J80k37N2k59
$$ 140 115 -128 193 -59 32 174 136 -190 89 217 197 23 121 10 144 51 -196 -15 165 -72 -20 -279
3262b79K48k30K84l00O0K99k30M0l6M33m28J64l59L34J6j16K00k37K51j81J5l4
$$ -279 -31 -261 23 -277 -217 82 -148 -108 -144 289 -139 25 -334 0 16 -100 100 -137 114 -67 -52 -86
3284h6J36k3P8k13J41r7j5k52N58k59J49m2R1k42OM9J61l07K9M6K3K3O8L91l92
$$ -86 50 27 105 -108 33 -64 -79 -331 227 -32 117 75 166 -76 -70 -21 140 -167 -138 -92 -69 -46 22 413 21
3309B1K88l12J90j91J23r2R7k77K9R7n1R4j7q1j35R3O1J60N2r3k7O6l93K87q9
$$ 21 309 -3 187 -4 119 27 124 -153 -124 -27 -78 16 -1 -82 -217 -124 -63 97 149 56 29 95 -298 -11 -100
3334a00m5J51l2K36L8j10k19K45o8L4k79K19Q0k48K91l64K39l17L11k19lMM6J58
$$ -100 -145 6 -26 210 248 138 -81 164 96 130 -149 70 150 -98 193 -171 68 -249 62 -157 -160 -156 -110 48
3358D8q1k13K46k71L40l2k40J4J45J42j96K30J5J5k59K63m37L37n4K40j31J63
$$ 48 -33 -246 0 -271 69 37 -203 -189 -44 98 -98 132 147 162 -97 166 -271 66 12 252 121 284
3380B84j87J60l77J6L27k96K61k96J27l4J12K1q4J68j60J56l59P3J37l82J77K07
$$ 284 97 257 -120 -104 223 -73 188 -108 19 -15 97 118 34 202 42 198 -161 -88 49 -333 -156 51
3402E1J71j34K1pq4j85J79r0K17j79J68r7k23J46k5M51m59j88M51k52L6o4K11
$$ 51 222 88 109 102 18 -167 12 -78 139 -40 128 31 -192 -46 -71 380 -79 -267 184 -68 -32 -96 115
3425A15K6O9l20QO9j20M0k57M33K6k86L10k82J95j2k39J61j9J04%J85m74J90J61
$$ 115 141 210 -110 -102 -33 -153 -113 -370 63 89 -197 113 -169 26 14 -225 -64 -83 21 21 206 -268 -78 83
3449H3o9P7P0l0K22m50M4O4J48k37K17k21Q1P2j96K03Pn3O0N4k46N8n0k35N86
$$ 83 14 91 161 131 353 -97 -53 11 159 -78 139 -82 -1 71 -125 78 85 32 92 146 -100 -42 -92 -327 259
3474B59j20P0m94L43j3l96K13K46r7J99l0q6q1M8J24l54K22J86l74J08J61j09
$$ 259 139 209 -285 58 45 -351 -138 108 11 210 180 94 13 61 185 -169 53 239 -135 -27 134 25
3496B5j89J08L7J00k12N2L26k73j59J56K36k14NJ06n4N6J42k87%J10l20J77K57
$$ 25 -164 -56 -19 81 -131 -79 247 -26 -185 -29 207 -7 -2 104 50 106 248 -39 -39 71 -249 -72 185
3519A85j89L68p2l20j8j45J34j0J71L8l35K25j96J83j47Q4k06K21p8K21J14m13
$$ 185 -4 364 292 -28 -46 -191 -57 -67 104 142 -193 32 -164 19 -128 -44 -250 -29 -107 114 228 -185
3541a85J61m2J6L7o7K70k94K9k8Q8J08k38L7J32L41l19k67J16K13j95M9J8j26
$$ -185 -24 -66 -50 -13 -80 190 -104 -75 -103 -15 93 -145 -108 24 365 46 -221 -105 108 -87 -38 -20 -146
3564a46L11l31J38l61P2N76k58j94J7M22m10K45j75N3M0k14M44K1m0m46K39p3
$$ -146 165 -166 -28 -389 -317 259 1 -193 -176 246 -164 81 -94 -41 -1 -215 229 250 210 -236 3 -70
3586g0J29L1j01J98k82J99J28j80p3K11l08m2n1K43J84k86j34oK0L16k2m85L09
$$ -70 59 90 -11 187 -95 104 232 52 -21 190 -118 -160 -211 32 216 -70 -204 -210 -190 126 104 -381 -72
3609g2j28K43j22K5K5K27m37M18l84K17R4l01K31k9j29J95k08J69K21k00j33Q
$$ -72 -200 43 -79 -54 -29 198 -239 179 -205 12 106 -195 36 7 -122 73 -135 34 255 55 -78 -70
3631g0J99J19l62N9J32k48J35J10j80J33J19l46K28k6k9Ro3k26K46Q1p7R4J73
$$ -70 129 248 -114 -55 77 -171 -36 74 -106 27 146 -200 28 2 -27 -18 -81 -307 -61 20 -57 37 210
3654B10k52k35L60okj5m3k5J37J14j89J52j31Mp0k6K1j25J12J02k10j7K87o3j21
$$ 210 -42 -277 83 77 75 60 17 -8 129 243 54 206 75 79 9 -17 4 -121 -9 93 -117 -134 153 90 -31
3679c1J8J35J99k37j72J22k08L00J78k95M0l57K76n0k33L5K14P0n2qQ7l05L29
$$ -31 -13 122 321 84 -88 34 -174 126 304 9 49 -308 -32 -82 -315 -280 -66 4 -48 -56 31 -274 55
3702E5L56k96j3p0m8J05N2n3J12m99L76r5k13M27k26j65L01q3J77j95K0J30r1
$$ 55 411 115 102 32 -16 89 141 88 200 -299 77 -18 -231 196 -30 -195 106 23 200 5 25 155 64
3725F4j19J4P8k98L58n1j88J35k46L14J87k88J34q2p0K39l42J67p7p2L37q1L07
$$ 64 -55 -41 37 -261 97 46 -142 -7 -253 61 248 -40 94 12 -58 181 -161 6 -71 -143 194 113 420
3748D20n39J42p0mk9l16P36m17j90J06K13j87M3J1JJ90l92K98r7K92n51J07K14
$$ 420 -119 23 -47 -51 -80 -396 340 -77 -267 -161 52 -135 -92 -81 -80 110 -282 16 -81 211 -340 -233 -19
3771a9K9k06O3J67q4L44m65LJ74J73j88k72J89J39j9n1m85O64k45L58n2n7k57
$$ -19 10 -196 -133 34 -50 294 -171 -168 6 179 -9 -281 -92 47 28 -23 -508 156 -89 269 217 160 -97
3794i7J39K59m71J59LJ1j9R8l6n6K3j78M40r1L7Pk9k71J42j68j41K14K33l1R8
$$ -97 42 301 -170 -11 -8 3 -16 82 46 -10 13 -165 275 184 221 228 199 -72 70 -98 -239 -25 208 177 275
3819B75L2j31j12l5j44J99k33J22p9J23L2L5j78j74J87K25m8L0j48l3j33J6K70
$$ 275 307 176 64 29 -115 84 -149 -27 -106 17 49 84 -94 -268 -81 144 96 126 -22 -55 -188 -172 98
3842I8k05LR4l4J17j18J44j92J62r7j08K43m04L87p8J77l32j11R5L66k21p6K20
$$ 98 -107 -104 -10 -44 73 -45 99 -93 69 -28 -136 107 -297 90 12 189 -143 -254 -159 207 -14 -90 130
3865A30k38J45k17J91Q8N5j91J2K55l68J69O5j36M9p6j00J81j47j33M24j93J21
$$ 130 -108 37 -180 11 99 154 -37 -25 230 -138 31 96 -40 9 -67 -167 14 -133 -266 158 -35 86
3887H6k55k2J7L12ko6p0J46j10j52J54l04O6M1rn2J22J55jl6Q2p2j29J77L70j97
$$ 86 -169 -191 -174 138 136 70 0 146 36 -116 38 -266 -200 -159 -168 -220 -98 57 56 20 102 30 -99 78 448 251
3913B51l22O0k11M13r7r6k5l83K96K27j97K10k48K75j39j88J81N5l8P3k25J90
$$ 251 -71 -11 -222 191 94 -2 -27 -410 -114 113 -84 126 -122 153 14 -174 7 62 24 97 -128 62
3935F2l09L50k29J92j72k8J91P3p8N3j83K1J40k70K94q3K77k43j95l5K7n2J23
$$ 62 -247 103 -126 66 -106 -134 57 130 52 105 -78 -57 83 -187 107 24 301 58 -137 -172 -145 -197 -74
3958g4L18k77M7J82j42j43J1J20j76R2K10l21J09q6L66r3m6k49p4K55J88l30M04
$$ -74 244 -33 14 196 54 -89 -78 42 -134 -42 168 -153 -44 -130 236 143 97 -152 -226 29 217 -113 291
3981B91m77J48P3o4L10k64l32L08K5L6J97l94P6J96j59J82m4l65J48J54Q6l18
$$ 291 -186 -38 35 -29 281 17 -315 -7 18 54 251 -143 -67 129 -30 152 108 -257 -109 45 131 -187
4003a87qP9M66k02k84j53L06j22K56r5l47M01l05K57j06M6Q6J83k67P5k99K77
$$ -187 -195 -116 350 148 -136 -289 17 -105 151 56 -291 110 -195 62 -44 2 88 271 4 79 -220 57
4025E7K64k96K6k17L12k66j93M4K50j88M03j70k80K23J94j91J5L04l15j97J15
$$ 57 321 25 51 -166 146 -120 -313 -269 -19 -207 196 26 -254 -31 163 -28 -13 291 -24 -221 -106
4046a06J51N6Jk04J88o3J83o21L09M53k83p6n3O9l1L1K1J25j65K9j46K19k33J25
$$ -106 45 101 102 -102 86 23 206 -415 -106 347 64 -12 -65 4 -27 4 25 150 -15 14 -132 87 -146 -21
4070b1pj37K77M9n5jj24p8J29Q7k6K7j71K35k17o8J10j27J44j33J45k1Qk1K52
$$ -21 -28 -165 112 161 106 105 -19 -97 32 119 93 120 -51 184 -33 -101 9 -118 26 -107 38 17 25 4 256
4095B56l78j85L86j94o8k5K65O1k82k7J1k7K99m6K53k77J22q8L2r2j33Q2J18r4
$$ 256 -122 -307 79 -115 -183 -208 57 118 -164 -191 -180 -207 92 46 299 22 144 56 88 -4 -137 -55 63 -31
4119c1j03K53l82J18K61l72K86k44K51j35K15P3o9j21q1J14m6o4J48j20j12K18
$$ -31 -134 119 -263 -145 116 -256 30 -214 37 -98 117 190 121 0 -81 33 -13 -77 71 -49 -161 57
4141E7l62L10l04J98J45P4j78Q1k5q3R1K19j13J77l95J1L08j22J00j25p0p5J17
$$ 57 -305 5 -299 -101 44 118 -60 21 -4 -87 4 223 110 287 -108 -97 211 89 189 64 -6 -81 36
4164C6J30J30p5j82j37R1J60j63qK00l17R1K79n4j83O4k42O70o34L7o3K69l11
$$ 36 166 296 221 39 -98 -7 153 -10 -18 182 -135 -44 235 181 -2 62 -180 490 -144 -107 -170 99 -212
4187b12j8j02M36j77J01k08L15j93R9mk67K49J77l6l03L87l84Q0p6N0j29OJ29
$$ -212 -230 -332 104 -73 28 -180 135 -58 41 37 -230 19 196 160 -143 244 -140 -60 -136 -86 -215 -209 -80
4210h0K0k14L76j56L71l75j31J6mO2j99L66q9J73j32K4m43L72J91j65L6J21j38
$$ -80 -60 -274 102 -54 317 -58 -189 -173 -177 -115 -314 52 -37 136 4 28 -415 -43 148 -17 19 140 2
4233Bj8j5K32l8O9l69M97m78j1k1J66k76K80J94l21q8L57j14j1kL3J08l9K1j06
$$ 2 -16 -31 201 163 232 -137 360 -118 -129 -150 16 -260 20 214 -107 -195 162 48 37 35 68 176 137 158 52
4258E2%j86J54R3l09R9p0J76k07J67k85K50j04K0K20j51Oj8l5J05J17Q7J02m65
$$ 52 52 -134 20 113 -196 -97 -167 9 -198 -31 -316 -66 -170 -150 70 -81 -75 -93 -128 -23 94 181 283 -182
4282a82O3J87J36n05M28k14J20k51QJ09L43q4k10K59m39L88l57p4N18k56K7J93
$$ -182 -119 68 204 -301 127 -87 33 -218 -210 -101 242 158 -52 207 -232 156 -201 -275 243 -13 14 207
4304B07k77K35r9K20j39k72K81p3O5k86k2M35k87K11k75O2Ml2L04m77L45j87j9
$$ 207 -70 165 66 286 147 -125 156 83 148 -138 -160 275 -12 199 -76 -14 -10 -42 262 -215 130 -57 -76
4327g6K7q5q1M98n14L77j67L8k2J74k50J85l5J17r0N3m22K68Q7l01J38K11J79
$$ -76 -49 -134 -215 283 -231 146 -21 17 -5 169 -81 104 69 186 96 149 -273 -5 82 -219 -81 130 309
4350C09m17K66j58j25o2J83L82m18M5J23j55J89l12J52j23K07j9r2J23j70L38
$$ 309 -108 158 0 -125 -187 -4 378 -40 5 128 -27 162 -150 2 -121 86 67 -25 98 -72 266
4371B66m21K02L07l05J58l52K01l31NJ31J40N4k02K19k7p9N9J29oj13n6L21k35
$$ 266 -155 47 354 49 207 -145 56 -275 -270 -139 1 55 -147 72 45 -34 25 154 148 35 -21 300 65
4394F5j04J42m74M57n2p1j82m6K57q0J25MOR3j02k46qK84J82q1O6j82k38K36O4
$$ 65 -39 103 -371 86 34 -37 -219 -265 -8 -88 37 41 47 140 38 -208 -216 68 250 169 235 53 -185 51 115
4419A15m82M43j12Nm9K51k46J57r8M8J38k82N0j45J65L10j82n1J76q2j19K27N3
$$ 115 -367 76 -36 -31 -80 171 -75 82 -16 32 170 -112 -62 -207 -42 268 86 35 211 129 10 237 290
4442B90n16R7Q2K14j9j99M6k3j73K65M4M6k92N9K55n1k25j18L06k53K28R8L1l01
$$ 290 -226 -129 -47 167 148 -51 -5 -28 -201 64 108 154 -138 -79 176 125 -100 -218 88 -165 63 161 192 -109
4466a09K16j56J59k33J53l5j2J9J76r9l06n3M08J73k38K2k23J11l7j39J51j94
$$ -109 107 -49 110 -123 30 -5 -17 2 178 79 -227 -280 128 301 63 85 -138 -27 -64 -203 -52 -246
4488b46K12J4L5J91N7m69K17L8k18J39M9J72k29j50L69j1j29P1l07L37M6l66K07
$$ -246 -34 -20 15 206 263 -206 11 49 -169 -30 19 191 -38 -188 181 170 41 112 -195 142 188 -178 29
4511B9P7J08j84J7j04J48m2j2j38K07l31M03M2r5j73Q3J17j3r7j28Q2p9J79R6
$$ 29 106 214 30 47 -57 91 49 37 -101 106 -225 178 220 125 -48 35 152 139 42 -86 -4 -83 96 192
4535A92l95M65o7l05J84r7P8k11K88k94j1K38ql44K57J45M1j21n9M0k47K6J52
$$ 192 -203 262 195 -110 74 -23 55 -156 132 -162 -173 65 57 -287 -30 115 156 35 -24 16 -231 -205 -53
4558e3J57l72J91J0J21Q1j81L40m15Q6J51L4j10p9l75M65j88pJ46O0k7j27J9J61
$$ -53 104 -268 -77 -67 54 135 -46 294 -121 -35 116 150 40 -39 -414 51 -137 -144 2 62 35 -92 -73 88
4582H8k08N1m9J29M4j79K15j97K97l69OJ02K57l40M38mj38l20L46l51R6k9pL68
$$ 88 -120 -69 -118 11 55 -124 91 -106 191 -178 -172 -70 187 -153 285 281 143 -177 169 -182 -86 -115 -122 246
4606B46j62j7p3Q5j81J68j90J05j93Q5K37n2j6k69J67j03L34r5r3J01p3L9m3j34
$$ 246 84 67 -6 79 -102 66 -124 -19 -212 -127 110 58 42 -227 -60 -163 171 76 -17 84 11 50 7 -127
4630a27J90k1J10j40j05o7l9K11K11j27k02r8p8K38l1M2K07k98K69q2j18K52l05
$$ -127 63 42 152 12 -93 -160 -199 12 223 96 -106 -204 -282 -44 -75 -33 174 -124 145 63 -55 197 -108
4653a08J59K25m16L96n16L39k91M24k09j98K58j88q7K97j51j96J02M85o17L75
$$ -108 51 276 -140 256 -260 79 -212 212 3 -195 63 -125 -212 85 -66 -262 -160 325 -292 83
4673H3j58j25J8J49N9j80M5J64K28n23L47p5j51L60j24k51L22j98m9K75j64k57
$$ 83 -75 -200 -182 -33 26 -154 -109 55 283 -240 107 32 -119 241 117 -134 188 -10 -59 216 52 -205
4695b05K83K56m58K58k98J15L01l51o3K77j10M7N4k57K02m12L13jK44k32j2M3
$$ -205 78 334 -124 134 -164 -49 252 -99 -162 115 5 52 106 -151 51 -361 -48 -49 195 -37 -49 -6
4717fo7j35L03j64k39K53r7J74P3k91L08l84L06oJ28r3j11R7J69m68J39Q4L8q3
$$ -6 -73 -208 95 -69 -308 -55 -152 22 95 -196 112 -272 34 28 156 63 -48 49 218 -250 -111 -27 11 -72
4741g2q0k1K80k1M9j97LK62j70o2J12K6m66K99j89J81O5pR5o2J08j93j55L65L3
$$ -72 -152 -173 107 86 135 -62 -59 203 33 -29 83 109 -357 -58 -247 -66 -1 -8 87 25 133 -60 -215 150 183
4766A83j60r8j96K96j53p7L35m17P15l88j26K41j03k23J92q8J26j57N7J26J19
$$ 183 23 -75 -271 25 -128 -205 130 -287 428 40 -86 155 52 -171 21 -67 59 -98 -41 85 204
4787B04l01K01m0Q3l34k8K21l8q0K79k02J55J05k09j92J80j12J93l25N7L13r7
$$ 204 -97 104 64 147 -187 -215 6 -32 -112 167 -35 120 225 16 -176 4 -108 85 -240 -183 130 33
4809C3O0l20L21J19j92l3K6K6P5k10j81L65pj38J47k0l39J97J01Q9k16Q7Ml18
$$ 33 93 -227 94 213 21 -12 14 40 115 -95 -276 89 82 -56 91 71 -268 -71 30 119 -97 -10 -6 -324
4833c24M48k05n4K37K21k48l42K63O6JJ54j59J81j13j99L2j4M8k64L21K48k47
$$ -324 124 -81 -135 102 323 75 -267 -4 62 63 217 58 239 126 -73 -41 -55 -7 -271 50 298 51
4855E1P0m01L37m3j00J29j39j05K33j83J64k23J34pJ6K30k53PJ43K8J1L0N8j9
$$ 51 121 -280 57 14 -86 43 -96 -201 32 -151 13 -210 -76 -83 -67 163 -90 -83 60 88 99 129 187 168
4879A68k57pK8K29l67m2K41q7O1m6n3K51k07M10l27k57L69k52J73k5J22k29J71
$$ 168 -89 -96 -68 161 -206 -248 -7 -94 -33 -79 -132 119 -88 322 -5 -262 107 -145 28 3 125 -104 67
4902F7n5J21l48L48k91J2j2K75k51L17j87J81m20J06J85k94L43m45M10n8L3J15
$$ 67 12 133 -215 133 -158 -146 -158 117 -134 183 -4 177 -243 -137 48 -246 97 -348 62 4 37 152
4924A52o1J9k32K99J0k90Q0J18j3K5j63n4J51j69L88M6j21j18L24m66K78k91J63
$$ 152 91 110 -122 177 187 -103 -23 95 82 107 -56 -110 41 -128 260 306 185 67 391 -75 203 -88 75
4947G5j47K16k29R0j35Oj09L08Q8k2k23N7Kj23R6J94r3P1m44M8L86J1R0j82P7
$$ 75 -72 144 -85 5 -130 -124 -233 75 163 141 -82 -25 -23 -146 -50 144 51 122 -322 -274 112 123 213 31 108
4972A08J88k52K25l52l43O47j34ok22K8J30q8n9J53J23j57o7K75k40Q4j0j9k14
$$ 108 296 44 269 -83 -426 221 87 81 -141 -113 17 -71 -130 23 146 -11 -78 197 -43 41 31 12 -202
4995b02P5M30l02k41j08K76n0J00j08J57R8M1q6lL8n6L7p7J68N3m24j03J89L87
$$ -202 -127 303 1 -240 -348 -72 -122 -22 -130 27 125 166 80 77 115 59 96 19 187 240 -184 -287 -98 289
5019B89m63J46j92K22k9L6NJ11J60k4k35m8l6M3L0r2k50K62p1N7l9K2J48j84K45
$$ 289 -174 -28 -220 2 -27 9 14 125 285 261 26 -22 -58 -15 15 -77 -327 -65 -136 -79 -118 -96 52 -132 113
5044A13j22o7k06K57M9j4J34l23K44n1j61J18j66J54j44K85j17J92k73P0J58k27
$$ 113 -9 -76 -282 -25 24 10 144 -179 65 14 -147 -29 -195 -41 -185 100 -17 175 -98 -28 130 -97
5066i7K10k1k52N31o90O40m60J36M9k01J68P9oj45M4J84n4O7k76j00J77j53J88
$$ -97 113 92 -160 371 -319 321 -139 -3 46 -155 13 92 86 -59 -15 169 115 182 -94 -194 -17 -170 18
5089A8k66J72J5n6J69j2r5k6J70j31P7j84Q9J49j64R3j49K45j90J68r8J5j04j27
$$ 18 -248 -76 -61 -117 52 40 -55 -81 89 -42 35 -149 -60 89 -75 18 -131 114 -76 92 -6 9 -95 -222
5113b22K24O8k51m4J36J27q8K63m4j52N7j80J2j70K91r9N4j06m6J67O1k06j30
$$ -222 2 70 -181 -225 -89 38 -50 213 169 17 74 -106 -94 -264 27 -72 -18 -124 -170 -3 58 -148 -278
5136b78K21j2K57o82N44P7j48M6K41l7j31k85J88l8j20M3J83J88l48M2l4M0J22
$$ -278 -57 -69 188 -494 50 127 -21 25 266 229 98 -187 1 -37 -157 -114 69 257 -91 -49 -83 -43 79
5159G9k13O7K28jo7j86J01n2K40l7k42J15J87k48k58L09j19N6J58k45N6m1J8J96
$$ 79 -134 -67 161 160 93 -93 8 -44 196 159 -83 32 219 -29 -287 22 -97 -41 117 -128 -72 -113 -95 101
5183A01L6m24K57J56j69JL1p5J99O9k29K36J17l94r9J55m9n1J72J7l17L71J01
$$ 101 137 -287 -30 126 -43 -42 -11 -86 113 182 -47 189 306 -88 -187 -32 -81 -132 40 57 -260 111 212
5206B12L6l60K02k02J30J28P4l54Q3j05l5J69k62P1l4J16K83k89K32l00M61q3
$$ 212 248 -112 90 -112 18 146 220 -134 -51 -156 -191 -22 -284 -213 -247 -131 152 -137 95 -205 256 173
5228A73j48J81m04J18M5n5j42J91K2K5k26N48m97K80K6l61N8K35j76J2L23k78
$$ 173 25 206 -198 -80 -35 -90 -232 -41 -19 6 -220 328 -169 111 137 -224 -166 69 -107 -95 228 -50
5250e0M1j13L08j18j45J74j21L27j13k85k77M06o3M4J91j0j09k23j8L62j11l53
$$ -50 -9 -122 186 68 -77 97 -24 303 190 -95 -372 34 -29 15 206 196 87 -136 -154 208 97 -256
5272b56K52Q4m72L81O4P6j1Nq8O9j53Q8J8MM4r7o4J22n7o2k9J25J27j72k97l5
$$ -256 -4 80 -392 -11 53 129 118 123 35 104 -49 39 57 61 105 8 -56 66 9 -53 -82 43 170 -2 -299 -334
5298c34K55Q7J57j29r9J69k18K02p2j31j88J37N5L08n49N01o5j76N7q5K32l20
$$ -334 -79 8 165 36 -63 106 -112 90 18 -113 -301 -164 -109 199 -350 151 86 -90 -33 -118 114 -206
5320b06M60k42j54NN6j12R0o3K42o1k6q3j52L99r8J47kj89k15J21K5o9J15L25
$$ -206 254 12 -142 -137 -81 -193 -103 -166 76 15 -11 -94 -246 153 55 202 200 11 -204 -83 -58 -127 -12 313
5344C13m63m6k0k7K88J35j02k2j11j71J73K53J1k12o1l4j47J43K75l3j05j13J04
$$ 313 -150 -196 -216 -243 45 180 78 56 -55 -226 -53 200 211 -1 -62 -96 -243 -100 175 142 37 -76 28
5367B8l04L65l51M04k27K62j12m38L44n6K5P1J29m07K13K84m59K21n5m6L1Q6j0
$$ 28 -276 89 -262 142 -85 177 65 -373 -29 -85 -60 11 140 -267 -54 230 -229 -8 -63 -109 -78 8 -2
5390bJ51k44M1j43O7M06k07R9j29J24k19J38K97m11N2j22K65j17j0k01J02m08
$$ -2 149 -95 -54 -197 -130 276 69 168 39 163 -56 82 379 -32 20 -102 163 46 36 -165 -63 -471
5412d71L38J00k01J49J03k5j40Q1K59m70J67p0n3M08k60J63q7k27R9M08o18J59
$$ -471 -133 -33 -234 -85 18 -7 -147 -66 193 -277 -110 -180 -233 175 -85 78 -9 -236 -137 271 -347 -188
5434a88J34K11k91L13k42r7L13M7r5K6k1k2M4l80N68l68M2K9r5RM31k05l49K85
$$ -188 -54 157 -134 179 -63 -160 153 200 105 131 110 88 132 -248 320 -48 -6 23 -72 -63 368 163 -186 99
5458I9o4pn1q3R0K08q2M21n69k49Q7P9J61p9K55k27J18j28o7J60K49k25j33l1
$$ 99 35 28 -23 -106 -16 192 110 531 -38 -287 -200 -121 40 -39 216 -11 107 -21 -88 72 321 96 -37 -68
5482f8L73l06mJ27k66K85j14jl27M25k43L38j26j07k41J10J71j45K99o5k1k00
$$ -68 305 -1 -5 122 -144 141 27 26 -301 124 -119 219 93 -14 -255 -145 26 -119 180 115 94 -106
5504a06n2O03m58Q6L6r2K3M2m6k00Q9J74j38Q9j14J69j7n43L50K70r4R8Q1j49
$$ -106 -158 445 -13 73 109 17 40 82 36 -164 -75 99 -39 50 -64 105 88 -455 -105 165 71 169 250 101
5528A01K82l11k59K88r9K40l23n3j3r3K50K6j02r9J63l87M91K3k68P5K13lm9N4
$$ 101 383 72 -187 101 2 242 -81 -134 -147 -240 10 36 -66 -165 -2 -389 102 125 -143 -68 145 142 93 147
5552A47l05K63j02j47M84l10p5p9L68j73K7n33N47J74m16O8q5M1K33j54p7j0q0
$$ 147 -158 105 3 -144 340 30 -45 -124 244 71 98 -435 112 286 -130 -62 -147 -106 127 -27 -104 -114 -194
5575a94M46m03R9J41k9r9j9j02M73j47r6n9k6o2J03l31N61K5m39J71Q6j03j3M9
$$ -194 252 -151 -52 89 60 -39 -58 -160 313 166 70 11 -15 -77 26 -305 256 281 -158 13 99 -4 -17 32
5599C2J61J22n48N32k69l7P0R3o6M7k15L7R1K52p1k12J3k81L6K29j57J84J04j86
$$ 32 193 315 -233 299 30 -7 63 156 90 137 -78 -41 50 302 231 19 32 -249 -213 16 -141 43 147 -39
5623c9K0j14K76p2l4P7j67J49j14J48j41k87L84J64j72p5j28K32k29L7L55l15
$$ -39 -19 -133 143 71 37 114 -53 96 -18 130 -11 -298 86 250 78 3 -125 107 -122 -85 270 -45
5645d5Q5r1M3R1j6n9j14l31M02lJ61k73K44k68Q1j37K58l09K31J83j61j5J14M2
$$ -45 40 -51 -8 83 67 8 -106 -437 -35 -38 123 -150 94 -174 -93 -230 28 -281 -50 133 -28 -43 71 113
5669A13j51n8J4M2l96N27J4q8k4k2R2J72k33q0K27j1j88O0k52M67j33M1k59K09
$$ 113 -38 -96 -82 -40 -436 91 105 17 -7 -29 63 235 2 -78 149 138 -50 10 -242 225 92 133 -126 83
5693H3K57m98k01K70k8L16p8j61q4J16K16m3o8q5J93j19j05J90l24K30M3l82J98
$$ 83 340 -158 -359 -89 -117 199 121 -40 -124 -8 208 165 97 12 205 86 -19 171 -153 77 120 -262 -64
5716f4L24j83j2m8j98J56K1k99J67j54J29L24j65K04m6j57k28K24k9k76M31k11
$$ -64 260 77 65 17 -181 -25 -4 -303 -136 -290 -161 163 -2 202 156 -1 -229 -5 -34 -310 121 -90
5738i0J08j6J79n52K56J13K5j44j42L26N2J4k73K83j42l8M43m09L20k24J40k71
$$ -90 18 2 181 -371 -115 -2 23 -121 -263 63 115 129 -144 139 -3 -41 402 -7 313 89 229 -42
5760d2l4O5M38l51l61J77j0J19k8j86K58j02J48j19k06M34p9l50Q7K66k89K41
$$ -42 -76 -11 427 76 -285 -108 -118 1 -27 -213 45 -57 91 -28 -234 200 121 -229 -142 124 -165 76
5782G6q4j47K53l23k3J91Q5q4k8K52l05P7M5k9j48O9K7L64k97j65Q1K57k86J0
$$ 76 -8 -155 98 -225 -248 -57 28 -56 -84 168 -137 -60 -15 -44 -192 -123 -96 268 -29 -194 -113 144 -142 -132
5806a32K18k81J86Q0k3k47J93j28l8M14j27J68l10J21qk2j79j04K88l52J47Q9
$$ -132 86 -195 -9 71 48 -199 -6 -134 -172 242 115 283 -27 94 86 64 -115 -219 69 -283 -136 -47
5828d7k5k73K86k00J01K69q6l5K05k24j90N27l86J55j14K52k64O3R9j45O4P9k94
$$ -47 -72 -345 -59 -259 -158 111 25 -10 195 -29 -219 308 -78 77 -37 215 -49 14 113 -32 32 111 -183
5851a83K69k37K09L0j96J79nk12J19r1Q6K58k67j7L8j0j69J65R0K6M4j46k04K38
$$ -183 86 -151 58 88 -108 71 66 -146 -27 -118 -32 226 -41 -58 -20 -30 -199 -34 56 82 126 -20 -224 14
5875A4M8j39Q3l9L8n6R7p1L02j58q8p5J48k1k82L50m1k71K57l7n9q8P2l1L1K19
$$ 14 62 -77 6 -33 5 -51 46 -25 277 119 31 -44 104 83 -199 151 110 -161 96 59 0 -88 -16 -47 -16 203
5901B03j53j75J01K9K03l69K23rk51J45L93l97j82K94R8k51k60L21j09O8j4m2
$$ 203 50 -125 -24 5 208 -161 62 53 -198 -53 340 -57 -239 55 153 -98 -358 -37 -146 -78 -92 -134
5923a34J44K7m00P15l11j51j51L32o0j8Q4J6k91J5L11j90l2K34l37p2K90Rj31
$$ -134 10 37 -363 352 41 -110 -261 71 11 -7 77 93 -198 -183 128 -62 -94 140 -197 -269 21 30 -101
5946a01K41l80K07M4J32J75n60L65j01J0O9K9K7l81L01j81M7K98m74K16j56O9
$$ -101 140 -240 -33 11 143 318 -242 123 22 32 101 130 157 -224 77 -104 -57 241 -233 -17 -173 -104
5968a04M8K97l07J75K0q9R4K24l76N3J39k68K32k12K34k74J04RJ2M7K1J96l88
$$ -104 -56 241 -66 109 129 40 134 358 -18 35 174 -94 138 -74 160 -114 -10 -1 11 58 79 275 -113
5991a13L47lk92j9m1Q2j13J39J66q1k8O6k49J81m7J30K23m44R1N0k33L11J21k32
$$ -113 234 231 -61 -80 -121 -39 -152 -13 153 72 44 110 -139 42 -5 125 348 -96 -5 45 -188 123 244 12
6015A2n0K38k26j41J32J96l06Q9K29n14M00K2m19L29Km6J11p5j8j1R4j85K49K16
$$ 12 -38 200 -26 -167 -35 161 -145 -56 173 -341 59 81 -338 -9 -7 -53 58 -17 -35 -46 48 -137 112 328
6039C28m41nR7M4pl06M76l8o6j28Oj1K64j82j01J57j37M2J02j18l1k65N13j57
$$ 328 -113 -118 -21 23 16 -290 186 148 82 -46 -40 -51 213 31 -70 87 -50 -8 94 -24 -55 -320 193 36
6063C6l04N58j19k59P7l31N40k81L10l35L68m21M48k88J46j74K36l2j57o6l55
$$ 36 -268 290 171 -88 -11 -342 198 -83 227 -108 260 -161 287 -1 145 -29 207 175 18 -48 -403
6084d03K62Q1J2j4J52l7J84n57K30J63M0o0k60j4L60j35J91J9l8j9j99r9o9K19
$$ -403 -141 -60 -48 -62 90 53 237 -320 -90 73 113 53 -207 -221 139 4 195 214 176 157 -42 -141 -210 9
6108IQ9l00J96j82K08n2J64m7k89K39k72j13L03n4J14o0N5j8l1oL7O2j55M16l44
$$ 9 98 -202 -6 -188 20 -32 132 85 -204 35 -237 -350 -47 -101 13 -47 8 -10 -41 -47 -10 52 -103 313 -31
6133c1J74m42J14M4J8L31j14J01m05P2J62k56J67J15m3J0M2m9j84L86l2k34R5
$$ -31 143 -299 -185 -141 -123 208 94 195 -210 -138 24 -232 -65 50 7 17 59 10 -174 212 180 -54 41
6156D1R5k19q1K49o9n3L25q8J60k57n7K10n48PN48l18J20k37J52J5j56P6J90j23
$$ 41 136 -83 -164 85 16 -37 288 200 360 103 46 256 -292 -285 263 -55 65 -172 -20 -5 -161 -85 105 -18
6180a8j50K89J74k48oj92L09l02L05k02K75K4n14K97o0J8P5j87J79j19N4L36n19
$$ -18 -168 121 295 47 41 -151 158 -144 161 -41 234 258 -256 41 -19 -1 74 -113 66 -53 1 337 -182
6203a82J55P5j43R2K31k3n5j89n6K74j89J15q2k1k2k53M16k63K22q8k7m8J7M2
$$ -182 -27 48 -95 -3 228 205 150 -39 -95 179 -10 105 23 2 -20 -273 143 -120 102 14 -13 -61 -44 -2
6227bo4n7J92l52J92J23M9L1k98J19j2K1j33J18K8j21K77j63R0K24j92m02M63
$$ -2 -66 -123 69 -283 -91 32 81 112 -186 -67 -79 -58 -191 -73 -45 -166 111 -52 38 262 70 -332 131
6250A31j00Pj11K04j89o6P5j3K9p0mJ50J14j82J7P0k3rKj31R1q8ok1J23k2q9J3
$$ 131 31 38 -73 131 -58 -124 -49 -62 -33 -103 -107 43 157 -25 -8 62 39 30 32 -99 -8 -96 -102 -123 0 -22 -111 -98
6278i8j29L70j18q1J4q6M49l88j43K76j60j70M71K2l18j81M01j51m8l6L38k09
$$ -98 -227 143 25 -56 -42 -128 321 -67 -210 66 -94 -264 207 229 -89 -270 131 -20 -68 -104 234 25
6300B5o8J73k80p7J84j16k2L2M07j78r1K03J86n74K01o0p6K15p8k55M30j82O4
$$ 25 -43 130 -150 -227 -43 -159 -181 -149 258 80 -11 192 378 -196 5 -55 -131 84 6 -249 181 -1 63
6323F3j86J30J4l28K74J7k10J40J93nk18K25k92K23q7o6P4j33K10j45J73o0n4
$$ 63 -123 7 21 -307 -33 -16 -226 -86 107 102 -116 109 -183 40 -47 -113 -39 -172 38 -107 66 6 -48
$$ [...]
8191I6
##END NTUPLES=NMR FID
##END=
