##TITLE=1H_LR 795-C1-M
 CDCl3
 8 sc, 
 9.1.2025
##JCAMPDX= 6.0         $$ Bruker NMR JCAMP-DX V2.0
##DATA TYPE= NMR FID
##DATA CLASS= NTUPLES
##ORIGIN= UXNMR, Bruker Analytische Messtechnik GmbH
##OWNER= root
$$ XWIN-NMR		Version 3.5
$$ Thu Jan  9 13:53:16 2025 Russian Standard Time (UT+4h)  she@DPX200
##.OBSERVE FREQUENCY= 200.1315
##.OBSERVE NUCLEUS= ^1H
##.DELAY= (6, 6)
##.ACQUISITION MODE= SIMULTANEOUS
##.ACQUISITION SCHEME= undefined
##.AVERAGES= 8
##.DIGITISER RES= 18
##SPECTROMETER/DATA SYSTEM= spect
##.PULSE SEQUENCE= zg30
##.SOLVENT NAME= CDCl3
##.SHIFT REFERENCE= (INTERNAL, CDCl3, 0, 15.7039)
##AUDIT TRAIL= $$ (NUMBER, WHEN, WHO, WHERE, WHAT)
$$ ##TITLE= Audit trail, XWIN-NMR		Version 3.5
$$ ##JCAMPDX= 5.01
$$ ##ORIGIN= Bruker BioSpin GmbH
$$ ##OWNER= she
$$ F:/spectra/data/she/nmr/H-F/1/audita.txt
$$ ##AUDIT TRAIL=  $$ (NUMBER, WHEN, WHO, WHERE, WHAT)
(   1,<2025-01-09 13:51:27.93 +0400>,<she>,<DPX200>,
      <created by zg, POWCHK disabled, PULCHK disabled
       configuration hash MD5:
       00 E9 B6 7A A2 85 ED C7 34 08 36 98 17 FE 4E 26
       data hash MD5: 16K
       09 C2 93 25 B7 26 FB 15 BD 93 5D AB 1E EC 6B DB>)
$$ ##END=
$$ 
$$ hash MD5
$$ D3 5A D2 F0 DE C5 80 F3 2C 25 D6 AF 3A 40 5A 6E
##$RELAX= 
##$RELAX= 
##$RELAX= 
##$RELAX= 
##$RELAX= 
##$RELAX= 
$$ Bruker specific parameters
$$ --------------------------
##$DU= <F:/spectra>
##$EXPNO= 1
##$NAME= <H-F>
##$PROCNO= 1
##$TYPE= <nmr>
##$USER= <she>
##$AMP= (0..31)
100 100 100 100 100 100 100 100 100 100 100 100 100 100 100 100 100 100 
100 100 100 100 100 100 100 100 100 100 100 100 100 100 
##$AQSEQ= 0
##$AQ_mod= 1
##$AUNM= <au_zg>
##$AUTOPOS= <>
##$BF1= 200.13
##$BF2= 200.13
##$BF3= 200.13
##$BF4= 200.13
##$BF5= 200.13
##$BF6= 200.13
##$BF7= 200.13
##$BF8= 200.13
##$BYTORDA= 1
##$CFDGTYP= 0
##$CFRGTYP= 5
##$CHEMSTR= <none>
##$CNST= (0..31)
1 1 145 1 1 1 1 1 1 1 1 1 1 1 1 1 1 1 1 1 1 1 1 1 1 1 1 1 1 1 1 1 
##$CPDPRG= <>
##$CPDPRG1= <>
##$CPDPRG2= <>
##$CPDPRG3= <>
##$CPDPRG4= <mlev>
##$CPDPRG5= <mlev>
##$CPDPRG6= <mlev>
##$CPDPRG7= <mlev>
##$CPDPRG8= <mlev>
##$CPDPRGB= <>
##$CPDPRGT= <>
##$D= (0..31)
0 1.2 0 0 0 0 0 0 0 0.06 0 0.03 0 0 0 0 0.0002 0 0 0 0 0 0 0 0 0 0 0 0 
0 0 0 
##$DATE= 1736416287
##$DBL= (0..7)
120 120 120 120 120 120 120 120 
##$DBP= (0..7)
150 150 150 150 150 150 150 150 
##$DBP07= 0
##$DBPNAM0= <>
##$DBPNAM1= <>
##$DBPNAM2= <>
##$DBPNAM3= <>
##$DBPNAM4= <>
##$DBPNAM5= <>
##$DBPNAM6= <>
##$DBPNAM7= <>
##$DBPOAL= (0..7)
0.5 0.5 0.5 0.5 0.5 0.5 0.5 0.5 
##$DBPOFFS= (0..7)
0 0 0 0 0 0 0 0 
##$DE= 6
##$DECBNUC= <off>
##$DECIM= 24
##$DECNUC= <off>
##$DECSTAT= 4
##$DIGMOD= 1
##$DIGTYP= 9
##$DL= (0..7)
0 120 120 120 120 120 120 120 
##$DP= (0..7)
150 150 150 150 150 150 150 150 
##$DP07= 0
##$DPNAME0= <>
##$DPNAME1= <>
##$DPNAME2= <>
##$DPNAME3= <>
##$DPNAME4= <>
##$DPNAME5= <>
##$DPNAME6= <>
##$DPNAME7= <>
##$DPOAL= (0..7)
0.5 0.5 0.5 0.5 0.5 0.5 0.5 0.5 
##$DPOFFS= (0..7)
0 0 0 0 0 0 0 0 
##$DQDMODE= 0
##$DR= 18
##$DS= 0
##$DSLIST= <SSSSSSSSSSSSSSS>
$$ [...]
##$SUBNAM2= <"">
##$SUBNAM3= <"">
##$SUBNAM4= <"">
##$SUBNAM5= <"">
##$SUBNAM6= <"">
##$SUBNAM7= <"">
##$SUBNAM8= <"">
##$SUBNAM9= <"">
##$SW= 24.0689530833862
##$SWIBOX= (0..15)
0 0 2 0 0 0 0 0 0 0 0 0 0 0 0 0 
##$SW_h= 4816.95568400771
##$TD= 16384
##$TD0= 1
##$TE= 0
##$TE2= 300
##$TE3= 300
##$TEG= 300
##$TL= (0..7)
0 120 120 120 120 120 120 120 
##$TP= (0..7)
150 150 150 150 150 150 150 150 
##$TP07= 0
##$TPNAME0= <>
##$TPNAME1= <>
##$TPNAME2= <>
##$TPNAME3= <>
##$TPNAME4= <>
##$TPNAME5= <>
##$TPNAME6= <>
##$TPNAME7= <>
##$TPOAL= (0..7)
0.5 0.5 0.5 0.5 0.5 0.5 0.5 0.5 
##$TPOFFS= (0..7)
0 0 0 0 0 0 0 0 
##$TUNHIN= 0
##$TUNHOUT= 0
##$TUNXOUT= 0
##$USERA1= <user>
##$USERA2= <user>
##$USERA3= <user>
##$USERA4= <user>
##$USERA5= <user>
##$V9= 5
##$VALIST= <valist>
##$VCLIST= <CCCCCCCCCCCCCCC>
##$VD= 0
##$VDLIST= <DDDDDDDDDDDDDDD>
##$VPLIST= <PPPPPPPPPPPPPPP>
##$VTLIST= <TTTTTTTTTTTTTTT>
##$WBST= 1024
##$WBSW= 4
##$XGAIN= (0..3)
0 0 0 0 
##$XL= 0
##$YL= 0
##$YMAX_a= 824003
##$YMIN_a= -1015406
##$ZGOPTNS= <>
##$ZL1= 120
##$ZL2= 120
##$ZL3= 120
##$ZL4= 120
##$ABSF1= 10
##$ABSF2= 0
##$ABSG= 5
##$ABSL= 3
##$ALPHA= 0
##$AQORDER= 0
##$ASSFAC= 0
##$ASSFACI= 0
##$ASSFACX= 0
##$ASSWID= 0
##$AUNMP= <proc_1d>
##$AZFE= 0.1
##$AZFW= 0.1
##$BCFW= 1
##$BC_mod= 2
##$BYTORDP= 1
##$COROFFS= 0
##$CY= 11.3945322036743
##$DATMOD= 1
##$DC= 2
##$DFILT= <>
##$DTYPP= 0
##$F1P= 15.6554695791079
##$F2P= 12.8336369535428
##$FCOR= 0.5
##$FTSIZE= 0
##$FT_mod= 4
##$GAMMA= 1
##$GB= 0.15
##$INTBC= 1
##$INTSCL= 1
##$ISEN= 128
##$LB= 0.24
##$LEV0= 0
##$LPBIN= 0
##$MAXI= 10000
##$MC2= 0
##$MEAN= 0
##$ME_mod= 0
##$MI= 1.114404
##$NCOEF= 0
##$NC_proc= 0
##$NLEV= 6
##$NOISF1= 3.799351
##$NOISF2= 2.8
##$NSP= 1
##$NTH_PI= 0
##$NZP= 0
##$OFFSET= 15.70392
##$PC= 1
##$PHC0= -26576.91
##$PHC1= 16.18744
##$PH_mod= 1
##$PKNL= yes
##$PPARMOD= 0
##$PSCAL= 0
##$PSIGN= 0
##$REVERSE= no
##$SF= 200.130013532006
##$SI= 16384
##$SIGF1= 3
##$SIGF2= 2
##$SINO= 400
##$SIOLD= 16384
##$SREGLST= <1H.CDCl3>
##$SSB= 0
##$STSI= 0
##$STSR= 0
##$SW_p= 3612.71676300578
##$SYMM= 0
##$S_DEV= 0
##$TDeff= 0
##$TDoff= 0
##$TI= <>
##$TILT= no
##$TM1= 0
##$TM2= 0
##$TOPLEV= 0
##$USERP1= <user>
##$USERP2= <user>
##$USERP3= <user>
##$USERP4= <user>
##$USERP5= <user>
##$WDW= 1
##$XDIM= 8192
##$YMAX_p= 0
##$YMIN_p= 0
$$ End of Bruker specific parameters
$$ ---------------------------------
##NTUPLES= NMR FID
##VAR_NAME=  TIME,          FID/REAL,        FID/IMAG
##SYMBOL=    X,             R,               I
##VAR_TYPE=  INDEPENDENT,   DEPENDENT,       DEPENDENT
##VAR_FORM=  AFFN,          ASDF,            ASDF
##VAR_DIM=   8192,          8192,            8192
##UNITS=     SECONDS,       ARBITRARY UNITS, ARBITRARY UNITS
##FACTOR=    0.0002076,     1,               1
##FIRST=     0,             0,               0
##LAST=      1.7004516,     0,               0
##MIN=       0,             -1015406,        0
##MAX=       1.7004516,     824003,          0
$$ Real data points
##PAGE= N=1
##DATA TABLE= (X++(R..R)), XYDATA
0 0 0 0 0 8 -8 8 -8 8 -12 16 -24 30 -32 36 -40 48 -60 68 -84 92 -102 118 -132 152 -172 195 -216 239
28 239 -268 298 -332 369 -408 453 -496 548 -604 664 -734 809 -893 986 -1088 1209 -1343
45 -1343 1501 -1682 1898 -2163 2480 -2882 3394 -4070 4990 -6311 8307 -11551 17418 -29907
59 -29907 65887 -360750 -1015406 501016 -263297 -379791 724047 -354977 106894 824003
69 824003 -278904 122742 90480 -670208 42636 -206296 -264618 598007 -92676 -114798
79 -114798 499481 -111748 9327 -84955 -679944 118592 264738 -195574 314070 217479
89 217479 39999 308287 -162923 -326457 -83019 -253053 -106046 91466 80111 250901
99 250901 147089 -33794 86706 -9554 -319627 -293516 27833 130240 125524 186218 32729
110 32729 94624 218171 -199654 -308785 -150853 -211221 129164 170256 -59215 323014 137091
121 137091 -196177 186400 -127006 -383278 11589 -165841 61726 459729 -25004 5739
131 5739 159809 -147336 45356 -154933 -433067 93201 94996 28337 318607 -1821 2878
142 2878 147554 -269281 -91298 14345 -306924 71346 199881 30794 308786 31392
152 31392 -224405 98386 -102021 -235485 -26203 -136868 93955 308619 -6441 59063
162 59063 126765 -151687 -71092 -73074 -213706 23363 78530 27467 219078 123254 -46832
173 -46832 -23325 -139556 -102281 -9492 -173140 -30247 220972 112528 116983 76430 -140101
184 -140101 -27802 -16092 -203280 -50947 24079 3254 183772 117071 23067 60852 -143133
195 -143133 -136568 11825 -113800 -27261 73655 1766 203148 157028 -120896 -24729 -62050
206 -62050 -158086 16728 -51333 -54469 163757 90015 66529 97969 -87700 -86037 -68202 -135938
218 -135938 22990 34764 -27098 140581 112536 16994 43886 -107862 -144066 -4629 -43747
229 -43747 -30503 64763 56898 102994 92929 -25633 -48752 -80527 -111895 -28026 -853 8755
241 8755 92672 79447 47426 73438 -28259 -126222 -72946 -52741 -27182 50830 35429 48370
253 48370 108271 43225 -21157 -58743 -113388 -51624 -9004 -15138 77627 71234 25499 89588
265 89588 5584 -82854 -39333 -101903 -69611 64835 24987 39784 90560 25597 40297 -6145
277 -6145 -114450 -58916 -51597 -35328 81358 37901 32534 105044 -1265 -29038 -5052 -115888
289 -115888 -73666 15515 -2826 70602 78560 14333 49385 5774 -58458 -46537 -91075 -47875
301 -47875 51037 31120 55429 79059 7781 8920 -3729 -81191 -67746 -37928 -17422 51138
313 51138 65740 49205 41099 -345 -13807 -29170 -81478 -57820 -4178 14082 67175 77954
325 77954 18352 10853 4543 -50674 -59645 -45994 -40206 12440 62925 63722 44378 14233 -8192
338 -8192 -28902 -54760 -46958 -31551 -18679 46776 77013 34367 27739 9016 -47662 -40012 -31450
351 -31450 -56478 -14321 41920 49607 54195 38376 -869 -27749 -41025 -41015 -42275 -27089 25734
364 25734 51019 45794 51940 12542 -37384 -29450 -34093 -50750 -21424 8661 31502 61080 49498
377 49498 9180 -18935 -34024 -35737 -34220 -30422 -1966 29032 43356 52922 33287 -17054 -38743
390 -38743 -33842 -36720 -25122 -366 10798 31012 60606 42171 -9642 -30727 -35111 -42319 -24923
403 -24923 2228 7911 22559 50040 39358 2807 -13095 -33121 -55293 -27458 8402 2751
415 2751 15129 48909 34362 7264 -445 -32658 -52505 -20263 -4759 -10103 22732 47170 26386
428 26386 14274 6579 -28750 -46373 -23337 -10730 -7615 18540 34257 23063 26263 16806 -32568
441 -32568 -48689 -20178 -12910 -5370 19039 19574 20130 33597 14199 -20348 -33766 -35657 -22874
454 -22874 1518 17493 22215 15856 15864 22825 -6 -30681 -34460 -29796 -8847 21310 22164 15993
468 15993 17406 11790 3675 -16642 -31424 -22250 -20152 128 36198 19547 6882 24559 -4437
481 -4437 -22751 -5077 -30771 -32380 16383 19150 8725 25139 16381 -3245 -8276 -15612 -26997
494 -26997 -23213 4517 18134 8435 20630 21773 -7560 -3632 1854 -33370 -30949 5548 8841
507 8841 15113 29840 4785 -9079 11825 -2842 -29563 -19041 -10377 -1648 23451 25008 12530
520 12530 807 -10549 -1747 -6113 -19932 -10345 -12508 5062 43249 15908 -8316 5306 -14314
533 -14314 -9270 294 -26063 -2928 13119 1449 33617 14125 -17596 8591 -21385 -24376 22291
546 22291 -19907 -17749 36604 9292 12872 14950 -28110 -2365 -1238 -23360 5395 -10616 5567
559 5567 44148 -11083 2576 28300 -41992 -10225 20038 -35076 7028 20082 -15991 35935
571 35935 24240 -24844 -6685 -13927 -2733 8605 -24127 4541 20592 4275 30025 -2600
583 -2600 -29701 9236 -14246 -19801 20130 -1630 -5099 16337 13657 17386 -4992 -25810 -12844
596 -12844 -5028 11722 6259 -14472 13031 24126 8158 -728 -21117 -8906 -4867 -16299 17306
609 17306 8735 -6438 25738 -774 -3291 19402 -34313 -24283 12152 -3873 22659 233
621 233 -16710 44584 -1130 -23757 15412 -43409 -5482 42136 -37772 15885 44647 -35011
633 -35011 21003 14399 -41321 14212 -21986 -25139 47972 -4801 2135 22968 -30157 33227 10879
646 10879 -71726 17169 8735 -28678 51906 -3021 -23195 49845 -17764 -24068 18616 -33597
658 -33597 -6372 13111 -10222 42636 11518 -31192 20931 -2618 -19924 6757 -33872 -10643
670 -10643 44511 6361 -3174 14842 -5469 -2709 -4429 -22803 -6930 4414 -2735 14293 24152
683 24152 5069 -1547 -10373 -18998 6670 -2890 -31715 9620 29137 7746 17209 -6420 -21085
696 -21085 10157 -12301 -24023 3266 -649 17130 18194 -4625 22509 -4803 -38300 7258
708 7258 -9144 -17745 24275 -11925 2883 52665 -7743 -22326 2226 -23118 -2045 962 -22146
721 -22146 20149 22400 2534 18834 -9700 -15216 2847 -32175 -12631 27776 -3341 580 25559
734 25559 6555 4505 -3987 -32699 -14699 6715 -2112 2581 8436 14692 24255 -5987 -21589
747 -21589 3995 -17836 -25925 14550 2219 5255 34060 -7516 -5706 23000 -25305 -25659 -3639
760 -3639 -15613 23855 14555 -12585 34919 5625 -20956 11947 -36802 -20083 29444 -29663
772 -29663 9125 52041 -18006 8534 14357 -38911 7447 -7544 -39113 20658 11548 11651 28472
785 28472 -21351 10795 13642 -51376 2115 5893 -33752 33502 17328 -13479 41278 -3147
797 -3147 -33788 5348 -17803 -9818 4678 -15985 25288 30572 -5651 9276 -8297 -22904 437
810 437 -16817 -12559 15999 9218 11646 15957 5044 -736 -18222 -21486 -5872 -46 3580 2297
824 2297 10936 23020 10309 -4969 -18044 -17768 -944 -10720 -4304 18540 2707 14248 23363
837 23363 -14698 -4754 -3268 -35295 -2384 12971 -575 14632 4076 13398 21646 -23253 -13424
850 -13424 -7599 -30544 21270 15689 -22402 32719 18758 -17252 17435 -15118 -30760 3360
862 3360 -13822 7690 25336 -7078 15383 9980 -10672 15604 -26099 -36663 19989 -2984
874 -2984 2909 32065 -12241 6463 26635 -24182 -10689 -4978 -28044 10059 14115 3949 23156
887 23156 -2701 -5700 15442 -15454 -19000 -6584 -16447 13226 26689 880 3555 5776 16
900 16 -1748 -16441 -15340 -4534 -2453 17024 20066 -101 4428 4171 -10459 -5196 -6871 -20998
914 -20998 -5671 19785 17512 7762 5610 -1813 -4970 -2748 -10858 -17921 -7949 9994 17862 10987
928 10987 8334 3243 -12410 -5212 1853 -20738 -12477 10930 3719 16543 24258 -8909 -10320 5338
942 5338 -10809 -12697 -5746 -8645 6552 20865 16694 6056 -7657 -6028 -4120 -13992 -7594 -2479
956 -2479 -5528 16117 25218 5585 135 -6572 -15047 -5993 -5852 -9278 -189 7972 19881 19160 -2083
971 -2083 -6598 -7426 -16663 -5336 -1228 -10580 6858 20035 12083 10863 911 -16150 -14041 -7301
985 -7301 -4861 -3940 -289 14434 18685 9734 6447 -10155 -23327 -6339 -3916 -11269 6809 13603
999 13603 7366 17621 11890 -12125 -16788 -11471 -10170 -4648 6062 8564 8186 16524 15636 -7078
1013 -7078 -16133 -10915 -15574 -7162 8913 4760 6931 19116 11996 -553 -7187 -18097 -18634 -6973
1027 -6973 2416 7702 9428 13177 14577 3984 -7550 -14249 -19380 -13407 2219 8914 9584 14319
1041 14319 12803 4509 -3416 -10962 -19245 -17018 -1779 8718 9453 13511 14021 3697 -2022 -5725
1055 -5725 -18452 -20221 -4132 4680 7252 17806 15789 1213 1084 -1981 -19503 -19509 -6023 -2694
1069 -2694 6898 21598 14788 2695 4081 -3360 -18838 -15396 -7785 -7980 6534 21987 13536 6227
1083 6227 6299 -6630 -15572 -10983 -11703 -9716 5192 16363 14890 10783 5890 -5362 -13423 -11324 -11775
1098 -11775 -11134 1651 13136 14943 14972 7844 -4444 -11205 -13589 -12018 -8754 -2298 10000 16383
1112 16383 13827 10678 197 -13513 -13740 -9618 -10220 -3518 8913 12783 12210 14057 3995 -13175
1126 -13175 -13227 -8468 -13191 -3814 9516 6211 10998 19387 4279 -9645 -8550 -13967 -14563 -1393
1140 -1393 6081 4670 11498 18025 6547 -5886 -6336 -14497 -18080 -451 5612 1268 13501 15828
1154 15828 3594 1868 -4311 -18321 -15444 -2840 1714 4565 11575 12027 6254 4012 -1969 -15070
1168 -15070 -14884 -6246 -2172 4945 11398 9954 7776 5187 -983 -8618 -15668 -11509 -2069 3225 10167
1183 10167 12401 5688 4744 3134 -7601 -14407 -11421 -5021 896 8475 13480 7077 1992 4440 -4955
1198 -4955 -13687 -7383 -8352 -5774 11220 13471 5122 5589 4316 -3781 -8628 -8318 -9761 -8343 7697
1213 7697 13972 3704 8577 8483 -8997 -6402 -2394 -15060 -8075 6841 5197 10275 13213 907
1227 907 -3996 -3196 -5277 -10615 -10015 1202 7512 7366 12306 6205 -4853 -1577 -4694 -12798 -5597
1242 -5597 -800 -508 8917 12636 6737 1141 -4960 -6012 -5183 -9655 -4658 1714 3483 13873 12010
1257 12010 -3019 -501 -1597 -13398 -7440 -2436 -4598 6513 10872 8000 8093 -1145 -6253 -7866
1271 -7866 -11447 -812 -1075 -5613 13310 14399 -722 6536 -2025 -15040 -2455 -4506 -9816 3610
1285 3610 9449 7650 7179 4990 2211 -10412 -11954 -2140 -7178 -1936 11605 3406 7341 15020 -4309
1300 -4309 -11207 -3641 -8917 -7908 1030 4066 7956 11074 7124 -634 -3868 -5960 -11127 -8952 -603
1315 -603 5796 7248 5823 9110 6735 -6654 -6205 -7733 -13668 1425 4493 -2075 13989 13281 -1458
1330 -1458 712 -6581 -10085 -5167 -11075 2264 10602 2937 14925 5823 -9659 5928 -9264 -21394
1344 -21394 3533 -636 -771 14941 4826 7848 6658 -12529 -5038 -7539 -12162 6053 -3382 2316
1358 2316 24513 577 -3310 7918 -15114 -8773 360 -14327 4404 14201 2743 10434 5165
1371 5165 -3167 -3939 -15536 -7058 1426 -5732 8257 11687 3722 12149 140 -15113 -6001 -4606
1385 -4606 -7578 -1232 4623 10948 9054 5178 2913 -6927 -8825 -6988 -8619 286 5838 6009 7798
1400 7798 5554 7169 -1342 -16255 -6538 -2774 -6453 6964 5225 3381 15665 2254 -5732 -3567
1414 -3567 -13043 -5312 -1078 -3313 13501 6813 -215 13633 -3854 -9383 800 -18985 -5659
1427 -5659 15309 -2757 5060 13130 -1179 5599 -3047 -14139 -3875 -8310 1110 10642 -2595
1440 -2595 11435 11760 -11496 3666 338 -20285 -1590 1240 -2374 15022 5947 -912 6183 -2347
1454 -2347 -3125 -7503 -14013 3252 5284 313 12603 3935 -2687 4841 -6489 -9736 -1557 -6561
1468 -6561 -1506 8876 7784 5874 492 -3354 119 -4083 -8415 -4715 -2125 4876 11068 4062 -247
1483 -247 2265 -1378 -7619 -4519 -2562 -4586 2111 8277 6697 3884 632 -4652 -4908 -2663 -1796 -5968
1499 -5968 -2649 10429 7820 120 4306 -2360 -8326 838 -2830 -9073 3405 5527 1475 6854
1513 6854 5421 -3388 -5818 -2906 -1552 -3950 -1283 2133 1475 7532 7974 -4553 -5449 24 -4189
1528 -4189 -4171 117 -244 2264 6901 4334 246 -1959 -3789 -4414 -2841 -369 641 -482 2108 7978
1544 7978 3580 -3853 -2544 -4060 -4785 1949 -46 -2876 5088 5380 1679 1462 -2785 -3598 -4464 -3413
1560 -3413 2964 -661 -834 7793 1168 -318 5535 -7309 -8566 4195 -1992 -2724 4473 1741 2659
1575 2659 3733 594 -2691 -6420 -1271 730 -5430 4796 5904 -4755 5608 5723 -7574 -1274
1589 -1274 -1421 -7623 2451 3669 -795 2989 3323 2730 -431 -4231 -1732 -3857 -3426 3925 1705 1137
1605 1137 5596 535 -651 803 -4203 -4594 -2101 -275 4133 2372 1908 4211 -523 -2038 -344
1620 -344 -5078 -4788 1000 1876 1527 4618 4495 -1709 -1572 1371 -5122 -5520 1502 -632 807 7897 2913
1637 2913 -2033 868 -965 -4797 -3660 -366 -370 -569 6579 5500 -2171 1602 -149 -7907 -576 524
1653 524 -5151 2249 6735 2855 2888 1070 -2564 -4921 -2371 -116 -3073 -625 6816 2418 2205 5242
1669 5242 -5105 -5678 403 -3582 -1698 2379 1087 3827 4938 1572 -396 -5150 -4655 23 -1283
1684 -1283 70 3615 1768 3750 4783 -225 -4784 -5062 -2042 -863 220 3711 1592 726 6792
1699 6792 1453 -5910 -2921 -3563 -3919 3188 4192 597 1735 4775 1859 -3086 -2648 -3824 -5608 2714
1715 2714 6057 -513 1884 4707 -502 -397 -778 -6507 -5352 2052 4246 1658 2161 3688 -1105 -972
1731 -972 1931 -6352 -6771 2394 2181 2450 6046 428 -1935 1420 132 -3600 -4812 -1615 2426 3302
1747 3302 4993 2382 -3123 -372 858 -3141 -3295 -2353 -614 3530 5402 3485 -961 -3064 485
1762 485 -665 -3803 -1381 -1124 196 6484 4350 -1689 -1950 -1349 -2222 -1849 -543 -1259 -766 4577 6077
1779 6077 -672 -1982 -952 -4593 -957 2224 -3031 -2020 4859 4330 1079 -459 -2152 -4797 -1031
1794 -1031 2538 -1539 -2356 3820 2542 625 3321 -2205 -6808 -947 1725 -1103 388 1563 816
1809 816 2314 3493 -2080 -6307 -1657 750 -978 1124 2249 -127 1085 3025 -798 -4149 -2934
1824 -2934 -1207 -72 2579 2159 -778 -88 3078 335 -3194 -3029 -1973 -374 2158 2354 -78 -1028
1840 -1028 1788 929 -2332 -2098 -1648 -3271 1718 4616 -123 -1159 994 -311 -767 -378 -2696 -2877
1856 -2877 1043 4537 641 -1111 1690 -1147 -2748 1977 -1372 -4334 1442 2553 531 2553 375
1871 375 -3349 -694 1438 -995 -3157 -270 2190 692 1712 1527 -2921 -1636 2097 -1879 -1902 1143
1887 1143 -747 -276 3427 1117 -1615 -1516 -486 -147 -412 -81 -392 -519 2565 2710 -1346 -1795 -268
1904 -268 -1008 -341 993 -423 -1135 1576 2451 -364 -519 -476 -1675 -1024 1663 678 -1908 -214 2903
1921 2903 345 -783 1046 -2574 -2189 3102 -154 -2878 2252 904 -1355 2512 428 -2962 -1160
1936 -1160 938 475 -716 964 275 -1753 2354 2971 -4245 -1439 2222 -2576 600 3042 -3117 -93
1952 -93 3006 -832 280 -135 -2115 -703 -151 2141 932 -2649 1856 2433 -1611 1081 -1102 -4054
1968 -4054 1189 2180 -1090 1475 786 -90 1133 -240 -387 -1847 -2712 2039 2117 -1019 1319 95 -856
1985 -856 2614 755 -3898 -1012 1203 327 804 1601 600 -891 1187 1366 -2216 -2740 350 -478 809
2002 809 4776 470 -3277 2366 1758 -3700 -324 -407 -3137 2821 4558 -1087 -107 1202 -1162 -689
2018 -689 134 -1501 -1771 676 4112 1888 -855 1123 -1534 -1839 2167 -1520 -4220 1959 1909 1324 3465
2035 3465 -359 -2560 62 -1131 -1233 -971 -1967 2291 3389 1675 2322 -1564 -4457 506 463 -2717
2051 -2717 657 559 649 4695 1610 -2495 -2270 -1921 -197 -507 -1977 2132 1227 168 5828 41 -5880
2068 -5880 688 -1869 -4077 4195 242 -3016 4781 3474 -62 -663 -4078 -2216 -549 -87 2847
2083 2847 -1120 723 6007 -1702 -1895 1254 -6976 -2642 4582 -1533 1279 3949 -1624 2442 2617
2098 2617 -4089 -3421 -2966 301 3132 -683 1958 2474 -1521 2436 -256 -6549 -1265 -479 -1512 4206
2114 4206 2557 -63 1559 -60 55 -1986 -5623 -1563 1767 1536 3947 1612 -1258 850 769 -3027
2130 -3027 -3869 -1275 -50 602 4116 3024 -1088 -22 22 -2465 -2017 -1678 -1825 799 4178 3755 -852
2147 -852 -818 1477 -2842 -2665 9 -4541 149 6004 53 912 3149 -3176 -2676 -462 -2632 -1602
2163 -1602 -221 2043 3858 1031 1800 -1061 -5654 893 -44 -5558 2071 2904 -553 4352 1336 -2715
2179 -2715 14 -2264 -2179 147 -1099 1374 2047 78 3659 -39 -3982 -344 -1653 -2353 1374 -548
2195 -548 1063 3129 1430 427 -1272 -2809 -1031 -1665 -1141 2140 596 792 2958 192 -1726 -602
2211 -602 -2790 -2746 355 1719 -913 952 3012 104 -675 107 -2326 -2272 -3 361 50 1608 3469
2228 3469 233 -1465 1939 -1349 -4089 1279 110 -1969 3836 1612 -1313 2524 218 -2535 -794
2243 -794 -1206 -191 419 269 3138 675 -463 1524 -2162 -1684 1494 -2509 -1159 3169 381 1028
2259 1028 1567 -928 107 -1306 -1641 -123 -1706 601 2914 -865 1523 2375 -3091 -800 827 -2478
2275 -2478 -783 706 -57 2225 1690 693 -191 -1439 300 -622 -2805 821 912 -376 2762 2188 -1475
2292 -1475 -6 -36 -1992 -845 648 -995 -447 2661 2328 -554 -401 335 -2109 -999 655 -1418
2308 -1418 -190 3164 1730 -19 974 -473 -2791 -950 185 -1572 -193 2063 1312 1640 1347 -1123
2324 -1123 -2109 -996 -99 -643 -823 1488 2240 1035 2028 373 -2618 -1360 -198 -1545 -153 1361
2340 1361 935 1492 2508 812 -1984 -1929 -798 -1088 -322 1676 688 946 3250 1127 -2064 -1284 -1213 -2486
2358 -2486 76 1899 452 554 2975 1123 -981 -1204 -1879 -2907 77 1653 323 1055 2913 1175
2374 1175 -1063 -372 -2116 -3724 -69 1091 65 2395 2372 472 357 -86 -2505 -3014 -982 803
2390 803 861 1567 2210 532 137 649 -2502 -3141 -722 -10 749 2476 2068 769 502 -296 -1474 -2787
2408 -2787 -1877 65 42 1544 3322 843 -2 599 -1499 -2537 -1353 -882 -83 1907 3003 1263 413
2425 413 557 -1515 -3072 -719 -894 -1516 2052 2931 679 1175 600 -2202 -2298 -595 -980 -1064 1916 2462
2443 2462 437 1888 1167 -2611 -2017 -494 -1888 -824 1574 1352 843 2472 1197 -2015 -1798 -911
2459 -911 -2181 -618 1790 686 919 2348 434 -1166 -1396 -1966 -1957 -360 1019 1129 649 1665 975
2476 975 -923 -925 -1452 -2371 -709 1161 1000 1106 1075 1025 -145 -1523 -769 -1790 -1956 1321 1431 -218 1762
2495 1762 1080 -797 -91 -270 -2684 -1490 909 761 739 1640 867 -1255 139 269 -2153 -1735 1061
2512 1061 -220 492 2660 -545 -1730 1562 111 -1868 -810 -176 -687 1540 2681 -310 -746 690
2528 690 -641 -1224 277 -491 -1439 1010 2440 376 -602 300 -793 -784 1070 -856 -1824 1661 1131 152
2546 152 837 -705 -948 249 -426 -153 -788 -783 1329 522 381 892 -1438 -1062 998 347 -559 -613 49
2565 49 1528 660 377 256 -1549 -192 1609 -1506 -705 1393 -1048 297 2349 -1145 -1261 935 -563
2582 -563 -85 582 -707 -1402 688 2189 148 -1543 592 320 -274 973 -34 -1777 702 1905
2598 1905 -948 103 1071 -1198 -466 1549 -445 -1584 173 329 536 1379 -547 -1030 -304 638 304
2615 304 -1561 -664 921 206 937 1085 -1762 -428 706 -766 -30 94 -897 1259 1491 495 784 -1642
2633 -1642 -757 1831 -1137 -489 343 -1598 2159 2821 -2100 -139 618 -1473 354 167 -946 419
2649 419 88 1503 2033 -1183 272 -801 -2105 2208 511 -3307 2537 1952 -865 1570 -967 -2235
2665 -2235 1186 177 -835 95 172 1181 687 -87 1295 -1762 -2215 1561 532 -711 1687 -887
2681 -887 -269 2963 -569 -2317 -752 -361 268 732 -455 294 533 369 660 -1137 -1400 292 -926
2698 -926 249 2150 127 -1278 1380 1129 -570 -486 -1744 -771 1229 850 349 -416 272 1012 -766
2715 -766 -1787 773 -987 -1466 2410 284 -613 1392 -1264 -942 1990 -1300 -2311 620 714 1532 634
2732 634 -1003 821 -540 -481 676 -1799 -453 2488 -1461 613 2632 -1587 -1138 1046 -1340 314
2748 314 46 -1521 1117 1314 142 -189 -1555 536 1129 -2197 -209 1145 -996 899 1352 -1353
2764 -1353 1 55 -1302 114 962 -283 -320 -477 1346 730 -1540 -905 544 -689 583 648 -1422
2781 -1422 744 1486 -1429 -657 817 -1273 -641 549 -65 831 414 -527 159 1 149 -568 -1421 1221
2799 1221 1485 -1445 -181 1041 -1803 124 664 -2009 733 1091 -990 759 1117 -736 -167 -1383
2815 -1383 167 1071 -1421 514 867 -755 1829 -91 -2469 1365 179 -1664 1742 165 -357 1111
2831 1111 -823 -127 723 -1694 -687 277 -567 1750 -445 -1653 1946 257 -1786 67 -729 -758 1485
2848 1485 93 11 426 -582 143 -395 -720 943 -1064 -989 2338 296 -350 1378 -1063 -933 1478
2865 1478 -1582 -1916 1218 868 585 834 -90 -552 -496 -435 484 -1057 -646 1333 127 865 1968 -1736
2883 -1736 -1397 1428 -597 -871 760 -458 496 2180 -53 -666 -537 -320 -52 -273 -6 813 -443
2900 -443 953 1627 -742 -751 -102 -1220 546 1410 -846 179 1273 922 204 -898 -1332 -276 -166 407
2918 407 953 -665 761 1875 -453 -634 -399 -1897 -569 1311 513 71 173 549 506 249 -700 -1141
2936 -1141 -1107 784 1088 -633 465 773 -706 409 541 -2004 -1145 922 187 540 1664 -562 -510
2953 -510 909 197 -1266 -1039 29 416 453 1264 12 -1207 739 852 -1679 -274 140 -1103 1183
2970 1183 1317 -530 38 207 -780 263 -284 -954 -255 320 1392 552 -800 388 84 -551 570 -541
2988 -541 -1089 377 838 588 89 -502 -545 -189 -110 161 -238 -259 1274 646 -429 291 -458 -855 815 199
3008 199 -909 -74 544 -120 311 321 -654 -760 450 631 -774 -52 645 -575 589 1200 -744 -856
3026 -856 508 -281 -679 746 -119 -868 541 462 -718 -8 345 -404 -205 644 -348 -479 138 509 -646
3045 -646 27 429 -390 -74 577 -472 -833 177 28 111 431 95 -329 -216 333 -100 -724 -218 336 -117
3065 -117 394 693 -587 -474 552 -59 -813 -24 179 -454 218 608 96 -182 102 -415 -904 76 -36
3084 -36 -830 311 1057 -456 -31 384 -895 -973 287 -327 -780 306 553 -384 515 426 -887 -688 535
3103 535 -406 -442 798 469 -212 509 381 -919 -609 20 -791 -289 592 -93 71 740 138 -784 -747 -551
3123 -551 -166 -335 473 725 -317 317 740 -649 -473 -541 -715 -31 596 439 236 494 531 -25 -852 -275
3143 -275 -1245 -537 792 959 -624 618 449 -848 23 65 -992 -473 709 458 284 872 149 -785
3161 -785 -204 -430 -1525 -785 840 126 410 1506 -210 -985 330 -460 -1334 -518 110 118 756 1240 10
3180 10 -683 -253 -550 -839 -310 352 -69 822 939 365 -309 130 -438 -586 -47 155 -238 692 921 622
3200 622 110 -458 -340 -961 -650 508 113 196 1539 330 -411 320 -1042 -1422 314 -1 -476 601
3218 601 825 685 233 113 -502 -1295 -57 558 -591 201 1361 -379 342 1126 -1166 -870 184 -799
3236 -799 -178 783 353 309 162 88 -249 -1063 -188 -66 -853 408 775 -458 559 832 -970 44 -53
3255 -53 -1098 -294 596 269 534 80 169 178 -597 -366 -253 -794 776 460 -572 347 613 -471 12 -87
3275 -87 -966 222 195 -170 195 52 294 143 -422 220 121 -1196 368 317 -514 1014 637 -645 310 159
3295 159 -1391 46 344 -217 141 118 599 384 -479 287 -359 -1015 894 -240 -1016 891 233 -928
3313 -928 489 303 -794 685 -557 -647 291 -121 -245 105 44 466 -660 -829 904 -637 -911 1347
3331 1347 -170 -374 1240 -328 -644 799 -54 -446 444 -519 183 318 -100 727 -262 -517 519 -491
3349 -491 -302 861 -631 -465 1312 113 -310 601 -592 -540 -38 -573 -169 349 -20 822 283 -137 199
3368 199 -768 -878 1091 -680 -482 1225 5 102 703 -440 -890 364 -324 -230 217 -213 744 231 191
3387 191 811 -852 -712 617 -1058 56 1400 -498 372 1503 -333 -654 -5 -1335 -75 149 -431
3404 -431 758 83 99 873 -591 -527 99 -1159 238 1235 -814 459 873 -685 405 177 -1672 -99
3422 -99 228 305 808 -246 627 1025 -510 -82 -357 -1802 91 793 -570 817 968 -512 514 151
3440 151 -1464 -784 -234 239 1193 -167 347 520 -562 328 -427 -1775 283 311 -824 1423 773 -595
3458 -595 765 216 -721 9 -996 -439 939 810 1117 250 -826 614 -318 -1272 217 -653 -851 1788
3476 1788 774 -310 921 -759 -939 -41 -844 -705 116 230 1367 599 -1006 77 -544 -701 553
3493 553 -816 -986 1049 721 88 767 -318 -511 -106 -542 -168 -24 33 966 648 432 239 -980 -1005
3512 -1005 580 -476 -694 1084 -155 529 1269 -214 -760 -290 -472 -305 -67 227 391 321 886 564
3530 564 -913 -821 42 -619 177 854 -706 -168 1393 246 -554 -171 -880 -435 705 6 -195 116 234
3549 234 322 199 -395 -149 -793 9 962 49 -173 689 176 90 579 -776 -418 -86 -295 396 -324 36
3569 36 568 -255 112 110 -956 -528 792 -370 231 623 -760 147 548 -452 -434 -508 -91 190 -80 302
3589 302 113 -632 912 506 -1046 29 490 -1098 672 280 -654 181 448 -27 237 95 -410 -154
3607 -154 46 279 -181 -331 743 -67 -410 462 -305 -1081 753 95 -304 122 24 -87 496 484 -294 -246
3627 -246 -381 35 -137 -211 -11 -19 -277 677 -173 -659 341 -168 -236 472 555 -583 8 249 31 179 -323
3648 -323 -326 -492 -200 854 38 -417 504 29 -463 231 -307 -739 284 157 78 391 459 -136 -311 -443 -238
3669 -238 -408 442 125 -168 356 687 -139 -335 347 -651 -580 429 67 -60 1048 429 -323 -172 -13 -437
3689 -437 -368 -11 128 219 494 545 -215 208 43 -540 -261 330 -216 -93 334 527 -231 38 -170 -484 -43
3710 -43 -47 -51 -233 637 537 29 -111 -104 -880 -464 104 -512 -340 523 563 -292 219 145 -751 -416 -100 -465 77
3733 77 492 481 28 450 152 -842 -617 11 -452 244 977 230 19 508 -208 -366 -182 -209 -39 273 596
3754 596 286 233 664 247 -905 -111 -17 -664 331 792 -53 429 328 157 -279 -372 -489 -671 -300 519 55
3775 55 -246 455 131 -408 33 -378 -494 -176 430 405 304 191 17 -392 -11 44 -708 -69 207 -65 304
3796 304 669 -59 -230 128 -152 -729 -296 177 173 428 455 -196 -659 244 -310 -608 54 110 74 460 510 44
3818 44 -702 110 -270 -505 421 191 -532 498 419 -33 -187 57 -224 -239 -34 21 -29 329 687 -31 -194
3839 -194 165 -491 -237 502 -120 -583 419 93 -219 -84 -135 -118 -389 190 139 -473 346 408 -176 418 406
3860 406 -821 -368 144 -104 -212 337 -139 -371 334 288 -108 -65 139 -55 -5 518 -36 -452 403 217 -381
3881 -381 -189 268 -388 7 375 -157 -295 -64 194 -271 69 -12 -338 32 191 -256 -92 -58 100 10 464
3902 464 330 -241 -57 150 -164 -288 536 -90 -45 506 127 -107 50 315 -193 -347 374 -94 -65 515 281
3923 281 -131 220 -118 -531 -460 -11 -198 206 -96 363 12 -154 165 -282 -432 366 -17 -267 667 5
3943 5 -143 188 -10 -572 -318 75 9 59 255 446 -169 122 143 -534 -381 123 -349 157 463 80 -460 324
3965 324 167 -323 -278 -146 -327 13 409 198 -89 351 -38 -506 161 -195 -529 -42 1157 101 29 550
3985 550 -234 -715 155 -642 -525 219 319 136 159 148 139 -411 -98 177 -275 -85 655 -462 127 857 -166
4006 -166 -296 152 -260 -292 102 -190 443 62 186 130 -685 111 271 -508 149 271 -70 248 581 -552
4026 -552 -427 190 -431 201 126 134 483 36 258 433 -464 -276 -216 -619 329 388 -287 126 698 37 -206 61
4048 61 -751 -244 91 -99 40 360 550 61 -36 -33 -222 -176 697 147 -184 384 66 -132 658 463 -633
4069 -633 111 14 119 28 232 163 -106 -170 53 5 -453 327 240 -465 705 355 -15 151 -114 -475 98 -15
4091 -15 87 54 -165 344 -211 -260 706 -356 -409 567 -130 157 618 -433 -605 308 65 -30 202 211 -146 -101
4113 -101 52 87 -428 -31 363 -250 160 355 -204 338 67 -243 -73 191 95 -53 233 95 -192 132 285
4134 285 -27 50 -66 -5 -34 212 41 22 80 499 -350 -41 22 -367 -321 415 172 -212 299 -27 -61 281 -10
4157 -10 108 -392 10 59 -170 140 -15 -428 -300 596 -545 -40 174 113 -192 588 -146 -202 -24 -398 61
4178 61 -471 508 457 -283 308 122 -844 226 -61 -269 126 360 -205 247 405 -33 -238 -281 -56 -19 -140
4199 -140 290 196 16 441 -8 -610 -68 136 -258 131 472 -6 381 275 -222 19 -445 -55 -27 -21 684
4220 684 374 -55 401 -301 -693 4 -110 -763 261 463 118 52 152 -79 -288 -315 -54 -425 -124 123
4240 123 -34 -107 284 -243 -312 -227 -381 -250 207 339 32 244 62 -243 121 -287 -149 -496 -263 128 -37
4261 -37 208 454 -56 111 79 -452 -390 60 -11 -85 491 245 -59 -50 113 -167 -333 16 301 -245 193 364
4283 364 -665 -34 337 -228 -385 -133 56 417 308 -13 -16 103 -2 -210 -132 -157 248 121 763 418 -217
4304 -217 129 129 -312 -280 -317 -352 105 474 108 -300 156 -145 -144 156 53 -21 -467 140 152 8 -82 -7 -327 -110
4328 -110 377 -52 -11 416 425 -64 200 -197 -438 -304 -47 -146 -54 542 504 150 138 -100 -663 314 242 -260 22
4351 22 418 -175 102 642 -188 -224 -117 202 -253 -123 134 -64 112 615 62 -407 156 -43 -553 363 228
4372 228 -353 5 96 95 108 -85 -180 14 242 82 -54 -210 229 110 -162 -238 -194 -418 150 390 -139 -339
4394 -339 122 -145 -135 369 -74 1 16 245 167 -12 85 -181 -73 452 -116 -513 32 314 -223 -233 -108 -436
4416 -436 461 235 272 23 110 60 -194 62 123 -241 -148 406 -126 79 0 96 -124 281 2 -85 174 189 193 -93
4440 -93 362 -99 -364 -99 118 -93 -142 88 19 -147 191 -52 -469 -6 31 -198 74 370 -60 151 319
4461 319 -13 -557 70 -157 -82 150 58 -35 -12 182 66 -186 -120 -215 -267 193 368 56 61 533 -250 -209 -2
4484 -2 -527 -338 107 86 58 217 161 -192 -487 20 -527 -335 -50 -36 63 384 186 -41 -158 -285 -566 -147
4506 -147 -33 176 -249 450 541 -173 -56 -178 -538 -163 -147 -24 -73 196 322 168 -37 253 -257 -474 314
4527 314 -197 -58 462 291 -159 470 -156 -595 -73 -135 -20 169 424 483 -8 -356 -7 -404 -180 215 -97
4548 -97 -64 308 -174 95 208 -222 -553 -149 0 -47 -91 -161 141 44 359 96 -371 58 123 -34 216 533
4570 533 200 -301 590 94 -151 -313 -189 322 141 57 155 5 49 86 -382 -117 -11 -106 365 852 -211
4591 -211 240 177 -175 -291 50 -301 -68 388 56 -125 4 119 -38 -58 56 -346 -688 13 676 103 -120
4612 -120 357 -510 116 -110 -269 -218 81 -124 29 217 117 104 -319 -113 10 -530 169 246 -157 75 -52
4633 -52 -449 -202 -18 50 -130 -3 -220 21 81 -97 -105 -171 101 367 -64 144 176 -343 251 165 -225 -188 -227
4656 -227 -88 269 70 -117 27 -252 201 11 -93 207 171 82 352 -125 -567 313 166 -236 158 89 -193
4677 -193 274 173 -298 -271 13 27 -192 -52 349 92 -271 578 50 -504 90 -177 -161 426 -104 -436 -198
4698 -198 363 190 -61 -375 -20 -30 48 320 -70 -149 549 -66 74 49 -23 -467 465 -269 -124 363 -96 -69
4720 -69 -16 -348 42 -253 32 254 -249 188 146 -234 -4 209 -472 258 15 -47 119 226 19 -188 162
4741 162 -101 76 -350 -235 128 142 117 123 -497 -19 214 -599 -234 508 42 164 301 -59 450 236 -318
4762 -318 -106 20 221 -96 -64 103 354 -386 -27 398 -409 -352 243 -138 199 373 89 107 148 -565 -314
4783 -314 -380 36 151 88 145 372 -300 62 80 -607 42 26 -612 579 630 -268 415 80 -577 -321 -425 -465
4805 -465 25 -50 198 426 -434 530 64 -710 -90 -241 -269 117 420 -249 391 11 -265 -19 -113 -113 178 -286
4827 -286 367 219 -291 446 -374 -93 367 -286 -379 275 12 -260 172 -250 -275 230 -576 -89 -114 -65 -7 -85
4849 -85 -163 444 127 -281 530 -567 -333 180 44 -128 690 -28 -69 119 -228 214 -154 -109 15 -178 -249
4870 -249 577 -302 -55 511 44 -406 326 -345 -182 196 17 -135 97 -269 -51 113 231 152 188 100 515
4891 515 136 185 95 -288 -43 257 -56 226 186 -185 -30 -149 110 37 -50 257 321 -107 -201 -12 -41 103 224
4914 224 -270 20 260 -489 134 367 -23 -180 10 96 -190 -113 110 146 -389 116 -64 -243 323 260 -32
4935 -32 -250 161 -483 -3 117 -333 238 242 267 -100 183 -158 -374 385 -67 -86 -230 210 14 -175 216 187
4957 187 -347 -234 48 -246 -98 193 -232 -14 367 -95 -68 -199 155 188 -122 -183 128 -203 73 195 -327
4978 -327 200 547 -467 -129 379 -7 244 126 -30 66 61 -33 -276 -438 377 -72 -212 707 328 -167 20
4999 20 -215 -197 94 -93 237 289 -201 -53 233 163 26 59 33 -169 7 -10 373 74 -23 241 61 -397 -82
5022 -82 -386 -155 32 57 189 -160 78 -128 -525 -505 -117 60 100 536 178 17 -9 23 -397 38 -272 86
5044 86 351 67 334 306 68 0 116 81 23 -306 -275 420 139 -211 369 -125 -304 -100 -370 -98 125 42
5066 42 411 -55 153 -221 -61 50 -172 -417 100 520 -170 45 427 -565 -428 1 -357 -153 400 243
5086 243 -5 216 -130 -93 -161 -126 -156 135 200 2 89 20 -6 -29 -100 314 -99 -57 172 33 -146 442 -363 -387
5110 -387 -61 -180 -159 -248 -95 -64 108 -37 -68 152 221 58 -40 -164 390 104 174 53 -116 117 205 19 -69
5133 -69 -25 158 120 -255 4 200 41 -140 -69 33 -175 182 -25 180 149 -102 -271 -69 -217 -68 67 129
5155 129 74 -72 62 162 -193 -214 -297 -56 668 3 -41 16 204 -37 -103 -102 -396 50 128 152 -102 -75 187 -277
5179 -277 15 288 -65 31 -93 46 153 66 164 14 -149 -196 -41 -69 -10 223 59 -230 -11 -156 -339 192
5201 192 128 -98 28 -186 -23 -105 136 -218 -167 156 118 8 -116 143 -96 -65 -24 -282 -122 332 -277 -197
5223 -197 246 -76 197 207 95 -31 197 -175 12 -83 -315 220 -263 -140 181 -168 4 138 -281 229 290
5244 290 103 124 401 -194 -190 -126 30 51 188 1 209 111 128 117 -469 28 -164 -178 -109 218 -140 156 -320
5267 -320 171 15 -21 -174 -339 163 378 109 -196 313 254 -246 -337 28 -249 67 218 91 339 352 -263
5288 -263 -59 -7 -287 237 -6 213 -126 376 138 -33 -451 47 -56 -322 526 162 135 476 225 -104 197
5309 197 -22 -373 52 -76 -44 58 190 210 195 -340 353 -17 -694 419 -146 113 469 -109 -88 -40 -396
5330 -396 -262 90 -121 -202 32 -101 -72 42 -151 22 71 54 127 216 -83 185 -225 207 -230 162 3 -213
5352 -213 29 210 11 155 118 -157 -337 -272 -214 -124 244 19 270 153 -77 -271 113 -326 -422 -78 54 -118
5374 -118 166 270 -38 -184 -210 406 -561 301 130 48 279 443 -1 51 -146 -448 -264 91 -265 -61 21
5395 21 87 223 56 -87 -83 -87 -157 2 -286 161 129 -128 -24 151 5 152 -244 -76 110 -29 276 221 39
5418 39 -95 147 -314 247 403 -110 140 122 -349 -143 82 -119 -107 -76 -326 20 -42 205 -178 -396 -4 21
5440 21 -135 255 34 -399 504 55 -97 149 -105 -300 10 -250 -383 23 -35 -244 249 -168 -114 -131 -152 188
5462 188 -22 -225 273 217 -143 100 -261 -125 104 276 -65 340 -216 132 -8 -236 40 164 -86 147
5482 147 135 -305 138 -36 -213 33 -325 -429 0 81 220 -45 275 -89 -206 -217 153 -193 -388 400 -29
5503 -29 114 401 -31 -542 236 -373 27 176 30 -105 226 253 -28 -65 -199 -113 -51 -267 148 341 -115 421
5525 421 -322 -149 175 -309 -210 25 -366 220 336 -18 -126 64 -161 -118 90 -31 339 -21 -79 488 -51
5546 -51 -70 -89 -224 -15 92 287 166 388 -215 50 -304 27 114 -228 -14 367 147 -322 258 -372 -149
5567 -149 53 -262 -130 5 -299 -193 293 -259 -105 63 -131 -92 -311 -264 93 -198 256 263 -94 104 -184
5588 -184 -463 -12 447 13 296 225 287 119 32 -71 -197 -181 -205 196 132 135 257 -21 46 60 -492 -329 -211
5611 -211 22 144 253 -71 326 -273 -247 -197 -215 -78 -10 233 293 441 -73 -132 165 110 -26 -277 116 165 -142
5634 -142 289 -137 11 59 -130 -134 28 -31 108 360 -40 65 301 -208 -562 42 -155 -145 40 147 -270 595
5656 595 -132 -46 -461 -340 -203 141 -36 250 14 61 95 -247 154 -62 -99 67 -117 -143 -95 376 26 -414
5678 -414 152 23 74 -170 -62 -273 31 -121 181 -221 53 59 -160 -159 -107 -201 -61 189 -87 -194 -92 -248
5700 -248 70 -152 21 -191 -150 -129 257 98 -366 -70 76 -111 196 -115 -259 146 -281 -43 26 -86 -1
5721 -1 -290 -153 51 -32 -345 9 -17 16 157 -71 241 215 258 23 -86 -19 35 17 -78 107 -88 43 -79 -251
5745 -251 -154 190 -473 -119 203 7 302 213 247 141 -19 89 -59 -7 -81 206 -34 -112 22 48 5 -20 -35
5768 -35 -67 102 -177 -82 100 -168 -128 244 -290 131 -91 -36 274 37 108 9 -290 -243 -192 -219 -93 374 6
5791 6 268 112 -371 -39 289 227 -112 69 -386 34 177 -139 -117 187 -139 94 84 128 6 -65 389 -432
5813 -432 -221 85 -244 -451 113 -25 158 -160 149 255 200 -489 -66 -19 -206 -115 6 190 2 48 -132
5834 -132 210 -380 -218 -171 153 185 234 71 -6 177 77 -298 -326 -142 -165 -111 129 201 -23 23 141 -30 -359
5857 -359 48 420 4 143 415 152 -183 35 -293 72 -202 104 -51 335 516 -303 52 272 -183 -234
5877 -234 269 -591 -64 99 394 -133 -211 6 -557 -83 -117 61 63 368 187 62 284 -192 -502 -143 -408
5898 -408 -118 -73 71 -390 156 -271 125 -110 -127 38 -354 -275 45 174 122 -8 -98 -102 -139 197 -189 -43 -30
5921 -30 264 219 137 11 -343 49 35 -175 -11 248 187 -110 -43 61 7 128 190 -230 160 50 -159 -58 -57
5944 -57 179 -23 0 70 -335 -321 96 374 -4 -136 85 -274 424 -19 -164 61 8 -219 -100 121 -105 -86
5966 -86 -22 -11 45 -96 90 -337 -30 70 15 -252 366 283 36 -84 4 -71 333 -66 101 -198 -27 173 26
5989 26 336 280 169 -48 336 -31 -35 356 46 -192 268 93 -300 -51 -301 198 -22 78 -354 -244 78
6010 78 355 23 45 344 -180 -41 138 -137 -165 136 -172 453 27 -163 24 23 -73 -73 190 -102 -127 -229 -27
6033 -27 157 -391 -20 244 284 283 -238 -169 257 -37 -280 -234 93 -154 276 91 -177 158 406 20 10 -261
6055 -261 -25 262 -409 -289 230 -410 167 -334 -305 -108 19 -174 214 -283 -97 404 -190 77 108 -189 219
6076 219 -286 -282 232 20 195 128 -66 -156 23 -214 63 -1 -35 67 275 -353 20 -87 -470 299 198 -184
6098 -184 145 35 -23 340 -17 -284 -73 -252 -223 101 10 302 172 -242 -310 -37 -535 85 -142 -165 373 -33
6120 -33 83 402 -324 -130 27 -52 26 160 -252 134 189 63 -42 -16 -322 -69 84 52 280 -300 -2 213
6142 213 -54 95 -163 -167 10 -116 -245 193 267 -85 152 -206 -420 186 -266 -280 197 51 103 167 -81 -581
6164 -581 -27 -80 -212 110 -22 189 -103 -291 46 -60 47 175 -305 -377 175 -143 -94 226 -171 -146 77
6185 77 -31 -72 133 -418 124 164 17 156 -225 33 -42 -64 -125 42 94 10 383 -174 33 167 -146 104 -234
6208 -234 -323 43 -238 46 312 -433 -265 33 -60 98 284 -243 -87 -107 48 -76 49 -243 1 -121 199
6229 199 -97 96 -28 34 -129 -41 76 -317 274 255 -217 438 327 13 366 68 -270 169 -69 -264 429
6250 429 -233 0 -249 -397 -193 -165 105 -280 -6 -51 159 -111 -271 86 -147 -15 150 60 210 101 -232
6271 -232 84 -103 -21 -192 -123 167 154 197 -192 128 290 45 -260 -6 129 16 223 -288 285 -124 -115 432
6293 432 -407 77 -191 -80 188 251 2 -1 35 -408 -104 -180 -39 -50 -113 168 65 260 -26 -163 -10 115
6315 115 -208 -201 335 151 33 -202 -13 -87 -131 33 -184 254 -71 53 238 50 -109 -99 -290 27 131 95
6337 95 47 358 39 -167 -211 -123 -134 -292 -154 103 65 321 215 253 -91 59 -352 43 -324 -59 160 -50
6359 -50 -173 -62 82 -399 70 -17 -62 6 177 208 353 441 -82 115 -224 -356 -295 -53 301 -246 501 59
6381 59 -59 -506 -13 -104 53 172 -467 407 131 -161 113 -108 -124 3 -145 272 9 351 118 -241 -269
6402 -269 -169 -64 115 -328 13 164 569 140 5 176 -239 -98 33 -104 -231 205 -123 -71 6 149 167
6423 167 -187 -323 156 153 66 274 -14 91 -206 -230 55 -122 -67 -68 -194 24 375 139 -66 206 -56 -108 157
6446 157 129 7 359 61 -171 43 -248 56 -70 197 74 -262 57 10 -128 -50 -37 -315 -124 27 -221
6467 -221 -94 158 323 -320 -63 -52 -276 -28 -112 -49 34 256 -52 155 -192 87 156 -110 -58 191 -48 94
6489 94 115 -32 232 -29 272 236 12 -123 182 -188 73 -66 -96 -234 134 -161 -128 16 -295 310 171 -148
6511 -148 -189 81 -94 201 41 491 -33 -203 201 -229 84 313 -145 -75 -8 290 32 356 -55 91 -158
6532 -158 -128 -92 369 84 -78 -100 -23 -62 -118 156 -110 -158 189 389 327 158 233 -39 24 -133 -202 -91 226 107
6556 107 -26 58 -165 47 -111 -51 -310 -100 316 -23 -236 62 56 165 -24 -49 -350 -28 -81 46 -12 -10 -85
6579 -85 334 -289 13 147 -323 71 135 -138 -40 -104 -250 -201 172 -8 -82 131 92 221 -15 152 -259 -238 203
6602 203 -381 -5 14 247 -94 175 -64 -281 287 -10 103 -14 100 -191 75 198 295 22 25 -71 -135 -42
6624 -42 -2 -44 87 487 -197 63 -192 14 -510 101 -27 -19 194 64 264 -519 -310 -301 -158 11 23 207 -152
6647 -152 14 -86 -42 -322 -161 268 -37 -25 29 32 291 144 70 -189 -24 -106 -4 226 73 284 313 -88 -228
6670 -228 79 -366 -156 -48 297 -22 146 -27 95 -48 258 -301 66 91 -169 9 39 13 67 -245 -176 -226
6692 -226 -83 -275 23 -51 16 76 -19 145 64 197 54 -309 260 135 204 380 -50 267 48 -160 -281 -212
6714 -212 -39 -93 -42 -15 133 -261 -390 39 29 -162 402 -193 214 175 -4 113 47 -493 -113 113 145 92 271
6737 271 -62 281 72 143 -120 -550 35 129 -239 1 143 11 14 -79 -26 -7 21 232 111 38 214 144 -61
6760 -61 -117 -140 40 159 226 124 71 -203 13 38 -227 -191 7 214 85 259 39 -5 -221 -167 65 124 -161
6783 -161 -63 146 280 -40 294 -21 -106 -58 -106 -7 261 -136 -23 323 224 31 -248 -82 -96 33 123 -97 -210
6806 -210 27 128 -192 -103 -143 -359 39 55 123 12 138 -266 -44 0 -77 -31 119 -92 -126 263 161 17 409
6829 409 -51 -259 -277 -33 50 59 53 -20 109 -175 -186 39 -3 -62 82 66 44 -60 -309 -164 91 -223 35 58
6853 58 -81 209 25 -137 16 123 -121 -9 -235 201 -54 179 205 188 -106 -219 107 -36 46 201 -81
6874 -81 274 225 40 -220 -348 -152 -485 74 363 241 -79 167 198 -206 -20 -175 42 49 81 -185 54 238
6896 238 -210 -76 -219 -73 -97 224 -66 -52 127 -31 166 162 -180 -130 -181 -5 209 95 251 248 94 118 60
6919 60 -222 -74 31 234 30 147 0 -31 -37 -181 212 29 -25 -4 -127 -68 314 312 -218 313 51 -107 -142
6942 -142 381 394 203 77 116 65 -12 -195 -161 -103 98 -108 10 174 53 102 -335 -194 135 124 168 187 160 237
6966 237 -16 31 -470 -106 -302 112 -282 -216 341 -123 28 -26 -214 -180 -30 -65 126 53 -44 -34 -227 -88 -113
6989 -113 -221 -322 -12 -23 -4 -62 4 85 -103 85 -46 -160 -176 246 -196 72 220 94 -103 -179 131 -67
7011 -67 -19 -282 207 137 6 90 114 -260 -181 107 57 -110 -43 602 -49 -134 -138 -389 -319 -98 -257 -112 289 29
7035 29 -128 -14 -79 130 -300 92 33 -5 334 -172 -411 147 -87 -244 119 125 -95 291 -21 118 17 -127
7057 -127 -137 182 -40 -187 -366 -72 103 143 -142 89 -161 -287 83 -291 196 71 -119 -65 -16 119 179 96
7079 96 -90 67 346 -104 152 214 58 -145 -136 73 -496 86 -115 -111 342 187 -331 160 24 -375 24 296
7101 296 242 -365 162 -146 -61 -3 -133 -71 -153 176 -19 -218 244 -112 -134 -102 16 -293 20 98 119 -5 50
7124 50 -56 280 26 -193 -142 40 236 -80 517 13 193 41 215 -64 109 -276 -186 123 -161 63 274
7145 274 48 -253 232 -336 -260 -250 140 54 113 -137 -126 217 -261 -79 110 -12 -177 -18 283 133 190 86
7167 86 90 -35 -173 -290 -25 205 122 -162 -64 138 -18 -88 49 -97 -98 21 -243 -17 -13 -153 -281 -198 47 185
7191 185 -57 93 99 160 -93 170 260 -42 -465 118 208 205 -155 112 -212 76 -77 -352 -211 -197 -47 56 290
7214 290 31 232 218 79 -88 237 10 104 102 219 188 -246 -293 153 -55 78 179 200 222 -281 320 83 -111
7237 -111 177 -251 93 -167 3 -200 100 82 85 -131 -221 161 -17 30 -257 274 -429 66 327 -247 -121 152
7259 152 -56 -209 274 326 -118 330 20 -214 -78 -103 -28 -97 69 335 -63 130 -5 -127 118 47 24 283
7281 283 130 229 15 -94 177 122 393 -172 -36 -104 -190 223 -280 123 29 -142 -362 155 277 -19 213 98
7303 98 -153 78 228 -296 -219 13 -213 -58 90 211 -25 125 34 -172 114 -174 54 7 394 150 -29
7324 -29 79 -14 63 19 -83 -343 -25 94 189 -126 162 185 110 3 -3 30 162 -162 51 112 207 -19 -199 283
7348 283 112 263 126 172 -124 180 -216 233 -63 -302 -97 32 -169 221 -150 -58 -2 -60 156 -65 91
7369 91 58 -83 112 151 33 70 -10 -151 -292 48 -141 7 346 304 187 -83 184 79 -175 56 -403 64
7391 64 238 -121 -220 45 -51 -45 242 105 -103 -102 311 -39 132 102 -5 107 29 -134 -164 8 64 129 114 -25
7415 -25 -10 81 -102 -106 -25 -220 96 -58 -36 174 290 -248 -378 129 260 -173 110 -98 49 -19 -50 -85 -52 -112
7439 -112 -190 152 52 -19 -262 254 -278 -163 93 -3 -248 23 187 -138 161 -69 -219 194 -54 -131 -353
7460 -353 114 -107 -116 116 49 67 -55 172 -272 -173 -143 -155 -125 148 116 -18 -142 76 -242 420 -92 -150 63
7483 63 -289 122 70 104 154 -56 302 -299 4 421 136 -134 -77 -239 -158 126 -67 -124 98 -112 130 -212
7505 -212 -202 -15 201 -79 -132 38 -43 -47 -113 118 -145 141 -53 170 114 150 -41 20 160 -55 -65 235 101
7528 101 191 257 265 4 158 -244 -74 241 128 137 10 -40 -135 -3 16 116 -113 155 -83 203 23 115 175 79
7552 79 54 -71 -56 -49 -75 -220 -87 140 41 122 124 -43 52 -116 -136 -194 -12 252 165 231 -116 -45 15 162 110 -134
7578 -134 -117 166 -197 -186 -96 109 -39 -1 -78 231 -8 44 283 59 -56 248 -57 111 -27 -156 84 136
7600 136 137 147 150 -56 -186 -380 -11 -161 49 97 -189 226 141 -59 -145 -115 1 53 261 287 -263 190 -6 -32
7624 -32 76 -438 -193 -340 333 236 68 62 121 31 164 94 -220 95 56 -183 192 184 110 -208 88 -374 103 117
7648 117 -29 156 119 73 25 89 -170 -121 -313 -56 -53 32 -52 52 175 -140 -454 -257 -74 159 176 -238 -424
7671 -424 256 -35 -132 -113 32 -180 -44 79 47 167 365 9 -341 238 77 -353 -87 137 -9 411 105
7692 105 -10 117 151 -203 -160 -305 -227 145 227 29 211 44 50 -6 -193 -202 -12 -308 119 77 246 -125 -62 -409
7716 -409 30 -115 234 105 141 179 17 -17 -433 185 -18 -316 155 95 -304 -90 80 -356 -31 81 -10 -54
7738 -54 151 -191 69 363 77 -190 65 -264 -326 -7 70 214 38 -345 -356 198 52 -102 -65 -22 0 28 128
7761 128 -98 3 197 -70 -254 60 -79 -345 66 -16 139 156 -113 -62 381 48 -317 -207 404 180 -338
7782 -338 6 -299 -401 -432 221 -53 137 90 -148 0 194 -177 74 226 -33 96 -95 -215 133 -116 -111
7803 -111 -64 -65 175 -20 -40 55 -162 175 -124 111 -271 121 -3 -45 249 169 12 189 -48 -155 87 8 -162
7826 -162 43 -203 24 -2 -3 -219 51 43 -59 222 183 232 154 342 -95 -98 56 75 -402 140 10 21 -46 5 -42
7851 -42 76 231 -300 -407 -118 -98 -90 86 136 219 181 -344 -107 -176 -146 8 239 550 43 228 -469 88 119
7874 119 155 -128 218 546 -28 74 -137 5 -128 0 -11 23 217 293 171 195 -75 -78 -146 63 -170 -2 -134
7897 -134 -97 152 337 284 -269 121 15 -369 249 146 138 147 209 118 212 279 -353 -195 -21 -74 92 286 100 -33
7921 -33 -281 188 -172 20 -101 -68 196 223 71 -260 -121 -321 -135 147 68 41 119 -19 118 287 -113 -171
7943 -171 20 265 -156 -19 -133 -43 32 309 129 -28 -29 -184 -126 103 -40 112 220 -30 -236 31 -245 62
7965 62 277 171 -138 -25 39 -149 101 77 -38 -19 103 51 86 204 444 19 -258 -158 -181 214 -34 27 0
7988 0 -18 139 -325 -431 -168 -134 -462 -286 -251 -49 235 372 -6 99 -162 92 341 -178 267 -48 -65 -120
8010 -120 132 -454 98 106 -246 -62 -33 -101 288 88 -447 -86 -152 -162 -420 239 41 -55 -54 -40 -173 -196 -89 73
8034 73 -28 251 34 3 -247 -138 75 -67 150 -270 21 553 167 64 -334 -192 78 -72 10 54 -288
8055 -288 -103 -360 20 -102 -90 -180 12 -249 -103 -66 129 -30 293 177 -97 117 -260 -17 259 -236 85
8076 85 -199 -205 -200 -244 -134 -35 139 126 34 -277 -307 101 224 258 -63 5 -14 -60 193 159 -16 8 366 -183 -84 -15
8102 -15 -326 68 136 39 11 -99 257 48 33 -390 101 -156 -47 300 127 418 -40 156 -68 -38 -357 -176
8124 -176 50 -111 -330 116 -34 -218 113 -353 123 102 -256 -3 -15 -68 175 132 -127 20 99 -110 -78 -79 -100
8147 -100 205 -248 175 -54 -268 314 315 -179 133 80 138 180 -107 -161 109 -253 35 201 7 29 -4 -49 50
8170 50 -301 342 -198 -60 -21 182 206 -112 36 65 18 43 -98 -169 58 -277 143 335 -508 -326 -118
8191a18
$$ Imaginary data points
##PAGE= N=2
##DATA TABLE= (X++(I..I)), XYDATA
0 0 0 0 0 8 -16 24 -32 40 -48 64 -88 112 -137 169 -208 248 -300 359 -425 505 -591 687 -795 919 -1057
25 -1057 1212 -1388 1575 -1783 2019 -2275 2557 -2868 3211 -3585 3993 -4444 4936 -5479 6073
40 6073 -6726 7446 -8239 9123 -10105 11201 -12441 13843 -15450 17312 -19492 22102
52 22102 -25273 29232 -34327 41171 -50887 65835 -91998 150850 -521294 194334 493104
63 493104 -645243 747947 15225 -286993 740966 -237456 -437255 254327 -553925 30127
73 30127 342977 -140590 555488 169287 -431556 340877 -138403 -409163 -38504 -473275
83 -473275 89235 592040 -134505 140984 289582 -173663 50862 -158150 -417233 43272
93 43272 33024 37275 280698 150653 121415 37188 -217898 -120180 -90613 -287080 -168811
104 -168811 209299 293807 125820 100066 -10615 -77328 61483 -212834 -341954 32707
114 32707 67200 194066 302603 -69470 87684 100571 -368964 -44118 -21833 -381097 105880
125 105880 171928 69199 437156 -11100 -252402 103962 -162446 -121789 -7352 -287596
135 -287596 173205 350870 -10684 178348 -18834 -237877 49133 -216633 -186466 170659
145 170659 -108113 87090 362721 2285 85636 714 -354072 -4244 22325 -219146
155 -219146 76852 88959 97926 301459 -41231 -153591 45125 -180473 -152632 32718 -82969
166 -82969 91004 220377 42921 112226 54288 -184317 -115432 -93897 -84522 75950 -9561
177 -9561 27772 267593 102957 -57231 -31177 -188491 -108582 43104 -110504 1577 171035
188 171035 65219 130624 84860 -112085 -57242 -128686 -151769 78884 17705 1216 156260
199 156260 43484 81022 88181 -213102 -135886 3967 -103396 55536 91918 -9595 164146
210 164146 102775 -59233 -5861 -125727 -143178 -3429 -37912 66008 134174 1978 86761
221 86761 86440 -90767 -61899 -99602 -133621 53974 66146 13038 101667 72087 29768 15721
233 15721 -99453 -111515 -55723 -51216 36092 87914 50790 82373 57230 -29485 -23990 -71691
245 -71691 -140180 -40021 41257 41206 89369 66346 16127 44663 -19106 -100493 -80501 -72981 -3655
258 -3655 75494 43591 75277 72918 -26309 -54 -31910 -127927 -43588 -16156 -12019 118626
270 118626 79622 7204 53320 -17284 -50591 -38868 -114002 -42090 41206 24335 101660 68229
282 68229 -17689 39741 -33818 -102576 -21950 -65251 -39960 91756 58626 54372 65543 -32844
294 -32844 -27093 -25568 -89503 -43312 -20967 5635 102129 67722 19814 35892 -36457 -59163
306 -59163 -28388 -72129 -43532 30463 42633 73965 66584 5932 -15877 -43322 -55305 -35662
318 -35662 -48618 -14642 58208 60372 58980 48196 -28505 -51065 -28884 -56468 -48682 1990 21235
331 21235 52571 78052 41093 -7023 -36555 -49886 -44715 -41380 -16348 21161 33128 61882
343 61882 68853 -1087 -34028 -29860 -62639 -44226 1981 -5578 24831 73636 49754 15429 -9377
356 -9377 -46356 -54902 -39872 -18184 2179 19973 54851 60909 20607 -812 -29415 -67551 -41023
369 -41023 -10471 -13717 17385 48700 45140 40815 11180 -38208 -53249 -41525 -22333 -2902 9609
382 9609 31664 49309 37370 16253 -12763 -52896 -56473 -23166 -4195 9210 32562 35856 30794
395 30794 32862 2231 -50568 -55881 -28972 -13857 7863 34576 32663 25160 29613 7724 -35322
408 -35322 -44343 -34250 -31137 2960 42819 30465 17407 33388 10236 -30853 -32326 -35148 -37792
421 -37792 4644 32429 18172 28922 40363 4511 -22882 -22664 -36806 -38338 -651 23518 19100
434 19100 28644 33228 6800 -8331 -13458 -44554 -45672 2436 21868 17101 29807 23782 5392
447 5392 5853 -11825 -41072 -35984 -14059 7020 28695 32611 21115 5935 -3453 -2832 -18287 -39156
461 -39156 -24940 47 19380 38118 27165 3745 -656 -7453 -16546 -23841 -26536 -4718 11523
474 11523 19867 39945 18793 -14629 -646 -13012 -35546 -6823 -6207 -11991 33668 36557 3272
487 3272 8127 1725 -21791 -20766 -14416 -12912 -1281 22392 31407 10303 4623 7091 -19779 -21124
501 -21124 -1389 -20006 -17103 26546 28975 12286 16477 -5127 -25076 -3092 -3519 -26910 -8736
514 -8736 13903 15625 26932 19865 -5027 -14538 -17946 -7923 -1446 -11913 555 11101 14099
527 14099 35665 8843 -30189 -9052 -9242 -14213 8277 -7817 1740 30049 5870 13523 8494
540 8494 -34641 -7435 -4935 -23164 26296 7033 -18196 39177 16678 -14240 3668 -28595
552 -28595 -15065 14127 -14384 8335 14610 1794 36096 -7066 -27966 20157 -29777 -26198
564 -26198 36368 -14571 -3362 38742 -11710 10655 21731 -40315 -18076 2190 -2931 16534
576 16534 -8805 918 31415 -527 4638 -4817 -39796 2923 6567 -16871 24164 12944 -10370
589 -10370 15112 8276 -2881 -12907 -29398 -5718 11046 14395 11938 -10550 6385 21851 -6586
602 -6586 -15667 -20169 -9724 10100 -3062 15413 20076 -12466 11328 2907 -22895 8853 -20805
615 -20805 -27369 30250 11568 9584 10551 -23817 23670 7581 -46255 8697 -12530 -15788 54605
628 54605 -14542 -13440 51500 -32848 -15539 27085 -44566 -152 13296 -24971 46614 14492
640 14492 -26860 21323 -23954 -2182 23834 -64474 3513 49652 -27059 31393 18762 -46498
652 -46498 30108 -2180 -48507 21612 -9435 -13196 35018 -1736 18615 15461 -45708 3041
664 3041 11007 -29681 6738 -5382 -7610 48811 11663 -24710 4762 -8131 -14853 -2214 -13783
677 -13783 -405 19255 6672 9349 16564 -7059 -18344 -12146 -14309 5948 10755 -17617 11231
690 11231 37968 -785 -6731 -10015 -28645 4902 2825 -20060 13697 16414 10211 16241 -14354
703 -14354 -2439 -2554 -40207 3633 17248 -14121 25175 9322 -11812 37347 -9158 -47232
715 -47232 3368 -6494 -3913 18968 -8497 15907 29146 -11516 -2531 -10873 -26658 4410 -10014
728 -10014 -7529 38206 9512 -10522 18773 -596 -16821 -10136 -25481 -7724 23512 10606
740 10606 3987 11400 6618 6756 -14193 -31353 -98 353 -16076 22842 21669 -2608 21313 -7162
754 -7162 -27661 12981 -17095 -30479 15609 6874 19373 25523 -19120 11250 8337 -39323 1052
767 1052 -11049 -21663 42587 158 -8209 52419 -17002 -27540 16690 -35526 -7190 19582
779 19582 -26456 23745 33652 -4999 15134 -20667 -18044 17301 -40026 -8536 36614 -18792
791 -18792 21801 35392 -27554 13378 1693 -49362 3467 4507 -9509 21141 458 15679
803 15679 30489 -19999 -14386 -6109 -24932 3740 4559 -4304 25233 15953 1110 4899 -8791
816 -8791 -14475 -17308 -14884 7611 14255 10434 8140 6911 12066 -3007 -20211 -19233 -12276 7966
830 7966 7697 1850 22825 8401 -2526 11667 -20468 -22323 3937 -19259 2371 32259 4104
843 4104 7187 5900 -4655 7652 -25328 -25373 9266 -10129 18309 33441 -20918 12389 23391
856 23391 -33250 -3787 -3198 -32154 13057 11333 5120 29529 -6885 -5283 9722 -22082 -1543
869 -1543 -9911 -31740 29459 23139 -6538 26611 -7693 -17212 19668 -23376 -24356 11055 -10722
882 -10722 12931 30020 -1851 7944 -3667 -21278 6889 -10468 -22349 7304 3578 15044
894 15044 28984 -4949 -12035 728 -8281 -7692 -11209 -8820 9786 11084 16283 16705 -8656 -10394
908 -10394 -1375 -13102 -8655 448 -7098 4465 26668 16408 -4306 -7563 -9338 -11000 -4536 -5338
922 -5338 -7513 5213 19009 18730 3630 -6412 -7288 -15637 -9996 5092 -8508 -6060 22054 13253
936 13253 5642 12720 -16434 -23463 3489 -4859 -11012 5135 5370 11745 20252 6006 -8977 -17052
950 -17052 -12844 -1703 -6287 -1519 10381 5776 14164 19194 -6955 -16948 -11248 -13760 -2457 5154
964 5154 559 8409 14375 13341 6905 -14660 -19542 -7765 -9281 243 11225 1110 9338 20538
978 20538 3299 -6740 -10177 -20607 -12022 2660 5675 6373 7425 13914 12499 -4088 -10669 -15757
992 -15757 -21457 -851 12021 551 11014 18607 2933 2055 -1240 -22061 -20827 -3105 2983
1005 2983 7210 13650 12149 4959 4261 1331 -17806 -22906 -6115 -1032 4359 18393 11536 2795
1019 2795 9034 446 -15503 -15597 -14614 -8209 7637 15403 13993 9152 4972 1197 -8749 -17893 -15042
1034 -15042 -9305 1043 15794 17835 9449 6042 1062 -8933 -14040 -14365 -12217 -3019 12958 19206
1048 19206 11853 6269 2457 -8058 -14046 -11414 -12919 -8691 9866 18785 12122 11381 5658 -11041
1062 -11041 -12906 -7826 -15966 -11107 9149 14196 12982 17763 6184 -11517 -10633 -9449 -17340 -8875
1076 -8875 7012 8288 13702 21585 6597 -9117 -7449 -12745 -17065 -5334 2120 4239 15138 19452
1090 19452 8546 -2893 -8291 -14001 -15659 -7205 452 2990 12501 18736 11185 2250 -6354 -15377
1104 -15377 -15888 -9131 -1908 4905 9538 15522 15065 4044 -5223 -11814 -19013 -12273 227 3391 7896
1119 7896 15593 13458 4353 -489 -8510 -19607 -14383 -257 837 5700 17711 10599 3099 7049
1133 7049 -6518 -20361 -11641 -5419 -3287 9476 15714 8573 6876 7988 -4980 -17607 -12438 -8481
1147 -8481 -7401 9995 17555 6037 8698 8955 -7647 -11582 -8935 -14969 -7178 9824 12600 9578
1161 9578 9552 5722 -3320 -7817 -9041 -14061 -9223 5465 10116 10243 11539 5118 -2281 -5083 -8955
1176 -8955 -11700 -10508 -2152 10148 12343 10861 8165 -1948 -6471 -5606 -11027 -12428 -2748 6342 10912
1191 10912 11635 9743 636 -8002 -4777 -7767 -13654 -2586 4080 3867 15106 13942 -1855 -4846
1205 -4846 -3261 -9105 -10439 -4965 -336 2591 12849 16111 615 -3068 669 -12988 -11600 1369
1219 1369 -5887 -1488 15823 10644 4786 5293 -6689 -12383 -6192 -4288 -4413 -1031 9021 13229 6111
1234 6111 3845 -1197 -12063 -7993 -3213 -7764 -58 8829 5841 8919 9339 -1514 -8034 -9728 -7795
1249 -7795 -2032 -2225 1801 9794 8029 8651 5081 -10626 -10101 -2603 -10131 -3927 7755 4225 8461
1264 8461 11497 1491 -2153 -7345 -11488 -6309 -4730 3918 8879 584 10650 13220 -8218 -6212
1278 -6212 -3809 -15533 -2209 5586 -2506 8553 13430 3796 164 -3928 -6049 -11308 -10276 4058
1292 4058 4389 2676 14257 5590 -1790 5382 -9648 -17767 -2174 -815 -1100 8641 9685 7187 5413
1307 5413 -1356 -9104 -9487 -5905 -5321 -1315 7978 10867 7576 2571 432 -1486 -11942 -10767 -2313
1322 -2313 -4352 6513 13662 1303 7517 9419 -10979 -9536 -6275 -9650 960 975 6349 16774
1336 16774 2670 2795 1658 -17275 -3890 -2301 -16538 8474 14073 216 13247 4036 -6032
1349 -6032 -497 -15135 -9750 1848 -4950 10284 9632 -401 17704 -1128 -18213 2075 -10704
1362 -10704 -11881 9805 -1899 5662 20194 257 -1221 160 -11900 -7883 -9152 -2736 11400
1375 11400 3093 7111 13117 -2461 -865 -4432 -19353 -5424 4703 -271 5439 9533 9729 4031
1389 4031 -4726 -5675 -10039 -9850 -798 482 5667 11601 6344 3676 -895 -3220 -6262 -16372 -4865
1404 -4865 7859 1662 9013 9662 -981 6242 -2285 -15686 -5384 -6586 -1387 9394 3119 11225
1418 11225 8841 -8143 2812 -4367 -17239 1283 -5378 -3371 22376 4011 -3278 10537 -5745
1431 -5745 -6224 -3387 -14294 -628 4233 3514 14955 504 652 8035 -15221 -7657 4529 -15614
1445 -15614 -221 14344 1459 11234 5973 -9775 -603 -4209 -8585 -3331 -6381 7499 13855
1458 13855 229 5709 2307 -10354 -1199 -4621 -10175 2928 3043 2173 11508 6196 -995 -4568
1472 -4568 -7758 -2448 -2432 -5528 947 5366 7361 8965 387 -6475 -2931 -2766 -7627 -2986 2870 1679
1488 1679 4645 9156 3163 -2602 -4505 -6700 -4670 -598 1278 -23 1592 10547 7755 -6379 -3186
1503 -3186 -2536 -8950 405 2866 -4746 5217 9464 186 1603 1243 -7556 -7218 -1495 1439 21 1541
1519 1541 5039 3345 3638 3003 -7746 -8854 820 -411 -1755 3640 3294 2784 4625 847 -4301 -5061
1535 -5061 -4100 -2416 749 2994 3114 1552 1684 4376 389 -7676 -4568 -772 -2167 3453 3726 -1623
1551 -1623 4307 4901 -2289 -2847 -4082 -4444 -947 219 4925 3720 -1502 5517 1193 -5441 1189 -5003
1567 -5003 -8559 6562 4089 -2268 5468 3101 -704 1501 -2666 -4510 -4838 -417 4923 -1090 3230
1582 3230 7472 -4833 -639 5329 -8973 -4582 3119 -4160 3495 7367 -670 942 2164 -1441
1596 -1441 -2900 -4964 -2211 143 -586 5846 4275 -815 2972 -1008 -4823 -724 -3199 -3252 2254 3257
1612 3257 4622 3041 -588 703 -1845 -4747 -927 -1871 -2421 4361 4809 1793 2438 1030 -4189 -4635
1628 -4635 543 -2658 -3713 4401 4147 886 5695 1196 -5761 -2339 -906 -3578 -1870 2399 3034
1643 3034 1667 5019 3885 -5530 -3248 -158 -6141 -730 5020 -1636 2549 7606 857 -2081 -2398
1658 -2398 -4334 -3990 -948 2962 812 602 6819 2067 -2779 457 -5366 -7755 2229 966 -295
1673 -295 4885 1960 2189 2596 -2667 -4331 -4827 -3600 3280 2048 1211 4461 1755 66 905 -3116
1689 -3116 -6422 -3465 854 2873 2441 3910 1982 -1516 1865 -856 -8283 -3620 865 155 4909
1704 4909 5494 -477 -926 1729 -923 -5900 -3885 -574 -1114 4516 7884 -1144 -1875 2462 -2638 -3704
1720 -3704 -1350 -4369 -2320 5380 6287 1217 -860 849 -2428 -4214 434 -3466 -4748 5420 5951
1735 5951 921 2771 -1439 -4993 -503 -479 -3622 -2315 1364 5164 3957 1956 -337 -5265 -2868
1750 -2868 837 -2400 -2388 1031 2284 4119 4083 -333 -3813 -4645 -521 512 -2844 -44 2507 1642
1766 1642 4849 2306 -5043 -4519 -754 -987 -609 835 882 1168 3591 4489 -3198 -5565 -1190 -2368 21
1783 21 3995 -592 -1296 4765 3375 -2347 -3585 -2697 -3057 -10 3815 542 -1769 3775 3191 -2194
1799 -2194 -250 -2123 -6119 214 4816 360 69 1879 597 99 615 -3436 -5780 -641 3652 1313
1815 1313 568 2502 -476 -839 1198 -1960 -4958 -1472 1471 2296 2601 1644 -1774 -1250 1856 -321
1831 -321 -4299 -2220 671 1674 3128 2228 -647 -1218 778 219 -2897 -2067 238 -554 2076 4724
1847 4724 -1109 -3154 525 -616 -1570 -356 -1174 -807 2753 4605 125 -2988 384 -222 -2788 1135
1863 1135 504 -3173 2337 4144 -501 302 -171 -3740 -654 2181 -257 -1969 662 3231 980 -246
1879 -246 302 -2536 -2260 2351 -203 -1864 2059 1034 -109 2448 450 -2968 -1927 50 860 93
1895 93 309 643 306 1885 1528 -2434 -2581 295 203 186 1459 739 -560 1024 1603 -915 -1627 -23
1913 -23 -657 117 1761 1264 -1598 -194 2605 174 -2186 321 -926 -1688 3275 1414 -2781 1995
1929 1995 2323 -2503 1094 946 -2944 -1162 1827 1320 -37 363 949 -1720 849 2794 -3990 -2678
1945 -2678 3852 -784 -851 3283 -1766 -1365 3634 -258 -1349 182 -1545 240 1053 1565 1300 -2462
1961 -2462 714 2963 -2301 -1251 658 -2877 1467 3947 -1055 76 819 -1018 255 -428 -1067 -889
1977 -889 -1390 2558 3154 -1372 -71 753 -1516 1014 719 -3799 -958 2750 1192 720 1005 -235 -1527
1994 -1527 -78 952 -1878 -2357 1385 1726 714 2886 34 -4133 544 1814 -3864 -1075 2054
2009 2054 -1317 2437 4976 -2240 -2672 873 -1548 -1538 406 -428 -882 1566 4038 977 -2734 -797
2025 -797 -772 -2360 1505 263 -3321 2682 3954 148 662 -1667 -4327 -323 505 -914 913 163
2041 163 2251 3381 -425 -1361 -2021 -4667 394 2897 -1403 870 2586 403 2625 370 -4703 -3030
2057 -3030 -500 1001 1558 -731 1776 3036 -811 1893 -404 -7480 -334 2183 -2545 3947 2814
2072 2814 -3603 3012 3083 -4115 -3379 -3207 -1555 2413 1443 2825 325 -1005 4288 -1956 -6358 876
2088 876 -3370 -2504 7653 1246 -1415 3571 -2058 -1693 1361 -4539 -3222 689 2395 4469 282
2103 282 -640 2089 -2902 -1050 148 -5963 -527 3724 727 3534 2555 -2258 -740 -1101 -2185 -1663
2119 -1663 -3632 129 4776 2217 1876 419 -3248 -1622 -24 -3134 -2635 1221 3247 2055 3074
2134 3074 1578 -2708 -2490 -536 -2253 -1265 875 587 2069 3832 2287 -2801 -3415 95 -1973 -2741
2150 -2741 2430 -611 462 6518 -23 -2731 1233 -3296 -3619 1455 -402 -113 2064 2227 3135 -801
2166 -801 -1887 -1134 -5015 505 3202 -3249 1719 5398 -1046 1646 803 -4926 -1414 -283 -1407 2173
2182 2173 994 1432 2746 -406 991 -516 -5013 -542 945 -1105 2493 1606 652 2656 -82 -2056
2198 -2056 -1811 -2299 84 454 62 2841 1975 -394 1394 -702 -3353 -828 -870 -1012 1981 2954 405
2215 405 478 2276 -837 -2546 -623 -1269 -1454 1751 2169 543 1270 2013 -570 -2775 307 -548 -3573
2232 -3573 1158 2928 -719 2662 2247 -2888 70 274 -3748 -414 987 423 1566 725 1768 336
2248 336 -2081 288 -1071 -2396 2230 -318 -889 3889 1309 -868 784 -1294 -1019 82 -1221 700
2264 700 94 408 3102 -661 -591 1787 -3112 -2304 1869 -1370 -108 2346 434 1615 1379 -1458 -1097
2281 -1097 -1600 -80 533 -1193 1082 2599 -305 1189 1414 -2329 -1255 252 -1077 -586 1588 344
2297 344 157 2596 1531 -1603 -1701 -41 -1325 -1199 1648 330 -32 3005 1383 -1703 -880 -906 -2150
2314 -2150 -423 1784 -42 197 2251 850 146 -341 -2299 -2462 -131 978 858 30 1475 1924 -207
2331 -207 -165 -930 -3138 -1486 1220 -236 645 2308 761 487 792 -1124 -3253 -2146 95 821 503
2348 503 2052 1462 -171 905 -707 -4013 -2187 -64 -475 1400 3150 465 -21 1289 -238 -2806
2364 -2806 -1710 -1015 -1190 1417 3072 633 -106 1608 -231 -2997 -1388 -1451 -2249 1643 3389 684
2380 684 1334 1503 -1484 -1691 -795 -2538 -1735 984 2536 1951 1163 1466 -881 -2145 -705 -2010 -2300
2397 -2300 1097 2308 1705 2295 1373 -1070 -1315 -1264 -1533 -1915 -501 1571 1740 1881 2214 -613 -2399 -866
2415 -866 -1842 -2366 161 1354 1346 2260 2270 -712 -1967 -1252 -1462 -2585 215 1281 213 2236 3037 -719
2433 -719 -1333 -699 -2578 -2127 1099 666 11 2299 2814 -417 -544 -49 -3167 -2081 1121 56 89 2749
2451 2749 1930 -96 429 -364 -3065 -2363 430 -176 563 2567 1255 -21 913 -522 -2480 -1271 -588
2468 -588 -81 1077 1936 1542 27 3 342 -2188 -1695 -473 -920 952 2355 995 542 393 -469 -554
2486 -554 -1831 -1083 23 -435 2145 2583 -297 187 779 -1813 -832 23 -1181 -102 2318 1671 228
2503 228 521 232 -1985 -991 525 -1272 -1100 2108 1033 135 2178 -615 -2528 721 563 -1880 -57
2520 -57 1623 437 1105 2317 -1165 -1779 341 -174 -1479 403 543 -238 1065 2348 -231 -1688 270
2537 270 -194 -1122 1177 382 -1601 1643 1909 -429 217 -1121 -1157 727 -21 222 -62 -82 1727 879
2555 879 -662 77 -995 -1083 1416 357 -962 -79 -69 1249 762 -775 -373 -699 -199 2269 -671 -1422
2573 -1422 1601 -367 93 2303 -939 -1579 958 464 -248 587 -194 -454 981 1747 121 -1700 -53
2590 -53 608 -746 339 183 -1532 664 2280 -709 -913 452 -964 -816 1437 155 -1568 713
2606 713 1418 412 807 -959 -1370 -245 600 290 -1055 -596 1617 1097 173 720 -1261 -1122 1166 -435
2624 -435 -569 944 -716 603 1605 -217 -356 -1482 -1199 1986 15 -1468 1442 -619 498 2839
2640 2839 -2189 -1996 1270 -1060 -186 1344 -842 599 767 502 1014 -2306 -1568 409 -1419 1455
2656 1455 1858 -3170 1127 3244 -1661 -288 -536 -2748 1173 1451 -1121 262 361 399 428 -1386 216
2673 216 -1023 -2383 1548 1360 -1033 1145 2 -1445 2299 -249 -3245 -258 515 512 796 -277 -103
2690 -103 507 -287 -410 -925 -1656 596 108 -81 1850 469 -2140 878 675 -1564 -882 -368 -345 1768
2708 1768 1304 -1135 -548 -40 432 -796 -1696 827 514 -941 1905 877 -1604 442 -484 -1902 1868
2725 1868 16 -2315 1422 1577 505 25 -1519 413 362 -1211 485 -872 -618 2776 -771 -1359
2741 -1359 1977 -1462 -1957 1392 -597 -594 1066 -1007 456 1667 -1075 -659 -1152 -175 1910 -1181 -605
2758 -605 2026 -334 39 974 -1460 -601 921 -832 608 849 -313 -237 -257 522 465 -1277 -1290 1393
2776 1393 -155 288 1087 -1024 193 1638 -1327 -1543 980 -348 -797 1327 428 -80 -155 -774 -18
2793 -18 3 -29 110 -632 857 1782 -1443 -582 1604 -1275 -630 1526 -1421 105 1830 -1396 6 1294
2811 1294 -904 -300 -293 269 1104 -856 -485 1551 -837 264 456 -2524 859 1654 -1690 1120 1403
2828 1403 -1012 1002 -229 -937 663 -1219 -551 1489 -58 1159 803 -2000 1072 752 -2236 -19
2844 -19 342 -543 1749 746 -651 165 -549 -469 60 -823 626 9 -738 2278 724 -1556 523 -62
2862 -62 -1116 986 -345 -1305 1651 1402 115 222 -371 -819 -264 8 618 131 -38 1591 344 -275
2880 -275 564 -1759 -1600 1717 233 -936 1702 241 24 1777 -617 -1681 -406 -124 218 133 23
2897 23 1030 0 8 1204 -986 -1619 233 -325 222 2010 -624 -110 1529 109 -472 -998 -1266 564
2915 564 653 385 1061 107 -114 1195 -715 -926 177 -609 -71 2048 713 -759 196 61 -272 -365 -728
2934 -728 -964 -229 1404 1360 -567 -215 499 -897 -606 352 -1482 -831 1963 745 -283 950 -758
2951 -758 -1295 756 95 -1643 -104 741 1069 724 428 -55 -1145 52 753 -1547 -423 1218 -634
2968 -634 663 1806 -1184 -1046 340 -375 47 -150 -678 -10 648 797 -17 -1354 -306 777 -891
2985 -891 245 135 -564 823 1075 -86 -174 -373 -791 95 -193 168 73 -866 1089 1029 -995 -36 -68 -1122
3005 -1122 578 501 -757 -14 911 -27 -43 125 -666 -615 -22 748 -414 -487 519 -113 -102 1139 -539
3024 -539 -1152 582 121 -809 287 279 -852 294 730 -890 -763 623 -162 -225 427 66 -726 93 717
3043 717 -719 -364 526 -337 -387 478 -143 -701 160 576 -251 467 -51 -591 -294 114 79 -384 -201 552
3063 552 287 -184 354 -508 -672 384 272 -754 135 441 -132 253 622 -151 -796 168 179 -1044 256
3082 256 765 -718 -139 1221 -428 -444 89 -213 -783 435 646 -274 621 1176 -306 -272 67 -789 -819
3101 -819 722 449 -345 1025 651 -404 -125 -25 -987 -661 416 499 -239 1042 361 -25 -38 -175 -862
3120 -862 -479 -125 -21 608 959 425 -119 425 431 -906 -992 -160 -89 319 1269 861 -57 68 181 -439 -888
3141 -888 -247 -177 -184 970 1219 -494 -8 362 -1324 -352 -57 -966 64 1514 560 29 299 -58 -958
3160 -958 -732 292 -551 -238 1376 922 -50 730 -309 -1558 67 -121 -1002 635 983 714 760 898
3178 898 -455 -804 -269 135 -440 -61 748 416 549 1097 -572 -1280 -83 -486 -798 675 481 353 803
3197 803 1080 40 -641 -789 -388 -97 200 582 512 285 937 274 -1193 -496 -584 -1065 341 773 -450
3216 -450 592 994 66 -282 -548 -756 -1056 -95 1042 31 -57 1242 106 -771 639 -797 -1091 814
3234 814 279 -74 729 538 -131 292 -280 -709 -630 -18 862 190 125 1000 -591 -107 783 -1074 -729 528
3254 528 -392 252 1082 -77 21 -36 -578 -628 -694 -179 10 -328 565 901 -483 -116 627 -1129 -435 427
3274 427 -685 346 769 -35 224 292 -399 70 -698 -103 255 -665 455 1155 -659 -54 732 -991 -85
3293 -85 303 -1285 -194 815 -62 264 452 108 -144 -715 -78 -49 -620 404 575 -677 787 333 -1147
3312 -1147 249 359 -1149 120 323 -829 547 219 -209 351 -11 -51 -67 -993 441 -78 -1221 739
3330 739 364 -273 929 -17 -1075 873 110 -899 562 12 116 300 -32 248 97 -1120 587 -93
3348 -93 -298 648 -45 -440 1304 322 -976 296 -471 -216 -109 263 -61 584 336 221 37 -688 12
3367 12 -502 -905 1271 289 -617 1272 415 -787 509 -458 -1244 390 217 -439 512 225 567 267 -229
3386 -229 255 -690 -895 834 -117 61 1600 -350 -335 1061 -778 -1367 213 -235 -17 1067 378 398
3404 398 428 -180 502 -680 -1147 1034 -238 122 1822 -657 -297 901 -877 -536 132 -1337 -141
3421 -141 1080 348 403 -313 -117 448 -977 -1048 279 -772 372 1721 30 196 813 -1022 -459 375
3439 375 -1500 -451 573 372 1451 -14 -271 439 -913 -475 244 -1388 266 1567 -292 1021
3455 1021 871 -1491 -28 321 -1035 72 70 -284 1168 972 226 -264 -1528 124 410 -1220 190
3472 190 804 -508 1613 666 -1290 -311 -595 -1121 307 150 -322 652 394 924 115 -888 -438 -98
3490 -98 -909 413 242 -214 1424 784 -457 266 -757 -1012 282 -195 -92 604 142 796 579 -372 -237
3509 -237 -1323 -1044 916 305 -614 782 666 -102 429 -418 -1141 -582 104 -143 565 505 25 137 244
3528 244 -4 -949 -797 321 -51 418 712 -392 -551 931 368 -994 -445 -544 -319 875 401 -275 50
3547 50 210 426 -368 -306 -248 -264 -231 1303 2 -744 291 89 -539 451 -550 -556 586 73 330 123 -194
3568 -194 359 -142 -862 -126 -785 -580 1167 -222 -441 838 -609 -64 713 -223 -434 50 -233 417 224
3587 224 -55 47 -706 175 640 -571 -125 714 -593 526 924 -1000 -40 511 -224 102 219 -345 65
3606 65 271 273 18 -160 492 135 -352 177 -193 -875 539 419 -266 289 726 -551 196 273 -308 -585 36
3627 36 184 111 23 236 212 -206 127 109 -889 321 -11 -325 253 341 -326 289 110 -8 -208 -451 222 -34
3649 -34 396 662 60 -152 498 -311 -569 225 -221 -806 228 535 -62 186 160 -616 -697 -328 -242 -161 190
3670 190 729 140 49 246 -565 -556 311 -395 -582 444 386 201 359 183 -395 -445 107 -177 95 41 269 424
3692 424 630 152 -502 -592 -176 -454 -329 273 275 79 493 542 -306 -728 -347 -825 -88 289 280 136 661 460
3714 460 -125 -373 -519 -674 -502 367 254 -271 376 190 -3 -315 -478 -725 -363 484 191 271 371 477
3734 477 -209 -397 40 -923 -280 421 6 88 755 -146 -505 394 -388 -633 -237 207 281 572 483 43 -284
3755 -284 209 -202 -998 -504 236 -350 95 788 -108 -452 -70 -491 -529 39 -159 8 11 699 256 -611 -9
3776 -9 -93 -457 -2 170 -607 224 890 352 -182 -453 80 -243 75 63 -224 415 993 311 1 242 -510
3797 -510 -484 -47 37 -92 57 598 70 227 321 -625 -720 240 -88 -89 229 213 6 370 333 -617 -368 220 -214
3820 -214 -359 557 160 -728 277 540 -340 -354 294 -7 -186 383 312 -14 12 453 16 -182 262 -155 -348
3841 -348 640 -46 -402 349 289 -78 16 -34 -424 97 97 180 -39 41 243 -92 115 168 -321 -428 195 78 -98
3864 -98 416 169 23 433 442 -335 -725 230 209 8 262 158 -268 130 361 -347 -132 204 -252 -184 -61 99
3886 99 -589 -80 524 75 -8 -77 -231 -470 134 475 -451 8 -6 -301 236 483 -317 -320 273 -214 -71 442
3908 442 -112 -248 185 172 -237 -348 43 -47 -188 413 544 -303 317 696 -556 -244 36 -840 94 477
3928 477 -174 -96 210 112 -283 -614 -16 -94 -243 187 204 -251 521 392 -458 -90 86 -538 104 -80 295
3949 295 222 326 -166 -329 215 -6 -537 -416 391 -137 -157 380 34 -294 339 -9 -579 -205 183 -79 -28
3970 -28 506 39 -277 -222 -26 -352 -320 -299 -31 66 820 59 -538 62 -19 -288 -208 294 -435 482 234 0
3992 0 301 -279 -616 -291 -342 267 -184 301 822 136 -287 233 -498 -580 323 -383 -179 190 260 319 147 -276
4014 -276 -227 -423 -179 549 4 -359 419 -55 165 359 -317 -442 429 -17 -154 350 -56 -9 123 281 -126
4035 -126 -460 -42 171 -170 363 291 -456 284 468 -562 -402 -270 -735 140 909 13 92 286 14 -136
4055 -136 -324 -249 12 -119 463 341 -83 291 247 -75 310 519 -489 44 345 13 270 -38 -297 340
4075 340 -356 221 53 -211 -42 376 -34 188 163 -708 257 20 -381 131 196 -81 251 -11 -225 -68 39
4096 39 415 -302 -635 250 281 -87 384 296 -433 204 -257 -482 131 -84 -175 170 400 26 -519 -364 290
4117 290 -123 -64 -128 -313 -141 341 -148 -142 135 -108 -149 285 -18 62 -140 181 32 -7 233 -213 -102 83
4139 83 84 -138 -366 -130 -351 -642 222 65 -115 202 520 -406 32 45 -50 166 294 -89 83 -36 225 -47
4161 -47 -276 204 -394 -194 347 3 -378 701 97 -122 56 7 -69 20 -17 -109 0 414 286 -157 -177 458
4183 458 -376 -178 268 -95 36 419 91 -185 320 -480 -152 98 -106 22 7 424 429 -142 -167 33 -174
4204 -174 -49 208 -203 78 488 -278 -279 205 -249 -389 -182 -200 3 -174 122 373 -87 -19 188 -758 -135
4225 -135 -85 -271 379 681 -47 -43 247 -437 -274 -478 -329 -19 -5 444 149 -249 199 -190 -520 -58 -20 -216
4247 -216 312 422 -172 181 383 -200 -336 -363 -184 48 333 329 92 -302 574 -124 -487 -203 -380 -173 291
4268 291 162 107 233 358 -29 149 50 -49 -243 97 750 -289 36 203 -297 -249 79 -313 147 321 171
4289 171 195 231 -31 -154 119 -100 -141 -163 122 584 174 182 -213 -76 209 -182 -452 -161 -92 369 -88 365
4311 365 -31 -414 -84 76 -106 -232 311 -214 329 371 272 200 -138 30 -372 -144 363 -19 -11 343 106 -143
4333 -143 -102 -305 -311 440 452 -37 118 160 253 44 73 58 -500 74 553 -248 -335 221 0 -70 279 -245 -144
4356 -144 -416 512 60 275 317 2 -456 202 -17 103 35 242 -218 7 178 -347 -177 437 -282 -313 -77
4377 -77 175 -154 85 -318 -209 -298 61 128 -274 207 -136 -242 463 305 -281 -115 208 326 -43 21 236
4398 236 -106 117 460 -444 -284 -47 315 -37 96 9 -243 46 295 -297 -140 170 -213 112 126 -531 -54
4419 -54 -136 157 -219 -52 52 -200 -82 183 180 -321 -221 -169 -368 -5 17 -280 346 64 101 -91 -356 -121
4441 -121 -42 -17 188 -242 22 435 277 -187 166 -629 285 348 72 184 101 312 259 184 213 -175 -433 193
4463 193 239 -89 97 71 125 -53 87 -350 -426 44 -47 -192 -7 511 -39 -19 330 24 -401 -20 -299 -291 164
4486 164 3 -112 -130 168 -76 -345 -10 -196 -261 309 34 52 52 -201 -522 -69 7 -206 -107 2 321 -159
4508 -159 -70 197 -393 -140 104 -41 -66 356 451 73 85 -33 -97 -188 83 113 -47 63 325 -246 -52 8 -300
4531 -300 -360 -251 -270 97 22 164 243 213 269 -532 70 77 -322 -376 105 119 26 455 208 -321 94 -85 -356 -12
4555 -12 261 53 1 290 259 -140 -303 -303 -622 73 782 -23 -191 437 397 75 157 -186 -385 -105 204 -277
4577 -277 -15 131 179 -192 92 -225 -354 -319 284 15 -69 381 -287 -39 -195 10 -276 0 191 -86 184
4598 184 50 -168 -217 -2 -109 -297 -320 294 -290 57 519 100 -174 78 -180 -234 248 7 -68 349 439 60
4620 60 46 74 434 103 215 364 25 496 325 -162 23 176 -398 -15 212 88 -295 11 -227 -41 -114
4641 -114 -178 -49 -219 -33 217 -23 -182 -84 -197 158 332 -334 41 80 92 -67 178 -183 -122 -33 322 -74
4663 -74 -50 307 218 -143 190 -94 -245 109 283 -183 42 175 -158 349 291 -357 -51 -82 -450 368 -130 -150
4685 -150 448 9 46 229 -511 112 -7 -282 330 79 -506 293 36 -179 -48 -101 -371 -16 115 381 107
4706 107 -293 272 39 -521 424 138 -74 446 245 -44 -185 -81 -95 -90 -274 1 79 -2 242 105 -97 260
4728 260 -70 -352 348 -47 61 349 108 120 695 41 -499 -48 55 -219 -28 347 616 7 403 -49
4748 -49 -234 -315 331 -135 -365 180 -190 -53 40 -268 -279 -386 -483 110 171 58 364 344 273 262 -213 -98 -55
4771 -55 -253 -164 652 -84 377 559 -21 -320 177 -404 -88 132 152 14 -44 19 239 -241 -108 107 -305 77
4793 77 396 -61 190 594 -246 -260 -5 -70 30 300 -197 420 407 225 74 -211 -535 -37 -502 20 342
4814 342 290 236 206 -204 84 139 -415 -214 252 -302 374 -227 260 155 -328 -187 1 -770 381 330 -372
4835 -372 233 479 -310 376 -170 -766 187 -224 181 294 -69 -62 398 -389 9 82 -675 273 65 -358 610
4856 610 -33 -306 336 116 -376 -161 -359 93 -146 -363 206 223 -153 407 140 -589 108 2 127 101 -61
4877 -61 -243 366 -8 -340 -245 -344 -438 458 77 46 43 -213 43 -172 -220 107 -353 -215 167 35 186 -22 87
4900 87 -61 514 149 146 -176 22 236 -214 38 483 -333 29 74 -16 -122 43 178 -84 -82 -170 -224 68 70 48
4924 48 156 -168 37 -187 -126 81 -170 37 565 -155 66 26 -440 -278 190 -302 134 -115 -82 251 157 -93
4946 -93 -203 78 329 60 136 -31 -49 40 -13 -41 -414 -24 -51 65 30 149 -26 414 67 -146 -192 -203 130
4969 130 121 7 -47 206 82 -101 194 -322 288 -267 -464 227 45 -163 -105 57 -230 -239 -122 -274 -368 -356 -36
4992 -36 235 -185 277 133 -389 -209 -137 -375 -225 326 -152 -71 278 -226 4 -250 -163 -270 -373 -43 288
5013 288 -134 451 256 -276 96 154 -295 194 7 -141 266 186 -216 -146 -283 -78 181 -46 194 -122 115
5034 115 188 19 -16 -115 -281 -126 70 114 176 393 360 -97 -301 -80 122 -358 -217 87 -218 144 207 -193
5056 -193 14 -101 -592 -461 268 29 103 201 419 45 -144 -45 -295 -175 29 394 -308 -19 59 130 156 24
5078 24 -258 -292 -236 21 29 121 -128 -45 183 75 55 -347 20 151 -158 385 608 -104 6 112 -403 -109 33
5101 33 36 -79 254 -94 -204 -46 -225 -280 -322 -70 -18 -47 49 159 475 107 261 -359 -104 168 -146 -15 30
5124 30 18 -12 -137 -64 14 -65 82 128 -353 392 -69 292 219 -86 255 -314 -66 -48 107 138 -8 127 516
5147 516 174 -238 8 -369 -177 225 -169 72 -204 -4 -50 -64 -196 73 -73 83 315 -406 31 85 -76
5168 -76 -59 241 -182 -166 4 -16 -229 -195 103 188 74 -13 4 57 6 -107 -36 8 -132 -209 396 272 136 -336
5192 -336 35 308 284 -263 -176 -110 19 339 -78 -327 338 24 -148 92 30 -184 -39 278 37 53 6 272
5214 272 -100 -66 -126 -459 35 415 294 -55 367 347 -54 90 -129 -300 -264 151 374 221 191 90 -258 100
5236 100 12 -176 -18 44 4 -46 274 -161 -207 17 200 -227 37 112 76 130 117 203 69 -152 344 -368 -76
5259 -76 224 117 -13 164 -74 -106 10 -180 -97 -255 28 178 195 208 219 -434 -137 -34 142 -137 25 -205
5281 -205 94 407 -178 -126 -33 24 -74 148 -252 96 27 261 -24 -182 -54 -138 -197 87 397 84 173 122 56
5304 56 32 -338 -636 -256 140 -57 53 244 -94 3 124 -138 -392 -278 -345 -64 81 551 26 -63 94 -186
5326 -186 -185 -34 -205 -41 203 1 354 -86 -72 -130 -73 -315 214 103 -158 732 122 -56 -126 -287 -7 -144
5348 -144 -114 -188 -61 85 541 359 -100 -33 -18 -148 -131 79 77 473 278 -234 127 141 -389 -105 5 -412 10
5371 10 114 -136 101 -156 -384 164 -76 -30 59 -243 146 365 147 220 222 -232 114 -394 -101 218 -47 213
5393 213 469 -50 7 -192 -285 -6 -106 -283 223 4 -25 355 157 -192 415 -226 1 -91 -78 93 209 -348
5415 -348 40 -234 -270 315 -519 -202 333 285 273 184 -439 -18 274 -160 -406 192 145 232 398 -32 18 21 54
5438 54 402 -209 12 471 -180 -52 231 -215 222 -170 -494 252 -14 47 -27 98 -279 -58 -5 101 524
5459 524 -61 204 70 -265 51 -136 -270 266 -230 -72 412 298 -51 -31 -251 -234 593 -167 40 288 -349
5480 -349 254 228 -307 114 21 -255 -30 -24 -91 273 225 -175 320 166 12 -178 -348 245 327 80 292 265 -120
5503 -120 -190 -214 -185 465 -106 22 -17 110 -78 -23 86 -1 -83 -292 -174 -120 96 50 -1 -207 306 -413 -275
5526 -275 155 -342 -164 120 -31 98 165 219 -109 183 -225 -428 177 290 3 466 246 289 -249 -176 3
5547 3 45 -51 -85 125 217 303 107 -67 32 -187 -276 -7 -339 209 -107 -98 124 -290 -162 88 -198 -57 417 220
5571 220 -98 83 11 -1 -240 -252 -267 -154 150 205 154 113 -208 -464 -248 326 -286 264 301 -209 60 337 -79
5594 -79 -225 138 -50 -121 -220 -141 471 -148 481 41 -88 26 3 -79 -166 238 -72 225 151 105 -361 -195 -245
5617 -245 -67 59 89 351 -31 61 253 -648 149 94 -184 -161 326 159 10 266 -291 -313 305 -210 -22 -312
5639 -312 34 -9 147 271 13 -157 209 -69 -173 241 244 82 -16 7 -336 -419 61 -100 -33 -107 287 135 63
5662 63 161 -186 -405 -1 -87 -137 151 -4 81 312 134 -62 222 128 -301 19 -263 259 42 1 200 -3
5684 -3 -361 37 -126 278 239 87 172 -56 -100 -10 142 49 37 -66 41 -247 30 72 282 -168 172 215 95
5707 95 -361 93 179 -239 215 272 -175 322 243 -100 -61 -185 78 -205 -158 31 70 -183 67 81 -247 429 -150
5730 -150 114 337 -175 -244 23 -42 -366 168 -96 141 151 -278 -130 -255 -143 -117 -106 156 291 22 87 269
5752 269 -197 -153 -148 126 45 30 -53 86 91 -149 92 18 -264 -132 28 63 222 147 -185 197 -54 -307 -4 156
5776 156 -299 101 370 214 257 85 217 -17 186 -44 -365 151 -289 -223 278 223 107 -26 172 460 40
5797 40 -7 -40 -233 9 137 -120 -297 -100 -255 232 102 106 291 126 145 -246 -138 188 -257 54 8 57 149
5820 149 -38 118 -113 19 -112 -61 232 489 -1 437 419 -10 -14 -183 32 -171 115 61 73 76 -345 -287 147
5843 147 -130 -60 156 -121 427 427 -202 217 116 113 60 -104 -229 -34 256 277 -131 53 283 -322 -96 103
5865 103 -508 -469 31 -53 3 214 50 -260 -46 -206 -94 34 384 35 309 -207 -244 -208 -196 -289 -87 -286
5887 -286 135 -55 -119 409 -4 -235 26 -337 -100 -54 -28 113 20 420 149 -21 14 -203 -96 -171 56 -126
5909 -126 48 -161 191 29 -153 -79 -301 -57 -202 23 -261 133 129 -80 -17 4 -322 133 302 -74 -36 226
5931 226 -310 -367 12 -232 -200 5 -6 168 147 -145 -214 236 -189 63 -278 -146 368 121 78 -179 -87 38
5953 38 224 -582 -180 -229 -226 -65 -52 -92 -8 426 86 -105 247 189 -141 48 -36 93 26 117 170 -343 -279 -17
5977 -17 -221 362 21 30 306 -193 -10 234 -15 299 239 221 156 -8 -182 351 91 -145 526 -65 45 464
5999 464 207 -322 -57 -65 -84 -49 -49 76 -34 -82 -6 -240 -252 268 -52 -269 378 -125 26 316 -7 121 -22
6022 -22 189 -46 -114 160 -41 357 56 -5 73 -163 49 -126 -78 411 -135 219 277 -26 -175 -131 -321 -156
6044 -156 170 -175 177 223 140 228 -118 -108 176 -340 -489 467 229 113 -28 -130 190 -247 69 86 -32 -145
6066 -145 343 -103 -128 344 154 -29 52 -389 5 182 -31 211 110 -28 4 32 -252 -233 -194 209 53 138
6088 138 444 93 -149 216 245 -70 -12 -21 -139 153 338 -211 -98 111 -173 91 220 22 427 -105 -77 355
6110 355 -48 -188 -120 -69 145 -72 -29 52 134 -63 133 37 -121 214 119 -85 214 13 95 -11 -125 -203 -42
6133 -42 -137 -47 277 -4 182 251 235 -5 -122 -108 -90 147 -46 6 -268 -163 290 -290 456 193 -270 143 28
6156 28 -139 317 141 129 242 -77 -311 54 -125 10 158 71 112 27 -271 70 -293 -412 -45 19 -479 539
6178 539 -47 117 141 -413 -228 86 -305 -147 438 -58 -80 84 -131 -7 106 -437 242 121 146 134 48 208
6200 208 92 -194 -9 5 -93 162 130 -90 49 64 -310 136 -158 -146 -76 -43 10 -19 -37 74 11 -147 -116 -59
6224 -59 22 55 8 -42 -4 -26 78 -174 -12 187 456 -148 -210 -203 158 -107 416 -113 -41 344 -115 61 534 71
6248 71 -213 35 -129 93 -357 75 65 92 111 127 -332 413 -71 -188 -130 -124 -137 -25 111 52 184 143 -249 99
6272 99 -281 3 129 26 67 118 170 -199 -280 -366 -179 -118 -273 474 143 -432 428 -122 107 174 -198 75 58
6295 58 -1 142 -205 -161 -124 82 -240 -17 426 -203 471 439 -217 -34 61 -213 -285 261 -51 231 -97 270
6317 270 -108 48 -134 19 -272 220 -199 -182 381 1 232 131 -386 -504 -120 116 -119 -159 153 -181 240
6338 240 148 41 -27 -246 -73 80 141 69 -19 -87 -48 -488 -34 -12 -235 161 94 -118 328 -267 -226 345 -285
6361 -285 -183 108 -108 52 187 387 -30 83 -94 -356 124 69 211 226 245 431 206 -197 63 -64 -292
6382 -292 83 -314 21 341 250 125 176 142 -298 -292 -271 -159 266 283 220 195 -344 -265 -100 -163 -26 -168 -7 113
6406 113 20 106 103 0 -14 -79 -65 -397 69 -48 153 135 -334 -107 -248 -1 -207 206 208 253 139 7 -17 -7
6430 -7 -47 -166 -15 -158 40 40 234 122 -33 217 -67 -176 73 50 196 -27 28 2 13 71 -91 147 -53
6453 -53 -242 -53 46 -224 310 338 152 -279 57 43 -58 -25 -33 131 270 -206 -162 53 21 -565 -244 -168 -160 84
6477 84 -233 -172 69 68 100 -5 57 -135 42 -77 -53 -81 -170 213 9 -161 -72 215 -33 304 -153 -184 211 -44
6501 -44 -170 75 -45 -164 -3 -88 -83 123 61 -142 86 30 -254 -201 320 82 75 293 309 57 33 -315 -136 204
6525 204 -179 -199 -77 105 202 -59 -22 -48 155 162 -61 -81 27 -266 41 -16 37 -58 -25 301 -199 -87 89 -82
6549 -82 97 25 -165 176 97 330 -46 -66 -325 -38 -102 -9 -30 274 -247 -300 -157 -125 99 -134 -361 -51 -234
6572 -234 390 236 106 221 28 -196 -33 97 -74 221 29 10 170 -107 -410 -63 -225 59 36 -191 -13
6593 -13 286 -198 66 -130 43 51 -102 -1 -244 -3 -71 263 -120 217 -247 -472 88 -216 -63 119 196 24
6615 24 116 46 -62 259 97 184 98 -163 58 33 304 -173 -28 88 -165 -125 -128 16 220 407 272 -95 -134
6638 -134 -299 -438 -71 -192 -220 278 25 -120 -11 -151 -176 -55 -100 -192 -27 -171 -85 -104 -83 323 -13 -2 105
6661 105 -2 231 74 205 42 261 129 0 39 -32 53 164 29 231 71 -34 -65 -27 -50 -228 -459 -11
6683 -11 394 -127 131 -37 69 -159 142 -132 32 146 106 197 83 -129 -242 -118 -101 8 250 79 81 373
6705 373 105 -210 125 -35 -81 261 -240 -219 30 68 130 15 -169 -144 42 151 152 121 -121 64 17 15 -134 -249
6729 -249 82 78 -259 -162 -145 197 304 101 -32 -170 -7 -143 -187 -92 -155 -354 374 180 -29 -76 15 3 -123
6752 -123 -19 -19 160 -300 13 -237 17 -96 42 -93 -64 -159 -213 116 127 -306 37 -69 -60 261 -64 -136 -15
6775 -15 205 -85 245 169 -99 -49 -282 213 -69 -9 -153 5 89 -5 -164 -179 -1 193 145 -489 54 -109 -191
6798 -191 -52 570 -138 -100 -144 -87 -18 258 38 -18 122 -44 -117 345 -80 282 99 -74 -198 -46 151 -64
6820 -64 174 -265 134 230 34 -39 -90 -275 25 48 217 189 140 312 -212 -543 -139 -37 -202 -300 128 285 -70
6843 -70 -307 149 -22 172 -128 -148 71 365 303 -14 -40 246 -34 149 173 53 -155 110 101 399 207 7
6865 7 64 -143 -272 47 215 57 101 193 128 -216 -69 -316 -147 131 72 -8 254 -457 296 -61 -149 -213 -106
6888 -106 92 -129 -51 -17 -39 -151 -95 -449 196 120 -148 -62 168 156 59 128 -246 -84 12 226 -171 38 150
6911 150 90 112 38 94 -279 -118 -63 241 -158 -18 127 -50 325 90 -193 -148 -214 175 40 60 -132 150 90
6934 90 -161 -332 135 100 -54 -19 -55 -16 -66 14 481 -42 -173 150 -98 -394 182 10 -303 -73 212 15
6956 15 -95 324 -212 75 82 165 -50 223 244 113 104 -93 -362 -54 367 27 207 391 -475 -300 -215 -39 -135
6979 -135 91 82 222 436 -96 176 201 40 -196 -105 155 175 -84 209 43 -321 -191 -266 36 89 -194 -156 -47
7002 -47 38 -170 60 -165 -173 99 -343 128 149 89 -30 -138 -159 -51 -190 121 71 35 -18 65 133 -129 129 -294
7026 -294 -182 -332 -199 186 2 -248 306 -159 -66 -128 -77 18 326 181 -123 -247 394 -114 -98 30 -46 -21
7048 -21 -272 130 -1 467 247 -26 85 201 -226 -105 -263 -173 58 331 109 -97 124 137 -251 -63 -206
7069 -206 -112 -21 354 -361 158 38 -198 -31 -212 -229 -265 -289 -1 54 58 -318 -71 172 -11 -250 118 98 189
7092 189 261 -34 164 165 76 -392 -61 200 -11 31 -141 106 -126 115 -65 -262 -49 286 41 161 14 -66
7114 -66 155 -91 -146 -20 -97 144 -123 135 -108 27 -93 -64 152 -111 -137 203 380 -24 -49 -17 140 309
7136 309 54 -231 2 -155 85 -261 395 354 -89 -419 167 -232 -263 18 -59 83 195 48 -456 85 -126
7157 -126 -31 100 103 -43 93 34 56 -470 252 -82 -216 107 63 -17 272 151 43 -67 155 17 139 18
7179 18 -83 -52 -7 373 67 -260 -232 281 280 95 113 15 131 13 -32 0 -85 -186 246 65 -46 -130 87 -19
7203 -19 142 151 -110 -113 137 31 39 393 210 92 -174 -574 -148 321 -203 9 -140 -268 40 268 -73 -248
7225 -248 65 86 169 42 47 117 112 340 -159 137 221 -30 -93 133 314 -268 169 180 -83 -55 -40 -222 -145 242
7249 242 -184 -24 75 -86 77 223 -199 -83 -30 -33 65 -46 229 -555 -97 90 -612 53 -137 -248 -89 30
7271 30 57 291 -42 -223 -312 -187 252 -23 332 -88 -44 28 177 -286 -48 -194 -233 285 268 48 404 228
7293 228 -130 -97 -55 -50 -91 43 76 213 94 80 -174 -234 89 -108 6 168 132 135 188 -251 -15 -236 -25 -160
7317 -160 228 311 65 239 29 -92 71 274 -164 175 -77 112 65 -16 -181 375 33 -236 -425 214 -137
7338 -137 -186 -99 84 219 -18 112 -74 -211 -112 -8 -79 -118 60 -223 -300 -532 237 -89 -121 189 185 -88 149
7361 149 189 -141 -152 -206 150 -329 111 -64 100 203 195 -285 -65 155 -330 131 305 -175 154 205 13 -150
7383 -150 -259 159 -87 199 269 54 111 94 -62 277 -352 63 -15 -66 337 103 133 85 8 127 -46 -224 -167
7406 -167 -111 1 250 84 -89 -38 68 118 66 -90 111 -60 110 -152 -70 -39 -114 -190 -1 5 31 267 190 137
7430 137 84 -3 -126 -194 -206 164 -121 107 -163 124 130 151 -126 -22 -108 -376 52 257 -10 22 201 113 -55
7453 -55 52 -244 -10 85 51 250 96 38 28 17 181 -61 44 -44 -139 166 -72 55 -59 113 -18 91 -138
7476 -138 50 104 -203 188 -118 -23 -57 -66 89 307 -18 -80 -145 -215 187 -52 -197 -90 -221 -147 -357 -31 27
7499 27 30 154 278 -419 33 -174 10 81 -63 357 134 -209 -192 -11 -99 297 -129 14 -319 -123 14 -138
7521 -138 -156 -273 -6 135 -136 -163 106 -127 39 -204 -61 -61 -194 -241 -229 -181 240 264 -1 83 210 -170 8
7544 8 -32 -58 -115 -12 514 126 236 -444 175 -385 -104 -499 -197 162 42 -116 27 -158 -105 -63 -234 -242 -271
7567 -271 187 5 162 -109 -206 -221 269 -26 47 22 -301 16 15 40 42 -161 14 -364 190 132 18 208 596
7590 596 61 -26 113 47 32 -189 -167 -38 -13 292 132 25 100 -188 192 -122 -273 148 209 259 -194 233 -303
7613 -303 -210 -137 -57 53 336 -194 -99 82 38 -19 -142 109 -64 312 -28 13 -177 111 4 -14 75 339 2
7636 2 -95 -72 -60 481 9 -79 -13 172 -306 115 -52 -27 -29 140 8 232 99 -148 -148 209 0 -328 148 273
7660 273 -114 -149 -101 -155 -76 -124 18 156 228 -382 101 346 -195 -113 141 165 -225 -252 91 -57 -171 -81 149
7683 149 154 449 -83 12 224 -2 84 -92 60 -438 -100 277 79 234 -12 65 310 -40 54 -376 44 14
7705 14 -28 -96 92 64 -61 58 -172 -124 -88 -151 122 -70 -79 257 -54 -30 -228 -302 -570 -111 -212 -140 60 412
7729 412 -1 -50 191 69 -87 24 23 171 319 -60 -26 232 68 66 53 89 -48 152 12 227 21 -186 -332
7752 -332 -60 61 23 -125 349 101 56 256 -107 -267 -179 227 -295 126 89 108 34 -169 42 -18 -171 -95 39
7775 39 71 -288 15 -145 -16 -11 -150 -190 176 -222 130 71 77 173 -161 -68 -91 -28 21 197 51 374 -48 -227
7799 -227 -74 -97 221 11 27 108 -410 -147 230 -173 -95 112 -303 110 -47 -187 -128 183 40 -209 91 121
7821 121 -2 -396 -226 -185 233 183 234 -7 68 -118 -226 119 -117 107 25 264 332 58 -112 -335 165 42
7843 42 79 302 239 38 41 132 -101 31 146 227 137 -20 42 34 -48 194 -352 -210 -36 111 48 36 296 93 176
7868 176 -116 -245 311 -260 74 -219 68 131 177 233 14 244 70 137 -238 -142 44 293 77 -95 55 110
7890 110 -121 -161 321 10 200 401 -175 -323 180 295 -94 -4 -113 -238 163 -114 219 155 54 -38 -272
7911 -272 -36 0 78 30 1 -82 -136 -164 -347 -152 -190 -78 230 4 109 -44 68 -157 34 8 -294 -120 -118 -219
7935 -219 -4 -169 -107 -336 240 70 10 -121 -181 -207 245 -47 205 259 13 -48 -65 -96 179 351 175 33 -250
7958 -250 101 -264 -40 -153 -148 -151 290 174 93 196 24 -233 -25 225 23 22 -22 265 379 68 38 -263 26
7981 26 15 55 -122 173 -6 72 141 -9 3 90 -256 -115 126 -62 25 -40 209 77 -65 -70 -69 22 209 -11 219
8006 219 71 87 184 239 195 -142 -43 -137 -103 323 -53 -62 141 -174 -173 251 -180 44 282 -212 105 113 -33 -369
8030 -369 -308 -114 -343 -145 162 136 77 264 90 -161 140 49 -420 60 12 -25 448 90 -82 72 -21 -48 399
8053 399 75 121 -43 54 108 316 -128 55 -186 249 346 -86 219 334 -176 32 -59 -207 311 328 -37 148
8075 148 170 -105 -75 -159 -81 -168 32 -76 164 270 129 91 82 -178 -2 112 -110 -248 -136 134 256 -41 93
8098 93 137 -679 -115 192 -439 430 277 89 282 -255 -352 114 202 -149 230 174 331 195 168 -169 140 -218
8120 -218 -182 169 -119 130 288 156 44 -85 121 40 -176 -148 355 33 -63 114 74 12 301 192 -15 90
8142 90 11 -128 55 144 198 -157 -194 -39 -277 -457 -89 -67 299 80 -298 88 217 -273 45 -96 137 147
8164 147 81 22 89 -172 -19 -19 187 -75 -320 33 64 247 42 215 22 21 92 -252 11 419 -263 -154 350
8187 350 -200 -53 404 -281
8191b81
##END NTUPLES=NMR FID
##END=
