##TITLE=1H_LR-794-Q-C4
 200.13MHz, CDCl3,
 8 sc
 
 17.1.2025
##JCAMPDX= 6.0         $$ Bruker NMR JCAMP-DX V2.0
##DATA TYPE= NMR FID
##DATA CLASS= NTUPLES
##ORIGIN= UXNMR, Bruker Analytische Messtechnik GmbH
##OWNER= pz
$$ XWIN-NMR		Version 3.5
$$ Fri Jan 17 14:09:59 2025 Russian Standard Time (UT+4h)  she@DPX200
##.OBSERVE FREQUENCY= 200.1313
##.OBSERVE NUCLEUS= ^1H
##.DELAY= (6, 6)
##.ACQUISITION MODE= SIMULTANEOUS
##.ACQUISITION SCHEME= undefined
##.AVERAGES= 8
##.DIGITISER RES= 18
##SPECTROMETER/DATA SYSTEM= spect
##.PULSE SEQUENCE= zg30
##.SOLVENT NAME= DMSO
##.SHIFT REFERENCE= (INTERNAL, DMSO, 0, 14.3821)
##AUDIT TRAIL= $$ (NUMBER, WHEN, WHO, WHERE, WHAT)
$$ ##TITLE= Audit trail, XWIN-NMR		Version 3.5
$$ ##JCAMPDX= 5.01
$$ ##ORIGIN= Bruker BioSpin GmbH
$$ ##OWNER= she
$$ F:/spectra/data/she/nmr/H-C/1/audita.txt
$$ ##AUDIT TRAIL=  $$ (NUMBER, WHEN, WHO, WHERE, WHAT)
(   1,<2025-01-17 14:08:48.82 +0400>,<she>,<DPX200>,
      <created by zg, POWCHK disabled, PULCHK disabled
       configuration hash MD5:
       00 E9 B6 7A A2 85 ED C7 34 08 36 98 17 FE 4E 26
       data hash MD5: 16K
       F6 A7 3B 37 61 6E 6B 1A 57 92 04 15 F4 6C 8A A1>)
$$ ##END=
$$ 
$$ hash MD5
$$ 04 0E B7 58 76 23 1B F0 7D 32 0A 78 C0 E9 5E 6A
##$RELAX= 
##$RELAX= 
##$RELAX= 
##$RELAX= 
##$RELAX= 
##$RELAX= 
$$ Bruker specific parameters
$$ --------------------------
##$DU= <F:/spectra>
##$EXPNO= 1
##$NAME= <H-C>
##$PROCNO= 1
##$TYPE= <nmr>
##$USER= <she>
##$AMP= (0..31)
100 100 100 100 100 100 100 100 100 100 100 100 100 100 100 100 100 100 
100 100 100 100 100 100 100 100 100 100 100 100 100 100 
##$AQSEQ= 0
##$AQ_mod= 1
##$AUNM= <au_zg>
##$AUTOPOS= <>
##$BF1= 200.13
##$BF2= 200.13
##$BF3= 200.13
##$BF4= 200.13
##$BF5= 200.13
##$BF6= 200.13
##$BF7= 200.13
##$BF8= 200.13
##$BYTORDA= 1
##$CFDGTYP= 0
##$CFRGTYP= 5
##$CHEMSTR= <none>
##$CNST= (0..31)
1 1 145 1 1 1 1 1 1 1 1 1 1 1 1 1 1 1 1 1 1 1 1 1 1 1 1 1 1 1 1 1 
##$CPDPRG= <>
##$CPDPRG1= <>
##$CPDPRG2= <>
##$CPDPRG3= <>
##$CPDPRG4= <mlev>
##$CPDPRG5= <mlev>
##$CPDPRG6= <mlev>
##$CPDPRG7= <mlev>
##$CPDPRG8= <mlev>
##$CPDPRGB= <>
##$CPDPRGT= <>
##$D= (0..31)
0 0.7 0 0 0 0 0 0 0 0 0 0.03 0 0 0 0 0 0 0 0 0 0 0 0 0 0 0 0 0 0 0 0 
##$DATE= 1737108528
##$DBL= (0..7)
120 120 120 120 120 120 120 120 
##$DBP= (0..7)
150 150 150 150 150 150 150 150 
##$DBP07= 0
##$DBPNAM0= <>
##$DBPNAM1= <>
##$DBPNAM2= <>
##$DBPNAM3= <>
##$DBPNAM4= <>
##$DBPNAM5= <>
##$DBPNAM6= <>
##$DBPNAM7= <>
##$DBPOAL= (0..7)
0.5 0.5 0.5 0.5 0.5 0.5 0.5 0.5 
##$DBPOFFS= (0..7)
0 0 0 0 0 0 0 0 
##$DE= 6
##$DECBNUC= <off>
##$DECIM= 32
##$DECNUC= <off>
##$DECSTAT= 4
##$DIGMOD= 1
##$DIGTYP= 9
##$DL= (0..7)
0 120 120 120 120 120 120 120 
##$DP= (0..7)
150 150 150 150 150 150 150 150 
##$DP07= 0
##$DPNAME0= <>
##$DPNAME1= <>
##$DPNAME2= <>
##$DPNAME3= <>
##$DPNAME4= <>
##$DPNAME5= <>
##$DPNAME6= <>
##$DPNAME7= <>
##$DPOAL= (0..7)
0.5 0.5 0.5 0.5 0.5 0.5 0.5 0.5 
##$DPOFFS= (0..7)
0 0 0 0 0 0 0 0 
##$DQDMODE= 0
##$DR= 18
##$DS= 0
##$DSLIST= <SSSSSSSSSSSSSSS>
$$ [...]
##$SUBNAM0= <"">
##$SUBNAM1= <"">
##$SUBNAM2= <"">
##$SUBNAM3= <"">
##$SUBNAM4= <"">
##$SUBNAM5= <"">
##$SUBNAM6= <"">
##$SUBNAM7= <"">
##$SUBNAM8= <"">
##$SUBNAM9= <"">
##$SW= 18.0517328524113
##$SWIBOX= (0..15)
0 0 2 0 0 0 0 0 0 0 0 0 0 0 0 0 
##$SW_h= 3612.71676300578
##$TD= 16384
##$TD0= 1
##$TE= 0
##$TE2= 300
##$TE3= 300
##$TEG= 300
##$TL= (0..7)
0 120 120 120 120 120 120 120 
##$TP= (0..7)
150 150 150 150 150 150 150 150 
##$TP07= 0
##$TPNAME0= <>
##$TPNAME1= <>
##$TPNAME2= <>
##$TPNAME3= <>
##$TPNAME4= <>
##$TPNAME5= <>
##$TPNAME6= <>
##$TPNAME7= <>
##$TPOAL= (0..7)
0.5 0.5 0.5 0.5 0.5 0.5 0.5 0.5 
##$TPOFFS= (0..7)
0 0 0 0 0 0 0 0 
##$TUNHIN= 0
##$TUNHOUT= 0
##$TUNXOUT= 0
##$USERA1= <user>
##$USERA2= <user>
##$USERA3= <user>
##$USERA4= <user>
##$USERA5= <user>
##$V9= 5
##$VALIST= <valist>
##$VCLIST= <CCCCCCCCCCCCCCC>
##$VD= 0
##$VDLIST= <DDDDDDDDDDDDDDD>
##$VPLIST= <PPPPPPPPPPPPPPP>
##$VTLIST= <TTTTTTTTTTTTTTT>
##$WBST= 1024
##$WBSW= 4
##$XGAIN= (0..3)
0 0 0 0 
##$XL= 0
##$YL= 0
##$YMAX_a= 768060
##$YMIN_a= -756409
##$ZGOPTNS= <>
##$ZL1= 120
##$ZL2= 120
##$ZL3= 120
##$ZL4= 120
##$ABSF1= 10
##$ABSF2= 0
##$ABSG= 5
##$ABSL= 3
##$ALPHA= 0
##$AQORDER= 0
##$ASSFAC= 0
##$ASSFACI= 0
##$ASSFACX= 0
##$ASSWID= 0
##$AUNMP= <proc_1d>
##$AZFE= 0.1
##$AZFW= 0.1
##$BCFW= 1
##$BC_mod= 2
##$BYTORDP= 1
##$COROFFS= 0
##$CY= -3
##$DATMOD= 1
##$DC= 2
##$DFILT= <>
##$DTYPP= 0
##$F1P= 0
##$F2P= 0
##$FCOR= 0.5
##$FTSIZE= 0
##$FT_mod= 4
##$GAMMA= 1
##$GB= 0.15
##$INTBC= 1
##$INTSCL= 1
##$ISEN= 128
##$LB= 0.25
##$LEV0= 0
##$LPBIN= 0
##$MAXI= 10000
##$MC2= 0
##$MEAN= 0
##$ME_mod= 0
##$MI= 1.114404
##$NCOEF= 0
##$NC_proc= 0
##$NLEV= 6
##$NOISF1= 3.799351
##$NOISF2= 2.8
##$NSP= 1
##$NTH_PI= 0
##$NZP= 0
##$OFFSET= 14.38212
##$PC= 1
##$PHC0= 251.8792
##$PHC1= 11.1922
##$PH_mod= 1
##$PKNL= yes
##$PPARMOD= 0
##$PSCAL= 0
##$PSIGN= 0
##$REVERSE= no
##$SF= 200.129724274929
##$SI= 16384
##$SIGF1= 3
##$SIGF2= 2
##$SINO= 400
##$SIOLD= 16384
##$SREGLST= <1H.CDCl3>
##$SSB= 0
##$STSI= 0
##$STSR= 0
##$SW_p= 3205.1282051282
##$SYMM= 0
##$S_DEV= 0
##$TDeff= 0
##$TDoff= 0
##$TI= <>
##$TILT= no
##$TM1= 0
##$TM2= 0
##$TOPLEV= 0
##$USERP1= <user>
##$USERP2= <user>
##$USERP3= <user>
##$USERP4= <user>
##$USERP5= <user>
##$WDW= 1
##$XDIM= 8192
##$YMAX_p= 0
##$YMIN_p= 0
$$ End of Bruker specific parameters
$$ ---------------------------------
##NTUPLES= NMR FID
##VAR_NAME=  TIME,          FID/REAL,        FID/IMAG
##SYMBOL=    X,             R,               I
##VAR_TYPE=  INDEPENDENT,   DEPENDENT,       DEPENDENT
##VAR_FORM=  AFFN,          ASDF,            ASDF
##VAR_DIM=   8192,          8192,            8192
##UNITS=     SECONDS,       ARBITRARY UNITS, ARBITRARY UNITS
##FACTOR=    0.0002768,     1,               1
##FIRST=     0,             0,               0
##LAST=      2.2672688,     0,               0
##MIN=       0,             -756409,         0
##MAX=       2.2672688,     768060,          0
$$ Real data points
##PAGE= N=1
##DATA TABLE= (X++(R..R)), XYDATA
$$ [...]
$$ plain form
2284 -399 444 210 -847 -341 409 -277 -527 683 194 -367 83 327 -268 36 487 278 -661 -108 98
2303 98 -408 -244 323 -27 -428 47 94 -428 -83 125 279 81 320 457 -333 -134 147 -113 -189 479 77
2324 77 -527 190 -142 45 -422 2 7 -434 -80 46 101 155 253 -15 53 400 97 31 26 283 347 -296 -179 -64
2348 -64 -296 -154 168 -228 -172 -113 313 -338 -82 142 71 -237 4 385 -262 50 388 13 -308 92 -199
2369 -199 -440 -174 40 -315 21 169 -37 -311 -78 205 -251 34 582 -79 -397 401 180 -251 235 422
2389 422 111 -337 76 164 -149 -201 278 -2 -695 296 17 -572 -43 465 253 -135 387 113 -407 36 539
2410 539 -56 -93 558 -91 -851 -242 39 -437 -186 678 197 -966 174 197 -599 166 1208 142 -692
2429 -692 350 352 -736 270 814 -86 -352 497 -16 -1109 -387 889 -131 -465 649 -294 -1136 -261
$$ packed form
2284c99Q43k34j057N06P50o86k50J210m89n61M50K44n95L04M51k09r39N53K06
2303I8n06J64N67l50m01M75M7n22L45K08J54j98K39J37p90J99K81k60p6O68m02
2324G7o04P17l32J87m67M24Nm41L54J26N5N4R8k68O8L47l03o6nK57O4o43J17J15
2348f4k32J42L22l96N6N9M26o51K56K24p1l08K41L81o47L12L38l75l21M00k91
2369a99k41K66K14l55L36J48k06k74K33K83m56K85N48o61l18P98k21m31M86J87
2389D22l11m48M13Q8l13n2M79k80o93R91k79n89N29N08k12l88N22k74n20M43N03
2410E39n95l7O51o49p60O09K81m76K51Q64m81j163J140K3p96P65J042j066q34
2429f92J042Kj088J006N44r00k66Q49n13j093P22J276j020l34J114r43q42Q75
$$ plain form
2447 -261 590 96 129 1106 96 -1137 -78 382 -490 146 1385 474 -1154 49 -381 -1556 172 1387
2465 1387 85 -551 579 -234 -1544 -308 1349 286 -156 1184 -189 -1774 -474 1028 -145 526
2481 526 1511 -210 -1868 -735 255 -1016 91 2034 260 -1690 -110 -294 -1237 392 2447 705
2497 705 -641 576 -92 -2249 -139 1837 336 -98 1147 -232 -2491 -642 1396 -213 1 2101
2513 2101 8 -2380 -568 697 -840 235 2889 500 -2051 -120 73 -1966 90 2988 700
2528 700 -1188 -96 -249 -2852 -332 2405 567 -528 1325 -226 -3157 -924 1781 135 133 2602
2544 2602 236 -3058 -1006 1232 -1038 216 3088 816 -2712 -1081 184 -2081 -209 3454 1002
2559 1002 -1533 55 32 -2710 -515 3126 1104 -1060 1109 137 -3365 -1048 2256 613 -497 2039
$$ packed form
2447b61Q51m94L3R77j010j233J059M60q72O36J239r11j628J203m30j175J728J215
2465A387j302o36J130q13j310J236J657j063m42J340j373j585J300J502j173O71
2481E26R85j721j658J133R90j271J107J943j774j950J580j84r43J629K055j742
2497G05j346J217o68k157K110J976j501m34J245j379k259J849K038j609K14K100
2513B101k093k388J812J265j537J075K654k389k551J931J93k039K056K898k288
2528G00j888J092j53k603K520K737j838j095J853j551k931K233K705j646kK469
2544B602k366l294K052K238k270J254K872k272l528J631J265k265J872L663k452
2559A002k535J588k3k742K195L641k022k164K169r72l502K317L304j643j110K536
$$ plain form
2575 2039 425 -3620 -1755 1565 -407 -389 2948 1437 -2607 -1330 803 -1430 -539 3050 1528 -1981
2591 -1981 -406 190 -2237 -1153 3198 1566 -1416 492 265 -3093 -1594 2484 1050 -518 1735
2606 1735 853 -3208 -1969 1579 410 -689 2388 1524 -2613 -1643 980 -808 -965 2710 2205 -2434
2622 -2434 -1175 340 -1788 -1241 2533 1670 -1275 325 912 -2456 -1877 2445 1225 -911 853 1107
2638 1107 -2564 -1784 1534 607 -721 1730 1353 -2301 -2000 934 -66 -987 2173 1931 -1890 -1290 951
2655 951 -922 -1237 1908 1850 -986 -498 347 -1466 -1325 1694 1603 -796 378 948 -1683 -1952 1455 1121
2673 1121 -609 932 1503 -1365 -1483 720 77 -495 1399 1496 -1329 -1301 548 -658 -1058 1243 1780
2690 1780 -1043 -810 690 -683 -965 882 1356 -362 -60 952 -909 -1390 939 768 -722 522
$$ packed form
2575B039j614m045J865L320j972J8L337j511m044J277K133k233Q91L589j522l509
2591a981J575N96k427J084M351j632k982J908k27l358J499M078j434j568K253
2606A735q82m061J239L548j169j099L077q64m137R70K623j788j57L675n05m639
2622b434J259J515k128N47L774q63k945J600N87l368N79M322j220k136J764K54
2638A107l671P80L318r27j328K451l77l654L01K934j000r21L160k42l821O00K241
2655I51j873l15L145n8k836M88Q45j813J41L019r1k399J174N70k631k69L407l34
2673A121j730J541N71k868j18K203o43n72J894R7k825K8J849j206m00K301N37
2690A780k823K33J500j373k82J847M74j718L02J012j861m81K329j71j490J244
$$ plain form
2706 522 973 -1252 -1364 638 330 -803 622 785 -613 -1244 273 -184 -675 1186 1240 -529 -221 729
2724 729 -247 -705 708 1022 -202 -509 554 -559 -1047 419 497 -483 398 925 -444 -405 449 25 -157
2743 -157 549 769 -667 -588 174 -32 -474 564 548 -448 -316 289 -425 -686 249 412 -313 -320 729 -423
2763 -423 -491 684 423 -182 14 107 -125 -357 401 315 -179 153 208 -513 -571 211 90 -122 -139 336 -401 30
2785 30 229 -267 -171 402 489 14 39 232 -259 -477 322 -24 -150 -18 197 -171 -199 -30 357 -268 206 316
2807 316 68 -201 110 74 -252 -1 188 -96 -158 350 54 17 51 416 -350 -190 278 -190 -386 1 35 -151
2829 -151 64 333 132 -179 147 226 -34 -13 98 100 -356 -55 -151 -316 -119 198 -55 81 -69 161 -301 -60
2851 -60 256 -290 -445 350 116 -170 80 184 -87 -124 -171 -115 -451 -136 -1 -295 -180 -442 -200 -47 154
$$ packed form
2706E22M51k225j12K002l08j133J425J63j398o31J517m57m91J861N4j769L08R50
2724G29r76m58J413L14j224l07J063j113m88J466P8r80Q81N27j369L9Q54m24j82
2743a57P06K20j436P9P62k06m42J038j6r96J32O05p14k61R35J63p25pJ049j152
2763d23o8J175k61o05J96R3k32k32P58q6m94L32N5p21n8P82j21k12j7M75p37M31
2785C0J99m96R6N73Q7m75K5J93m91k18P99l46j26J32K15l68k8J69L87o25M74J10
2807C16k48k69L11l6l26K51J89k84o2N08k96l7L4L65p66J60M68m68j96L87L4j86
2829a51K15K69k01l11L26P9k60K1J11Km56L01r6j65J97L17k53J36j50K30m62K41
2851f0L16n46j55P95k34k86K50J04k71l7m7N6l36L15J35k94J15k62K42J53K01
$$ plain form
2872 154 -25 -60 64 535 -50 -176 390 93 -57 -145 -105 -75 -31 106 -38 -192 -210 52 97 -140 173 -149
2894 -149 -329 -43 403 -62 52 425 213 43 -48 392 -236 -45 150 -40 -489 350 278 -231 -153 -7 -151
2915 -151 -493 217 379 -351 -175 509 -111 -190 630 542 -192 346 220 -258 -709 194 244 -326 9 383 -456
2936 -456 -436 539 240 -178 281 446 -304 -385 591 116 -376 469 307 -456 -135 606 -401 -195 439 431 -799
2957 -799 -472 305 -402 -475 572 362 -361 294 991 -431 -342 533 371 -431 465 768 -424 -693 516
2976 516 132 -632 444 865 -852 -835 676 191 -554 434 902 -574 -557 855 -299 -821 715 912
2994 912 -356 -162 722 -735 -1304 610 692 -761 69 850 -692 -1026 650 361 -811 464 969 -742
3012 -742 -974 658 235 -1086 617 1481 -769 -766 708 -99 -993 363 1036 -849 -724 1070 -63 -1087
$$ packed form
2872A54j79l5J24M71n85j26N66k97j50q8M0L0M4J37j44j54j8K62M5k37L13l22
2894a49j80K86M46m65J14L73k12j70r1M40o28J91J95j90m49Q39p2n09P8J46j44
2915a51l42P10J62p30J76O84o20p9Q20q8p34N38j26m78m51R03N0n70L35L74q39
2936d56K0R75k99m18M59J65p50q1R76m75m92Q45j62p63L21P41j007K06O34qj230
2957g99L27P77p07p3J047k10p23O55O97j422Q9Q75j62q02Q96L03j192k69J209
2976E16l84p64J076M21j717J7J511m85p45R88M68j476J7J412j154n22J536J97
2994I12j268J94Q84j457n69J914Q2j453Q30P81j542l34J676k89j172J275N05j711
3012g42k32J632m23j321J703Q64k250LJ474q07q94J356O73j885J25J794j133j024
$$ plain form
3030 -1087 607 996 -615 72 1331 -398 -1265 824 752 -1199 391 1249 -848 -1573 514 748 -1006
3047 -1006 -23 1436 -613 -1297 509 113 -1182 398 1678 -376 -911 902 -55 -1401 354 1315
3063 1315 -754 -405 994 -183 -1559 410 870 -654 10 1471 -476 -1558 492 771 -975 -75
3079 -75 1741 -347 -1323 822 758 -1014 111 1597 -145 -1215 666 298 -1264 32 1412 -610
3095 -610 -776 623 -209 -1400 270 1466 -715 -374 1380 -53 -1442 348 1003 -523 -258 1280
3111 1280 -143 -1556 133 700 -744 15 1379 -230 -1369 620 539 -1118 243 1733 21 -630
3127 -630 784 133 -1042 190 1134 -469 -783 840 133 -1369 127 1398 -483 -129 1140 62
3143 62 -1511 -86 717 -751 -143 1224 -187 -1071 471 310 -1005 -267 1359 160 -1293 170 98
$$ packed form
3030a087J694L89j611O87J259j729q67K089p2j951J590Q58k097p25K087K34j754
3047a006R83J459k049o84J806l96j295J580J280k054n35J813r57j346J755R61
3063A315k069L49J399j177j376J969M60j524O64J461j947j082K050K79j746R00
3079g5J816k088r76K145o4j772J125J486j742j070J881l68j562J296J380k022
3095f10j66J399q32j191J670J196k181L41J754j433j389J790O55j526K65J538
3111A280j423j413J689N67j444P59J364j609j139J989q1j657J361J490j712o51
3127f30J414o51j175J232R44j603l14J623p07j502J496J271j881L54J269j078
3143F2j573J425Q03j468O08J367j411q84J542j61j315P38J626j199j453J463p2
$$ plain form
3160 98 -1301 -210 1300 -167 -901 627 171 -1296 222 1168 -409 -287 971 -126 -1249 155
3176 155 946 -439 -224 884 121 -1229 120 622 -365 13 950 58 -847 325 702 -813 -52 1152
3194 1152 167 -629 430 257 -902 -268 909 -58 -618 379 201 -907 -265 792 -466 -95 939
3211 939 280 -846 -19 985 -164 -148 708 298 -581 -129 586 -352 -510 901 50 -964 151 341
3229 341 -879 -250 1128 -187 -461 419 474 -640 -277 722 -195 -253 702 338 -575 -54 519 -255 -484
3248 -484 437 159 -793 166 357 -379 -282 868 232 -488 203 495 -434 -60 482 328 -399 151 435 -457
3268 -457 -275 418 -66 -544 -46 408 -160 -257 542 51 -389 569 275 -533 -63 205 -180 -395 283 107
3288 107 -112 -199 302 -276 -415 158 54 -273 43 366 -267 -357 280 -108 -290 106 339 -201 62 217 84
$$ packed form
3160I8j399J091J510j467p34J528m56j467J518R46j577J22J258j097j123J404
3176A55P91j385K15J108p63j350J349N02r87L78R37q92r05J172L77j515P61J204
3194A152r85p96J059j73j159O34J177r67n60R97j78j108O42J057j258L71J034
3211I39o59j126Q27J004j149J6Q56m10q79M52P15r38j58J411q51j014J115J90
3229C41j220O29J378j315k74Q80N5j114L63R99r17n8R55l64r13N21N73p74k29
3248d84R21k78r52R59J91p36R7J150o36p20O91K92r29L74N42j54p27N50K84q92
3268d57J82O93m84m78M98M54n68r7P99m91m40R58k94q08M70K68l85k15O78j76
3288A07k19q7N01n78j39N73j04l27L16L23o33r0O37l88j82L96K33n40K63J55j33
$$ plain form
3309 84 -438 153 143 -167 -146 65 -304 -154 203 -137 -221 -128 197 -101 -353 48 144 138 -128 33 -63 -498 191
3332 191 82 -314 7 30 -375 -38 -44 -93 -279 -72 224 -66 -115 193 -30 -213 -2 248 -62 -224 234 256
3354 256 -178 45 15 242 -103 120 -16 -85 -271 125 -29 -168 65 -61 -31 202 69 -74 41 161 42
3375 42 253 181 11 -230 218 171 -235 -224 88 -269 -187 286 194 -245 -213 344 -95 -202 55 246 -82 69
3397 69 96 138 -164 270 176 -520 -155 14 -171 -132 247 291 -357 -60 252 -80 -464 211 40 -113 -97 -65 -74
3420 -74 16 405 115 -433 91 240 -361 -197 148 -11 -431 272 306 -256 -168 576 -119 -327 190 179 -474 -52
3442 -52 495 -60 -374 180 158 -545 -189 386 -190 -247 173 11 -327 60 259 -222 -148 528 403 -313 33
3463 33 545 -432 -257 513 270 -451 348 409 -390 -277 327 138 -480 785 262 -536 -159 644 105 -275
$$ packed form
3309H4n22N91j0l10K1K11l69J50L57l40q4R3L25k98k52M01R6ok66J61r6m35O89
3332A91j09l96L21K3m05L37om9j86K07K96k90m9L08k23j83K11K50l10j62M58K2
3354B56m34K23l0K27l45K23j36o9j86L96j54j39K33j26L0K33j33j43J15J20j19
3375D2K11p2j70k41M48m7m06J1L12l57Q2M73r2m39L2N57m39j07K57J91l28J51
3397F9K7M2l02M34r4o96L65J69j85L9L79M4o48K97L12l32l84O75j71j53J6L2r
3420g4R0L89k90n48N24J49o01J64L45j59m20P03L4n62Q8P44o95k08N17j1o53M22
3442e2N47n55l14N54k2p03L56N75n76n7M20j62l38L87J99m81P4O76j25p16L46
3463C3N12r77J75P70k43p21P99O1p99J13O04j89o18J265n23p98L77Q03n39l80
$$ plain form
3483 -275 639 564 -649 -223 692 -248 -283 590 671 -669 93 286 -492 -548 773 228 -626 287 747 -320
3503 -320 -667 655 361 -318 410 541 -741 -565 1056 40 -690 645 566 -804 -483 881 -200 -871
3521 -871 830 693 -706 -428 424 -385 -685 806 785 -572 78 651 -515 -961 919 374 -359 391
3539 391 725 -792 -864 494 45 -287 499 829 -860 -784 758 -243 -801 767 952 -777 -449 467
3557 467 -280 -580 504 971 -855 -207 651 -470 -927 761 619 -576 231 770 -696 -1158 591 553
3575 553 -389 477 1121 -766 -920 444 53 -511 613 843 -703 -880 512 -345 -977 691 1129 -304
3593 -304 -461 709 -433 -1104 822 1086 -693 -156 658 -628 -864 589 798 -774 334 1031 -559
3610 -559 -946 608 221 -1004 501 971 -571 -865 340 -194 -779 575 1385 -504 -498 588 -268 -1212
$$ packed form
3483b75R14p5j213M26R15r40l5Q73Q1j340P62J93p78n6J321n45q54R13M60j067
3503c20l47J322k94o79P28J31j282J76J621j016p30J335p9j370L21J364j081o71
3521h71J701j37j399K78Q52q09l00J491k1j357O50N73j166m46J880n45p33P50
3539C91L34j517p2J358m49l32P86L30j689P6J542j001n58J568J85j729L28R16
3557D67p47l00J084M67j826O48Q58j121m57J688j42j195Q07N39j466m62J749l8
3575E53r42Q66O44j887j54J364l91n64J124K30j546j77J392q57o32J668M38j433
3593c04j57J170j142o71J926K64j779N37Q14j286k36J453K09j572J108O97j590
3610e59l87J554l87j225J505M70j542k94J205n34n85J354Q10j889OJ086q56r44
$$ plain form
3628 -1212 438 1170 -453 -306 1082 -460 -1049 402 938 -387 183 1256 -404 -1060 222 347 -618
3645 -618 170 1124 -406 -954 224 26 -586 391 1275 -366 -738 511 -299 -547 452 1200 -202 -570
3663 -570 511 137 -1152 18 698 -302 15 793 -382 -1077 66 625 -303 -242 1007 -201 -815 255
3681 255 219 -559 265 1079 -131 -739 244 69 -665 16 1171 -131 -479 512 52 -1005 -35 617 -101
3700 -101 -135 662 -279 -996 -49 669 -220 90 1003 -459 -982 75 428 -566 228 908 37 -641 98 149
3720 149 -509 5 986 -94 -538 312 182 -532 -175 656 20 -192 175 253 -549 412 618 -242 -198 533
3740 533 110 -694 -61 623 -227 -370 594 86 -629 -321 286 -292 -180 743 143 -313 120 195 -483 -261
3760 -261 400 -71 -280 28 226 -471 -4 46 -24 -456 162 206 -484 -189 223 424 -95 254 234 -626 -142
$$ packed form
3628a212J650P32j623J47J388j542n89J451N36j325N70J073j660o56J282J25r65
3645f18P88R54j530n48J178j98o12R77Q84j641l72J249q10k48R99P48j402l68
3663e70J081l74j289J170O80j000L17P78j175o95J143N59r28O1J249j208o14J070
3681B55l6p78Q24Q14j210o08R83j75p34O81J155j302l48R91m60j057R70O52p18
3700a01l4P97r41p17R47P18q89L10R13j462n23J057L53r94P94O80q71o78P39N1
3720A49o58N14R81j080m44Q50j30p14L57Q31o36k12L67P8q02R61K06q60M4P31
3740E33m23q04O33O84q50j43R64n08p15L08O07n78J12R23o00m56M33P5o78K22
3760b61O61m71k09L08J98o97M67N0p0m32O18M4o90K95M12K01n19L49k0q60M84
$$ plain form
3781 -142 287 -388 16 159 254 -262 270 256 -219 32 287 153 -303 -62 260 -12 -446 126 105 -144 155
3802 155 160 -195 -136 432 0 -420 164 339 -162 -7 390 22 -100 111 212 -282 -238 -38 68 -123 23
3823 23 111 -456 -14 92 -235 -267 135 15 -15 -97 119 -17 -73 309 -129 6 -324 185 -49 -157 321 325 56
3846 56 5 -2 -126 -71 -30 -6 -21 155 -43 -257 -115 39 80 57 60 108 153 146 335 -264 -45 232 22 87 -251 51
3872 51 99 -134 -3 260 -67 155 9 -115 -36 174 82 38 -41 408 109 -22 244 200 33 15 289 -143 -315
3895 -315 -75 221 -180 -41 172 -105 -155 385 -110 -228 171 64 -274 18 120 -232 -2 221 -7 -175
3915 -175 84 22 -154 -94 306 -189 -186 -58 23 -213 -70 134 64 -187 150 286 -216 -189 321 188 -129 17
3937 17 483 -234 -177 374 219 -318 63 257 -380 -153 515 -387 -222 254 249 -305 246 249 -165 -218 490 451 -232
$$ packed form
3781a42M29o75M04J43R5n16N32j4m75K51K55j34m56K41L22k72m34N72k1k49K99
3802A55Nl55N9N68m32m20N84J75n01J55L97l68j22K11J01m94M4K00J06j91J46
3823B3Q8n67M42J06l27l2M02j20l0q2K16j36n6L82m38J35l30N09k34j08M78Mk69
3846E6n1pj24N5M1K4j5J76j98k14J42J54M1k3LM8M5pJ89n99K19K77k10O5l38L02
3872E1M8k33J31K63l27K22j46j24P9K10r2m4p9M49k99j31K66m4j67j8K74m32j72
3895c15K40K96m01J39K13k77n0N40m95j18L99j07l38K92J02l52K30K23k28j68
3915a75K59o2j76O0M00m95LJ28Q1k36J43K04p0k51L37J36n02K7N10j33l17J46
3937A7M66p17N7N51j55n37L81J94o37K27O68r02J65M76nn54N51Lm14n3P08l9o83
$$ plain form
3960 -232 109 205 -401 -371 207 -43 -236 235 370 -603 -170 564 40 -89 215 334 -394 -139 620 -102 -497
3981 -497 475 439 -376 149 334 -376 -29 298 -66 -275 63 40 -738 -313 697 51 -338 326 467 -417
4001 -417 -399 607 -124 -397 270 384 -495 -482 115 -163 -657 686 339 -692 -85 226 -481 -278 983
4020 983 421 -407 -278 248 -298 -288 684 432 -406 166 479 -716 -516 417 96 -432 465 486 -407 -476 571
4041 571 50 -389 652 595 -517 -662 696 -270 -377 736 491 -542 -260 480 -354 -769 525 857
4059 857 -419 -109 414 -380 -789 646 802 -355 414 608 -678 -463 340 33 -329 422 1067 -715
4077 -715 -575 205 -310 -546 618 757 -531 -360 513 -52 -876 717 818 -382 39 578 -502 -746
4095 -746 433 498 -403 20 435 -329 -697 372 142 -418 245 788 -334 -561 241 -87 -616 557 839
$$ packed form
3960b32L41R6o06L0N78k50j93M71J35r73M33P34n24j29L04J19p28K55P59p22l95
3981d97R72l6q15N25J85p10L47L27l64k09L38k3p78M25J010o46l89O64J41q84
4001d17J8J006p31k73O67J14q79J3N97k78m94J343l47j031O07L11p07K03J261
4020I83n62q28J29N26n46J0R72k52q38N72L13j195K00R33l21n28Q97K1q93o9J047
4041E71n21m39J041n7j112j45J358r66j07J113k45j033K82P40q34m15J294L32
4059H57j276L10N23p94m09J435J56j157P69J94j286K15Q03l07l62P51O45j782
4077g15J40P80n15k36J164J39j288J71Q73n65q24J593J01j200M21N39j080k44
4095g46J179O5r01M23M15p64l68J069k30n60O63N43j122k27Q02l28n29J173K82
$$ plain form
4114 839 -95 -384 465 -240 -962 338 858 -405 -527 325 -198 -960 240 653 -406 30 652 -543
4132 -543 -860 12 393 -372 486 872 -463 -1090 345 344 -578 196 725 -502 -539 550 -243 -823 466
4151 466 708 -532 -283 636 -84 -971 275 681 -626 -53 671 -199 -1022 173 609 -490 39 980
4169 980 -80 -1072 313 388 -526 184 967 -184 -557 -16 258 -798 23 984 -144 -497 638 -195
4187 -195 -1049 11 921 -74 -180 647 -138 -712 -36 867 22 -147 839 -444 -674 335 267 -403 -12
4206 -12 701 178 -511 28 617 -392 112 431 136 -600 -47 407 -790 73 713 -111 -270 273 173 -616
4226 -616 -119 525 -91 -402 288 216 -660 -89 565 -137 9 648 -76 -676 -151 749 -541 6 436 -68
4246 -68 -237 296 135 -603 -249 523 200 -640 455 179 -469 -236 500 -23 -274 61 184 -266 -42 184
$$ packed form
4114H39r34k89Q49p05p22J300N20j263j22Q52n23p62J200M13j059M36O22j195
4132e43l17Q72L81p65Q58L86j335o27J435jr22P74N29j227l7J089p93n80J289
4151D66K42j240K49R19p20q87J246M06j307N73P24q70q23J195M36j099N29R41
4169I80j060r92J385P5r14P10P83j151l73N41K74j056Q21R61j128l53J135q33
4187a95q54J060R10r95j06Q27p85n74O76R03q45j69R86j283k30J009o8o70L91
4206a2P13n23o89N39N89j009N04L19k95p36N53M54j197Q63O40q24j59N43j00p89
4226f16M97O44o16l11O90p2q76N71O54p02J46O39p24o00N25R00j290N47M30n04
4246f8j69N33j61p38L54P72l23q40J095k76o48K33P36n23k51L35J23m50K24K26
$$ plain form
4266 184 -14 -143 21 11 -167 -78 23 -42 -189 1 108 -629 130 298 -228 -284 378 332 -224 -279 96 -255
4288 -255 -183 478 -29 -234 247 92 -437 -62 191 97 -255 82 -158 -65 -328 176 67 -313 119 81 90 209
4310 209 202 -408 -102 18 304 -313 166 181 84 -38 -10 -126 -171 -228 17 -238 -211 -146 110 -288 126 226 -237
4333 -237 -267 333 364 -227 15 -85 -10 33 -16 171 -223 -268 -14 -188 -292 403 113 -317 293 16 -104 245
4355 245 227 3 -163 215 55 -32 468 289 -196 -89 97 166 125 -42 -105 -66 -362 -27 34 -1 194 182 32
4378 32 -154 -3 45 154 99 56 -104 161 177 474 -31 197 44 -146 2 31 -109 -32 -53 159 -45 145 120
4401 120 -230 162 408 -252 36 164 347 -246 -255 131 7 -24 -65 100 162 -62 408 5 -88 23 -27 -256
4423 -256 -90 101 -8 32 -37 30 -363 -125 522 -214 -315 199 242 -283 -123 42 -246 -205 259 -181 -396 -34
$$ packed form
4266A84j98j29J64j0j78Q9J01o5j47J90J07p37P59J68n26n6O62m6n56n5L75l51
4288b55P2O61n07k05M81j55n29L75K53r4l52L37k40R3k63N04j09l80M32l8RJ19
4310B09po10L06J20K86o17M79J5r7j22K8j16m5n7K45k55K7O5K56l98M14J00m63
4333b37l0O00L1n91K42j00P5M3m9J87l94m5K54j74j04O95k90m30O10k77j20L49
4355B45j8k24j66L78j60q7N00j79m85J07J86O9m1j67o3L9k96L35O1l5J95j2j50
4378C2j86J51M8J09n5m3j60K65J6K97n05K28j53j90J48K9j40P7k1K12k04J90k5
4401A20l50L92K46o60K88J28J83n93rL86j24l1m1J65O2k24M70m03r3J11n0k29
4423b56J66J91j09M0o9O7l93K38O47p36j01N14M3n25J60J65k88M1M64m40k15L62
$$ plain form
4445 -34 377 -281 -299 284 -6 -45 405 280 -203 -200 237 -114 -476 239 114 -220 -32 140 16 -58 25 276
4467 276 -418 -327 162 -156 -339 441 344 -390 -68 283 -156 -363 83 224 -282 396 195 -197 -92 530 -28
4488 -28 3 316 419 -76 -171 530 52 -247 400 307 -568 -102 272 192 -276 276 41 -436 -46 241 -359 -140
4510 -140 453 127 -436 424 441 -159 -290 351 74 -667 184 414 -300 -484 304 61 -189 220 296 -89 -465
4531 -465 405 112 -317 359 104 -405 -238 441 126 -561 361 521 -212 -133 378 -360 -755 284 309 -404
4551 -404 65 342 -235 -393 374 426 -224 296 492 -413 -341 344 190 -364 473 644 -416 -353 172 58 -740
4572 -740 480 554 -455 -131 96 -347 -391 432 428 -74 -107 510 -167 -553 479 43 -330 236 537 -727
4592 -727 -410 488 -150 -533 130 284 -546 -628 322 287 -579 318 710 -500 -339 509 -326 -732 580 720
$$ packed form
4445c4M11o58j8N83k90l9M50j25m83LM37l51l62P15j25l34J88J72j24p4Q3K51
4467B76o94R1M89l18j83P80r7p34L22L51m39k07M46J41n06O78k01l92J05O22n58
4488b8L1L13J03m95r5P01m78k99O47r3q75M66L74q0m68N52k35m77L90K87o00K19
4510a40N93l26n63Q60J7o00j31O41k77p41Q51K30p14j84P88k43k50M09P6l85l76
4531d65Q70k93m29O76k55n09J67O79l15o87R22J60p33P9N11p38l95J039K5p13
4551d04M69K77n77j58P67N2o50N20J96r05P2O85j54n54Q37J71j060O3N25j14p98
4572g40J220P4j009L24K27m43m4Q23mn02l3O17o77l86J032m36l73N66L01j264
4592g27L17Q98o38l83O63J54q30q2R50l5q66Q97L92j210J61Q48q35m06J312J40
$$ plain form
4612 720 -352 -339 732 -279 -765 328 450 -364 -291 629 -385 -380 560 554 -778 193 620 -591 -380 457
4632 457 292 -750 246 510 -48 -704 434 -2 -420 280 488 -297 -202 731 -449 -675 274 443 -183
4651 -183 -199 439 -50 -733 330 428 -428 -384 630 -281 -752 539 321 -587 -168 533 -264 -341 261 164 -659
4672 -659 198 642 75 -259 450 -82 -876 482 390 -331 -50 351 162 -545 -79 518 -529 -203 590 -25
4692 -25 -384 112 373 -232 221 521 56 -170 365 37 -449 -88 705 -109 -165 229 -16 -611 85 723 -126
4713 -126 -250 177 205 -734 261 509 -164 -233 419 48 -726 227 428 -161 -239 469 37 -302 169 346 -162
4734 -162 0 352 297 -500 231 303 -266 210 310 -70 -374 330 129 -383 -361 360 6 -358 425 97 -227
4755 -227 159 301 -286 -255 359 266 -317 306 231 -134 -195 345 -59 -197 212 171 -179 -123 209 42 -113 29
$$ packed form
4612G20j072J3J071j011m86J093J22q14P3R20j014NR40oj332R71M27j211K11Q37
4632D57j65j042R96K64n58o56J138m36m18P00K08p85R5R33j180k26R49J69o26
4651a83j6O38m89o83J063R8q56M4J014r11m71J291k18r08M19P01p97p7O02r7q23
4672f59Q57M44n67l34P09n32p94J358r2p21K81M01j89p07M66N97j047L26P93o15
4692b5l59M96K61o05M53L00m65k26N35l28m86L61P93q14n6L94k45n95O96O38q49
4713a26j24M27K8r39R95K48o73o9O52l71p74R53K01n89p8P08m32l39M71J77n08
4734a62J62L52n5p97P31P2n69M76J00l80l04P04k01n12K2P21l54l64P83l28l24
4755b27L86J42n87L1O14r3n83O23p5l65o1N40m04j38M09m1l50N6L32j67j55J42
$$ plain form
4777 29 414 -267 -300 -35 226 -210 280 167 -156 -120 210 4 -176 216 238 -249 -236 249 63 257 -52 320
4799 320 62 52 330 95 -186 67 79 -215 132 208 -54 -161 -148 231 -26 148 193 -204 -15 -90 -106 -90 -76
4822 -76 157 -341 -48 96 245 6 188 305 -135 -203 48 153 142 146 110 -163 -182 71 -5 -40 284 71 -274
4845 -274 -13 108 -76 29 198 21 -357 45 -89 -91 145 111 -86 -47 -130 -147 31 -170 150 -117 -129 3
4867 3 85 -47 267 287 -145 -37 -171 156 -136 -19 479 32 -122 75 269 69 -117 93 15 -203 -34 -217
4889 -217 -95 208 -226 -172 -224 213 148 -33 43 -142 -149 -197 -245 327 -170 43 138 183 48 270 -89 -92 66 190
4913 190 -277 -48 -60 66 86 151 348 5 26 197 50 -179 235 257 -421 118 81 -98 78 192 75 -187
4935 -187 51 322 83 -68 217 253 -15 -202 30 -297 13 163 -133 -468 37 139 -325 147 203 56 -183
$$ packed form
4777B9L85o81l3K65K61m36M90j13l23L6L30k06j80L92K2m87J3M85j86J94l09L72
4799C20k58j0K78k35k81K53J2k94L47P6k62j07J3L79k57J74M5l97J89p5j6J6J4
4822g6K33m98K93J44J49k39J82J17m40o8K51J05j1Ml6k73j9K53p6l5L24k13l45
4845b74K61J21j84J05J69j77l78M02j34kK36l4j97L9q3j7J78k01L20k67j2J32
4867CQ2j32L14K0m32J08j34L27k92J17M98m47j54J97J94k00j86K10p8k18J69j83
4889b17J22L03m34N4n2M37o5j81P6j85pm8m8N72m97K13R5M5j35K22l59lJ58J24
4913A90m67K29j2J26K0O5J97l43K1J71j47k29M14K2o78N39l7j79J76J14j17k62
4935a87K38K71k39j51K85L6k68j87K32l27L10J50k96l35N05J02m64M72N6j47k39
$$ plain form
4956 -183 137 -112 -178 -224 59 -143 -214 251 100 -147 -13 495 -130 136 332 264 -417 -127 129 -128 -248
4977 -248 412 270 -209 121 288 -142 103 160 251 -82 205 70 -209 -208 278 -114 -306 -20 61 -384 -60 184
4999 184 -44 -148 76 226 -74 -101 463 -171 32 177 -59 -234 -1 378 -299 -149 454 170 -383 179
5019 179 378 -266 -291 265 182 -239 319 322 -360 15 471 196 -216 79 224 -280 -232 230 -76 -430 427 155
5041 155 -258 -80 239 23 -106 473 404 -381 326 580 -168 -64 531 96 -372 361 426 -161 -6 623 -43
5062 -43 -509 224 427 -330 198 645 -82 -428 37 457 -171 -295 518 -316 -544 463 122 -424 27 321
5082 321 -149 -331 295 61 -323 142 302 -366 -106 437 -44 -404 -18 52 -550 -110 435 100 -524 96
5102 96 352 -269 -72 235 30 -451 309 180 -409 37 617 -134 -226 272 216 -390 -24 233 -261 -188 317
$$ packed form
4956a83L20k49o6m6K83k02p1M65j51k47J34N08o25K66J96o8o81K90K56k57j20
4977b48O60j42m79L30J67m30K45N7R1l33K87j35k79JM86l92j92K86Q1m45L24K44
4999A84k28j04K24J50l00k7N64o34K03J45k36j75K33L79o77J50O03k84n53N62
5019A79J99o44k5N56q3m21N58Lo82L75M56k75m12K95J45n04M8M62l06l54Q57k72
5041A55m13J78L19k16j29N79o9p85P07K54p48J04N95m35m68P33O5n87J55O29o66
5062d3m66P33K03p57N28M47p27l46M65M20o28j24Q13q34k28J007l41n46M51K94
5082C21m70j82O26k34l84M65J60o68K60N43m81l60L86P0o02M40N45l35o24O20
5102I6K56o21J97L07k05m81P60j29n89M46N80p51r2M98n6o06L66K57m94P3N05
$$ plain form
5123 317 122 -443 -44 289 -413 -472 182 60 -681 -58 343 -349 -169 478 -210 -337 346 390 -274 -145 407
5144 407 -242 -168 292 419 -479 -182 383 99 -323 346 -69 -114 -60 625 -112 -240 426 41 -411 191 633
5165 633 -115 -335 263 69 -446 83 108 -449 -280 162 17 -165 327 292 -305 -39 550 154 -337 76 -27
5186 -27 -254 -109 350 6 -344 161 139 -293 -234 586 128 -64 210 411 -365 81 141 7 -333 541 351
5207 351 -544 -11 555 -280 82 201 19 -198 335 341 -437 -148 326 395 -294 221 389 -274 -243 183 -19
5228 -19 -263 268 258 -480 -88 234 227 -400 496 144 -138 -49 221 -126 -197 252 -25 -359 -28 252 -25 -262
5250 -262 197 351 -68 -75 127 -107 -254 435 46 -148 180 0 -157 -237 128 192 -224 344 313 -129 -53 130
5272 130 18 -449 -29 29 -106 174 67 119 -270 297 -12 -293 -87 181 -5 -233 -86 52 -228 63 483
$$ packed form
5123C17j95n65L99L33p02n9O54j22p41O23M01o92J80O47o88j27O83M4o64J29N52
5144D07o49P4M60J27q98K97N65k84m22O69m15m5N4O85p37j28O66l85m52O02M42
5165F33p48k20N98j94n15N29K5n57J69M42j45j82M92l5n97K66N89l96m91M13j03
5186b7k27J45M59l44l50N05k2m32N9Q20m58j92K74K01p76M46O0j34l40Q74j90
5207C51q95N33N66q35L62J19j82k17N33Op78K89M74O9o89N15J68o63L1M26k02
5228a9k44N31j0p38L92L22po27Q96l52k82Q9K70l47p1M49k77l34L31K80k77k37
5250b62M59J54m19pK02k34j47O89l89j94L28j80j57q0L65O4m16N68l1m42P6J83
5272A30j12m67M20N8j35K80j07N2l89N67l09k81K06K68j86k28J47J38k80K91M20
$$ plain form
5293 483 -332 -173 30 -25 -26 124 305 -88 -95 100 80 -121 -126 -22 -218 -20 146 14 -177 -55 1 -234 -144
5316 -144 8 -78 -188 356 316 16 71 147 -34 -74 -68 111 -66 19 -16 68 60 8 -86 -59 334 228 51 -200 407
5341 407 16 -176 252 48 24 -63 -91 -51 -137 -362 247 58 -81 257 20 101 2 95 -37 -157 53 -10 -142
5364 -142 -22 -64 -243 -210 182 -13 -27 124 -38 31 -80 -29 -159 83 74 101 -118 -223 82 -58 61 272 128
5387 128 -95 -58 -76 115 -207 -205 152 61 -90 -67 130 281 133 -159 78 68 33 26 -26 -168 64 -49 215 171
5411 171 -119 -120 223 -230 -329 -30 -41 -123 -280 71 -82 34 10 127 141 -145 -103 -164 -142 153 119 89 104 108 61
5436 61 91 -19 -176 -182 111 40 -121 132 266 -142 -186 136 256 129 208 185 -229 109 -182 60 60 -227 -215 -287
5460 -287 98 93 95 -326 -452 47 -68 -286 219 65 -281 69 283 -157 -123 276 144 -341 -291 172 -46 68
$$ packed form
5293D83q15J59K03n5jJ50J81l93pJ95k0k01nJ04j96J98J66j32j91J22N6k35R0
5316a44J52q6j10N44m0l00N5P6j81m0OJ79j77Q5l5Q4qn2r4K7L93j06j77k51O07
5341D07l91j92M28k04k4q7k8M0q6k25O09j89j39L38k37Q1r9R3j32j20K10o3j32
5364a42J20m2j79L3L92j95j4J51j62O9j11N1j30K42rK7k19j05L05j40J19K11j44
5387A28k23L7j8J91l22KL57r1j51K3J97J51j48k92K37j0l5pn2j42K32j13K64m4
5411A71k90jL43m53r9K99j1q2j57L51j53J16k4J17J4k86M2o1K2K95l4l0J5Mm7
5436F1L0j10j57oK93p1j61K53J34m08m4L22J20j27P9k3m14L38k91K42%k87J2p2
5460b87L85nKm21j26M99j15k18N05j54l46L50K14m40L4L99j32m85N0M63k18J14
$$ plain form
5482 68 299 35 -200 -31 -121 -113 -364 149 -86 -107 280 101 -58 -33 -77 151 -198 216 22 -341 238 154 -89
5505 -89 -300 367 -68 -128 -31 145 -118 -103 160 73 -257 -41 87 -336 108 178 -18 -221 411 73 -263 -117
5527 -117 202 -151 -125 327 -101 -56 52 299 -87 -208 19 12 -403 18 320 -180 -421 205 302 -45 4 -8
5549 -8 -196 14 -62 -99 -77 -160 -165 -117 -156 310 175 -166 254 360 -322 39 322 -281 60 209 194 -308 90 307
5573 307 -174 -323 467 238 -326 35 293 -133 6 90 228 -176 86 192 -332 -35 176 -103 -144 205 162
5594 162 -102 -311 208 -21 -334 71 73 -289 -34 275 -90 -12 296 -28 -396 -66 387 -118 -187 105 90 -430
5616 -430 97 59 -118 -70 218 -157 -208 153 365 -313 -156 197 -125 -210 137 111 -98 -219 311 -225 -100 348
5638 348 77 -23 155 173 -174 101 305 295 -411 114 226 -185 -425 327 68 -140 -24 363 -59 -112 485
$$ packed form
5482F8K31k64k35J69r0Qk51N13k35k1L87j79j59K5m4K28l49M14j94l63N79q4k43
5505h9k11O67m35o0R7J76k63J5K63q7l30K16J28m23M44P0j96k03O32l38l36J46
5527a17L19l53K6M52m28M5J08K47l86j21K27pm15M21L02n00k41O26R7l47M9j2
5549hj88K10p6l7K2q3nM8l9M66j35l41M20J06o82L61K83o03L41J49j5n02L98K17
5573C07m81j49P90k29n64L61K58m26J39Q4J38m04K62J06n24K97K11k79m1L49m3
5594A62k64k09N19k29l13M05Kl62K55L09l65P8L08l24l68L30M53n05o9K92j5n20
5616d30N27l8j77M8K88l75n1L61K12o78J57L53l22q5L47k6k09j21N30n36J25M48
5638C48k71j00J78J8l47K75K04j0p06N25J12m11k40P52k59k08J16L87m22n3N97
$$ plain form
5659 485 236 -122 -21 313 -255 -212 238 120 -133 53 90 -171 61 216 -204 -68 276 -57 -295 -46 259
5680 259 185 -148 109 232 -109 -137 400 -84 -262 209 218 -370 -17 33 -73 -261 214 -141 -274 218 256 -217
5702 -217 -3 356 149 -311 -141 32 -174 -91 296 78 -71 263 17 -168 -90 74 -316 -264 -5 214 -30
5723 -30 123 188 -210 138 183 158 -182 26 114 -173 -314 115 -60 -219 177 19 -97 -406 -109 58 -12 35
5745 35 577 53 24 366 169 -99 262 -44 -80 -426 72 -122 -322 369 191 53 69 -73 62 -167 -78 168
5767 168 -270 135 353 249 178 282 310 -35 73 -111 -240 -207 -85 -1 -175 -229 100 9 -217 143 -110 280
5789 280 -52 94 -81 82 80 296 -252 -14 -1 -203 -158 194 -17 -11 98 -8 -55 2 -121 -30 -121 262 426
5812 426 -70 70 -31 -144 -50 144 95 -90 22 213 219 -256 -101 174 -78 -212 154 143 -245 55 -178 -232
$$ packed form
5659D85k49l58J01L34n68M3M50j18k53J86L7k61K32J55m20J36L44l33k38K49L05
5680B59p4l33K57J23l41k8N37m84j78M71Rn88L53N0j06j88M75l55j33M92L8m73
5702b17K14L59k07m60J70J73k06Q3L87k18j49L34k46j85P8J64l90N2K59K19k44
5723c0J53O5l98L48M5k5l40K08Q8k87j41M29j75j59L96j58j16l09K97J67p0M7
5745C5N42n24k9L42j97k68L61l06l6l46M98j94k00O91j78j38J6j42J35k29Q9K46
5767A68m38M05K18j04p1J04K8l45J08j84j29L3J22Q4j74n4L29r1k26L60k53L90
5789B80l32J46j75J63kK16n48K38J3k02M5L52k11OJ09j06m7N7j23R1r1L83J64
5812D26m96J40j01j13R4J94m9j85J12J91Om75J55K75k52j34L66j1l88L00k33n4
$$ plain form
5834 -232 -122 -15 144 162 73 -320 -71 -87 -180 7 70 169 -347 -33 201 -63 -212 231 -14 -177 27 -137
5856 -137 -234 -229 -175 5 -41 -124 85 -6 18 228 264 72 -108 31 58 15 -95 292 -295 47 -107 252 -337 -16
5880 -16 -3 -346 -79 -45 -24 149 -26 -44 -126 -56 417 14 39 -110 89 -65 -11 150 12 -16 146 -108 -225
5903 -225 155 266 157 -164 -138 20 -343 -183 80 38 -123 -28 -136 -200 -87 -12 140 215 -226 -142 21 -117
5925 -117 123 -85 24 61 107 -266 -92 191 49 -95 147 -125 -111 -196 111 -329 -57 230 72 -23 57 -54
5947 -54 -114 -112 -27 -167 -149 48 102 -70 328 7 -57 -110 298 -286 33 -207 -39 -198 -364 107 -16 -140 50
5970 50 130 -51 -6 111 92 -56 -82 129 -212 71 373 171 205 107 -108 -252 -74 66 -404 -160 187 -108
5992 -108 122 213 110 -133 -79 133 -145 -84 66 153 27 103 400 21 -212 98 269 177 -49 297 -228 -181
$$ packed form
5834b32J10J07J59J8q9l93K49j6r3J87O3R9n16L14K34k64j49M43k45j63K04j64
5856a37r7NN4J80m6q3K09r1K4K10L6j92j80J39K7m3j10L87n87L42j54L59n89L21
5880a6J3l43K67L4K1J73j75j8q2P0M73m03K5j49J99j54N4J61j38k8J62k54j17
5903b25L80J11j09l21K6J58l63J60K63m2j61R5j08o4J13P5J52P5m41Q4J63j38
5925a17K40k08J09L7M6l73J74K83j42j44K42k72J4q5L07m40K72K87j58r5Q0j11
5947e4o0KQ5j40J8J97N4j72L98l21o4n3M08n84L19k40J68j59j66M71j23j24J90
5970E0Q0j81M5J17j9j48k6K11l41K83L02k02L4r8k15j44J78J40m70K44L47k95
5992a08K30R1j03k43N4K12k78O1J50Q7j26P6K97l79k33L10J71r2k26L46n25M7
$$ plain form
6014 -181 219 24 -233 -125 249 -429 -330 19 5 -75 -215 232 -12 -152 65 117 22 -103 359 35 -176 143
6036 143 191 -257 23 153 -68 -140 358 -124 -232 -10 -187 -339 -400 350 -102 140 305 91 -135 285 286 -55
6058 -55 7 127 366 -48 -1 329 -309 -144 34 158 -180 109 189 24 -95 88 5 -147 152 69 -24 99
6080 99 65 -37 -289 38 -35 15 -129 19 -75 -143 139 345 -294 -89 185 104 -66 155 235 -201 93 206 -191
6103 -191 109 391 87 -231 66 235 -119 -275 316 118 -285 -126 271 -284 -120 249 166 -177 -139 150 -107
6124 -107 -129 -21 -14 -144 60 173 -1 -189 294 59 -151 225 251 -144 -356 55 -64 -299 143 -131 -323
6145 -323 126 466 -134 -15 328 29 -178 -119 252 -120 9 -51 -203 -106 -21 234 -22 -180 202 -105 -100 165
6167 165 419 -278 -218 383 -328 -143 33 42 -153 -85 421 -71 -91 -108 -42 -102 190 77 -298 4 140 44 -130
$$ packed form
6014a81M00j95k57J08L74o78R9L49j4q0j40M47k44j40K17N2r5j25M62l24k11L19
6036A43M8m48K80J30k21p2M98m82j08K22j77j52o1P50m52K42J65k14k26M20Jl41
6058e5O2J20K39m14M7L30o38J65J78J24l38K89Q0j65j19J83q3j52K99q3r3J23
6080I9l4j02k52L27p3N0j44J48r4o8K82K06o39K05K74q1j70K21Q0m36K94J13l97
6103a91L00K82l04l18K97J69l54j56N91j98m03J59L97n55J64L69q3l43L8K89k57
6124a07k2J08Pj30K04J13j74j88M83k35k10L76K6l95k12M11j19k35M42k74j92
6145c23M49L40o00J19L43k99k07N9L71l72J29o0j52R7Q5K55k56j58L82l07NK65
6167A65K54o97O0O01p11J85J76Rj95O8N06m92k0j7O6o0K92j13l75L02J36r6j74
$$ plain form
6190 -130 95 49 -78 9 374 237 -35 155 270 160 -139 149 51 -248 327 376 -320 62 141 -23 -334 171
6212 171 163 -7 457 538 14 86 -160 -115 -142 -197 10 45 -139 205 48 -117 203 157 -4 -238 94 -44 -209
6235 -209 30 178 -68 96 358 185 -101 183 -57 -271 -101 218 -183 -119 179 -36 -58 -49 236 -53 -71 -116
6257 -116 106 -112 -150 316 360 -157 151 -11 -25 62 103 -80 -238 -52 236 -296 151 -37 -145 34 37 -404
6279 -404 -193 -57 -106 112 104 128 -167 -127 -34 110 -16 -263 142 72 -123 159 -27 -104 -158 280 -177 49 145
6302 145 196 -119 87 155 -79 -180 -64 80 -40 -44 115 35 -25 125 166 -241 106 278 -70 -20 -126 -293 -173
6325 -173 54 12 269 -73 224 -72 -248 -75 43 36 295 -15 67 19 111 90 67 -6 178 -142 -77 63 -102
6348 -102 -117 34 64 -198 -128 49 16 -117 -138 -208 236 202 306 215 -208 270 173 -157 -65 82 1 126 44 182
$$ packed form
6190a30K25m6j27Q7L65j37k72J90J15j10k99K88r8k99N75M9o96L82P9j64l11N05
6212A71qj70M64Q1n24P2k46M5k7n5K07L5j84L44j57j65L20m6j61k34L32j38j65
6235b09K39J48k46J64K62j73k86K84k40k14J70L19m01O4K98k15k2RK85k89j8m5
6257a16K22k18l8M66M4n17L08j62j4Q7M1j83j58J86K88n32M47j88j08J79Lm41
6279d04K11J36m9K18qK4k95M0R3J44j26k47M05p0j95K82j86p7n4M38m57K26R6
6302A45N1l15K06O8k34j01J16J44j20mJ59q0o0J50M1m07L47J72l48N0j06j67J20
6325a73K27m2K57l42K97k96j76J73J18pK59l10Q2m8R2k1k3p3J84l20O5J40j65
6348a02j5J51L0k62P0J77l3j33k1p0M44l4J04r1m23M78r7l30R2J47q1J25q2J38
$$ plain form
6372 182 105 154 -34 169 -112 -59 215 165 -37 -97 83 -178 60 -125 -303 -105 112 -35 -90 -142 -14 -44 213
6395 213 164 -279 -240 173 52 -78 52 86 127 -49 294 -44 -66 -26 29 79 198 -86 12 -227 227 -35 28
6418 28 -86 -194 155 270 -43 295 54 -18 -88 -109 -177 65 -150 3 107 -68 -102 -77 383 27 81 -230 256
6441 256 34 -17 32 185 -286 39 47 -17 -251 -165 125 -98 89 -62 134 -42 87 -65 -37 22 198 -195 163
6464 163 225 -73 -94 125 305 -222 -233 191 100 -71 56 279 -55 -86 125 -7 -236 -146 -109 79 -6 -165 161
6487 161 -181 40 53 -230 79 114 -58 117 187 -47 157 149 141 160 -63 -114 -176 -41 65 127 -279 -164 16 -147
6511 -147 16 73 51 -236 55 132 452 -137 157 102 54 254 -91 122 -124 100 -48 64 88 129 157 -5 124
6534 124 192 -53 32 290 -142 -71 247 -80 27 157 -45 -347 -212 241 -90 -182 32 106 -348 92 242 -213
$$ packed form
6372A82p7M9j88K03k81N3K74n0k02o0J80k61K38j85j78J98K17j47n5n2J28l0K57
6395B13m9m43L9M13j21j30J30L4M1j76L43l38k2M0N5N0J19k84R8k39M54k62O3
6418B8j14j08L49J15l13L38k41p2p0k1o8K42k15J53J04j75l4K5M60l56N4l11M86
6441B56k22n1M9J53m71L25Qo4k34Q6K90k23J87j51J96j76J29j52K8N9J76l93L58
6464A63O2k98k1K19J80n27j1M24r1j71J27K23l34l1K11j32k29R0L7J88q5j59L26
6487A61l42K21J3k83L09L5j72J75P0k34K04qqJ9k23n1o2J35J06O2m06J15J80j63
6511a47J63N7k2k87K91P7L20n89K94n5m8K00l45K13k46K24j48J12K4M1K8j62J29
6534A24O8k45Q5K58m32P1L18l27J07J30k02l02J35M53l31r2K14P4m54M40J50m55
$$ plain form
6556 -213 -148 103 -191 53 88 159 8 -152 302 -24 87 -73 -28 41 -83 -5 -199 114 8 -39 123 -2
6578 -2 49 -68 -46 187 -219 -167 -170 56 -321 -489 328 163 -151 -56 160 85 -187 -73 -135 -171 228 121 20 77
6602 77 369 -106 71 -43 -28 -287 -9 22 -63 -200 442 50 -155 -2 275 -100 -36 226 301 -180 71 18
6624 18 -77 -351 -85 222 -40 -55 74 -100 -165 356 34 410 -213 -105 -180 102 231 -42 -100 70 85 -258
6646 -258 205 170 -26 -269 192 -127 -224 -39 115 221 177 66 14 -169 -286 -138 -296 -57 -10 257 68 -134
6668 -134 292 -29 -165 -8 303 196 -79 338 10 -106 -57 -61 109 144 61 -75 -247 161 57 -178 124 28
6690 28 -72 127 16 -25 -64 166 314 -189 -199 242 -32 -61 32 144 -273 -108 28 116 123 245 61 -38 -18 -33
6714 -33 120 58 24 32 -213 -94 263 -184 -184 40 -83 -57 141 107 113 214 -91 70 20 -27 -26 -125 -98 250 37 -26
$$ packed form
6556b13O5K51k94K44L5P1j51j60M54l26J11j60M5O9j24P8j94L13j06m7J62j25
6578bN1j17K2K33m06N2lK26l77j68Q17j65l14R5K16p5k72J14o2l6L99j07j01N7
6602G7K92m75J77j14J5k59K78L1q5j37O42l92k05J53K77l75O4K62P5m81K51n3
6624A8r5k74K66L07k62j5J29j74o5N21l22L76o23J08p5K82J29k73n8J70J5l43
6646b58M63l5j96k43M61l19r7J85J54J06m4j11n2j83j17J48j58K39M7K67j89k02
6668a34M26l21j36J57L11j07k75M17l28j16M9mJ70L5q3j36j72M08j04k35L02r6
6690B8j00J99j11m1l9K30J48n03j0M41k74k9R3J12m17J65J36Q8PJ22j84r9K0j5
6714c3J53o2l4Qk45J19L57m47%K24j23K6J98l4OJ01l05J61n0m7Jr9K7L48k13o3
$$ plain form
6740 -26 27 -199 154 198 -53 8 -183 36 84 136 129 -18 10 -213 69 120 -238 135 172 22 -188 67 137 0
6764 0 109 96 -179 -95 -167 95 51 22 -180 -42 155 426 -154 207 269 -132 -89 -103 28 -64 148 -180 -282 -120
6788 -120 -64 20 -113 -172 152 -112 187 24 110 155 -143 -152 -103 -9 -236 44 40 125 67 258 110 -71 41 -146
6812 -146 -162 -37 -319 -140 36 21 -284 -188 71 58 187 -229 -57 -11 -151 318 269 -122 8 51 2 28 105
6835 105 -156 -71 25 -200 -153 13 -56 272 -95 80 170 -109 115 99 -137 -22 141 -194 1 -69 201 -84
6857 -84 -190 -174 -22 -144 140 -1 -187 -161 1 190 42 -113 286 -307 72 70 -156 260 34 158 -21 64
6879 64 -92 -159 -81 77 -118 -98 269 102 111 47 302 169 313 -233 -56 -41 62 161 -240 -8 -8 151 -86 303
6903 303 -156 -72 -98 -135 391 -107 177 203 76 49 85 21 124 14 80 130 213 54 16 -184 -66 52 -267 109
$$ packed form
6740b6N3k26L53M4k51O1j91K19M8N2pj47K8k23K82N1l58L73L7j50k10K55P0j37
6764@J09j3k75Q4p2K62m4k9k02J38J97K71n80L61O2m01M3j4J31r2K12l28j02J62
6788a20N6Q4j33n9L24k64K99j63Q6M5k98rM9R4k27K80mQ5n8J91j48j81J12j87
6812a46j6J25k82J79J76j5l05R6K59j3J29m16J72M6j40M69m9l91J30M3m9K6P7
6835A05k61Q5R6k25M7J66o9L28l67J75R0k79K24j6k36J15J63l35J95p0K70k85
6857h4j06J6J52j22K84j41j86K6J62J89j48j55L99n93L79kk26M16k26J24j79Q5
6879F4j56o7P8J58j95K0L67j67Ro4K55j33J44n46J77J5J03R9m01K32%J59k37L89
6903C03m59Q4k6l7N26m98K84K6j27k7L6o4J03j10O6N0Q3j59l8k00J18J18l19L76
$$ plain form
6927 109 182 -11 2 206 -66 33 98 114 40 123 258 -104 -80 7 355 51 -212 -6 76 -317 -340 -92 443 11
6951 11 -10 57 -136 23 196 210 -288 -110 -346 58 20 35 -214 -73 -28 60 -288 -184 50 -424 -150 79 -35
6974 -35 122 -112 98 58 147 16 -357 208 -98 -80 47 89 137 128 -405 -146 310 -134 -1 33 -120 46 296
6997 296 101 57 -1 73 -103 -94 13 248 -110 93 302 32 -105 26 303 70 76 -180 -228 -80 -56 364 -148
7020 -148 66 144 147 30 80 -220 -94 52 63 -216 -176 -42 -261 -202 231 204 107 -135 -180 -53 96 -97 53
7043 53 89 74 -49 -26 -267 374 -103 58 182 -90 136 -179 13 165 -60 -123 -112 6 -100 250 93 62
7065 62 47 -11 -83 179 -174 -108 138 -9 58 89 280 130 71 83 -82 15 138 0 38 106 322 103 88 -99
7089 -99 -198 -91 -162 -150 17 -50 -405 -49 151 -217 163 132 232 61 -158 58 -197 204 156 -34 59 96 129
$$ packed form
6927A09P3j93J3K04k72R9O5J6p4Q3J35l62K4Q7L48l04k63K06Q2l93k3K48N35m32
6951A1k1O7j93J59J73J4m98J78k36M04l8J5k49J41M5Q8l48J04K34m74K74K29j14
6974c5J57k34K10m0Q9j31l73N65l06J8J27M2M8rn33K59M56m44J33L4j53J66K50
6997B96j95m4n8P4j76RJ07K35l58K03K09k70j37J31K77k33Ok56m8J48K4M20n12
7020a48K14P8Lj17N0l00J26J46J1k79M0J34k19N9M33k7r7k42m5J27J49j93J50
7043E3L6j5j23K3k41O41m77J61J24k72K26l15J92J52k25o3J1J18j06L50j57l1
7065F2j5n8p2K62l53O6K46j47O7L1J91j50n9J2j65R7J23j38L8O8K16k19j5j87
7089i9r9J07p1J2J67o7l55L56K00l68L80l1J00j71k19K16k55M01m8j90R3L7L3
$$ plain form
7112 129 -114 27 -3 373 33 -155 93 -208 -43 -215 46 25 -100 -27 -270 -24 33 -188 -94 -280 -150 -53
7134 -53 111 -37 -47 -243 -127 -308 77 222 220 -56 136 83 107 -160 94 -239 84 -29 121 193 45 34 199
7157 199 -111 182 171 -250 61 28 70 217 53 -154 -391 103 172 21 -316 187 213 -85 -127 292 172 113
7179 113 33 -36 -54 -323 63 117 -214 246 -146 136 -149 -4 -83 161 156 261 -124 34 32 96 145 5 207 -184
7203 -184 -13 -38 -76 83 26 -83 -80 94 173 -442 60 130 -147 78 156 206 -12 -88 318 76 -104 216 122 128
7227 128 -30 -256 134 69 52 -228 212 -237 -78 111 159 -53 -153 -260 -146 -101 74 -94 376 -192 63
7248 63 -205 -12 -245 196 102 -11 -155 -324 54 -140 60 -35 -64 -98 257 222 29 -80 195 -97 -127 -67 -83
7271 -83 -91 -34 145 121 62 -29 -25 -60 274 -90 18 -132 189 290 -214 -292 154 -173 84 94 163 112 -108 195 24
$$ packed form
7112A29k43J41l0L76l40j88K48l01J65j72K61k1j25P3k43K46N7k21R4j86J30R7
7134e3J64j48j0j96J16j81L85J45kk76J92n3K4k67K54l33L23j13J50P2j48j1J65
7157A99l10K93j1m21L11l3M2J47j64k07k37M94O9j51l37N03K6k98m2M19j20n9
7179A13q0o9j8k69L86N4l31M60l92K82k85J45p9K44nJ05l85J58kO4M9j40K02l91
7203a84J71k5l8J59n7j09LJ74P9o15N02P0k77K25P8N0k18p6M06k42j80L20r4O
7227A28j58k26L90o5j7k80M40m49J59J89M8k12j00j07J14M5J75j68M70n68K55
7248F3k68J93k33M41r4j13j44j69L78j94K00r5k9l4L55l5j93j09K75k92l0O0j6
7271h3qN7J79k4n9r1Ml5L34l64J08j50L21J01n04p8M46l27K57J0O9n1k20L03j71
$$ plain form
7296 24 -158 58 174 164 82 -48 -52 55 -106 -93 90 255 -176 -35 -183 39 -90 152 -120 6 63 93 -136
7319 -136 -78 205 78 79 -79 -28 119 -12 -73 -232 -79 56 23 24 2 126 -75 -69 -84 -241 -187 -9 31 92 -91
7344 -91 -90 -164 1 -151 115 -70 108 -160 -21 40 34 -133 52 -78 -3 37 42 199 -345 -29 118 -50 189 -25
7368 -25 18 -142 50 98 -59 266 -55 -35 117 -117 52 81 -132 -167 68 70 -23 -143 -81 109 20 -37 18 -80 -191
7393 -191 101 -65 -199 17 -100 169 -162 172 -41 19 -171 -39 375 -96 58 182 -152 13 153 -154
7413 -154 -184 100 -15 -198 51 -151 -159 167 41 -66 7 90 -226 -335 -27 16 169 -41 71 -32 35 177
7435 177 50 128 115 -154 -213 124 -11 299 59 -169 -19 -132 -44 195 110 6 -53 -111 25 -133 114 138 114
7458 114 -27 -163 -55 -63 -118 146 -53 54 -135 59 -108 -164 170 45 36 8 -31 -31 -136 127 -272 289 -130
$$ packed form
7296B4j82K16J16j0q2j30mJ07j61J3J83J65m31J41j48K22j29K42k72J26N7L0k29
7319a36N8K83j27Jj58N1J47j31o1j59J53J35l3Jk2J24k01Oj5j57N4J78M0O1j83
7344i1Jp4J65j52K66j85J78k68J39O1oj67J85j30P5M0NJ57n44L16J47j68K39k14
7368b5M3j60J92M8j57L25l21K0J52k34J69K9k13l5K35Kr3j20O2J90q9n7N5r8j11
7393a91K92j66j34K16j17K69l31L34k13O0j90J32M14m71J54J24l34J65J40l07
7413a54l0K84j15j83K49k02qL26j26j07P3Q3l16j09L08M3J53k10J12j03O7J42
7435A77j27P8j3k69n9L37j35L10k40k28J50j13Q8K39q5j04n9n8J36j58K47K4k4
7458A14j41j36J08qn5K64j99J07j89J94j67n6L34j25rk8l9%j05K63l99N61m19
$$ plain form
7481 -130 -325 -20 -209 83 -199 -410 112 -37 -18 113 265 73 -209 -91 -51 -146 61 -176 121 -212 -155
7502 -155 121 -246 -138 95 -201 97 -129 -121 76 230 129 178 -37 61 16 166 -171 -305 139 -111 -48 -98
7524 -98 96 18 -153 -64 -58 197 -89 -134 77 -237 31 -142 -135 -201 79 15 -41 1 106 -178 -108 -188 -118 81 -284
7549 -284 -161 23 -10 -127 7 1 241 117 2 -81 -148 166 -291 199 -81 69 184 261 -126 152 -37 -124
7571 -124 -6 -57 245 77 -220 -24 96 39 108 -46 71 202 -271 -194 202 134 47 41 52 172 -83 -33 -35 -198
7595 -198 -36 176 -23 143 -154 -71 330 -96 34 101 -81 -62 179 75 63 -46 -91 197 -72 102 250 99
7617 99 46 38 -65 -106 -189 -60 118 195 -154 -304 4 -150 189 -192 -59 47 -92 -121 -61 -56 -29 6 -149 -45
7641 -45 212 56 -75 101 -219 -101 8 -146 303 125 -98 125 13 -129 -30 -287 -110 -164 156 -28 -41
$$ packed form
7481a30j95L05j89K92k82k11N22j49J9J31J52j92k82J18M0r5K07k37K97l33N7
7502a55K76l67J08K33k96K98k26QJ97J54j01M9k15R8m5J50l37j34M44k50O3n0
7524i8J94p8j71Q9OK55k86m5K11l14K68j73Po6K80o4n6M2J05k84P0q0P0J99l65
7549b84J23J84l3j17J34oK40j24j15q3o7L14m57M90k80J50J15P7l87K78j89q7
7571a24J18n1L02j68k97J96J20n7O9j54J17J31m73P7L96o8q7oJ1J20k55N0kj63
7595a98J62K12j99J66k97Q3M01m26J30O7j82J9K41j04j2j09m5K88k69J74J48j51
7617I9n3qj03m1q3J29J78P7l49j50L08j54L39l81J33J06j39k9O0NK7L5j55J04
7641d5K57j56j31J76l20J18J09j54M49j78k23K23j12j42R9k57J77n4L20j84j3
$$ plain form
7662 -41 -139 117 148 -262 -117 -13 -233 3 319 -67 -54 23 103 -66 88 -283 -9 -120 -190 215 -317 -79
7684 -79 100 136 -230 120 -254 -46 67 -7 -44 -27 -368 -44 -84 45 149 158 -235 81 180 -177 -262 -121 113
7707 113 11 -107 -47 132 -30 -65 -124 0 249 40 -121 409 -3 -101 -21 -10 -138 -128 -56 -58 5 158 34 85
7731 85 -218 25 236 -95 -89 -3 15 -97 -92 -309 -83 -51 -42 224 207 -322 6 -213 -286 91 104 -46 -21 -1 -32
7756 -32 -199 184 -83 -31 -72 -202 -86 186 -73 49 183 -68 -168 35 178 -69 -300 104 -70 9 37 -99
7778 -99 205 -57 -55 -105 -40 -26 169 170 -100 169 -215 -49 78 -110 -86 -135 64 -56 424 -440 96 1 -54 -97
7802 -97 115 -236 110 32 245 19 -165 -138 -320 36 -102 -163 -105 -84 -202 136 267 -123 45 -50 67 -127
7824 -127 -7 284 -103 118 -152 65 140 -355 35 -52 305 14 140 80 57 59 -13 -122 28 -233 85 46 233
$$ packed form
7662d1r8K56L1m10J45J04k20K36L16l86J3P7Q0j69J54l71K74j11p0M05n32K38
7684g9J79L6l66L50l74K08J13p4l7J7l41L24m0J29J04Rl93L16R9l57q5J41K34
7707A13j02j18O0J79j62l5n9J24K49k09j61N30m12r8Q0J1j28J0P2kO3J53j24N1
7731H5l03K43K11l31OQ6J8j12Nk17K26L2RK66j7n29L28k19p3L77J3j50K5K0l1
7756c2j67L83k67N2m1j30J16K72k59J22J34k51j00K03J43k47k31M04j74P9K8j36
7778i9L04k62Kn0O5J4J95Jk70K69l84J66J27j88K4m9J99j20M80q64N36r5n5m3
7802i7K12l51L46p8K13k26j84K7j82L56j38o1N8K1j18L38J31l90J68r5J17j94
7824a27J20K91l87K21k70K17P5m95L90q7L57k91J26o0k3Kp2j09J50k61L18l9J87
$$ plain form
7847 233 61 285 -34 36 84 55 67 -199 14 123 -39 115 132 78 80 -171 -180 -274 190 -234 -11 2 1 -71 -39
7872 -39 -63 92 8 -21 122 80 -9 28 132 -77 219 -165 -25 -111 157 179 21 -67 31 6 62 199 -125 -49 -24
7897 -24 73 -116 -70 -137 -190 358 -225 -23 -122 55 220 58 -183 116 -9 -344 -123 55 -96 -226 -16 272
7919 272 32 26 4 27 98 -78 -142 48 212 -62 -180 -23 136 88 -48 -53 110 -43 233 196 137 52 151 -252
7943 -252 136 208 -61 -230 119 95 80 -263 77 -238 -169 2 -381 11 47 25 -172 -126 51 80 94 149 -43
7966 -43 223 -23 48 91 16 -158 -314 25 182 -69 130 -129 157 16 68 -43 223 -197 20 252 -65 -151
7988 -151 101 147 123 -9 -19 -204 132 -8 122 48 -185 -24 -25 -52 -260 -86 -14 238 -166 106 92 16 -99
8011 -99 50 136 -25 5 -272 -175 207 -190 3 -39 -194 -258 -184 -217 187 196 235 -204 167 10 45 11 7 37 3 191
$$ packed form
7847B33j72K24l19P0M8k9J2k66K13J09j62J54J7n4Kk51rr4M64m24K23J3jp2L2
7872c9k4J55q4k9J43m2q9L7J04k09K96l84J40q6K68K2j58q8R8k5N6J37l24P6K5
7897b4R7j89M6o7n3N48n83K02r9J77J65j62k41K99j25l35K21J78j51j30K10K88
7919B72k40ok2K3P1j76o4J90J64k74j18J57J59m8j36nJ63j53K76l7n9q5R9m03
7943b52L88P2k69j69L49k4j5l43L40l15O9J71l83L92L6k2j97M6J77K9J4N5j92
7966d3K66k46P1M3p5j74j56L39J57k51J99k59K86j41N2j11K66m20K17K32l17q6
7988a51K52M6k4j32j0j85L36j40J30p4k33J61jk7k08J74P2K52m04K72j4p6j15
8011i9J49Q6j61L0k77R7L82l97J93m2j55o4P4l3M04RL9m39L71j57L5l4mL0l4J88
$$ plain form
8037 191 26 111 140 180 -33 -91 -111 -270 -126 -116 -54 34 58 180 -131 -26 -62 34 100 4 -38 65 -6 323 120
8062 120 184 -55 -56 -80 82 70 35 -8 51 -36 -176 -85 152 23 54 25 -111 184 -31 -157 -196 -65 214 12
8086 12 91 -41 46 -270 83 83 -78 78 -186 -3 -187 19 -182 106 -62 -96 218 56 115 194 -193 77 -232
8109 -232 -1 61 -229 20 220 64 -23 148 103 -249 -67 -36 -151 163 166 127 -170 -33 53 97 -108 145 170
8132 170 -7 -32 102 -116 -57 183 73 -54 -360 -101 88 77 95 132 69 -194 22 -216 -71 -341 -47 -96
8154 -96 93 57 253 125 -49 -171 -144 -81 -247 4 82 -7 122 53 90 -22 9 -231 202 -51 -11 144 194 56
8178 56 3 -38 -10 -52 93 -172 -83 107 66 153 38 130 -159
$$ packed form
8037A91j65Q5K9M0k13n8k0j59J44J0O2Q8K4J22l11J05l6R6O6r6m2J03p1L29k03
8062A20O4k39jk4J62j2l5m3N9q7j40R1K37j29L1k9j36K95k15j26l9J31K79k02
8086A2P9j32Q7l16L53%j61J56k64J83j84K06k01K88j68l4L14j62N9P9l87K70l09
8109b32K31O2k90K49K00j56q7J71m5l52J82L1j15L14Ll9k97J37Q6M4k05K53K5
8132A70j77k5J34k18N9K40j10j27l06K59J89j1J8L7o3k63K16k38J45k70K94m9
8154i6J89l6J96j28j74j22K7O3j66K51P8q9J29o9L7j12L1k40M33k53M0J55N0j38
8178E6n3m1K8m2J45k65Q9J90m1Q7j15R2k89
8191a59
$$ Imaginary data points
##PAGE= N=2
##DATA TABLE= (X++(I..I)), XYDATA
$$ plain form
0 0 0 0 0 0 0 0 0 -8 8 -8 8 -16 24 -24 32 -40 52 -64 80 -95 112 -136 160 -185 217 -257 300 -345 400 -457
30 -457 525 -598 678 -769 866 -977 1099 -1229 1373 -1533 1708 -1897 2102 -2329 2577 -2848
46 -2848 3141 -3463 3815 -4206 4633 -5102 5625 -6207 6859 -7594 8428 -9383 10499 -11811
60 -11811 13385 -15310 17733 -20891 25185 -31396 41207 -59078 101983 -421962 -75706
71 -75706 768060 -231354 -288782 469007 170238 -585593 -38776 302755 -235022 -114115
81 -114115 590273 141307 -461643 -14218 194591 -330998 -45178 531713 51020 -406707
91 -406707 131399 206856 -409960 -223908 392269 113174 -178879 189545 41124 -491432
101 -491432 -60248 465376 -44509 -299368 319994 278889 -416804 -238011 314214 17951
$$ packed form
0@%%%%%%%qJ6j6J6k4M0m8N6p2R2j16J44j75K07k48K96l45M02m74N57o45P45q57
30d57R82j123J276j447J635j843K076k328K602k906L241l605L999m431M906n425
46b848N989o604P278q021Q839r735J0727j1832J3066j4453J6022j7811J9882k2310
60a1811K5196k8695L3043l8624M6076n6581P2603j00285J61061n23945L46256
71g5706Q43766r99414n7428P57789k98769p55831N46817L41531n37777J20907
81a14115P04388m48966o02950M47425K08809n25589K85820N76891m80693m57727
91d06707N38106P5457o16816J86052O16177k79095k92053L68424j48421n32556
101d91432M31184N25624n09885k54859O19362m1105o95693J78793N52225k96263
$$ plain form
111 17951 -200697 293336 255781 -345024 -211833 201854 -39587 -146679 235904 150036
121 150036 -222749 -28587 134999 -238878 -204360 325469 230183 -215935 -46707 143559
131 143559 -180889 -176708 219328 124723 -136822 98373 181670 -221453 -234503 172562 114587
142 114587 -122902 111936 197246 -187901 -212027 126913 48574 -151280 84937 216503
152 216503 -77711 -162491 40340 -23881 -131849 108973 193921 -77701 -95280 95368 -32982
163 -32982 -166630 57924 165200 -24583 -31682 97600 -40972 -168387 28185 126294 -35849
174 -35849 -23566 102937 -21260 -139559 -1609 59751 -47556 -4168 108721 3395 -112086
185 -112086 -9465 48070 -41032 -4620 98312 23172 -63327 1628 24258 -44114 -12752
$$ packed form
111A7951k18648M94033l7555o00805J33191M13687k41441j07092L82583q5868
121A50036l72785J94162J63586l73877L4518N29829r5286m46118J69228J90266
131A43559l24448M181L96036r4605k61545K35195Q3297m03123j3050M07065n7975
142A14587k37489K34838Q5310l85147k4126L38940p8339j99854K36217J31566
152B16503k94214q4780K02831o4221j07968K40822Q4948k71622j7579J90648j28350
163c2982j33648K24554J07276j89783p099J29282j38572j27415J96572R8109j62143
174c5849J2283J26503j24197j18299J37950O1360j07307M3388J12889j05326j15481
185a12086J02621N7535q9102L6412J02932p5140q6499O4955K2630o8372L1362
$$ plain form
196 -12752 73256 33043 -40922 -8420 8302 -49618 -28740 47636 24686 -25769 631 8616
208 8616 -40791 -36769 26962 35647 -2995 7664 24295 -20360 -37704 12241 28982 2651 11376
221 11376 28144 -6816 -40353 -11052 16354 -8551 -5426 32600 6983 -40301 -15290 11001
233 11001 -16329 -12383 34027 23741 -24895 -9508 21052 -14307 -24547 32049 29892 -19977
245 -19977 -1303 24692 -17794 -29207 19638 18121 -21519 471 26134 -18082 -30562 20728
257 20728 11334 -30641 5669 33086 -15678 -24841 23105 11696 -27683 2954 29633 -13033
269 -13033 -20005 26688 8630 -30563 7029 28829 -19781 -21414 26978 12532 -28394 162
281 162 27681 -10660 -24252 14657 10469 -18316 1426 15038 -10642 -9570 11358 -3092 -15295
$$ packed form
196a2752Q6008m0213p3965L2502J6722n7920K0878P6376k2950n0455K6400P985
208H616m9407M022O3731Q685l8642J0659J6631m4655j7344M9945J6741k6331Q725
221A1376J6768l4960l3537K9301K7406k4905L125L8026k5617m7284K5011K6291
233A1001k7330L946M6410j0286m8636J5387L0560l5359j0240N6596k157m9869
245a9977J8674K5995m2486j1413M8845j517l9640K1990K5663m4216j2480N1290
257B0728r394m1975L6310K7417m8764r163M7946j1409l9379L0637K6679m2666
269a3033o972M6693j8058l9193L7592K1800m8610j633M8392j4446m0926K8556
281A62K7519l8341j3592L8909m188k8785J9742J3612k5680J072K0928j4450j2203
$$ plain form
294 -15295 8571 14987 -10338 -6702 16736 1372 -16872 6450 14560 -6687 -2305 12640 -271
307 -271 -10779 1506 5193 -8525 -5961 9070 1556 -12047 -2122 4780 -6051 -6749 2784 5471
321 5471 1131 -1023 2718 4193 -1031 -980 5034 3804 582 2338 4209 -1709 -6750 54 2633 -7664
337 -7664 -4956 6937 -1028 -10337 -671 3262 -6394 -3323 7454 2603 -4007 6984 8344 -9016
351 -9016 -2596 15332 434 -11855 8772 13808 -10143 -12298 7619 2578 -13334 -1687 9855
364 9855 -5057 -6777 6282 -4266 -11289 8678 10172 -9706 -904 17986 -189 -18556 5645
377 5645 18420 -8289 -10081 16341 4668 -18496 -1286 10793 -8579 -7205 13608 2043 -18030
390 -18030 -47 13442 -10407 -10868 20242 10360 -20129 -3251 17042 -6182 -14280 15208 15815
$$ packed form
294a5295K3866O416k5325L636K3438j5364j8244K3322Q110k1247M382J4945j2911
307b71j0508J2285L687j3718K564J5031p514j3603R925O902j0831o98R533K687
321E471m340k154L741J475n224N1O014j230l222J756J871n918n041O804K579j0297
337g664K708J1893p965r309R666L933r656L071J0777m851o610J0991J360j7360
351i016O420J7928j4898j2289K0627N036k3951k155J9917n041j5912J1647J1542
364I855j4912j720J3059j0548p023J9967J494j9878Q802J8890j8175j8367K4201
377E645J2775k6709j792K6422j1673k3164J7210J2079j9372J374K0813j1565k0073
390a8030J7983J3489k3849m61L1110r882l0489J6878K0293k3224q098K9488O07
$$ plain form
403 15815 -14387 -8089 12123 -8209 -17408 16418 17446 -16310 -4630 18187 -11931 -25948 16094
416 16094 24636 -14906 -4956 26608 -10233 -38326 11922 28023 -17677 -5270 34077 -6186
428 -6186 -42332 5303 22944 -22083 -2695 47781 426 -45807 7888 22913 -34112 -5042
440 -5042 58493 5054 -45521 14056 21826 -51911 -19472 63839 12287 -44951 20233 22578 -63727
453 -63727 -22171 65156 3082 -41601 46213 35611 -77117 -32386 68519 -842 -45531 60131
465 60131 47973 -81084 -35763 62759 -18964 -54207 68693 55607 -75897 -28116 56003
476 56003 -41321 -63217 82897 64398 -75062 -15300 67192 -49949 -75005 75955 60971
487 60971 -60031 9700 67874 -70510 -83233 76551 45766 -70430 31206 87245 -79421
$$ packed form
403A5815l0202O298K0212k0332r199L3826J028l3756J1680K2817l0118j4017M2042
416A6094Q542l9542R950L1564l6841k8093N0248J6101m5700J2407L9347m0263
428f186l6146M7635J7641m5027J9388N0476m7355m6233N3695J5025n7025K9070
440e042O3535n3439n0575N9577P770p3737L2439Q3311n1552n7238O5184K345q6305
453f3727M1556Q7327o2074m4683Q7814j0602j12728M4731J00905o9361m4689J05662
465F0131j2158j29057M5321R8522q1723l5243J22900j3086j31504M7781Q4119
476E6003r7324k1896J46114j8499j39460N9762Q2492j17141k5056J50960j4984
487F0971j21002O9731N8174j38384j2723J59784l0785j16196J01636N6039j66666
$$ plain form
498 -79421 -92735 73805 29756 -82273 46286 111339 -69330 -93060 67057 14592 -92061
509 -92061 53493 119401 -61551 -73390 72111 -11114 -114019 51139 119685 -52928 -52917
520 -52917 79845 -24386 -125337 42938 103103 -52041 -20294 99553 -34426 -128559 42508
531 42508 80474 -66869 66 123529 -31744 -129852 40464 59365 -90926 3944 143372
542 143372 -18768 -123196 38968 47821 -102643 -6097 138620 -2299 -91753 49382 28875
553 28875 -119101 -10542 129188 -2380 -67042 65373 17817 -125588 -12032 105967
563 105967 -22395 -49109 95174 26595 -128565 -20088 82719 -35223 -28559 111831 20136
574 20136 -119698 3076 72913 -71839 -46014 125193 43044 -104419 224 56492 -82942
$$ packed form
498g9421j3314J66540m4049j12029J28559O5053j80669k3730J60117n2465j06653
509i2061J45554O5908j80952j1839J45501q3225j02905J65158O8546j72613J1
520e2917J32762j04231j00951J68275O0165j55144L1747J19847j33979r4133J71067
531D2508L7966j47343O6935J23463j55273r8108J70316J8901j50291R4870J39428
542A43372j62140j04428J62164Q853j50464R6546J44717j40919q9454J41135k0507
553B8875j47976J08559J39730j31568o4662J32415m7556j43405J13556J17999
563A05967j28362k6714J44283o8579j55160J08477J02807j17942O664J40390r1695
574B0136j39834J22774O9837j44752K5825J71207q2149j47463J04643N6268j39434
$$ plain form
585 -82942 -50028 113450 42908 -80685 12721 50869 -77933 -51175 80904 25032 -45026
596 -45026 52006 43750 -98469 -52550 79604 14889 -48396 52345 50498 -74994 -41839 47793
608 47793 -20252 -44221 74510 58942 -70510 -35771 42435 -29802 -44912 69283 52851
619 52851 -55675 -11980 49524 -39746 -65804 47389 56899 -25673 -1849 27277 -44772 -46077
631 -46077 40819 25060 -31536 18976 44685 -35028 -48637 19855 11190 -19529 32362 43509
643 43509 -32870 -39231 18810 3211 -25671 19006 37731 -10528 -18365 6704 -18240 -30837
655 -30837 22280 38932 -6840 -13675 8585 -10997 -24228 7846 20129 674 5863 16600
667 16600 -11292 -29643 -3484 14540 6169 6825 9157 -8071 -15093 -3331 -1985 -4494 7922
$$ packed form
585h2942L2914J63478p0542j23593R3406L8148j28802K6758J32079n5872p0058
596d5026R7032q256j42219M5919J32154o4715o3285J00741j847j25492L3155Q9632
608D7793o8045k3969J18731j5568j29452L4739P8206p2237j5110J14195j6432
619E2851j08526M3695O1504q9270k6058J13193R510q2572K3824K9126p2049j305
631d6077Q6896j5759n6596N0512K5709p9713j3609O8492q665l0719N1891J1147
643D3509p6379o361N8041j5599k8882M4677J8725m8259p837K5069k4944j2597
655c0837N3117J6652m5772o835K2260j9582j3231L2074J2283j9455N189J0737
667A6600k7892j8351K6159J8024q371O56K332j7228p022J1762J346k509J2416
$$ plain form
680 7922 17646 4971 -11014 -11609 -4804 427 6237 9773 8175 476 -9098 -7974 -151 -1745 -1236
695 -1236 11513 11361 -7081 -13300 -4302 -2109 -1048 9361 8454 -4936 -1836 5259 -9103 -12276
709 -12276 12347 15370 -5264 -2329 8076 -7436 -14772 6170 10817 -6117 -573 10193 -7371
722 -7371 -14212 6621 4616 -9595 6811 16694 -9410 -15131 10654 7589 -13297 1900 18762
735 18762 -4155 -12879 8382 2113 -15304 4117 15595 -8799 -10293 12145 979 -18691 3136
748 3136 18390 -7644 -11117 14840 5056 -17497 1286 15341 -5371 -7182 11829 1630 -13927
761 -13927 2668 9957 -10002 -6385 14254 153 -15768 4223 10566 -10222 -5389 13146 1377
774 1377 -10847 4923 9047 -8767 -3625 12344 -636 -11069 6496 7154 -11555 -3989 10740
$$ packed form
680G922R724j2675j5985n95O805N231N810L536j598p699r574J124P823j594N09
695a236J2749j52j8442o219Q998K193J061J0409r07j3390L100P095j4362l173
709a2276K4623L023k0634K935J0405j5512p336K0942M647j6934N544J0766j7564
722g371o841K0833k005j4211J6406R883k6104n721K5785l065k0886J5197J6862
735A8762k2917q724K1261o269j7417J9421J1478k4394j494K2438j1166j9670K1827
748C136J5254k6034l473K5957r784k2553J8783J4055k0712j811J9011j0199j5557
761a3927J6595P289j9959L617K0639j4101j5921J9991O343k0788M833J8535j1769
774A377j2224J5770M124j7814N142J5969j2980j0433J7565O58j8709P566J4729
$$ plain form
787 10740 -1765 -10695 4166 7413 -7827 -4634 8666 805 -7353 4379 6008 -5547 -1080
800 -1080 6719 -705 -4394 3711 3077 -4638 -1684 4347 -1591 -5272 2413 2176 -4990 -1026 3953 -1300
816 -1300 -2370 2221 2417 -1591 -341 3133 485 -1994 1579 1936 -1948 -1104 1644 -736 -1745 -679
832 -679 441 -530 -2252 -5 1883 -1338 -1148 1693 1177 -926 -242 2124 1523 -1393 361 2846 -1042
849 -1042 -2071 1733 706 -2745 -450 1311 -1096 -2450 440 1283 -2347 -941 3630 155 -2646
864 -2646 2398 2318 -2299 -236 3627 622 -2904 916 3216 -3051 -3268 3875 425 -5089 986 2981
880 2981 -4063 -2726 4100 1495 -4361 1688 5969 -3269 -4641 6313 2675 -6433 2097 7377 -4366
895 -4366 -6370 5396 1911 -7859 421 8637 -4486 -8113 6831 2901 -10333 2238 11631 -4706
$$ packed form
787A0740j2505q930J4861L247j5240L193J3300p861q158J1732J629j1555M467
800a080P799p424l689Q105o34p715K954O031n938l681P685k37p166L964M979n253
816a300j070M591J96m008J250L474k648k479L573L57l884Q44K748k380j009J066
832f79J120r71j722K247J888l221J90K841n16k103O84K366o01k916J754K485l888
849a042j029L804j027l451K295J761k407j354K890Q43l630J406M571l475k801
864b646N044q0m617K063L863l005l526L820K300o267k17P143l450n514O075J995
880B981p044J337O826k605n856O049M281r238j372J0954l638r108Q530N280j1743
895d366k004J1766l485r770Q280Q216j3123l627J4944l930j3234J2571R393j6337
$$ plain form
909 -4706 -7116 9381 3232 -12365 1867 13542 -5200 -9130 11490 3547 -17048 474 14043
922 14043 -6913 -9700 13190 3524 -17443 690 15371 -8498 -9188 18325 5563 -20031 2456
935 2456 16661 -12487 -10397 21089 5771 -21388 1989 16300 -14849 -13360 21450 6558 -21201
948 -21201 5634 16132 -19761 -12050 25798 4913 -21960 11090 19856 -22276 -15308 25646 3895
961 3895 -22990 14252 20809 -26128 -15154 25599 -2365 -24503 19319 22064 -27099 -12502 28118
974 28118 -6716 -28869 23981 28003 -27472 -12153 28520 -9316 -29644 22923 23625 -26203 -5412
987 -5412 29147 -16054 -33578 24055 22168 -28047 556 32904 -19654 -33028 26140 18335 -29924
1000 -29924 5846 37556 -18146 -31614 23561 10029 -32654 12621 39037 -23489 -30002 28926
$$ packed form
909d706k410J6497o149j5597J4232J1675j8742l930K0620p943k0595J7522J3569
922A4043k0956k787K2890r666k0967J8133J4681k3869o90K7513j2762k5594K2487
935B456J4205k9148K090L1486j5318k7159K3377J4311l1149J489L4810j4892k7759
948b1201K6835J0498l5893P711L7848k0885k6873L3050Q766m2132O968M0954k1751
961C895k6885L7242O557m6937J0974M0753k7964k2138M3822K745m9163J4597M0620
974B8118l4834k2153N2850M022n5475J5319M0673l7836k0328N2567P02m9828K0791
987e412L4559m5201j7524N7633j887n0215K8603L2348n2558j3374N9168p805m8259
1000b9924L5770L1710n5702j3468N5175j3532m2683M5275K6416o2526o513N8928
$$ plain form
1012 28926 5473 -39261 10687 40194 -18784 -23061 28689 -54 -40457 14242 38566 -19512
1024 -19512 -15811 32413 -4815 -40390 14423 29599 -24385 -7898 38879 -7447 -44457 12297
1036 12297 26278 -25027 -3994 38631 -8224 -35912 16763 16882 -31675 163 43504 -5097
1048 -5097 -32539 16109 11336 -34211 749 40097 -7697 -26077 20759 7948 -36704 -2713
1060 -2713 33022 -5613 -15060 24773 2817 -37540 1658 30568 -11659 -12643 30570 5990 -33914
1073 -33914 -321 19556 -16204 -7804 32296 4735 -31271 1002 14901 -19745 -7000 30855
1085 30855 4463 -22034 8288 9948 -24969 -7449 29517 5891 -15884 9697 7271 -24625
1097 -24625 -7376 21370 -442 -10727 16570 6661 -25007 -8168 15037 -3333 -5955 19330
$$ packed form
1012B8926k3453m4734M9948K9507n8978m277N1750k8743m0403N4699K4324n8078
1024a9512L701M8224l7228l5575N4813J5176n3984J6487M6777m6326l7010N6754
1036A2297J3981n1305K1033M2625m6855k7688N2675J19m8557L1838M3341m8601
1048e097k7442M8648m773m5547L4960L9348m7794j8380M6836j2811m4652L3991
1060b713L5735l8635r447L9833k1956m0357L9198K8910m2227r84M3213k4580l9904
1073c3914L3593J9877l5760Q400M0100k7561l6006L2273J3899l4646J2745L7855
1085C0855k6392k6497L0322J660l4917J7520L6966k3626k1775K5581k426l1896
1097b4625J7249K8746k1812j0285K7297r909l1668J6839K3205j8370k622K5285
$$ plain form
1109 19330 7813 -20174 -5124 11342 -7953 -6031 19963 8937 -14268 -2344 4518 -12855
1121 -12855 -5577 17360 6545 -9789 2004 3196 -15325 -6803 13759 4758 -3785 8301 2635
1134 2635 -14576 -5407 9174 961 -911 10832 3348 -12679 -4805 3188 -4935 399 12561 1602
1148 1602 -9118 -378 -191 -8926 1013 12234 2593 -3729 3475 -1949 -10762 1368 9586 -237
1162 -237 165 7261 -3812 -11759 747 4593 -3763 2545 9992 -3413 -10546 1037 2026 -5493 4458
1177 4458 10914 -3298 -5665 5001 -2298 -9783 5973 11436 -4524 -4252 6873 -3886 -12261 4493
1191 4493 9500 -5762 -1456 9415 -3982 -12067 4512 6211 -5524 2566 11285 -5053 -10623
1204 -10623 6704 4200 -9536 2671 12517 -4897 -9218 6639 523 -11591 3601 11640 -6153
$$ packed form
1109A9330j1517k7987J5050J6466j9295J922K5994j1026k3205J1924O862j7373
1121a2855P278K2937j0815j6334J1793J192j8521Q522K0562r001q543J2086n666
1134B635j7211R169J4581q213j872J1743p484j6027P874P993q123N334J2162j0959
1148A602j0720Q740J87q735R939J1221r641o322P204n424q813J2130Q218r823
1162b37M02P096j1073p947J2506L846q356O308P447j3405p133J1583R89p519R951
1177D458O456j4212k367J0666p299p485J5756N463j5960K72J1125j0759q375J6754
1191D493N007j5262M306J0871j3397q085J6579J699j1735Q090Q719j6338n570
1204a0623J7327k504j3736J2207R846j7414m321J5857o116j2114J5192Q039j7793
$$ plain form
1217 -6153 -7204 8612 102 -12196 3958 11378 -5785 -4431 10603 -246 -12130 3258 9403
1230 9403 -5821 -3280 9018 -1064 -10084 3337 5733 -8216 -1151 10422 -2336 -9649 5627
1243 5627 4985 -8809 -274 10981 -1812 -8310 5995 5354 -9253 -1548 9549 -1913 -7141 4770
1257 4770 2793 -8762 -884 7689 -2737 -5562 5827 2881 -7287 118 7110 -2403 -3966 6200
1271 6200 2401 -6343 1118 5475 -3724 -3515 5611 1028 -6739 866 4968 -4771 -4252 5893 1587
1286 1587 -6063 936 4984 -2513 -2861 4108 1950 -3428 804 3134 -2141 -1953 3356 -21 -3670
1301 -3670 1368 2141 -3414 -1729 2615 -250 -3137 1242 2625 -2360 -1015 3102 315 -1785 1689
1316 1689 2184 -1946 -840 2607 -128 -2477 294 1664 -1719 -1477 1195 -72 -1669 197 792 -523
$$ packed form
1217f153j051J5816q510j2298J6154P420j7163J354J5034j0849j1884J5388O145
1230I403j5224K541J2298j0082r020J3421K396j3949P065J1573j2758p313J5276
1243E627o42j3794Q535J1255j2793o498J4305o41j4607P705J1097j1462n228J1911
1257D770j977j1555P878Q573j0426k825J1389k946j0168P405O992r513j563J0166
1271F200l799q744P461M357r199K09R126m583p767P605M102r739N19J0145m306
1286A587p650O999M048p497l48O969k158n378M232K330n275J88N309l377l649
1301c670N038P73n555J685M344k865k887M379J383m985J345M117k787k100L474
1316A689M95m130J106L447k735k349K771J370l383K42K672j267j597J866N95j315
$$ plain form
1332 -523 -59 1138 237 178 1070 517 -340 285 724 -446 -468 438 54 -823 -499 6 -678 -760 -376 -94
1352 -94 -311 -48 176 -85 592 245 -281 383 949 -6 -544 724 529 -1063 -93 991 -1060 -1162 746
1371 746 -364 -1739 535 1275 -1187 -1108 1927 451 -1584 1080 2242 -1083 -878 2467 -124 -2975
1387 -2975 1083 2329 -2365 -1278 2580 -1121 -4102 1150 2653 -2874 -1234 4219 -365 -4001 1964
1402 1964 3510 -2902 -529 5447 -214 -4569 2198 2636 -5042 -773 6078 -1172 -5690 2642 2429
1417 2429 -6495 -688 7095 -1099 -5040 4522 2976 -7485 -462 8498 -1466 -5301 6605 2694
1431 2694 -9245 -1403 7418 -3007 -5110 7481 2873 -9993 -807 6719 -5100 -4225 9969 3144
1445 3144 -9750 772 7064 -6842 -4962 11159 3752 -9119 1904 6540 -9149 -6085 10614
$$ packed form
1332e23M64J197r01n9Q92n53q57O25M39j170k2R06l84q77L24N05o84q2L84K82
1352i4k17K63K24k61O77l47n26O64N66r55n38J268j95j592R70J084k051j02J908
1371G46j110j375K274P40k462P9L035j476k035K664J162l325K05L345k591k851
1387b975M058J246m694J087L858l701k981N252J503n527J640N453m584l636N965
1402A964J546o412K373N976n661m355O767M38p678M269O851p250m518Q332k13
1417B429q924N807P783q194l941R562j546j0461P023Q960r964l835J1906l911
1431B694j1939P842Q821j0425k103J2591m608j2866R186P526j1819Q75J4194o825
1445C144j2894J0522O292j3906J880J6121p407j2871J1023M636j5689L064J6699
$$ plain form
1458 10614 2518 -8793 4608 6884 -11416 -6740 10828 1668 -8024 7221 8283 -11113 -6690
1471 -6690 9759 -256 -7316 9544 8769 -11408 -5255 8378 -4598 -9018 11289 9631 -10828
1484 -10828 -3679 8776 -7282 -11037 11148 10332 -8577 -34 8666 -8899 -11188 10369 8109
1497 8109 -7246 3708 10739 -10735 -13003 8096 4617 -8293 6390 12419 -9779 -11672 6448
1510 6448 145 -9024 9372 14020 -8284 -8334 7104 -3486 -12376 9198 15424 -5849 -5468 6837
1524 6837 -6445 -14212 6860 12132 -4955 -611 8968 -7919 -15114 5119 8494 -4146 4955
1537 4955 12226 -7880 -14056 4053 3487 -6653 7053 14688 -5869 -11595 2725 -2234 -10352 7531
1551 7531 15558 -3441 -7419 3680 -4712 -12371 5139 13293 -370 -841 6610 -6671 -14041 2819
$$ packed form
1458A0614q096j1311J3401K276j8300M676J7568r160r692J5245J062j9396M423
1471f690J6449j0015p060J6860p75k0177O153J3633j2976m420K0307j658k0459
1484a0828P149J2455j6058l755K2185q16j8909Q543Q700j7565k289K1557k260
1497H109j5355J0954P031k1474k268K1099l479j2910J4683O029k2198j893J8120
1510F448o303r169J8396M648k2304n0J5438j0590q890K1574O226k1273L81J2305
1524F837j3282p767K1072N272j7087M344R579j6887p195K0233L375j2640R101
1537D955P271k0106o176J8109n66j0140J3706P635k0557n726J4320m959q118J7883
1551G531Q027j8999l978J1099q392p659J7510Q154j3663m71P451j3281p370J6860
$$ plain form
1565 2819 8809 -519 3497 9030 -7161 -13421 612 3084 -3821 6614 12591 -4069 -11095 -486
1579 -486 -1481 -5919 7916 13310 -1932 -6299 1120 -5048 -9595 5220 11710 676 -776 2641
1593 2641 -8248 -12091 3344 7859 147 4043 6933 -7451 -11550 1113 2489 -1372 8372 10882
1607 10882 -5086 -9815 -170 -1504 -4583 7949 10682 -2723 -5047 326 -6966 -8424 6504 10275
1621 10275 -119 139 2530 -8453 -9418 5491 7129 -962 4499 6772 -7542 -10896 2053 2695
1635 2695 -1716 6969 8533 -6874 -9412 1272 -1304 -4923 7393 10027 -3263 -5132 1489 -5056
1649 -5056 -7016 7230 9548 -1939 -784 3547 -7124 -8803 5623 6366 -3160 3389 7310 -8128
1663 -8128 -11372 3737 4617 -3652 4242 9392 -5245 -9219 2578 1092 -5359 5591 10130 -3499
$$ packed form
1565B819N990r328M016N533j6191o260J4033K472o905J0435N977j6660p026J0609
1579d86r95m438J3835N394j5242m367P419o168m547J4815O490j1034j452L417
1593B641j0889l843J5435M515p712L896K890j4384m099J2663J376l861R744K510
1607A0882j5968m729R645j334l079J2532K733j3405k324N373p292j458J4928L771
1621A0275j0394K58K391j0983r65J4909J638q091N461K273j4314l354J2949O42
1635B695m411Q685J564j5407k538J0684k576l619J2316K634j3290j869O621o545
1649e056j960J4246K318j1487J155M331j0671j679J4426P43r526O549L921j5438
1663h128l244J5109Q80q269P894N150j4637l974J1797j486o451J0950M539j3629
$$ plain form
1677 -3499 -6506 2237 -2070 -7324 4823 9464 -2447 -3736 3647 -3925 -8599 3665 7234 -2425
1691 -2425 805 6431 -4800 -9315 3739 5930 -3991 1318 8923 -2911 -9400 1665 3611 -4930
1705 -4930 1278 8811 -1953 -7168 1843 1106 -6026 1799 8344 -1251 -4805 3859 588 -7113 1447
1720 1447 7237 -1095 -2357 3959 -880 -7234 1184 5077 -2848 -1491 5827 -876 -7473 1008 4482
1735 4482 -3167 -1143 6524 754 -5684 687 3080 -3023 -548 5642 305 -4379 1447 1577 -4489
1750 -4489 -680 5022 -284 -3601 1921 1288 -3935 -995 4174 -85 -2008 2788 1487 -3928 -541
1765 -541 3226 -1076 -1742 3069 1117 -3498 -760 2083 -1162 -1882 2566 1108 -2795 8 1650 -1603
1781 -1603 -1257 2459 1074 -1808 776 1818 -1346 -1078 2188 912 -1708 376 1149 -1318 -1197 1083
$$ packed form
1677c499l007Q743m307n254J2147M641j1911j289P383p572m674J2264L569r659
1691b425L230N626j1231m515J3054K191r921N309P605j1834o489J1065J946q541
1705d930O208P533j0764n215R011p37p132P825O545r595l554Q664l271p701Q560
1720A447N790q332j262O316m839o354Q418L893p925J357P318o703o597Q481L474
1735D482p649K024P667n770o438O371K393o103K475O190n337m684N826J30o066
1750d489L809N702n306l317N522o33n223K940N169m259j923M796j301n415L387
1765e41L767m302o66M811j952m615K738K843l245p20M448j458l903K803J642l253
1781a603L46L716j385k882K584J042l164K68L266j276k620K084P73k467J21K280
$$ plain form
1797 1083 502 -1562 258 814 -984 -908 1086 423 -906 369 969 -422 -299 924 85 -422 419
1814 419 364 -743 -89 254 -349 -820 446 351 -784 -159 622 -160 -292 514 639 -187 -180 842 154 -183
1834 -183 358 439 -385 -265 258 -519 -396 296 -367 -517 -42 257 -84 44 397 388 -419 -94 262 -152 270
1855 270 291 -166 -246 370 -86 -493 196 308 -843 48 190 -89 -477 277 225 -600 221 803 -180 -558 881
1876 881 528 -1017 -108 857 -426 -624 703 240 -1160 -174 981 -788 -542 842 -23 -1338 40
1893 40 918 -282 -216 1523 81 -1591 552 1074 -844 -198 2011 -85 -2070 478 754 -1838 -361
1910 -361 2227 -13 -1991 798 820 -2117 -87 2738 -65 -1107 1566 750 -2566 -389 2388 134
1926 134 -990 2183 379 -3256 -647 1960 -1146 -1079 3130 646 -3285 -567 1557 -1425 -681 3840
$$ packed form
1797A083n81k064J820N56j798P6J994o63j329J275O00j391J23J223q39n07Q41
1814D19n5j107O54L43o03m71J266r5j135O25P81p82j32Q06J25q26PJ022o88l37
1834a83N41Q1q24J20N23p77J23O92o63j50M75K99l41J28L53rq07L25L56m14M22
1855B70K1m57q0O16m56m07O89J12j151Q91J42k79l88P54n2q25Q21N82r83l78J439
1876H81l53j545R09R65j283j98J327m63j400R86J155j769K46J384q65j315J378
1893D0Q78j200O6J739j442j672K143N22j918O46K209k096j985K548K76k592J477
1910c61K588k240j978K789K2k937K030K825k803j042K673q16l316K177K777k254
1926A34j124L173j804l635K609K607l106O7M209k484l931K718K124k982P44M521
$$ plain form
1942 3840 1347 -2392 78 1471 -2905 -1424 3883 1341 -2383 766 751 -3984 -1873 3283 929
1957 929 -1463 2154 1428 -4294 -1788 3338 484 -883 3719 2271 -3987 -2233 2003 -1125 -1038 4237
1973 4237 2427 -3824 -1767 811 -3037 -2142 4678 3099 -2718 -86 930 -4387 -2573 4427 2775
1988 2775 -603 1790 1398 -5387 -3445 3188 1604 -713 3528 2504 -5133 -3790 1674 -289 -459
2003 -459 4863 3349 -3714 -2466 296 -2822 -1652 5634 4300 -2138 -870 141 -4550 -3412 4419
2018 4419 3988 -533 1270 462 -5825 -4396 2966 2544 194 3893 2307 -5361 -4879 1561 553 281
2034 281 5455 3638 -3903 -4152 -428 -2684 -1099 5940 4381 -2327 -1976 -938 -5111 -2811 5380 4571
2050 4571 -461 1016 512 -6275 -4432 3593 3519 637 3963 2078 -6286 -5226 1344 505 -88 5732
$$ packed form
1942C840k493l739K470J393m376J481N307k542l724L149j5m735K111N156k354
1957I29k392L617p26n722K506N126k854j367M602j448o258J754M236l128Q7N275
1973D237j810o251K057K578l848Q95O820j579n817K632J016n317J814P000j652
1988B775l378K393l92o785J942O633j584k317M241j024p637J343N464j963j70
2003d59N322j514p063J248K762l118J170P286j334o438J268J011m691J138P831
2018D419m31m521J803q08o287J429P362m22k350L699j586p668M82O440j008k72
2034B81N174j817p541k49L724k256J585P039j559o708L51J038m173K300Q191q09
2050D571n032J477n04o787J843Q025p4k882L326j885q364J060O570q39n93N820
$$ plain form
2066 5732 3719 -5100 -4565 -281 -2183 -964 6711 5374 -2680 -2233 -161 -4721 -2898 5927 5086 -833
2082 -833 334 109 -6431 -5010 4000 3718 14 3407 1980 -6556 -5774 1945 1460 -51 5901 4243
2098 4243 -4848 -4766 901 -1492 -1310 6668 5551 -3412 -2809 426 -4768 -3559 5765 5781 -1815 -386
2114 -386 1067 -5620 -4639 4292 4396 -341 2782 2456 -5936 -5651 2711 2133 -722 4731 4300 -5135 -5468
2131 -5468 1064 -1097 -1642 5627 5401 -3706 -3748 1258 -2977 -3653 5226 6553 -1911 -1530 1940 -3822
2147 -3822 -5239 3415 4929 -430 905 2537 -4618 -5716 2067 2516 -1098 2791 3921 -3893 -5382
2162 -5382 973 917 -1658 3961 5203 -2645 -3541 883 -1728 -3269 3697 5338 -1876 -2382 1519 -2544
2178 -2544 -5006 2330 5106 -1036 -909 2087 -1987 -4874 1233 3267 -361 1086 3271 -2002 -4256
$$ packed form
2066E732k013q819N35M284j902J219P675j337q054M47K072m560J823Q825q41n919
2082h33J167k25o540J421R010k82l704L393j427q536P82P719m85j511N952j658
2098D243r091Q2N667k393J82P978j117q963O03L235n194J209R324J6p596J429
2114c86J453o687R81Q931J04m737L123l26q392K85Q362n78k855N453m31r435l33
2131e468O532k161n45P269k26r107m2N006m235o76Q879J327q464L81L470n762
2147c822j417Q654J514n359J335J632p155j098P783M49l614L889J130p814j489
2162e382O355n6k575N619J242p848q96M424k611j541O966J641p214n06L901m063
2178b544k462P336K776o142J27K996m074k887O107K034l628J447K185n273k254
$$ plain form
2193 -4256 716 1385 -1482 1644 4129 -1606 -3908 349 93 -2646 1732 4036 -738 -2251 1068
2208 1068 -863 -3297 1360 4454 -427 -1764 1705 -698 -3878 29 3110 -40 -530 1748 -849
2223 -849 -3140 -70 1497 -708 201 2735 -277 -2694 159 876 -1164 614 2616 122 -1930 56
2239 56 130 -1506 328 2334 -94 -1454 601 -27 -2247 -243 1974 103 -1004 1042 433 -1698
2255 -1698 -469 1542 72 -164 1237 182 -1779 -314 498 -439 -533 1033 364 -1552 -415 313 -654
2272 -654 -287 1162 505 -491 382 431 -812 25 978 388 -629 220 127 -935 -491 641 49 -527 300
2291 300 79 -868 -123 147 -7 70 117 370 -411 92 369 -10 -63 730 -5 -587 -228 -108 -473 -111 86
2312 86 163 -88 -207 87 -150 -227 344 133 -255 365 140 -449 70 206 384 72 -1 117 -173 -256 -23 42
$$ packed form
2193d256M972O69k867L126K485n735k302M257k56k739M378K304m774j513L319
2208A068j931k434M657L094m881j337L469k403l180L907L081l150m90K278k597
2223h49k291L070J567k205R09K534l012k417K853P17k040J778K002k494k052J986
2239E6P4j636J834K006k428j360K055o28k220K004K217j871j107K046o09k131
2255a698J229K011j470k36J401j055j961J465Q12r37r4J566o69j916J137P28r67
2272f54L67J449o57r96Q73M9j243Q37R53n90j017Q49r3j062M44J132n92n76Q27
2291C00k21r47P45K70j54P7M7K53p81N03K77l79n3P93p35n82L59J20l65L62J97
2312H6P7k51j19K94k37p7N71k11l88O20k25n89N19J36J78l12p3J18k90q3K33O5
$$ plain form
2334 42 -119 314 -71 -335 167 343 -226 195 313 221 -157 194 199 121 -97 391 -76 -328 207 -34 -491 -36
2356 -36 118 -369 -146 -349 104 -233 -162 223 -112 -133 463 197 -245 165 340 -59 -102 47 51 -346 -167 132
2378 132 -183 -402 -34 -132 -412 272 237 -367 -179 375 197 -360 39 484 61 141 547 17 -725 -35 206
2399 206 -731 -170 260 -226 -636 91 10 -586 -72 1003 -44 -52 532 -170 -535 495 625 -161 -12 707
2419 707 61 -1094 -410 191 -395 -292 654 26 -982 49 119 -332 249 1053 430 -542 -1 254 -580
2438 -580 24 1230 225 -459 219 -429 -1359 105 926 89 -174 677 -369 -1187 154 734 -176 22
2456 22 1376 25 -1423 -172 565 -798 13 1787 -146 -1042 -239 -430 -1119 -132 1661 291 -859
2473 -859 299 -320 -1633 29 1776 338 -126 1011 -178 -1801 -431 1040 193 307 1541 41
$$ packed form
2334D2j61M33l85k64N02J76n69M21J18r2l78L51Np8k18M88m67k52N35k41m57M55
2356c6J54m87K23k03M53l37P1L85l35k1N96k66m42M10J75l99m3J49Ml97J79K99
2378A32l15k19L68r8k80O84l5o04J88N54j78n57L99M45m23Q0M06n30p42O90K41
2399B06r37N61M30m86m10P27q1n96N14J075j047qN84p02l65J030J30p86J49P19
2419G07o46j155O84O01n86J03R46o28j008J031P0m51N81Q04o23r72N41K55q34
2438e80O04J206j005o84O78o48r30J464Q21q37k63Q51j046q18J341N80r10J98
2456B2J354j351j448J251P37j363Q11J774j933q96Q03j91o89R87J793j370j150
2473h59J158o19j313J662J747j438m64J137j189j623J370J471q47J14J234j500
$$ plain form
2489 41 -2068 -539 340 -943 148 2103 178 -1498 -154 -13 -1280 196 2491 566 -1110 245
2505 245 -187 -2294 -218 2328 509 -456 939 -418 -2505 -506 1570 29 -115 1780 306 -2582
2521 -2582 -707 948 -587 243 2612 849 -1997 -591 225 -1540 -145 2925 850 -1530 71
2536 71 -293 -2888 -371 2996 755 -600 1398 -47 -3106 -777 2455 681 -326 2125 385 -3009
2552 -3009 -621 1503 -397 30 3044 456 -2826 -949 709 -1634 -385 3386 1412 -2172 4
2567 4 36 -2650 -644 3261 1661 -852 928 356 -3031 -1571 2629 918 -728 1615 548 -3528
2583 -3528 -1626 1594 50 -282 3060 1126 -3005 -1358 1089 -720 -569 3411 1577 -1815 -679
2598 -679 629 -2161 -1054 3031 1814 -1602 154 468 -2775 -1799 2520 1333 -808 1260 1136 -2973
$$ packed form
2489D1k109J529Q79j283J091J955j925j676J344J41j267J476K295j925j676J355
2505B45m32k107K076K546j819r65J395j357k087J999K076j541j44J895j474k888
2521b582J875J655j535Q30K369j763k846J406Q16j765J395L070k075k380J601
2536G1l64k595K517L367k241j355J998j445l059K329L232j774j007K451j740l394
2552c009K388K124j900M27L014k588l282J877J658k343J249L771j974l584K176
2567DL2k686K006L905j600k513J780n72l387J460M200j711j646K343j067m076
2583c528J902L220j544l32L342j934m131J647K447j809J51L980j834l392J136
2598f79J308k790J107M085j217l416J756L14l243R76M319j187k141K068j24m109
$$ plain form
2614 -2973 -1799 1825 796 -428 2158 1465 -2673 -1796 887 -606 -936 2299 1496 -2160 -1212 480
2630 480 -1594 -1093 2676 1578 -1459 -165 835 -1941 -1566 2556 1929 -1064 512 1004 -2393 -2102
2646 -2102 1560 956 -817 1614 1417 -2413 -2045 1010 478 -969 1952 1907 -1327 -1434 627 -547 -985
2663 -985 1756 1820 -1171 -685 642 -1409 -1639 1735 1332 -1245 7 536 -1458 -1615 1285 1259 -467
2680 -467 421 1574 -1342 -1611 995 610 -681 1017 1248 -1092 -1190 274 -134 -888 934 1314 -685
2697 -685 -827 284 -649 -648 1252 1438 -765 -285 787 -890 -1093 1136 1098 -541 -122 919 -798 -1154
2715 -1154 591 110 -705 624 989 -1026 -862 448 175 -604 738 800 -371 -952 350 -216 -784 577
2733 577 859 -234 -313 245 -685 -974 450 392 -402 44 310 -783 -846 292 469 -248 485 929 -448
$$ packed form
2614b973J174L624j029j224K586o93m138Q77K683j493l30L235q03l656R48J692
2630D80k074N01L769j098l037J294J000k776L75M122o27k993J576M92l397K91
2646b102L662o04j773K431j97l830L68L055n32j447K921m5l234j07K061j174m38
2663i85K741O4k991M86J327k051k30L374m03k577J252N29j994j57K900k6j726
2680d67Q88J153k916k69K606l85j291J698K31k340r8J464m08p54J822L80j999
2697f85j42J111r33JJ900J86k203M80J072j677k03K229l8j639M19J041j717l56
2715a154J745m81q15J329L65k015J64J310k73p79J342O2j171n81J302n66n68J361
2733E77K82j093p9N58r30k89J424n8p94M46K66j093o3J138J77p17P33M44j377
$$ plain form
2752 -448 -585 497 282 -426 162 582 -283 -379 133 139 -762 361 569 -430 -385 268 -74 -312 379 476 -194
2773 -194 -311 332 -100 -289 128 -74 -78 63 283 -293 -496 249 -97 -702 -217 433 -109 -408 293 184 -232
2794 -232 256 662 -193 26 88 187 -38 0 317 -363 -165 -37 -331 -536 273 226 -82 31 629 -239 -82
2815 -82 6 299 174 -37 325 -91 -375 128 -13 -257 -223 -55 90 -93 130 -192 -33 8 173 -58 369
2836 369 493 72 -407 84 269 14 -87 532 -79 -253 -279 -111 -315 -118 175 -4 -231 239 57 -300
2856 -300 81 58 4 -153 200 -8 -111 61 48 26 -90 -106 -87 -180 183 -58 -97 -387 -78 223 -128 112 227
2879 227 -311 -40 158 246 106 292 -121 -173 -286 -7 -180 68 335 -196 -348 -48 164 -367 -402 378 53
2900 53 9 335 274 57 -199 385 53 47 110 336 -248 -295 293 57 -147 186 80 -376 -207 257 -93 -261
$$ packed form
2752d48j37J082k15p08N88M20q65r6N12Or01J123K08r99M5O53l42k38O91R7o70
2773a94j17O43m32j89M17k02mJ41K20n76k03P45l46o05M85O50n42k99P01j09m16
2794b32M88M06q55K19O2R9k25L8L17o80J98J28k94k05Q09m7l08J13N98q68J57
2815h2Q8K93j25k11L62m16k84N03j41k44L4J68J45j83K23l22J59M1J65k31M27
2836C69J24m21m79M91J85k55j01O19o11j74k6J68k04J97K93j79k27M70j82l57
2856c00L81k3n4j57L53k08j03J72j3k2j16j6J9r3L63k41l9k90L09L01l51K40J15
2879B27n38K71J98Q8j40J86m13n2j13K79j73K48K67n31j52L00K12n31l5P80l25
2900E3m4L26o1k17k56N84l32oO3K26n84m7N88k36k04L33j06m56J69M64l50j68
$$ plain form
2922 -261 235 295 -453 -27 449 -161 -241 749 230 -153 -170 200 -226 -230 231 1 -685 50 163 -327 -511 251
2944 251 207 -504 292 466 -539 -397 333 -151 -340 479 773 -388 -92 338 -344 -514 687 518 -655
2963 -655 -235 696 -510 -896 464 756 -222 297 932 -430 -618 740 493 -662 282 712 -396 -922
2981 -922 503 201 -795 248 677 -772 -769 168 -96 -584 370 1096 -660 -722 728 277 -974 662 1081
3000 1081 -743 -273 665 -198 -1048 487 875 -873 -106 756 -769 -865 746 551 -652 60 1081 -278
3018 -278 -946 666 487 -715 418 1514 -553 -941 790 -64 -1329 659 1104 -497 -925 655 -240
3035 -240 -929 624 1321 -478 -434 1167 -61 -1469 370 1184 -880 122 1149 -446 -1779 265
3051 265 709 -918 -137 1365 -706 -1228 505 324 -1070 376 1716 -396 -1349 665 121 -1197 568
$$ packed form
2922b61M96O0p48M26M76o10q0R90n19l83j7L70m26mM61k30o86P35J13m90j84P62
2944B51m4p11P96J74j005J42P30m84j89Q19K94j161K96M30o82j70J201j69j173
2963f55M20R31j206l86J360K92r78N19O35j362j88J358k47j155R44M30j108n26
2981i22J425l02r96J043M29j449LR37k64m88R54P26j756o2J450m51j251J636M19
3000A081j824M70R38q63q50J535L88j748P67Q62j525r6J611j95j203P12J021j359
3018b78o68J612j79j202J133J096k067l88J731q54j265J988M45j601m28J580q95
3035b40o89J553O97j799M4J601j228j408J839Q14k064J002J027j595j333K044
3051B65M44j627P81J502k071n22J733j81j394J446J340k112r53K014n44j318J765
$$ plain form
3068 568 1477 -466 -732 816 129 -1443 120 1402 -589 -309 1145 -528 -1452 232 1056 -690 148
3085 148 1385 -144 -1348 126 785 -844 231 1283 -186 -1373 530 411 -1056 83 1580 -519
3101 -519 -970 791 28 -1583 309 1332 -208 -707 911 -96 -1327 429 1099 -660 -449 1249
3117 1249 -160 -1566 -104 674 -788 -22 1446 118 -1406 351 636 -1105 -101 1470 -34 -1139
3133 -1139 595 347 -1343 40 1175 -240 -1011 912 -48 -1616 49 977 -341 -601 1051 311
3149 311 -1382 -152 1014 -264 -234 1628 31 -1335 335 794 -708 -192 1397 -108 -1075 304
3165 304 372 -1061 -175 1262 -10 -672 535 331 -1378 91 1247 -152 -517 891 373 -1342 -293
3182 -293 936 -385 -447 669 -60 -560 -1 573 -679 -1 1123 1 -892 308 334 -693 -14 966
$$ packed form
3068E68R09j943k66J548o87j572J563J282j991K80J454j673r24J684Q24j746Q38
3085A48J237j529j204J474O59j629J075J052j469j187J903j19j467J139J497k099
3101e19m51J761p63j611J892J023j540m99J618j007j231J756O70j759K11J698
3117A249j409j406J462P78j462P66J468j328j524J757K85j741J004J571j504j105
3133a139J734k48j690J383J135j415p71J923r60j568J665R28j318k60J652p40
3149C11j693J230J166j278L0J862j597j366J670M59j502N16J589j505r67J379
3165C04O8j433Q86J437j272o62J207k04j709J469J156j399l65J408n18j715J049
3182b93J229j321o2J116p29n00N59N74j252O78J124j122q93J200K6j027O79R80
$$ plain form
3200 966 19 -810 344 357 -1124 -293 938 -250 -584 593 294 -1070 -46 951 -575 -526 704 82
3218 82 -641 -40 494 -444 -247 350 273 -842 85 565 -579 -356 731 71 -870 122 188 -602 -338 649
3238 649 203 -307 544 484 -453 -89 450 252 -514 554 382 -742 100 398 -270 -167 674 72 -635 -96
3258 -96 441 -1 -245 396 234 -311 158 441 -404 -292 641 122 -432 86 94 -273 -476 182 29 -582 107
3279 107 278 -517 -55 726 -59 -106 -88 148 -271 -184 551 61 -288 135 451 -403 -149 246 134 -477 232
3300 232 197 -98 -165 168 -482 -159 315 167 -261 150 304 -8 -78 0 -84 -246 9 -40 -242 -43 222 -21
3322 -21 -370 -226 139 -146 213 233 47 309 242 261 0 -198 -32 -34 -150 6 210 -354 -106 133 8 -250
3344 -250 40 41 -122 -176 103 -107 -177 165 54 -24 137 96 -79 -115 120 -167 52 -63 -96 -48 66 -172 27
$$ packed form
3200I66r47q29J154J3j481Q31J231j188l34J177k99j364J024R97j526M9J230o22
3218H2p23O01N34r38J97N97p7j115R27M80j144K23J087o60r41R92O6p90K64R87
3238F49m46n10Q51o0r37L64N39j98p66J068j72j124Q42K98o68J03Q41o02p07N39
3258i6N37m42k44O41j62n45M69K83q45J12R33n19n54N18Ql67k03O58j53o11O89
3279A07J71p95M62P81p85m7J8K36m19Q7P35m90l49M23L16q54K54L95j12o11P09
3300B32l5k95o7L33o50L23M74j48m28M11J54l12p0P8q4j62K55m9k02J99K65k43
3322b1l49J44L65k85L59K0j86K62o7J9k61j98J66kj16J56K04n64K48K39j25k58
3344b50K90Jj63n4K79k10p0L42j11p8J61m1j75l6K35k87K19j15l3M8J14k38J99
$$ plain form
3367 27 -165 162 151 -259 301 21 37 127 79 -29 -112 198 303 -267 -88 393 42 -238 -184 -140 -98 -51 181
3390 181 154 -329 -341 -65 17 40 -4 -8 -186 62 64 -136 63 67 -27 -313 6 58 -278 -209 497 -31 -154 -30 116
3415 116 -171 -24 179 -77 -75 390 62 -308 24 310 -120 -108 273 19 -101 -68 255 -431 -225 608 -61
3436 -61 -347 61 -136 -180 200 408 5 -431 329 370 -770 9 553 -133 -18 366 268 -501 50 176 15
3457 15 -233 418 236 -303 -136 545 -330 -122 553 59 -498 120 242 -548 -272 562 349 -412 128 366
3477 366 -591 -343 523 -18 -319 446 332 -351 -410 654 -303 -298 819 664 -740 -152 651 -184 -480 681
3497 681 199 -383 -144 563 -560 -872 985 473 -381 276 329 -402 -712 722 419 -559 186 772 -674
3516 -674 -718 418 158 -246 388 920 -1001 -673 790 76 -762 759 853 -475 -215 785 -296 -573
$$ packed form
3367B7j92L27j1m10N60k80J6R0m8j08q3L10J05n70J79M81l51k80N4M4M2M7K32
3390A81k7m83j2K76Q2K3m4mj78K48Kk00J99Mr4k86L19N2l36O9P06n28j23J24J46
3415A16k87J47K03k56KM65l28l70L32K86m30J2L81k54j20L3L23o86K06Q33o69
3436f1k86M08j97m4L80K08m03m36P60M1j140P79N44o86J15L84r8p69N51J26j61
3457A5k48O51j82n39J67O81q75K08O75m94n57O18J22p90K76Q34k13p61N40K38
3477C66r57K48Q66n41l01P65j14o83n9J064r57NJ117j55j404N88Q03q35k96J161
3497F81m82n82K39P07j123l12J857n12q54O57N3p31l10J434l03r78P45N86j446
3516f74m4J136k60m04O34N32j921L28J463p14q38J521R4j328K60J000j081k77
$$ plain form
3534 -573 680 997 -474 44 616 -701 -1000 762 473 -566 171 456 -836 -1318 701 288 -437 398
3552 398 760 -926 -1106 665 118 -732 798 758 -752 -504 541 -328 -811 935 824 -831 -436 673
3570 673 -743 -1062 701 1044 -424 82 912 -693 -1177 781 859 -548 270 988 -725 -703 348 126
3588 126 -522 773 817 -769 -902 202 14 -1119 579 893 -747 -226 422 -466 -1063 865 1001 -533
3606 -533 20 731 -682 -1260 579 902 -533 134 1203 -708 -1232 387 586 -725 309 1152 -562
3623 -562 -748 465 244 -681 295 1210 -429 -535 433 -145 -966 631 1120 -305 -298 735 -469 -1180 325
3642 325 908 -246 210 1033 -47 -1444 364 540 -517 357 1138 -206 -939 378 325 -656 120 973
3660 973 -335 -847 430 165 -554 327 1008 -192 -354 567 -132 -1264 366 1015 -123 -444 581 -340
$$ packed form
3534e73J253L17j471N18N72j317k99J762k89j039P37K85j292m82K019m13p25Q35
3552C98L62j686j80J771n47q50J530m0j510K48J045q69m83J746j11j655L95J109
3570F73j416l19J763L43j468N06Q30j605m84J958P8j407Q18P18j713K2J051k22
3588A26o48J295M4j586j33J104j88j133J698L14j640N21O48q88n97J928J36j534
3606e33N53P11j413n78J839L23j435O67J069j911n24J619J99j311J034Q43j714
3623e62j86J213k21r25R76R15j639j06R68n78q21J597M89j425PJ033j204p11J505
3642C25N83j154M56Q23j080j397J808J76j057Q74P81j344p33J317n3r81P76Q53
3660I73j308n12J277k65p19Q81O81j200j62R21o99j132J630O49j138l21J025r21
$$ plain form
3678 -340 -1027 -34 669 -615 -124 962 -279 -923 73 417 -603 219 944 -323 -837 -37 211 -628
3696 -628 43 707 95 -324 235 35 -883 -165 684 -81 -503 708 6 -819 266 606 -192 -30 465
3715 465 -154 -1066 17 304 -473 -83 457 75 -794 159 170 -290 -274 694 -101 -370 385 243 -237 -84
3735 -84 815 -16 -404 173 -49 -677 -30 617 -42 -70 265 151 -538 -135 310 -236 -494 642 -118 -517
3755 -517 -49 325 -290 -149 630 45 -464 -245 -6 -397 -376 523 23 -416 23 127 -808 37 643 85
3775 85 -84 42 315 -114 -347 270 -28 -201 274 159 -133 -200 226 30 -150 303 -2 -199 -116 -30 -277
3796 -277 -281 -18 72 -66 257 32 -109 11 262 80 -316 108 420 67 -267 275 267 -324 -68 251 -442 2
3818 2 248 -118 -149 168 223 -335 12 377 58 -135 194 10 -63 -170 -95 6 -281 -64 61 -74 191 89
$$ packed form
3678c40o87R93P03j284M91J086j241o44R96L44j020Q22P25j267n14Q00K48q39
3696f28O71O64o12m19N59k00r18P18Q49p65m22J211p02q25J085L40p98J62M95
3715D65o19r12J083K87p77L90N40l82q69R53J1m60J6R68p95k69P55j42m80J53
3735h4Q99q31l88N77k22o28O47O47o59k8L35j14o89M03M45n46k58J136p60l99
3755e17M68L74o15J41P79n85n09K19K39l91K1Q99n00m39M39J04r35Q45O06n58
3775H5j69J26K73m29k33O17k98j73M75j15k92o7M26j96j80M53l05j97Q3Q6k47
3796b77mK63R0j38L23k25j41J20K51j82l96M24L12l53l34N42qn91K56L19o93M44
3818BK46l66l1L17N5n58L47L65l19j93L29j84p3j07P5J01k87K17J25j35K65j02
$$ plain form
3840 89 18 -383 168 105 -115 46 228 -20 159 140 243 -64 172 -53 -245 -185 85 -406 -1 203 -28 -155
3862 -155 -56 333 190 -128 168 172 73 161 234 -46 -73 -26 172 -220 4 303 -145 165 166 82 -64 -4 45 198
3886 198 -330 -119 171 -210 10 502 -267 -214 194 241 -181 26 243 -179 -77 -88 -359 -245 84 219 -455
3907 -455 119 65 -91 -158 -90 167 -233 -50 172 29 -202 459 15 -185 -66 29 -16 -98 440 31 -8 132
3929 132 345 -316 -142 567 93 -128 180 343 -142 56 533 -30 -283 391 -85 -513 17 425 -249 -168
3949 -168 198 -5 -584 -306 218 -419 -70 136 -257 -257 -85 317 -105 -16 531 154 -334 -89 349 -478 -232
3970 -232 674 5 -153 99 399 -261 -86 664 135 -276 378 264 -461 -255 234 -97 -479 482 275 -214
3990 -214 -163 189 -240 -173 608 34 -281 103 338 -457 -562 389 120 -442 164 426 -328 -396 559 80 -363
$$ packed form
3840H9p1m01N51o3k20J61J82k48J79j9J03l07K36k25j92O0K70m91M05K04k31j27
3862a55R9L89j43l18K96Mr9Q8P3k80k7M7J98l92K24K99m48L10Jq4j46O0M9J53
3886A98n28K11K90l81K20M92p69N3M08M7m22K07K17m22J02j1k71J14L29J35o74
3907d55N74n4j56o7O8K57m00J83K22j43k31O61m44k00J19R5m5q2N38m09l9J40
3929A32K13o61J74P09m74k21L08J63m85J98M77n63k53O74m76m28N30M08o74Q1
3949a68L66k03n79K78N24o37L49K06l93%J72M02m22Q9N47l77m88K45M38q27K46
3970b32R06o69j58K52L00o60J75P50n29m11O54j14p25K06M89l31l82R61k07m89
3990b14N1L52m29O7P81n74l15L84K35p95j05R51k69n62O06K62p54o8R55m79m43
$$ plain form
4011 -363 508 354 -368 -472 172 -16 -584 425 525 -528 -484 475 -116 -492 533 529 -478 -36 529 -346
4031 -346 -708 353 498 -150 44 294 -671 -668 649 425 -201 302 459 -642 -422 814 351 -294 647
4050 647 1123 -763 -687 549 -79 -714 757 699 -672 -291 362 -466 -559 264 801 -567 -215 529 -458
4069 -458 -902 643 559 -348 311 769 -402 -850 602 246 -605 131 883 -673 -808 327 -153 -837 607
4088 607 871 -532 -305 161 -196 -721 495 955 -436 -410 653 -364 -843 316 661 -418 158 1214
4106 1214 -476 -708 585 334 -404 373 724 -359 -624 470 216 -554 290 991 -214 -1007 644 -146
4124 -146 -844 328 560 -368 -338 511 -531 -804 342 899 -102 -301 531 -343 -820 177 646 -464 97
4143 97 944 -336 -796 433 123 -644 302 1005 -61 -740 640 408 -674 292 1157 -337 -646 380
$$ packed form
4011c63Q71j54p22j04O44j88n68J009J00j053M4R59n91l76J025mj007M42N65q75
4031c46l62J061J45o48J94K50r65LJ317k24o26N03J57j101K20J236m63o45R41
4050F47M76j886P6J236o28o35J471n8j371L81O53q28r3Q23N37j368L52P44r87
4069d58m44J545q4r07O59M58j171m48J452l56q51P36P52j556j35J135m80o84J444
4088F07K64j403K27M66l57n25J216M60j391K6J063j017m79J159L45j079N76J056
4106A214j690k32J293k51p38P77L51j083k65J094k54p70Q44P01j205p93J651p90
4124a46o98J172K32r28L0Q49j042k73J146N57j001j99Q32q74m77R97M69j110N61
4143I7Q47j280m60J229l10p67R46P03j066o79J380k32j082R66Q65j494l09J026
$$ plain form
4161 380 -10 -764 335 640 -324 -82 537 -246 -928 188 730 -533 -132 651 -412 -968 122 255
4179 255 -383 66 664 -452 -942 -14 57 -675 3 546 -239 -451 328 41 -813 113 675 -96 -137 721
4199 721 -20 -642 244 596 -377 -204 535 107 -592 4 159 -265 -58 763 -166 -784 64 392 -465 56
4219 56 463 230 -307 441 181 -610 109 581 -53 -279 307 355 -508 -159 657 -301 -319 614 155 -668 -41
4240 -41 602 -340 -124 531 -14 -465 6 291 -268 -150 362 141 -337 44 146 -261 -100 509 41 -441
4260 -441 100 341 -289 -46 691 215 -389 146 497 -574 -68 303 -101 -391 204 254 -294 163 192 -177
4280 -177 75 -112 104 -363 81 155 -65 -66 118 333 -99 212 222 -176 -404 -31 289 -170 -27 83 -281
4301 -281 -194 317 154 -117 102 -4 -423 -158 409 -98 -102 226 305 -102 -161 383 -153 -121 -32 -94 -294 231 19
$$ packed form
4161C80l90p54J099L05r64K42O19p83o82J116N42j263M01P83j063n56J090J33
4179B55o38M49N98j116m90R28P1p32O78N43p85k12P79k87q54R26N62p71m1Q58
4199G21p41o22Q86L52r73J73P39m28o99N96J55m24K07Q21r29o18Q48L28q57N21
4219E6M07k33n37P48k60p91P19M72o34k26N86M8q63L49Q16r58j8R33m59q23O27
4240d1O43r42K16O55n45m51M71K85n59J18N12k21m78L81J02m07J61O09m68m82
4260d41N41K41o30K43P37m76o04N35L51j071N06L71m04k90N95N0n48M57K9l69
4280a77K52j87K16m67M44P4k20jJ84K15m32L11J0l98k28L73L20m59J43J10l64
4301b81Q7N11j63k71K19j06m19K65N67n07mL28P9m07n9N44n36L2Q9o2k00N25k12
$$ plain form
4324 19 11 -183 74 -220 -378 11 292 -184 -82 99 335 -220 44 204 -4 -227 237 119 -158 66 217
4345 217 -240 -311 264 -129 -108 236 -106 -107 -183 152 -178 -348 6 50 18 -105 78 14 73 137 176 148 -173 111
4369 111 28 -44 -256 65 -272 -115 170 -41 -313 238 397 25 315 -24 -72 25 432 -67 -194 266 37
4390 37 -286 -247 238 125 -263 206 -78 68 -178 248 82 -389 218 156 -50 -106 212 102 -155 194 55
4411 55 -120 -2 -36 -118 -155 39 -96 -184 253 320 -274 -192 153 -133 -116 -125 334 51 259 303 195 -228 -342 -36
4435 -36 -386 45 181 -27 -315 106 118 -353 -402 163 18 -243 177 -32 -200 -240 167 -12 -243 646 268
4456 268 -548 -39 275 49 76 166 -118 -359 235 215 -171 -139 259 -7 -572 146 310 -139 26 335 -25
4477 -25 -147 293 26 -405 -178 266 -99 -260 431 238 -415 268 114 -229 -174 117 16 -114 229 219 -174
$$ packed form
4324A9qj94K57k94j58L89K81m76J02J81K36n55K64J60k08k23M64j18k77K24J51
4345B17m57p1N75l93K1L44l42jp6L35l30j70L54M4l2j23J83o4N9O4L9k8l21K84
4369A11q3p2k12L21l37J57K85k11k72N51J59l72K90l39m8R7M07m99j27M60k29
4390C7l23L9M85j13l88M69k84J46k46M26j66m71O07o2k06n6L18j10k57L49j39
4411E5j75J18l4q2l7J94j35q8M37O7n94Q2L45k86J7rM59k83K08M4j08m23j14L06
4435c6l50M31J36k08k88M21J2m71m9N65j45k61M20k09j68m0M07j79k31Q89l78
4456B68q16N09L14k26K7R0k84k41N94k0l86L2L98k66n65P18J64m49J65L09l60
4477b5j22M40k67m31K27M44l65j61O91j93o53O83j54l43N5K91j01j30L43j0l93
$$ plain form
4498 -174 -177 498 489 -406 227 325 -413 -241 253 -133 -355 188 374 -454 -337 256 -182 -366 147 191 -866 64
4520 64 465 -287 -352 574 99 -557 100 585 -465 -312 535 -126 -494 112 389 -328 -519 486 -83 -478
4540 -478 703 445 -340 -124 495 -85 -661 269 588 -379 -275 435 -93 -401 463 534 -679 -277 394 -289
4560 -289 -472 299 235 -298 173 314 -507 -306 322 356 -565 516 472 -541 -349 246 36 -276 231 421
4580 421 -263 112 428 -214 -621 501 411 -626 274 496 -314 -692 332 194 -552 -122 445 -359 -520
4599 -520 383 130 -222 171 626 -412 -348 506 133 -735 101 446 -354 -234 469 235 -571 388 677 -572
4619 -572 -102 523 -104 -473 331 599 -532 -102 384 -223 -614 500 469 -121 8 775 -257 -654 506
4638 506 64 -537 121 688 -410 -349 207 156 -336 101 566 -184 -328 604 -25 -858 142 683 -344 -168
$$ packed form
4498a74lO75rq95O33R8p38J72M94l86k22N43J86q28J17N93m38j84N13M4j057R30
4520F4M01p52o5R26m75o56O57M85j050J53Q47o61l68O06K77p17j91J005n69l95
4540d78J181k58p85K16O19n80n76R30L19r67J04P10n28l08Q64P1j213M02O71o83
4560b89j83P71o4n33M71J41q21K01O28L4r21J081m4j013J92N95k10l12N07J90
4580D21o84L75L16o42m07J122r0j037R00K22q10l78J024j38p46M30N67q04j61
4599e20R03k53l52L93M55j038O4Q54l73q68Q36L45q00J20P03k34q06R59K89j249
4619e72M70O25o27l69Q04K68j131M30M86o07l91J114l1n90J29P67j032l97J160
4638E06m42o01O58N67j098O1N56n1m92M37M65p50j44R32o29q33J000N41j027J76
$$ plain form
4658 -168 333 -118 -597 95 202 -472 140 721 17 -838 277 536 -359 -47 629 -17 -405 431 371 -519
4678 -519 354 584 -341 -285 748 -57 -794 -25 287 -220 -47 442 197 -493 280 597 -322 -107 574 201
4698 201 -519 -3 555 -430 -63 507 -172 -263 268 194 -411 -320 599 128 -430 616 268 -522 197 414 104
4719 104 -425 363 107 -711 328 399 -170 -104 328 69 -489 195 151 -379 -306 443 122 -220 67 293 -366
4740 -366 -351 229 -279 -373 -58 218 -190 -246 560 -87 -350 228 376 -428 -371 523 -180 -187 311 -12 -154 -93
4762 -93 157 -192 -272 353 324 -413 67 232 -89 -220 287 204 -412 30 434 -46 -145 174 -50 -220 167 142
4784 142 -104 -68 238 160 -265 -170 100 -447 42 230 -16 -236 81 202 -297 95 282 -138 -304 51 298
4805 298 -253 123 224 -274 -356 100 -4 -322 -120 213 -73 -242 391 -50 152 16 49 -164 -189 194 -42
$$ packed form
4658a68N01m51m79O92J07o74O12N81p04q55J115K59q95L12O76o46l88Q36o0q90
4678e19Q73K30r25N6J033q05p37P69L12n07J73M89k45o90P73L17r19K15O81l73
4698B01p20N16N58r85L67N70o79r1N31p4o05R1R19m71n58J046l48p90P19K17l10
4719A04n29P88k56q18J039P1n69O6M32k59n58O84m4n30P3P49l21l42K87K26o59
4740c66J5N80n08r4L15K76m08n6Q06o47k63N78J48q04N7Q94p03pM98l23j42O1
4762i3K50l49q0O25k9p37M80J65l21j31N07q3o16M42M04m80r9L19k24j70L87k5
4784A42k46L6L06p8m25R5K70n47M89J88k46k20L17J21m99L92J87m20j66L55K47
4805B98n51L76J01m98q2M56j04l18K02L33k86j69O33m41K02j36L3k13k5L83k36
$$ plain form
4826 -42 -22 123 76 -78 -201 -73 -135 -264 25 253 182 -80 216 -105 -390 -268 -48 -71 -32 33 -4 -275 72
4849 72 21 -108 -171 243 -231 -87 245 29 -149 27 121 -255 -186 -55 -1 -264 254 392 -178 -211 231 55
4871 55 -356 -142 219 -38 7 255 214 225 -84 316 -212 -35 188 152 -67 -60 114 175 -19 226 22 14 205
$$ packed form
4826d2K0J45m7j54j23J28o2j29K89K28p1k62K96l21k85J22K20k3L9O5l7k71L47
4849G2n1j29o3M14m74J44L32k16j78J76R4l76O9J31N4k63N18J38n70l3M42j76
4871E5m11K14L61k57M5K48m1J1l09M00n28J77K23l6k19PJ74O1j94K45k04qJ91
$$ [...]
8191B7
##END NTUPLES=NMR FID
##END=
